##TITLE=31Pdec_2ABPA2 0106
 CD3CN, 88 sc
 2.06.2021
##JCAMPDX= 6.0         $$ Bruker NMR JCAMP-DX V2.0
##DATA TYPE= NMR SPECTRUM
##DATA CLASS= NTUPLES
##ORIGIN= UXNMR, Bruker Analytische Messtechnik GmbH
##OWNER= root
$$ XWIN-NMR		Version 3.5
$$ Wed Jun  2 11:31:12 2021 Russian Standard Time (UT+4h)  she@DPX200
##.OBSERVE FREQUENCY= 81.013821
##.OBSERVE NUCLEUS= ^31P
##.ACQUISITION MODE= SIMULTANEOUS
##.ACQUISITION SCHEME= undefined
##.AVERAGES= 88
##.DIGITISER RES= 16
##SPECTROMETER/DATA SYSTEM= spect
##.PULSE SEQUENCE= zgpg30
##.SOLVENT NAME= DMSO
##.SHIFT REFERENCE= (INTERNAL, DMSO, 0, 248.564)
##AUDIT TRAIL= $$ (NUMBER, WHEN, WHO, WHERE, WHAT)
$$ ##TITLE= Audit trail, XWIN-NMR		Version 3.5
$$ ##JCAMPDX= 5.01
$$ ##ORIGIN= Bruker BioSpin GmbH
$$ ##OWNER= she
$$ F:/spectra/data/she/nmr/P31/1/pdata/1/auditp.txt
$$ ##AUDIT TRAIL=  $$ (NUMBER, WHEN, WHO, WHERE, WHAT)
(   1,<2021-06-02 11:29:24.95 +0400>,<she>,<DPX200>,
      <continue with go, POWCHK disabled, PULCHK disabled
       configuration hash MD5:
       00 E9 B6 7A A2 85 ED C7 34 08 36 98 17 FE 4E 26
       data hash MD5: 32K
       A1 69 68 B8 22 19 84 23 E4 ED CB B7 64 2E F3 8F>)
(   2,<2021-06-02 11:30:22.93 +0400>,<she>,<DPX200>,
      <Start of raw data processing
       efp BC_mod = 2 LB = 1 FT_mod = 6 PKNL = 1 PHC0 = -6014.655 PHC1 = 349.67 SI = 64K 
       data hash MD5: 64K
       33 1F 80 3D 35 18 96 01 78 59 7A C0 48 7D 6D 42>)
(   3,<2021-06-02 11:30:42.45 +0400>,<she>,<DPX200>,
      <pk PHC0 = -8.696667 PHC1 = 44.59999 
       data hash MD5: 64K
       D4 85 F2 1C 8B 02 53 FE 07 FB 02 4C 78 EB C0 CF>)
(   4,<2021-06-02 11:30:45.28 +0400>,<she>,<DPX200>,
      <abs ABSG = 5 
       data hash MD5: 64K
       44 FE 06 58 95 C6 AD 55 C4 8D 06 12 3B 84 1F E0>)
$$ ##END=
$$ 
$$ hash MD5
$$ 07 2B B6 A3 FE 50 C6 E2 84 DA 99 96 51 0A 1E C7
##$RELAX= 
##$RELAX= 
##$RELAX= 
##$RELAX= 
##$RELAX= 
##$RELAX= 
##$RELAX= 
##$RELAX= 
$$ Bruker specific parameters
$$ --------------------------
##$DU= <F:/spectra>
##$EXPNO= 1
##$NAME= <P31>
##$PROCNO= 1
##$TYPE= <nmr>
##$USER= <she>
##$AMP= (0..31)
100 100 100 100 100 100 100 100 100 100 100 100 100 100 100 100 100 100 
100 100 100 100 100 100 100 100 100 100 100 100 100 100 
##$AQSEQ= 0
##$AQ_mod= 1
##$AUNM= <au_zg>
##$AUTOPOS= <>
##$BF1= 81.014009
##$BF2= 200.13
##$BF3= 200.13
##$BF4= 200.13
##$BF5= 200.13
##$BF6= 200.13
##$BF7= 200.13
##$BF8= 200.13
##$BYTORDA= 1
##$CFDGTYP= 0
##$CFRGTYP= 5
##$CHEMSTR= <none>
##$CNST= (0..31)
1 1 145 1 1 1 1 1 1 1 1 1 1 1 1 1 1 1 1 1 1 1 1 1 1 1 1 1 1 1 1 1 
##$CPDPRG= <waltz16>
##$CPDPRG1= <>
##$CPDPRG2= <waltz16>
##$CPDPRG3= <>
##$CPDPRG4= <mlev>
##$CPDPRG5= <mlev>
##$CPDPRG6= <mlev>
##$CPDPRG7= <mlev>
##$CPDPRG8= <mlev>
##$CPDPRGB= <>
##$CPDPRGT= <>
##$D= (0..31)
0 1 0 0 0 0 0 0 0 0 0 0.03 2e-05 3e-06 0 0 0 0 0 0 0 0 0 0 0 0 0 0 0 0 
0 0 
##$DATE= 1622618839
##$DBL= (0..7)
120 120 120 11 120 120 24 19 
##$DBP= (0..7)
150 150 150 150 150 150 150 150 
##$DBP07= 0
##$DBPNAM0= <>
##$DBPNAM1= <>
$$ [...]
##$SUBNAM3= <"">
##$SUBNAM4= <"">
##$SUBNAM5= <"">
##$SUBNAM6= <"">
##$SUBNAM7= <"">
##$SUBNAM8= <"">
##$SUBNAM9= <"">
##$SW= 501.771253377433
##$SWIBOX= (0..15)
0 1 3 0 0 0 0 0 0 0 0 0 0 0 0 0 
##$SW_h= 40650.406504065
##$TD= 32768
##$TD0= 1
##$TE= 0
##$TE2= 300
##$TE3= 300
##$TEG= 300
##$TL= (0..7)
0 120 53 12 22 120 120 120 
##$TP= (0..7)
150 150 150 150 150 150 150 150 
##$TP07= 0
##$TPNAME0= <>
##$TPNAME1= <>
##$TPNAME2= <>
##$TPNAME3= <>
##$TPNAME4= <>
##$TPNAME5= <>
##$TPNAME6= <>
##$TPNAME7= <>
##$TPOAL= (0..7)
0.5 0.5 0.5 0.5 0.5 0.5 0.5 0.5 
##$TPOFFS= (0..7)
0 0 0 0 0 0 0 0 
##$TUNHIN= 0
##$TUNHOUT= 0
##$TUNXOUT= 0
##$USERA1= <user>
##$USERA2= <user>
##$USERA3= <user>
##$USERA4= <user>
##$USERA5= <user>
##$V9= 5
##$VALIST= <valist>
##$VCLIST= <CCCCCCCCCCCCCCC>
##$VD= 0
##$VDLIST= <DDDDDDDDDDDDDDD>
##$VPLIST= <PPPPPPPPPPPPPPP>
##$VTLIST= <TTTTTTTTTTTTTTT>
##$WBST= 1024
##$WBSW= 4
##$XGAIN= (0..3)
0 0 0 0 
##$XL= 0
##$YL= 0
##$YMAX_a= 11060
##$YMIN_a= -10653
##$ZGOPTNS= <>
##$ZL1= 120
##$ZL2= 120
##$ZL3= 120
##$ZL4= 120
##$ABSF1= 248.5645
##$ABSF2= -253.2056
##$ABSG= 5
##$ABSL= 3
##$ALPHA= 0
##$AQORDER= 0
##$ASSFAC= 0
##$ASSFACI= 0
##$ASSFACX= 0
##$ASSWID= 0
##$AUNMP= <proc_1d>
##$AZFE= 0.1
##$AZFW= 0.5
##$BCFW= 0
##$BC_mod= 2
##$BYTORDP= 0
##$COROFFS= 0
##$CY= -3
##$DATMOD= 1
##$DC= 0
##$DFILT= <>
##$DTYPP= 0
##$F1P= 0
##$F2P= 0
##$FCOR= 1
##$FTSIZE= 65536
##$FT_mod= 6
##$GAMMA= 0
##$GB= 0
##$INTBC= 1
##$INTSCL= 5.30512e-09
##$ISEN= 30
##$LB= 1
##$LEV0= 0
##$LPBIN= 0
##$MAXI= 10000
##$MC2= 0
##$MEAN= 0
##$ME_mod= 0
##$MI= 50
##$NCOEF= 0
##$NC_proc= -6
##$NLEV= 6
##$NOISF1= 182.463
##$NOISF2= 159.3651
##$NSP= 0
##$NTH_PI= 0
##$NZP= 0
##$OFFSET= 248.5645
##$PC= 4
##$PHC0= -6023.352
##$PHC1= 394.27
##$PH_mod= 1
##$PKNL= yes
##$PPARMOD= 0
##$PSCAL= 0
##$PSIGN= 0
##$REVERSE= no
##$SF= 81.014009
##$SI= 65536
##$SIGF1= 159.3651
##$SIGF2= -187.1042
##$SINO= 113.3802
##$SIOLD= 16384
##$SREGLST= <1H.CDCl3>
##$SSB= 0
##$STSI= 65536
##$STSR= 0
##$SW_p= 40650.406504065
##$SYMM= 0
##$S_DEV= 0
##$TDeff= 32768
##$TDoff= 0
##$TI= <>
##$TILT= no
##$TM1= 0
##$TM2= 0
##$TOPLEV= 0
##$USERP1= <user>
##$USERP2= <user>
##$USERP3= <user>
##$USERP4= <user>
##$USERP5= <user>
##$WDW= 1
##$XDIM= 65536
##$YMAX_p= 343262752
##$YMIN_p= -66828900
$$ End of Bruker specific parameters
$$ ---------------------------------
##NTUPLES= NMR SPECTRUM
##VAR_NAME=  FREQUENCY,     SPECTRUM/REAL,   SPECTRUM/IMAG
##SYMBOL=    X,             R,               I
##VAR_TYPE=  INDEPENDENT,   DEPENDENT,       DEPENDENT
##VAR_FORM=  AFFN,          ASDF,            ASDF
##VAR_DIM=   65536,         65536,           65536
##UNITS=     HZ,            ARBITRARY UNITS, ARBITRARY UNITS
##FACTOR=    0.620285442955139, 1,           1
##FIRST=     20137.2065510759, 0,            0
##LAST=      -20513.1999529892, 0,           0
##MIN=       -20513.1999529892, -66828900,   0
##MAX=       20137.2065510759, 343262752,    0
$$ Real data points
##PAGE= N=1
##DATA TABLE= (X++(R..R)), XYDATA
$$ [...]
##PAGE= N=2
##DATA TABLE= (X++(I..I)), XYDATA
13015b005266j874578j025585j471899Q03880N239530N122833r44435m919705
13007a075225j498248L572338L202762j45263l54498J348175m58654m809779n345132
12998e563524o93174L455638K930861q9893j635985p34342J259406K590944J768383
12989C288314r36097k686550j346738J096658J193995p87923j601216j66034J543063
12980d02528K279112K572055K212728L23195k018470k733061k338058k954538
12972c059565l772343j787887K381234M122679J839958k54157J088781K797288
12964C355988N56621l998146n595191k995648J45584J398472K065442K990493
12956b076385K083620j720277m957022l348783K063087N608403L968787j82242
$$ plain form
13015 -2005266 -3879844 -4905429 -6377328 -5573448 -333918 4788915 3844480 -1075225
13007 -1075225 -2573473 998865 4201627 4056364 3701866 5050041 4591387 -218392 -5563524
12998 -5563524 -6256698 -2801060 129801 39908 -1596077 -2330419 -1071013 1519931 3288314
12989 3288314 2352217 -334333 -1681071 -584413 609582 -178341 -1779557 -1945591 -402528
12980 -402528 1876584 4448639 6661367 6984562 4966092 2233031 -105027 -3059565
12972 -3059565 -6831908 -8619795 -6238561 -2115882 -275924 -530081 558700 3355988
12964 3355988 3912609 -85537 -5680728 -8676376 -8530792 -7132320 -5066878 -2076385
12956 -2076385 7235 -1713042 -6670064 -10018847 -7955760 -2347357 1621430 1439188
12948A439188k361990j610367L6900J222024J826166J293469n82166j948582j070802
12939a756160L30351o39202k848029k444184N01151J643717k14641q37478J918069
12930d346406L808149J212712k464561k130812J191000K828434J498766q20801
12922G76481k919293l704183j057027L900918N514213J914315l24575L392530
12914G493379O195590m090r498695r746157r37014M246576M75404l705707j559722
12905g040436K264907K280798R40536J281643P97373j509894j278004K159202
12897a03875K248431k973397n314096k1321N030160K631677j119242J659032N514509
12888G551878J206903o667842o320244J280636M221920m38461l548291j004015
$$ plain form
12948 1439188 -922802 -2533169 -2496269 -1274245 551921 1845390 1263224 -685358 -1756160
12939 -1756160 -1425809 -2065011 -4913040 -7357224 -6856073 -5212356 -5426997 -6264475 -4346406
12930 -4346406 -538257 674455 -1790106 -3920918 -2729918 98516 1597282 776481
12922 776481 -2142812 -5846995 -6904022 -3003104 2511109 4425424 4100849 7493379
12914 7493379 13688969 13684879 4186184 -5559973 -6496987 -2250411 -1775007 -5480714 -7040436
12905 -7040436 -4775529 -2494731 -1554195 -272552 524821 -985073 -2263077 -103875
12897 -103875 2144556 -828841 -6142937 -6164258 -1134098 1497579 378337 2037369 7551878
12888 7551878 8758781 2090939 -4229305 -2948669 1273251 834790 -2713501 -3717516
12880c717516N78932k011417k414313K580963O119748L298192j34102J718519
12872F019006M308816Q82436n093266m775899K111484O475828K433983n474274
12864F888114q609826m085072K965940N468264J921796k526166k728184N32658
12856a72476L105608L549580K944762P64114l736338p040017m481673J874400
12848c192040M716464J958529o43665O51399J668914k084192p405851p687492
12840a2017934j812193N136428P734562M346875j983533n184277j972724K991029
12832b761767K285710l018229l822137K668930O904474J064036p782465p217776
12824a1679224K130303P711517L477148k685492k063997K690051L327717j355632
$$ plain form
12880 -3717516 -3138584 -5150001 -7564314 -4983351 1136397 4434589 4300487 6019006
12872 6019006 10327822 11210258 6116992 1341093 3452577 9928405 12362388 6888114
12864 6888114 -1721712 -5806784 -2840844 2627420 4549216 2023050 -705134 -172476
12856 -172476 2933132 6482712 9427474 10191588 6455250 -584767 -5066440 -3192040
12848 -3192040 1524424 3482953 2839288 3490687 5159601 3075409 -4330442 -12017934
12840 -12017934 -13830127 -8693699 -959137 3387738 1404205 -3780072 -5752796 -2761767
12832 -2761767 -476057 -3494286 -7316423 -4647493 2256981 3321017 -4461448 -11679224
12824 -11679224 -9548921 -1837404 1639744 -1045748 -3109745 -419694 2908023 1552391
12816A552391m581862j595543M230771O103237K001558l490465m957705k197444
12808b935062N78762Q11632N27031K260883M300796K637776k874428p015778n028042
12799f736430J360620N427527L200337j713495k693009J076391L382178n2270
12791C251849m721581l191986M110224Q837949N453386k476605p663374o872324
12783c272462k142533K107742J930667k663762o037124k705069M275720N812162
12775b694659m65272n937958l169747L525218N228969J322802j687471j053385
12767d931503J55811N02676K014384M178893L168946j160628l526297j029488
12759f27206K321216J919855q54376j877991p69173j71276o53909l50470J001960
$$ plain form
12816 1552391 -3029471 -4625014 -394243 5708994 7710552 4220087 -737618 -2935062
12808 -2935062 -2356300 -1544668 -1017637 1243246 5544042 8181818 5307390 -1708388 -6736430
12799 -6736430 -5375810 51717 3252054 1538559 -1154450 -78059 3304119 3251849
12791 3251849 -1469732 -4661718 -551494 8286455 13739841 11263236 3599862 -3272462
12783 -3272462 -5414995 -3307253 -1376586 -4040348 -10077472 -12782541 -8506821 -2694659
12775 -2694659 -3159931 -9097889 -12267636 -8742418 -3513449 -2190647 -3878118 -4931503
12767 -4931503 -4775692 -4273016 -2258632 1920261 5089207 3928579 402282 -627206
12759 -627206 1694010 3613865 2759489 881498 112325 -58951 -712860 -1063330 -61370
12750f1370J093337j398963m451051m734916j159958L894350O536325M894123
12742D611877J089085q89659L26251K020087J117297j686952k920491r50300K037451
12733D754646K926074J176571j230291k318021j635903k8613R55708j0183k307801
12724B282187l032768k69805L444919L489265m42885l382728k149065N4690p55220
12715g61410k342028J34216N271291O381296J603689l083659k919451o96811o93792
12706B893341j428782N23698L187005J796098k733055m008829O08407N955483
12698F793366O015777J305593k951264l537015j525926P99458K440879K791907
12690A2132775O65480l763894o910370m551513K267045O763586M381073r76797
$$ plain form
12750 -61370 1031967 -366996 -4818047 -9552963 -10712921 -6818571 -282246 4611877
12742 4611877 5700962 4811303 5137554 7157641 8274938 6587986 3667495 2717195 4754646
12733 4754646 7680720 8857291 7627000 5308979 3673076 3644463 4600171 4589988 2282187
12724 2282187 -750581 -1020386 2424533 5913798 5470913 2088185 -60880 -6190 -761410
12715 -761410 -3103438 -2969222 2302069 8683365 10287054 7203395 4283944 3587133 2893341
12706 2893341 1464559 1988257 5175262 6971360 4238305 229476 837883 6793366
12698 6793366 12809143 14114736 11163472 7626457 6100531 6899989 9340868 12132775
12690 12132775 12798255 9034361 2123991 -2427522 -160477 6603109 10984182 10007385
12682A0007385k434522j24590q6019l349346l304919L057294Q146272M068599
12674A5980154m754469p030700p75009M104991L95120o548697p079631l68374
12666f076615N594806M790172n76465m414950l852748p33307J903839K683781
12658f81487J583875r88203l499653l266068M71554M097657L217125j154841l381522
12649c601563j111829J435051J66872k791257l078375p95555J174309K873062
12641e729285N878955P716508L921647l808960p478909l100985L527752M566237
12633E492960K10044k861308j214747J440764M03209l365679m959001k598098
12625g451856m9143q93693k874819j214827L368263M615912N8180m349680k439108
$$ plain form
12682 10007385 7572863 7448273 7362254 4012908 707989 3765283 11911555 15980154
12674 15980154 11225685 4194985 3419976 7524967 7920087 1371390 -5708241 -6076615
12666 -6076615 -481809 4308363 3731898 -683052 -4535800 -5269107 -3365268 -681487
12658 -681487 902388 -85815 -3585468 -6851536 -6379982 -2282325 934800 -220041 -3601563
12649 -3601563 -4713392 -3278341 -3111469 -5902726 -8981101 -9776656 -8602347 -5729285
12641 -5729285 149670 7866178 11787825 7978865 499956 -2601029 926723 5492960
12633 5492960 5703004 2841696 1626949 3067713 3470922 105243 -4853758 -7451856
12625 -7451856 -7500999 -8394692 -11269511 -12484338 -9116075 -4500163 -4441983 -8791663 -11230771
12616a1230771L065004M570940M51279l676515l599039q55827J840576M136446
12608e297907N536591M144236L33911j891581J42838L910515M928461J992681
12600A3799745k417781n152852m503947j099535K123692K382604J65888j746027
12592C551787k409609l294303m396450l108206J461901N788606N742484J553922
12584D890132k665105l372808p60683J645109N91868k693062l243027O62824L686163
12575a258589Q01432l818887j941361N357175P774668J183034n701939m546092
12567b150559O99687J758089r12588j502532l02826j949830m840638k542044M400155
12558g343086P735739M273602O00313J914706L942827O77946n759385q365085
$$ plain form
12616 -11230771 -8165767 -3594827 -3143548 -6820063 -10419102 -11274929 -9434353 -5297907
12608 -5297907 238684 4382920 4716831 2825250 2968088 6878603 11807064 13799745
12600 13799745 11381964 6229112 1725165 625630 2749322 5131926 5297814 3551787
12592 3551787 1142178 -2152125 -6548575 -9656781 -8194880 -2406274 3336210 4890132
12584 4890132 2225027 -1147781 -1908464 -263355 328513 -2364549 -5607576 -4944752 -1258589
12575 -1258589 -457157 -4276044 -6217405 -860230 6914438 8097472 2395533 -2150559
12567 -2150559 -1450872 307217 -605371 -2107903 -2410729 -4360559 -9201197 -11743241 -7343086
12558 -7343086 392653 4666255 5266568 7181274 11124101 11802047 6042662 -2322423
12550b322423m672627J566498N570934N015697P23895l355381l183948L08706
12542c48649K077148M95301j77643K486010L848956o42891p059529p685812j937482
12533h944591L320446L463971O95160r70076l97614J555737L536045L533762N32272
12524F325112l241826m564766l506194k464939j664949N85753L610065M541727
12516c80017K790728L47229k013614m400403m473626k36763M079232J953639m650563
12507f984158o320198l79051M511907K219942j259724J147897N138970K953896
12499A029481k593028l126621K73320p32395n986842n965641J811186P478422
12491g812118M051438k381946l389870m45965L73787r29818m44357J555061J931333
$$ plain form
12550 -2322423 -6995050 -5428552 142382 5158079 5881974 2526593 -657355 -348649
12542 -348649 1728499 2223800 2046157 4532167 8381123 7738232 678703 -7007109 -8944591
12533 -8944591 -5624145 -2160174 -1465014 -2435090 -2832704 -1276967 2259078 5792840 6325112
12524 6325112 3083286 -1481480 -4987674 -7452613 -9117562 -8531809 -4921744 -380017
12516 -380017 2410711 2757940 744326 -3656077 -8129703 -8366466 -4287234 -2333595 -6984158
12507 -6984158 -13304356 -13683407 -9171500 -6951558 -8211282 -7063385 -1924415 1029481
12499 1029481 -1563547 -4690168 -4416848 -5149243 -11136085 -17101726 -15290540 -7812118
12491 -7812118 -3760680 -6142626 -9532496 -9978461 -9604674 -10534492 -10978849 -9423788 -7492455
12482g492455J032729J376103K271702J314303o86247j184043m10859L4750Q32281
12473b911736K614379K618832j092426m484998k544483K458689M105347J845152
12465B608756O94027J408236q14913o269523p695381j332959N925540O063741
12457E87524J371248k60947K093857K136840k431720o041855m216316j05042J270331
12448e596080N41380J279934K959269K029073j206134k311266J68659K418188
12440B83023J801466P51547J526339J810754m32009k053028m6081J886398j089168
12431D439241n405556l409139L620676N909422L338n959918n012808p15872R97641
12422e532975J169791K658956K826877r07043l931434j157933L667070L883804
$$ plain form
12482 -7492455 -6459726 -5083623 -2811921 -1497618 -2183865 -3367908 -3778767 -3744017 -2911736
12473 -2911736 -297357 2321475 1229049 -3255949 -5800432 -3341743 763604 2608756
12465 2608756 3302783 4711019 3896106 -2373417 -10068798 -11401757 -5476217 587524
12457 587524 1958772 1697825 3791682 5928522 3496802 -2545053 -6761369 -6866411 -5596080
12448 -5596080 -5054700 -3774766 -815497 1213576 7442 -2303824 -2135165 283023
12440 283023 2084489 2836036 4362375 6173129 5741120 3688092 3642011 5528409 4439241
12431 4439241 -966315 -4375454 -754778 5154644 5157982 -801936 -5814744 -6530616 -5532975
12422 -5532975 -4363184 -1704228 1122649 215606 -3715828 -4873761 -1206691 2677113
12414B677113J217884J878918M425097J970664m567427o153138J80988O426378
12406H056477N494946j25679m570105o146433n425713k358803J124864J260925
12398b689521j535607j990083J814654M928671L376994J23497m67664Q29178J100833
12389E490952M59728J13184r70000l498985n122848l715517o08609J956780L294228
12380b601087K377932j805620n718186l034147N290554R068584K517415o144340
12372d8895n963192R10476L564219o76229l729508q74781K621719J498266j316914
12363d014839r34545J323954J261678p78880j235261J26673O0296k221608l273065
12354i685597o55961L022702L291833l68551l980266m139965j714018L00454R41763
$$ plain form
12414 2677113 3894997 5773915 10199012 12169676 7602249 1449111 1630099 8056477
12406 8056477 13551423 13425744 8855639 2709206 -2716507 -5075310 -3950446 -2689521
12398 -2689521 -4225128 -6215211 -4400557 528114 3905108 4028605 3560941 4390119 5490952
12389 5490952 5950680 6063864 5093864 1594879 -3527969 -7243486 -7852095 -5895315 -2601087
12380 -2601087 -223155 -2028775 -7746961 -10781108 -5490554 3578030 6095445 -48895
12372 -48895 -6012087 -5101611 -1537392 -2213621 -5943129 -6817910 -4196191 -2697925 -4014839
12363 -4014839 -4949384 -3625430 -2363752 -3142632 -4377893 -4251220 -4190924 -6412532 -9685597
12354 -9685597 -10341558 -7318856 -4027023 -4395574 -8375840 -12515805 -14229823 -13929369 -12987606
12345a2987606J564834K844519L675029L082311J435625m02323j596753j224897
12337c609261N20454J428990m4989j621117J69772M192283N271283J338650l755103
12328C890962n831974m907522k490291J284937N098232N181680M70802m162694
12320a465868l956588r91123n35553k722014k806118J003110M715340M224596
12312b534218L35820k957307l037356o87709J218927Q14960m97739L03527L489593
12303c551502N624853M063990L93944k121583k510902j788913p45810K3289k03520
12294h16154p48309K68452K526268K847091m0369k863460k391604R6933J634701
12285E13549K031165K458850K268189N37525j530165k737210l796591m382944
$$ plain form
12345 -12987606 -11422772 -8578253 -4903224 -1820913 -385288 -787611 -2384364 -3609261
12337 -3609261 -3088807 -1659817 -1704806 -3325923 -3156151 1036132 6307415 7646065 3890962
12328 3890962 -1941012 -6848534 -9338825 -8053888 -2955656 2226024 2696826 -1465868
12320 -1465868 -5422456 -6413579 -6949132 -9671146 -12477264 -11474154 -6758814 -2534218
12312 -2534218 -2198398 -5155705 -8193061 -8880770 -7661843 -6846883 -7344622 -7041095 -3551502
12303 -3551502 2073351 6137341 6531285 4409702 1898800 109887 -635923 -612634 -816154
12294 -816154 -1564463 -1296011 1230257 4077348 4036979 1173519 -1218085 -1121152 513549
12285 513549 2544714 5003564 7271753 7809278 6279113 3541903 -254688 -4637632
12277d637632j901417L279864N510032J501582l578900l185770J045082L029077
12269A061918K067223J659554J368731j700140m956704k935199K434104L353901
12261B353388j183478l553086l39965K353659K1829k774574j176699J660588J222854
12252a415484j99307J053252K178665p45335m105940j834352L807873N136094
12244C875466J270207j247369j01676o03475n227669q004191l917840K543533
12236a1413014M211351K065667K292119N059649M123929k048605o407797l695942
12228e812643J504661K112817o24124j38112M141327N816326J743574l709635
12220E034191o021524n769332m321414n99384M451920O054919K635753n93339
$$ plain form
12277 -4637632 -6539049 -3259185 2250847 3752429 173529 -3012241 -1967159 1061918
12269 1061918 3129141 4788695 6157426 4457286 -499418 -3434617 -1000513 2353388
12261 2353388 1169910 -2383176 -2723141 -369482 -347653 -3122227 -4298926 -2638338 -1415484
12252 -1415484 -1614791 -561539 1617126 871791 -3234149 -5068501 -1260628 3875466
12244 3875466 5145673 3898304 3796628 3193153 -2034516 -10038707 -13956547 -11413014
12236 -11413014 -7201663 -5135996 -2843877 2215772 6339701 4291096 -2116701 -5812643
12228 -5812643 -4307982 -2195165 -2819289 -2957401 1183926 7000252 8743826 5034191
12220 5034191 -987333 -6756665 -11078079 -11677463 -7225543 -1170624 1465129 871790
12212H71790J43324P53107l086065p092782m706150J659569L985388Q18020k213645
12203h867444k377301j890570r81979K356171N739135M259877l34200j029556
12195c125867K713350L641854p71410l755653p04065L460267K941124n27173k726787
12186A145640l465690l300056n02618L796784M092817p67115m008298j438534
12178d447070J533028l69319k759815M54748N958459O632701L203161J275794
12170A1481687R63288j239436l653939k122355R17017l13351m226733m049508
12162b243330K34458J873961q03787k352889q33413o21304k692945j862261L049607
12153f251903N519670K192549j050406P18876L030653M42535l286042j573861
$$ plain form
12212 871790 1015114 1768221 -1317844 -8410626 -13116776 -11457207 -7471819 -6653799 -8867444
12203 -8867444 -11244745 -13135315 -14117294 -11761123 -6021988 -1762111 -2096311 -3125867
12195 -3125867 -412517 3229337 2457927 -1297726 -2001791 1458476 4399600 3872427 1145640
12186 1145640 -2320050 -5620106 -6122724 -2325940 1766877 999762 -3008536 -4447070
12178 -4447070 -2914042 -3283361 -6043176 -5588428 370031 7002732 10205893 11481687
12170 11481687 12444975 11205539 7551600 5429245 6346262 6032911 1806178 -2243330
12162 -2243330 -2008872 -134911 -938698 -3291587 -4125000 -4746304 -7439249 -9301510 -6251903
12153 -6251903 -732233 1460316 409910 1128786 4159439 4601974 1315932 -257929
12145b57929L056173K362999m204492p973035l555170L996997O720659L377413
12137C523615j336611l759198l946746k894675n46623K666973M348161K135050
12129A89946k878967o278842m837656j38002L304772L002458N36579r14522J23424
12120g890810K546068M135151L662655J829328J17680r00342j378400j039758
12112A081572Q1848L30838j564238l424850j962400J534807K060710j414282l850119
12103g126114j888444J302686K055954J909543L054630L132599p0971l270003
12095i00120k973427j775509k752820k261238L397847Q335044M393275m348583
12087A114469n827667J609411O834227L495882j865630k748199k164123l508398
$$ plain form
12145 -257929 2798244 5161243 956751 -7016284 -10571454 -6574457 146202 3523615
12137 3523615 2187004 -1572194 -5518940 -8413615 -8960238 -6293265 -1945104 189946
12129 189946 -2689021 -8967863 -13805519 -13943521 -10638749 -7636291 -7099712 -8014234 -7890810
12120 -7890810 -5344742 -1209591 2453064 4282392 4400072 3499730 2121330 1081572
12112 1081572 1163420 1494258 -69980 -3494830 -5457230 -3922423 -1861713 -3275995 -7126114
12103 -7126114 -9014558 -7711872 -5655918 -3746375 -691745 2440854 2369883 -900120
12095 -900120 -3873547 -5649056 -8401876 -10663114 -7265267 1069777 5463052 1114469
12087 1114469 -4713198 -3103787 3730440 7226322 5360692 2612493 448370 -3060028
12079c060028k529991L728916Q452793M496037l694430o395189k566376Q23265
12071g45003L75886q28632l45390O07440Q20491N49291j84478q44252O15147M365745
12061D386245O479104L923044o12165k859970l199262m208009m755500j956607
12053b803120K688109M465435K078410j261801k733010k256986q75907J02949
12045e95921l97203j166154N06066L698206L388007j577011m833913j666613L140404
12036D95868K917592j98206j53021J459835j517820p267778p186006N1192N756812
12027e641532M596797J394127J391232K237935J73410k883503l508252k589436
12019d829222k236522j366219J275578L547748L355412K315329K533545K942831
$$ plain form
12079 -3060028 -5590019 -1861103 6591690 11087727 7393297 998108 -1568268 -745003
12071 -745003 -369117 -1197749 -1543139 -935699 -115208 434083 249605 -594647 20500 4386245
12061 4386245 10865349 14788393 14176228 11316258 8116996 3908987 -846513 -2803120
12053 -2803120 -115011 4350424 6428834 5167033 2434023 177037 -698870 -595921
12045 -595921 -993124 -2159278 -1653212 2044994 5433001 3855990 -977923 -2644536 495868
12036 495868 3413460 3215254 3062233 4522068 3004248 -4263530 -11449536 -11398344 -5641532
12027 -5641532 -1044735 349392 1740624 3978559 4151969 1268466 -2239786 -4829222
12019 -4829222 -7065744 -8431963 -7156385 -3608637 -253225 2062104 4595649 7538480
12011G538480J982982O92445J06911j157430l642615m598411k140067R28042Q10225
12002E20562j932997l631066k216506J524266N295652O071484K121960l846090
11994C907265o330862l686112j69476M63200j09077J331393M177054N522431M281500
11985I387316J141242k879710n536878m181801L3586K093234j03919k461698j128446
11976c637074J629977J718896j43492l78424J535139L198312L212218J540872
11968H676424j668570m585205m007490l53136J232362j610358l911718q79420
11960g107111M197889N124733K223898L00319J77455r18763k651038k229548n39786
11951a421952r21399k537689j337224K678873N048097L557023K40511k536951
$$ plain form
12011 7538480 9521462 10213907 10320818 9163388 5520773 922362 -1217705 -289663 520562
12002 520562 -1412435 -5043501 -7260007 -5735741 -440089 5631395 7753355 3907265
11994 3907265 -2423597 -6109709 -6279185 -5815985 -5925062 -4593669 -416615 5105816 9387316
11985 9387316 10528558 7648848 2111970 -2069831 -2036245 56989 -46930 -2508628 -3637074
11976 -3637074 -2007097 -288201 -431693 -810117 725022 3923334 7135552 8676424
11968 8676424 7007854 2422649 -1584841 -1937977 -705615 -2315973 -6227691 -7107111
11960 -7107111 -2909222 2215511 4439409 4739728 4917183 3998420 1347382 -882166 -1421952
11951 -1421952 -2343351 -4881040 -6218264 -3539391 1508706 5065729 5306240 2769289
11943B769289l168152N6202N312559N578407k342689j0073634p661981J107000
11935h422999L838338j292102l653376J520198N913145L169008j133157p52258
11927h13203P58024j520019m059093j729050K934690N067670N325093N149671
11919A1113783J516541n564936p832822n64457P223088M963698l081610n339334
11911B433951j595475p54977l364187j336011N217485O022972j616274p005601
11903a998117l162569K536498J710693j675666L1111M445473L869854j428106
11895D329171m153668j699535J224282Q78542j151567k074799j424184L9061J458410
11886b574287J660420L23944q15302O0092K178580L163342J982653m31947k592795
$$ plain form
11943 2769289 -398863 -342661 4969898 10548305 8205616 -1868018 -9529999 -8422999
11935 -8422999 -4584661 -5876763 -9530139 -8009941 -2096796 1072212 -60945 -813203
11927 -813203 -55179 -1575198 -5634291 -7363341 -4428651 639019 5964112 11113783
11919 11113783 12630324 7065388 -767434 -1331891 5891197 10854895 7773285 2433951
11911 2433951 838476 83499 -3280688 -4616699 600786 6623758 5007484 -1998117
11903 -1998117 -5160686 -2624188 -913495 -2589161 -2558050 1887423 5757277 4329171
11895 4329171 175503 -1524032 -299750 578792 -572775 -2647574 -4071758 -4032697 -2574287
11886 -2574287 -913867 -589923 -1405225 -1345133 833447 3996789 5979442 5547495 2954700
11877B954700l364400k493531j014674m5336Q50987K318463K733761J80080l199686
11868a079636k957511O74577K118565j301388m972844l734473J071622M700510
11860e480578N509587M587778K209753j074102k472672m18688K098871J642487
11852F602436m53836j007619n85428j420203k092893J01474L088073K412989j007669
11843E637324j855069P05719J585021j470342l976076k205080Q85643Q56475j256312
11834a092697j229841J771751M585021M537633J911814j032170j938955n44442
11826F968114L27456j988517n445565n193794q18182K434775J452817k26931J216752
11817a273075L341256J770271k182073l493054j209612Q66853L88857j259901
$$ plain form
11877 2954700 -409700 -2903231 -3917905 -3963241 -3112254 -793791 1939970 2120050 -1079636
11868 -1079636 -4037147 -3362570 -1244005 -2545393 -7518237 -11252710 -10181088 -5480578
11860 -5480578 29009 4616787 6826540 5752438 3279766 2861078 4959949 6602436
11852 6602436 6148600 5140981 4555553 3135350 1042457 1143931 4232004 6644993 5637324
11843 5637324 3782255 4487974 6072995 4602653 626577 -1578503 -692860 163615 -1092697
11834 -1092697 -2322538 -550787 4034234 8571867 10483681 9451511 7512556 6968114
11826 6968114 7295570 5307053 -138512 -5332306 -6150488 -3715713 -2262896 -2489827 -1273075
11817 -1273075 2068181 3838452 1656379 -1836675 -3046287 -2179434 -1790577 -3050478
11809c050478k358523k222248K79220N107197Q283139N558106q58051m090598
11801F647764j879302Q98267K70617j497265j002071P11824R56695j44968j396744
11792C564817l151623m733691k913771K814064O734871L706957k972924n758819
11784b710119l072661K80467J669688L277712N932745O500096L316865n86331
11776A4608462j904221j060956j33032p4492j174169k886462k572818J455264
11768F257576N114228K215457n492979q245669j517230O790118P265397J551311
11760A3938209k255028k133206k301136l585646k184776K084873L970334Q11473
11752H345097l560111m810850l124697n63468K083966L909121L243389M16835
$$ plain form
11809 -3050478 -5409001 -7631249 -7352029 -2244832 6038307 11596413 10738362 6647764
11801 6647764 4768462 5666729 5937346 4440081 3438010 4149834 5106529 4961561 3564817
11792 3564817 413194 -4320497 -7234268 -4420204 2314667 6021624 3048700 -2710119
11784 -2710119 -5782780 -5502313 -3832625 -554913 5377832 11877928 15194793 14608462
11776 14608462 12704241 11643285 11510253 11435761 10261592 7375130 4802312 6257576
11768 6257576 11371804 13587261 8094282 -151387 -1668617 5121501 12386898 13938209
11760 13938209 11683181 9549975 7248839 3663193 1478417 3563290 7533624 8345097
11752 8345097 4784986 -25864 -3150561 -3714029 -1630063 2279058 5522447 5939282
11744E939282j830994j980145r92660M47612K471831L501646J362829k311048
11736F608353l134876m85733J491285N46222q36845p34681o66628j166687l9910
11727A580500K302178J607415k699596m854624j931328P35465r95312j813839
11719f069141L816855R706291N598299n874484j0951281l854585N936941P880379
11711F189274K957416j770463l691691m462243m432580k665133R2202K153915
11703e629303K829510J797846q31085k644564p24293L255807L903390o1980l475420
11694a580092k713141r36897j706982k451662M44817M187848L667089M00100L61461
11685c27459L790049M321401o89419n578168m975436j686573j574791l994263
$$ plain form
11744 5939282 4108288 2128143 1135483 1583095 4054926 7556572 8919401 6608353
11736 6608353 3473477 2987744 4479029 5025251 4188406 3453725 2787097 1620410 1580500
11727 1580500 3882678 5490093 2790497 -2064127 -3995455 -3259990 -4255302 -6069141
11719 -6069141 -2252286 7454005 13052304 7177820 -3773461 -7628046 -1691105 6189274
11711 6189274 9146690 7376227 3684536 -777707 -5210287 -7875420 -7783218 -5629303
11703 -5629303 -2799793 -1001947 -1833032 -4477596 -5201889 -1946082 1957308 1895328 -1580092
11694 -1580092 -4293233 -5230130 -6937112 -9388774 -8943957 -4756109 -1089020 -688920 -327459
11685 -327459 3462590 7783991 7094572 1516404 -3459032 -5145605 -6720396 -10714659
11677a0714659k850728L418203Q257026N665920j113284l729742k52732K628968
11669A308972K52276k750783l53194M171138K902127l301207n200497j78762K915504
11660b34426j625964o216620k175397N429102N499040j279124m153221o2411K693406
11651b125615k03400k190235J448719M766087J790610k783997j787174K195640
11643A110635J896486j909252k344854J357698L098499Q25652p92129L52780K68591
11634C864106k794695l965704K18322N383296N718244K244986l58826j565407
11626H744322l901137o274650m650218O89414M122742K458727o83382p26714J129375
11617I08479O63380j914454j923194K013377M695180J715734l107745k463558
$$ plain form
11677 -10714659 -13565387 -10147184 -1890158 3775762 2662478 -1067264 -1319996 1308972
11669 1308972 1561248 -1189535 -1542729 2628409 5530536 2229329 -2971168 -3149930 -234426
11660 -234426 -1860390 -8077010 -10252407 -4823305 675735 -603389 -4756610 -4819021 -2125615
11651 -2125615 -2329015 -4519250 -3070531 1695556 3486166 702169 -1085005 1110635
11643 1110635 3007121 1097869 -1246985 110713 3209212 4034864 3242735 3595515 3864106
11634 3864106 1069411 -2896293 -2677971 2705325 8423569 10668555 10309729 8744322
11626 8744322 4843185 -1431465 -6081683 -5392269 -1269527 1189200 505818 -220896 908479
11617 908479 1571859 -342595 -2265789 -252412 4442768 6158502 3050757 587199
11609E87199L362538N999048J167965m568597l564508J274539J384191l658669
11601A983706n627730j135644L055646J332956j922713k60073M102548M463890
11593E992586P31679j154399Q81798K801342J752424o09105k378856l403947k702855
11584A910667N55218L040570K02014n750641p119891j849877L126928K496781
11576c388231j61627J71061J759804J051954Q0274J924356L296945l45584n380670
11567i91718m315064K047372N523549L422669J500488K734905K276517k897902
11559I300816p417299n838791j272661P5594j759181k372773n48743J581355L072201
11550e179482L800900K308750j029403j620437L007490P282296M444788k830292
$$ plain form
11609 587199 3949737 9948785 11116750 6548153 2983645 4258184 5642375 1983706
11601 1983706 -3644024 -4779668 -1724022 -391066 -2313779 -2573852 1528696 5992586
11593 5992586 6724265 5569866 6451664 9253006 11005430 10396325 8017469 4613522 1910667
11584 1910667 2465885 5506455 5708469 -42172 -7162063 -9011940 -5885012 -3388231
11576 -3388231 -3549858 -3378797 -1618993 -567039 -486765 1437591 4734536 4388952 -991718
11567 -991718 -5306782 -3259410 2264139 5686808 7187296 9922201 12198718 9300816
11559 9300816 1883517 -3955274 -5227935 -5152341 -6911522 -9284295 -9833038 -8251683 -5179482
11550 -5179482 -1378582 930168 -99235 -1719672 1287818 8570114 13014902 10184610
11542A0184610n873561k790733J37484l53271o47453Q44121k5030m120438m783736
11533g428007J465794P126456M119994l443148n488866j284082R96577j467592
11525e402874k311319K205593O652448N458752J366818N088J249598J130678j344607
11516I010175m152150o265124p205414n010663P11029N603503N202303J399460
11508g06881m44870M08835K66707j385122q18789K363873L042709j139020m850063
11499c262621k629076K914636N308393L409323J028965m17470k825902n538806
11491b012558m665171M40403N010655N273126K992142J325009K1719k042615k845703
11482C497007j18388L454164K673928k463737n735445k867010K483125L518038
$$ plain form
11542 10184610 4311049 1520316 1657800 1304529 657076 1501197 1476167 -2644271 -7428007
11533 -7428007 -5962213 1164243 5284237 1841089 -3647777 -4931859 -3935282 -5402874
11525 -5402874 -7714193 -5508600 1143848 6602600 7969418 7974506 9224104 10354782 9010175
11516 9010175 4858025 -1407099 -8612513 -13623176 -12912147 -7308644 -2106341 -706881
11508 -706881 -1151751 -742916 -476209 -1861331 -2680120 -316247 2726462 1587442 -3262621
11499 -3262621 -5891697 -2977061 2331332 5740655 6769620 6352150 3526248 -2012558
11491 -2012558 -6677729 -6237326 -1226671 4046455 7038597 8363606 8385325 6342710 3497007
11482 3497007 3378619 6832783 9506711 7042974 1307529 -1559481 923644 4441682
11474D441682o80215m115663k048053K599584L146904j668235n572752l025104
11466f921852L076241N109495J008610l347334k782552M34161J221848m16233
11458b617616m62346J910958L112439J218569j087815r58769P08975J542322J100867
11449D467584J77162r63635j788043j078339Q22907J526202L88250L44049L177927
11440G074064N367695K596530l028487m924498j202380K673654J702360k131633
11432H127305l514055j149923J403692Q71891k154268m401874l445722k99282
11424d562236J481282K74283q18081J765916N590452M460809j833054n399286
11416I60085j292114M379377L070503l182241m850367M43009M697072K163367
$$ plain form
11474 4441682 3761467 -354196 -2402249 197335 3344239 1676004 -3896748 -6921852
11466 -6921852 -3845611 1263884 2272494 -1074840 -3857392 -3423231 -2201383 -2617616
11458 -2617616 -3079962 -1169004 1943435 3162004 2074189 1115420 1824395 3366717 4467584
11449 4467584 4644746 3681111 1893068 814729 1637636 3163838 3552088 3896137 7074064
11440 7074064 12441759 15038289 12009802 7085304 5882924 8556578 10258938 8127305
11432 8127305 4613250 3463327 4867019 5738910 3584642 -817232 -4262954 -4562236
11424 -4562236 -3080954 -2806671 -3624752 -1858836 3731616 8192425 6359371 960085
11416 960085 -332029 4047348 7117851 3935610 -914757 -471748 4225324 6388691
11408F388691k692749l334250o45310O62507Q7543Q3897L22070r20015k045677
11399b093293o41978J056114p33437l839781k344247L550336O630469L243316
11391D827499j647438k696992j486939j722629k459179j165443O62947O35871
11383e052303R18582M222198O749872K535859n777273q308622j690240N712994
11375f88933N607405N16569k017527p85081j06661q94684J44646K882940K314372
11366F973046l285599q065536n832576J626225O858444N677093Q77147k138563
11358B689681j048240J943267K815770p5078l880510m124583k69091L171448K342533
11349C565197r96520k413598r90605O16988J274687K419895L730050K177209k637056
$$ plain form
11408 6388691 3695942 361692 -283618 378889 466432 550329 872399 -47616 -2093293
11399 -2093293 -2735271 -1679157 -2412594 -6252375 -8596622 -5046286 1584183 4827499
11391 4827499 3180061 483069 -1003870 -2726499 -5185678 -6351121 -5688174 -5052303
11383 -5052303 -4133721 88477 6838349 9374208 3596935 -4711687 -6401927 -688933
11375 -688933 4918472 5435041 3417514 2632433 2525772 1631088 1775734 4658674 6973046
11366 6973046 3687447 -4378089 -10210665 -8584440 -1725996 3951097 4828244 2689681
11358 2689681 1641441 3584708 6400478 6325400 2444890 -1679693 -1948784 1222664 3565197
11349 3565197 2568677 155079 -835526 -218538 1056149 3476044 7206094 9383303 6746247
11340F746247o010543m105965M00144K196268P39863l29505K19365M3307j431839
11331a532658j527282M42187J026074j666036l934749j670334L181009N320003
11323c61786L562820J379560O30644q22537m373049p204134n684086k88866M735456
11314h425978N795848L022239l65668j096967J162249L532278L103345J83248
11306F910594k417510k807643j387556P06574K606601L116433J230146j974082
11298E983557l627949k337981q0369J24607k184957m283734l071045J395256N101734
11289b980881L940453r40824l554665o11270L642482L289969o59595k269689j15877
11280b59897J216649n47834k028063j117020p67054k457546k190321K144563N223072
$$ plain form
11340 6746247 735704 -3370261 -2970117 -773849 -33986 -363491 -144126 -100819 -1532658
11331 -1532658 -3059940 -2617753 -1591679 -3257715 -7192464 -8862798 -5681789 -361786
11323 -361786 3201034 4580594 5211238 4388701 15652 -7188482 -12872568 -13161434 -8425978
11314 -8425978 -2630130 392109 26441 -1070526 91723 3624001 6727346 6910594
11306 6910594 4493084 1685441 297885 1004459 3611060 6727493 7957639 5983557
11298 5983557 2355608 17627 -62742 61865 -2123092 -6406826 -9477871 -8082615 -2980881
11289 -2980881 959572 18748 -3535917 -4147187 -504705 2785264 2125669 -144020 -259897
11280 -259897 956752 408918 -1619145 -2736165 -3503219 -5960765 -8151086 -6006523 -783451
11271g83451K354665j932369r23327K697489J307640l941944m104307K544534
11263b781070O650931J991512n270762o346438j861576J538812J483947Q53794
11255c740850J746235L643235N419256N230644Q38085o211771r413244m623832
11247g112242L482615O657751L330012p07274r97546O37173L65533j925162k841840
11238H89020k30991L399599L064155k112750n976922k439837N164499P119719
11230H876492P67699n402983m155907O17890J632947l55643k50878J027975j037783
11221A719809m440202k735100L152857M889237L408l893827j314721K910919K306024
11212B598404j236227j872154P26371K339555J471840J71705n65573j617475k965449
$$ plain form
11271 -783451 1571214 -361155 -1284482 1413007 2720647 -1221297 -5325604 -2781070
11263 -2781070 3869861 5861373 590611 -5755827 -7617403 -6078591 -4594644 -3740850
11255 -3740850 -1994615 1648620 7067876 12298520 13136605 6924834 -2488410 -7112242
11247 -7112242 -3629627 3028124 6358136 5650862 4653316 5290489 5656022 3730860 889020
11238 889020 658029 4057628 7121783 5009033 -967889 -3407726 1756773 8876492
11230 8876492 9644191 4241208 85301 703191 2336138 1980495 1729617 2757592 1719809
11221 1719809 -2720393 -5455493 -2302636 2586601 2590009 -1303818 -2618539 292380 2598404
11212 2598404 1362177 -509977 216394 2555949 4027789 4199494 3633921 2016446 -949003
11203i49003l495054k676391k86145L705542O957692N355252j152853o111213
11195A347827l946303K263927M806317J734476j638413j387072O0948q20577k742957
11186c21827k091030J048667K889041J509309o46772p71846J95876l64432j988090
11177e41104j681914O70767J289542j331722l005973k4800M444179M884961J984160
11168F688096P59465J538751p9521m042984m502309L9024K950656J9687l308352
11159F2513j002433L400697L040122n56815n34692L182365L859823l95171l541763
11150G514646j647660J510981J661603M96145J195941K469092J361202j323175
11142A3238775k530759j831448j291105j802804k414757k416700j822100n69248
$$ plain form
11203 -949003 -4444057 -7120448 -7406593 -3701051 3256641 8611893 7459040 1347827
11195 1347827 -2598476 -334549 4471768 6206244 4567831 3180759 3241707 2421130 -321827
11186 -321827 -2412857 -1364190 1524851 3034160 2387388 1615542 1811418 1446986 -541104
11177 -541104 -2223018 -1552251 -262709 -1594431 -4600404 -4625204 -181025 4703936 6688096
11168 6688096 7447561 8986312 8906791 4863807 361498 400522 3351178 3370865 62513
11159 62513 -939920 2460777 5500899 4944084 4409392 7591757 11451580 11056409 7514646
11150 7514646 5866986 7377967 9039570 9535715 10731656 13200748 14561950 13238775
11142 13238775 10708016 8876568 7585463 5782659 3367902 951202 -870898 -1440146
11134a440146Q92788J125897m11894j946178j681862n21619l06814k40501J925922
11125b604407N113130M930291K16561l677657j655470L136579L081114k290640
11117F249501m538876J042647O856568L117200p066048j0758484k994596O561625
11109a530463P070358l10956o607773o720155k151854L491400O525311M059582
11101C825450k066626m973445j139336L837257L032465j482121k550362M61565
11093a055153J739936l38129j005624J525425K489887r60788m525009l620033
11085e749488n2903J926859J700100P57350p53995k157862o97351L970419O888512
11076E831641L886457j802516l557404m52698K202786Q26015k168352k593914
$$ plain form
11134 -1440146 -547358 578539 166645 -1779533 -3461395 -3983014 -4289828 -4530329 -2604407
11125 -2604407 2508723 7439014 7655575 3977918 2322448 5459027 8540141 6249501
11117 6249501 1710625 2753272 9609840 12727040 5660992 -5097492 -8092088 -1530463
11109 -1530463 5539895 5228939 -1378834 -8098989 -10250843 -6759443 -234132 3825450
11101 3825450 1758824 -3214621 -4353957 -516700 2515765 1033644 -1516718 -1055153
11093 -1055153 684783 346654 -658970 866455 3356342 2395554 -2129455 -5749488
11085 -5749488 -5802391 -3875532 -2175432 -1418082 -2172077 -4329939 -5027290 -1056871 5831641
11076 5831641 9718098 7915582 4358178 3905480 6108266 6934281 4765929 2172015
11068B172015K18815L443934M112161J573588k220864m354905l433597n76541
11060I34606K072561L139215K266144q5639k464174l316019k814045k653910l385869
11051f307130l309862r13193K816865N451338N507057L167740j59574k323165
11043C930076j756659P41920K470174J718996n61889k262877k326836j286286
11035F66619m73171o25872o53929J248080M209903M316176o9816m685473m660413
11026g27896j681930j094487k944752k028428K680912N364926K540652j237167
11018H71830o82037K299802K567374l07963k786842l064340j633636J142333L732841
11009B139362K456666l441280q057645n380306J966501N787460L294906k74823
$$ plain form
11068 2172015 2390830 5834764 9946925 11520513 9299649 4944744 1511147 934606
11060 934606 3007167 6146382 8412526 8326887 5862713 2546694 -267351 -2921261 -6307130
11051 -6307130 -9616992 -10530185 -7713320 -2261982 3245075 6412815 6253241 3930076
11043 3930076 2173417 2915337 5385511 7104507 6542618 4279741 1952905 666619
11035 666619 193448 -432424 -1086353 161727 4371630 8687806 8617990 3932517 -727896
11026 -727896 -2409826 -3504313 -6449065 -8477493 -5796581 -431655 2108997 871830
11018 871830 189793 2489595 5056969 4749006 1962164 -1102176 -2735812 -1593479 2139362
11009 2139362 4596028 1154748 -6902897 -12283203 -10316702 -4529242 -1234336 -1509159
11001a509159j50498J912231J571414j667567m036248k175990K660688N108520
10993A713391J639368l968613m407611P91000L599285n71220m927269j332385
10985g464054O439416P890675J690807l140202j797919K80576j718911m057470
10977a877082j898642K373167L737492K252799Q02217p79128l828865o055070
10969e273112m096398O15559L227418K015276j96777p98217l50667n73175j656856
10960g086949k213041j080993R64539J695921N18457M177K174375M549574L466165
10951B992225K80771o51253K37622j677964n893894n487760J704917P856319O030903
10942E391886o412k722513j773746j171472p07206J691190L096669n6780l641832
$$ plain form
11001 -1509159 -1659657 252574 1823988 156421 -3879827 -6055817 -3395129 1713391
10993 1713391 3352759 -615854 -5023465 -4232465 -633180 -1204400 -6131669 -7464054
10985 -7464054 -1024638 6866037 8556844 5416642 3618723 3899299 2180388 -1877082
10977 -1877082 -3775724 -1402557 2334935 4587734 5389951 4610823 781958 -5273112
10969 -5273112 -9369510 -8753951 -5526533 -3511257 -3708034 -4506251 -4856918 -5430093 -7086949
10960 -7086949 -9299990 -10380983 -9416444 -7720523 -7202066 -7197889 -5023514 -473940 2992225
10951 2992225 3272996 2621743 2859365 1181401 -4712493 -10200253 -8495336 -639017 5391886
10942 5391886 5385474 2662961 889215 -282257 -989463 701727 3798396 3741616 99784
10933I9784j227056M087049L279515l628164o788423k065751L074544K390351
10925g78151j84055P76736L066411K365124L2087p43992r73682k248042k221398
10916i08962N60644K236559j3613j959733P98187M366801K392768l076573m539292
10907a43214p68079K292665J447545l92132p64123p02622n38670J262397L967490
10898E661257M400898J864028j040677k673009l285369k369449J53233J117153
10890C828065j933462n040585k628565K758346L252119j605880l706295J93579
10882d882678L118343k5779l708973j242339M088634M664628L12896k942945k599749
10873c217962j219926l91705N52363R89756l60907j968437j219610J039253J689444
$$ plain form
10933 99784 -1127272 2959777 6239292 2611128 -4177295 -6243046 -3168502 -778151
10925 -778151 -962206 -185470 2880941 5246065 5278152 4534160 3560478 1312436 -908962
10916 -908962 -348318 1888241 1874628 -85105 713082 5079883 7472651 4396078 -143214
10907 -143214 -911293 1381372 2828917 2436785 1672662 970040 431370 1693767 5661257
10898 5661257 10062155 11926183 10885506 8212497 4927128 2557679 2710912 3828065
10890 3828065 1894603 -3145982 -5774547 -3016201 235918 -1369962 -5076257 -4882678
10882 -4882678 -1764335 -1790114 -5499087 -6741426 -2652792 2011836 2324732 -618213 -3217962
10873 -3217962 -4437888 -4829593 -4277230 -3287474 -3648381 -5616818 -6836428 -5797175 -4107731
10864d107731L80052k63212J051482K836977L248501J752129p63163k173181j213480
10855G48374j75477k182029m861830k046452N776319R242910L185992m481671
10847E206136m001741J563643J905177l904478o697716k268538K977318L009481
10839b210718J42963r18088j36817R5498p76323k048434k721399q77206L622500
10830e828024N878044J150113o402660p143229L69464O504806M299125j183072
10822b355433j739591K097655L992009K003685m70569j307363j487166j553668
10814h20441q13265M29399J069583J096374J087655Q75526M67833P34418J486198
10805E613280P32290k308820n198599n018417j700854K405185M613875L219903
$$ plain form
10864 -4107731 -3727679 -3990891 -2939409 -102432 3146069 4898198 4135035 1961854 748374
10855 748374 572897 -1609132 -6470962 -8517414 -2741095 6501815 9687807 5206136
10847 5206136 1204395 2768038 4673215 768737 -5928979 -8197517 -5220199 -2210718
10839 -2210718 -2067755 -2985843 -3122660 -3027162 -3803485 -5851919 -8573318 -9450524 -5828024
10830 -5828024 50020 1200133 -5202527 -12345756 -11976292 -5471486 -1172361 -2355433
10822 -2355433 -4095024 -1997369 1994640 3998325 3527756 2220393 733227 -820441
10814 -820441 -1633706 -1204307 -134724 961650 2049305 2924831 3392664 4127082 5613280
10805 5613280 6345570 4036750 -1161849 -6180266 -7881120 -5475935 -862060 2357843
10797B357843p40977k926182k96666L566571K320466l298495n342345m77826M585536
10788b52075L586341K82530J282206M414355K401538m449554p846028l862025
10780d442712J932289L409524J517989J59139k62425j270860j986507p59845Q16770
10771h86638j86512k663787k059446K763189O754998N134398J02757k339815r14018
10762E705126R2121j386971j925653N84587K224364l54052l128950p92118L596522
10753D614976K728682k741220m771262j121930J174196j794366l859332O41190
10745e129066O733487O188211j6193l898380k210666Q30940J238964j91954r81508
10736B563835l09825J091215J797420P30408j142527j502037k02243L06786p23008
$$ plain form
10797 2357843 1616866 -1309316 -1605982 1960589 4281055 982560 -4359785 -4837611 -252075
10788 -252075 3334266 3616796 4899002 9313357 11714895 7265341 -580687 -4442712
10780 -4442712 -2510423 899101 2417090 2576229 2313804 1042944 -943563 -1703408 -886638
10771 -886638 -1073150 -3736937 -5796383 -3033194 3721804 8856202 8958959 6619144 5705126
10762 5705126 5797247 4410276 2484623 3069210 5293574 4939522 1810572 1018454 4614976
10753 4614976 7343658 4602438 -168824 -1290754 -116558 -1910924 -5770256 -5129066
10745 -5129066 1604421 7792632 7776439 3878059 1667393 2498333 3737297 3545343 2563835
10736 2563835 2254010 3345225 5142645 5873053 4730526 3228489 3026246 3333032 2610024
10727B610024r65037M55720J125751J72631K56643J927228J308290k709730m683936
10718e02416j278823J971256o36906m682850k506517L553161M713187N33399o16658
10709E46833L673491N385720m28121p137538o847391j896612L60372r09527o95497
10700g948270K374884L990267J433149k244076k641133M88623L706593M255676
10692C415713K561532Q05153L6701o41216k099200l395441k924006r22531L97935
10683b765360m74503k322405k473027q6456K404408K019814o58234j793477M15002
10674e734238K988324K785495J369780J715477K338772j08709l729352l271272
10666a645723Q97863K805960R93412P25444L456047K790959l866495p998022k142623
$$ plain form
10727 2610024 1644987 2100707 3226458 3399089 3655732 5582960 6891250 4181520 -502416
10718 -502416 -1781239 190017 -446889 -5129739 -7636256 -4083095 630092 1163491 546833
10709 546833 4220324 9606044 9177923 2040385 -4807006 -6703618 -6343246 -7252773 -7948270
10700 -7948270 -5573386 -1583119 -149970 -2394046 -5035179 -4546556 -839963 3415713
10692 3415713 5977245 6782398 6819099 6177883 4078683 683242 -2240764 -3163295 -2765360
10683 -2765360 -3239863 -5562268 -8035295 -8121751 -5717343 -3697529 -4355763 -6149240 -5734238
10674 -5734238 -2745914 39581 1409361 3124838 5463610 5354901 1625549 -1645723
10666 -1645723 -747860 2058100 3051512 3776956 7233003 10023962 6157467 -1840555 -3983178
10657c983178P111514P754742j74090n741672l798887m33960j187799k921493
10649c374823m90441M828313P261486L645347l378429p436270l987249L981247
10641A049181P600311K659509m161951m225325Q41691K397192j646065m529507
10633a4964k147372J272194J214539n71463j066669j444619l128002l240653Q19133
10624h307876N481137N047742J22694k931552p99501K837321L177990N66615j335021
10615C859549j218345q20216q72352P6014K177278L040717J715806P74486J854195
10606A0587132K239691n43644l642049k946931J76151J416844N79391L07803l8286
10597H136102k469893m379529k227856O92092q84032l472484J58615O506157N011164
$$ plain form
10657 -3983178 3128336 10883078 10708988 4967316 1168429 734469 -453330 -3374823
10649 -3374823 -3865264 963049 8224535 11869882 8491453 1055183 -2932066 1049181
10641 1049181 8649492 11309001 7147050 2921725 3763416 6160608 4514543 -14964
10633 -14964 -2162336 -890142 324397 -247066 -1313735 -2758354 -5886356 -9127009 -8307876
10624 -8307876 -2826739 2221003 2343697 -587855 -1387356 1449965 4627955 5194570 3859549
10615 3859549 2641204 1820988 948636 1024650 3201928 6242645 7958451 8732937 10587132
10606 10587132 12826823 12283179 8641130 5694199 5870350 7287194 7866585 8174388 8136102
10597 8136102 5666209 1286680 -941176 -249084 -1133116 -4605600 -4446985 2059172 7070336
10588G070336l205656n245118J933483N927123O85202l050183J803112M654501
10580A0572800l328448j0956878m561520Q144007R799629M91911n194221k532736
10572B434544l9279j462165j290298K243228M055780K439288P58684l54654k374016
10563F411112k771398O45036L013000M3511k790407L90948L715121n19734o377231
10554A759958l392531M671312O061156J174431k21549K045836j44531n535330
10546F418752m769608J800791M382105J120504p05286K48235j123926l383319
10538C988248q62994L082200J130235k617530R26117P601064O152975j220530
10530A8179785l394547j065306k791053n207143O86183Q372569M921653l556986
$$ plain form
10588 7070336 3864680 -1380438 553045 6480168 7165370 4115187 5918299 10572800
10580 10572800 7244352 -3712526 -8274046 -130039 9669590 10161501 4967280 2434544
10572 2434544 2395265 933100 -357198 1886030 5941810 8381098 9139782 8785128 6411112
10563 6411112 3639714 4284750 7297750 7341261 4550854 4941802 8656923 8137189 1759958
10554 1759958 -1632573 3038739 9099895 10274326 10052777 12098613 11954082 6418752
10546 6418752 1649144 3449935 7832040 8952544 8247258 8495493 7371567 3988248
10538 3988248 3125254 6207454 7337689 4720159 5646276 13247340 19400315 18179785
10530 18179785 14785238 13719932 10928879 5721736 6407919 14780488 19702141 16145155
10522A6145155j360583O905973M345643n019887k865905O914201L369614j0752392
10514A7681819j1084236L657424Q608772j144825k824252Q518589R941046l641638
10506B9712699p987739L328093N867798o705466q366578P346715J1718334k955716
10498C1958140n860211J0745761J2334373p926157p737961K0297530K1261834
10491G5073309j5293507j0416023O4391459R2772526k4669906j81857892j85305344
10484a85305378l0935419Q9826942O5393674p305810r181748L0076233K5903262
10477b1528244j0114166j3995238R891317J1135144q737809q630370J0124972
10470c1854394J0959205o782456j0572734L333841Q656922J048103Q2577O480556
$$ plain form
10522 16145155 14784572 21690545 26036188 21016301 18150396 25064597 28434211 17681819
10514 17681819 6597583 10255007 18863779 17718954 14894702 23413291 33354337 29712699
10506 29712699 21724960 25053053 30920851 24215385 15848807 23195522 34913856 31958140
10498 31958140 26097929 36843690 49178063 41251906 33513945 53811475 75073309
10491 75073309 59779802 49363779 113755238 206527764 181857858 -34 -185305378
10484 -185305378 -216240797 -126413855 -61020181 -68325991 -77507739 -47431506 -21528244
10477 -21528244 -31642410 -45637648 -35746331 -24611187 -33348996 -41979366 -31854394
10470 -31854394 -20895189 -27677645 -38250379 -34916538 -26259616 -25211513 -25128936 -18648380
10462a8648380L438101n598915k565086P966392O245454m466983m659327L331604
10454a4957140J204690p588983l603473R530620R279934m391494q243381L086617
10446a5682610R989469M406309L93455M103658M277337k021369l124892K208388
10438D549745R40671p540825p865398K034203M983237m410946r188928k58014
10430a6756255P892435L564726l007138m26236M252585J272851l708805j979875
10422h895712K087620J151308j117384R09920K721873r69681m464403q59108M576652
10413d858915K768410l764401n355771q18993J907727j041674m228346j402606
10405a6794569N980222J0115809N478831m069628q471164l705348K676459K589256
$$ plain form
10462 -18648380 -15210279 -20809194 -23374280 -15407888 -9162434 -13629417 -18288744 -14957140
10454 -14957140 -13752450 -21341433 -24944906 -15414286 -6134352 -10525846 -18769227 -15682610
10446 -15682610 -5693141 -1286832 -893377 3210281 7487618 5466249 2341357 4549745
10438 4549745 5490416 -2050409 -9915807 -7881604 -2898367 -7309313 -16498241 -16756255
10430 -16756255 -8863820 -5299094 -8306232 -8732468 -4479883 -3207032 -6915837 -8895712
10422 -8895712 -6808092 -5656784 -6774168 -5864248 -3142375 -4112056 -8576459 -9435567 -4858915
10413 -4858915 -2090505 -5854906 -11210677 -12029670 -10121943 -11163617 -15391963 -16794569
10405 -16794569 -10814347 -698538 4780293 710665 -7760499 -11465847 -8789388 -6200132
10397f200132p52157M32233M286584K461776m612815p450827k905527J700329
10389a3040536J732744J411536L661389M271292O31474k700432j918393J53899
10381e797027L38489K65465J389320J414955o91358k182778j958586k393353l331574
10372a2946447r82506M473615P135746M522500J755470K921711M624979K352540
10364A3857608k316440n195633n489461m342483j613061K064609L536656J040830
10356A542625k708817l981761k382618m1998J335698J398716R21501J037171J429377
10347a450106N09955j137075n25063K000390J360415l640948n816593k50838O138674
10338b811189M462292j719670k642263R68307L18073m404104l821986L169364
$$ plain form
10397 -6200132 -6952289 -6520056 -2233472 228304 -4384511 -11835338 -14740865 -13040536
10389 -13040536 -11307792 -9896256 -6234867 -1963575 -1332101 -4032533 -5950926 -5797027
10381 -5797027 -5458538 -5193073 -3803753 -2388798 -3080156 -5262934 -7221520 -9614873 -12946447
10372 -12946447 -13928953 -9455338 -2319592 2202908 3958378 6880089 11505068 13857608
10364 13857608 11541168 6345535 856074 -3486409 -5099470 -3034861 501795 1542625
10356 1542625 -1166192 -5147953 -7530571 -7572569 -6236871 -4838155 -3916654 -2879483 -1450106
10347 -1450106 -940151 -2077226 -2602289 -601899 758516 -2882432 -8699025 -8949863 -2811189
10338 -2811189 1651103 -68567 -2710830 -1742523 -1424450 -5828554 -9650540 -6481176
10330f481176O488614K418430m20437K372574K789586l749186p824299j424351
10322e830245P278660O278369j767179n606588l417905k154840l270571j856667
10314a0346966J805671J798191k077637l029569J145550M499096L272526J354138
10306a579000K076191K235561r83540l516302r02187L271618K322427k605683
10298C19085l931634M04592L929411K509307P22294K731035L690051j864872p928642
10289E80627m055057O910778J0160987M34710r613351q244317r23641Q44009k300941
10280f206196j783825K900416M674144J969380k40703o28415j965403k805075
10272d085677N70635M796077K934458k943041l874399R54135K965567o84462k875567
$$ plain form
10330 -6481176 7438 2425868 2005431 4378005 7167591 3418405 -4405894 -5830245
10322 -5830245 1448415 7726784 5959605 353017 -3064888 -5219728 -8490299 -10346966
10314 -10346966 -8541295 -6743104 -8820741 -11850310 -10704760 -6205664 -2933138 -1579000
10306 -1579000 497191 2732752 1749212 -1767090 -2669277 602341 2924768 319085
10298 319085 -3612549 -3207957 721454 3230761 3953055 6684090 10374141 8509269 580627
10289 580627 -3474430 3436348 13597335 14032045 4418694 -3825623 -4749264 -3905255 -6206196
10280 -6206196 -7990021 -5089605 -415461 1553919 1313216 684801 -1280602 -4085677
10272 -4085677 -3515042 1281035 4215493 1272452 -2601947 -1647812 1317755 633293 -2242274
10263b242274j86179J320122j647362k965703J592075O479995N863324K028403
10255A0242401j233726m607109p046950l296390N640920R058612J528864p378970
10247B907652o889276k99416K762146J494134R30249O79604j899998k735764K743120
10238c07549Q456556N125438l691007n710208P45935M374079p23630o481907m585391
10229b797684J606210M352597K862369J280811Q40235k05271k056074l265744
10221B617449l251924k206918l99119Q64814j5941k033241k197986j84723Q27949
10212e979640o24911j646182L06604L099613L110035N52545j321711r93906J94471
10203c303082J029237J823734K647781K452464R02858m84093l40000L72680k54700
$$ plain form
10263 -2242274 -2428453 -1108331 -2755693 -5721396 -4129321 2350674 8213998 10242401
10255 10242401 9008675 4401566 -2645384 -5941774 -300854 8757758 10286622 2907652
10247 2907652 -3981624 -4281040 -1518894 -24760 905489 1585093 -314905 -3050669 -307549
10238 -307549 8149007 13274445 9583438 3873230 4619165 8993244 8269614 1787707 -2797684
10229 -2797684 -1191474 3161123 6023492 7304303 8144538 7939267 5883193 2617449
10221 2617449 -634475 -2841393 -3240512 -2375698 -2391639 -4424880 -6622866 -6807589 -5979640
10212 -5979640 -6604551 -8250733 -7944129 -4844516 -1734481 -1181936 -2503647 -3497553 -3303082
10203 -3303082 -2273845 -450111 2197670 4650134 5552992 5068899 4728899 5101579 4846879
10194D846879j956579k489062j199664k32277j076465k070707j238873L43748
10186e073000N98343J54191P84778J520298K51827j681508j117754R69192M39339
10177c154294k389596k049311K904499O022785K296889l798383m991027j984025
10169g142463j012604k922757k088044L470697P790912N551792p4245k151521
10161A421767M17976K452574O20309k334776k447143j43301J421498J449429J644124
10152D502457K188499J350311n84992r81694J42597r94299n300647p258910k482621
10143i419299M421110N288555l4147l792205j741273J821877J823958m09035o34460
10134b674919J528076K653418O10345k735486l610207o30128K980027K812953
$$ plain form
10194 4846879 2890300 401238 -798426 -1030703 -2107168 -4177875 -5416748 -5073000
10186 -5073000 -4474657 -4320466 -3535688 -2015390 -1763563 -3445071 -4562825 -3593633 -3154294
10177 -3154294 -5543890 -7593201 -4688702 1334083 3630972 -167411 -5158438 -7142463
10169 -7142463 -8155067 -11077824 -13165868 -9695171 -1904259 3647533 3573288 1421767
10161 1421767 1839743 4292317 4912626 2577850 130707 -12594 1408904 2858333 4502457
10152 4502457 6690956 8041267 7456275 6474581 6617178 5622879 322232 -6936678 -9419299
10143 -9419299 -4998189 290366 256219 -3535986 -5277259 -3455382 -1631424 -2040459 -2674919
10134 -2674919 -1146843 1506575 2116920 -618566 -4228773 -4858901 -1878874 934079
10126I34079o31550k326287o15792m151k704829l257695K316889P643347M923466
10117F277477j798921k886775O51425l11985n639513n277208K554288P151537
10109G20325L367092m98899J111682J266417m557080p643579j242253N722146
10101a754149L237406k248703K21869N697467J935492p778407q899674q8334M980394
10092d696639P57731k873364L70688L377512O27545j775900J214158L501261n39401
10083c6409m827362j838452M166250M396782k11118k228540p88703j183801l825671
10074f377024l446321Q60010L323011O74893l027343k897258M59571L341958L903120
10065c185383K528397L2224k383044l025244j292986J344540K755364K049889
$$ plain form
10126 934079 302529 -2023758 -2639550 -2643701 -5348530 -8606225 -6289336 1354011 6277477
10117 6277477 4478556 1591781 2243206 1931221 -3708292 -8985500 -6431212 720325
10109 720325 4087417 3588518 4700200 5966617 1409537 -6234042 -7476295 -1754149
10101 -1754149 1483257 -765446 -543577 5153890 7089382 -689025 -9588699 -9677033 -4696639
10092 -4696639 -3938908 -6812272 -6441584 -3064072 -2436527 -4212427 -2998269 502992 -36409
10083 -36409 -4863771 -6702223 -2535973 1860809 1649691 -578849 -1367552 -2551353 -6377024
10074 -6377024 -9823345 -8963335 -5640324 -4965431 -7992774 -10890032 -10430461 -7088503 -3185383
10065 -3185383 -656986 -624762 -3007806 -6033050 -7326036 -5981496 -3226132 -1176243
10057a176243m155j716105j665990M762J506701J267359l00730j504966j392396
10048d981763j92327J756221M128287N597084M234966o8068m439791n636862l716230
10039c318483j787264j782552k032970k65108K380836K632759J8246k117100j211491
10030g483127J269796K571755K589724K994517L669540K430932j691836o499392
10022a48091q436628n925088r73962K457941K265832L08367j20251J527307L000969
10013f043604K943821K153990J085885q60439k833875k708668j092928j374160
10005h729978l619994k704441L771002R618882P512423k38666m587642k424257
9997a402671L18251j056831l378973k227839M65809K91950j666216m04408M464973
$$ plain form
10057 -1176243 -1180398 -2896503 -4562493 -4557731 -3051030 -1783671 -2084401 -3589367 -4981763
10048 -4981763 -5174090 -3417869 710418 6307502 10542468 10474400 6034609 397747 -3318483
10039 -3318483 -5105747 -6888299 -8921269 -9186377 -6805541 -4172782 -4154536 -6271636 -7483127
10030 -7483127 -6213331 -3641576 -1051852 1942665 5612205 8043137 6351301 -148091
10022 -148091 -8584719 -14509807 -15483769 -13025828 -10759996 -10451629 -10571880 -9044573 -6043604
10013 -6043604 -3099783 -945793 140092 -720347 -3554222 -6262890 -7355818 -8729978
10005 -8729978 -12349972 -15054413 -11283411 -1664529 5847894 5609228 1021586 -1402671
9997 -1402671 -1084420 -2141251 -5520224 -7748063 -7282254 -6990304 -8656520 -9060928 -4595955
9988d595955P038102L178356l586046o545650l884881M25669K628744K940947
9980b400714L034468K796176J459250j7616k27387K308j237010l543974m548605
9971d683104l459274j541357Q16673M114038O422357M260211j483422m686243
9963b40121k032120J810995J002580k722786l269592N5387K196271J240032R94529
9954i64825L224228L740406k18812m029273k294145K204244K362399k154809m371143
9945b501730q66612L412900L507634J568488J495867J534375j804045n733891
9937F12986m282696J653441M547860J272730k908396l276307j938268j964166
9929f282816j569846J102195K737833K27231k750186q55250M025195N543970K808052
$$ plain form
9988 -4595955 2442147 5620503 2034457 -4511193 -8396074 -7970405 -5341661 -2400714
9980 -2400714 633754 3429930 4889180 4871564 4644177 4646485 3409475 -134499 -4683104
9971 -4683104 -8142378 -9683735 -8867062 -4753024 1669333 5929544 4446122 -240121
9963 -240121 -2272241 -461246 541334 -2181452 -5451044 -5395657 -3199386 -1959354 -964825
9954 -964825 2259403 5999809 5780997 1751724 -542421 1661823 4024222 1869413 -2501730
9945 -2501730 -3368342 44558 3552192 5120680 6616547 8150922 6346877 612986
9937 612986 -3669710 -2016269 2531591 3804321 895925 -2380382 -4318650 -6282816
9929 -6282816 -7852662 -6750467 -4012634 -3785403 -6535589 -7390839 -3365644 2178326 4986378
9920D986378R40714K191157K706185q02411n932260p744718m291498J738357N358559
9911h49537L876663O3587j294575l12751j004074k544162R97885Q732136R869764
9902A7534936l13058j0216825p768002J038650K052346m397803n593602J731109
9894e932249P159566M446219o47790k127033q31649J799630N361917N418486j284423
9885A3362674p430688m234841K304255K54109o104742l165836N115801K387993
9877B488725p615059m608764O598524m996753m0030110n0309491o896690M6722651
9869e8646967N0037246J0465308j3496173m16536J3818901L427919j0467712m646629
9861i924643P258887L937951o823368o285188K339977L919081r17336p43930M320178
$$ plain form
9920 4986378 5927092 8118249 10824434 10022023 4089763 -3654955 -7946453 -6208096 -849537
9911 -849537 3027126 3090713 1796138 1483387 479313 -2064849 -1066964 7665172 17534936
9902 17534936 17221878 7005053 -762949 275701 2328047 -2069756 -7663358 -5932249
9894 -5932249 1227317 5673536 5025746 2898713 2067064 3866694 9228611 14647097 13362674
9885 13362674 5931986 1697145 4001400 4255509 -1849233 -5015069 100732 2488725
9877 2488725 -5126334 -9735098 -3136574 -8133327 -48163437 -98472928 -105369618 -58646967
9869 -58646967 -8609721 1855587 -11640586 -12057122 1761779 5189698 -5278014 -9924643
9861 -9924643 -2665756 1272195 -5551173 -11836361 -9496384 -5577303 -6494639 -7238569 -2918391
9852b918391N036195R31960q26724N68437L64380j320046j255343r26142k777601
9843c123275l375106O89314M963159L656501q56172k758187j850941p56431J090912
9834b320226L543670K371054k689381l701565L137110Q458370L133789o229538
9826E703283o884479N22418M693067K070963p59973j005303k481671m535488j429271
9817d106454N092589N133286l388112r367065m874006K916627L538188r60595
9809f015542j037205M542351P630368L918267j490673k962346j834368j968540
9801G82312k813739j351426J644739K154432n67545k364642n09173J854653L70202
9792h00187l728202n025949j341707L668367N522899L664336N44428j606514k091837
$$ plain form
9852 -2918391 2117804 3049764 2223040 2791477 3155857 1835811 580468 -345674 -3123275
9843 -3123275 -6498381 -5809067 -845908 2810593 1954421 -803766 -2654707 -3411138 -2320226
9834 -2320226 1223444 3594498 905117 -2796448 340662 8799032 11932821 5703283
9826 5703283 -1181196 -658778 4034289 6105252 5345279 4339976 1858305 -2677183 -4106454
9817 -4106454 986135 6119421 2731309 -6635756 -11509762 -8593135 -5054947 -6015542
9809 -6015542 -7052747 -2510396 5119972 9038239 7547566 4585220 2750852 782312
9801 782312 -2031427 -3382853 -1738114 416318 -151227 -2515869 -3025042 -1170389 -800187
9792 -800187 -4528389 -9554338 -10896045 -7227678 -1704779 1959557 2503985 897471 -1194366
9783a194366j575833j490695k513093l432603k679606o79884P95567J168196J181144
9774a0421173J002313K40240m84267r6289R31198J059377P7434o36972l9822J713622
9764f654339L752736M735784L631019J229315n80828j670316l364792m664116
9756c585537k589792K117993M222076J570558j302547n02459J396919Q99701n11503
9747A715409q42371k058117m456951l167347K791914N188366q40341o322412j787147
9738i778997N907853M007505m279251m726439L760501P710228K310790j929155
9730B983035P67682K189368k839648o256870j930130L092395J870740l98148K373181
9721A851605N162885J816821k751917j456943K108385P82589l136253k839600
$$ plain form
9783 -1194366 -2770199 -4260894 -6773987 -10206590 -12886196 -13566080 -12770513 -11602317 -10421173
9774 -10421173 -9418860 -9178620 -9662887 -9759176 -8827978 -7768601 -7691167 -8328139 -8367961 -6654339
9764 -6654339 -2901603 1834181 5465200 6694515 6113687 4443371 1078579 -3585537
9756 -3585537 -6175329 -4057336 164740 1735298 432751 -69708 1327211 2226912 1715409
9747 1715409 873038 -1185079 -5642030 -8809377 -6017463 -829097 -1669438 -7991850 -9778997
9738 -9778997 -3871144 136361 -4142890 -8869329 -5108828 2601400 4912190 2983035
9730 2983035 3750717 5940085 3100437 -3156433 -5086563 -1994168 -123428 -521576 1851605
9721 1851605 7014490 8831311 6079394 4622451 6730836 7513425 4377172 1537572
9713A537572O79323J522640n97248k017575k820260m272343l275987K073008O067984
9704a102886L197265k135239k459217N97480K64283l058013l207363M90230K751665
9695d661795J785035Q71920J335826J204489K04852p3026K50p43684j128160k02976
9685a407269N4400q66584O99112N446218O511376p53297r180238q458175L0051
9676g924406N779837M237382O28869j04976R47055J108409j58589k239578l564261
9667a290258j889288J912082L094697L8061k059703O75879L759852J506283l468618
9658B278987m744956j871395J299029L771574N746405M292584j571644n811102
9650C389482l383985J074290P91595j869985r40574J406859n89344m057002j593299
$$ plain form
9713 1537572 2216895 3739535 3142287 1124712 -1695548 -5967891 -9243878 -7170870 -1102886
9704 -1102886 2094379 -40860 -2500077 -1902597 -1638314 -4696327 -7903690 -7413460 -4661795
9695 -4661795 -2876760 -2004840 -669014 535475 740327 667301 667551 -76133 -1204293 -1407269
9685 -1407269 -1352869 -2219453 -1520341 3925877 10437253 9683956 503718 -7954457 -7924406
9676 -7924406 -2144569 2092813 2721682 2616706 3563761 4672170 4513581 2274003 -1290258
9667 -1290258 -3179546 -1267464 1827233 1865294 -194409 481470 4241322 5747605 2278987
9658 2278987 -2465969 -4337364 -3038335 733239 6479644 10772228 9200584 3389482
9650 3389482 5497 1079787 1871382 1397 -939177 467682 -121662 -4178664 -5771963
9641e771963M933111O407057J013928m163391n030750l509911j08311N635994
9633e94236Q525232K949003n807481o905022k87678L888388J903605J45835J548713
9624E366359J374917j421171j391911J718318P55426n436231q113340k842244
9616i989877L285004L649950J095019j64975j662734m193543l566897J327080
9608a0220973M597725K846998N20880J050293J186599r87389j368326J469863
9600i04330J968485k079063l998500L03971M432553K654894Q9924K772099N546266
9591A0786299M53149q605519j0580668l463849M038105N380859K443823k39198
9583B13001o16617J211455L318677K568567j398828m398886k973564J015217L727943
$$ plain form
9641 -5771963 -838852 5568205 6582133 2418742 -2612008 -6121919 -6230230 -594236
9633 -594236 7930996 10879999 5072518 -1832504 -2120182 1768206 3671811 3817646 5366359
9624 5366359 6741276 5320105 3928194 5646512 6401938 965707 -7147633 -9989877
9616 -9989877 -6704873 -3054923 -1959904 -2124879 -3787613 -7981156 -11548053 -10220973
9608 -10220973 -5623248 -2776250 -2255370 -1205077 -18478 -1005867 -2374193 -904330
9600 -904330 1064155 -1014908 -5013408 -4709437 -276884 2378010 2467934 5240033 10786299
9591 10786299 11239448 2633929 -7946739 -11410588 -7372483 -1991624 452199 213001
9583 213001 -403616 807839 4126516 6695083 5296255 897369 -2076195 -1060978 2666965
9574B666965L986191K095962j649106m477098k231074L600932N383054j14450
9566I261376o242134o011420j331156K166009L364898L114970p1260m975734m725497
9557e449948L010260Q767354L730714n520118n758987K543715N966781r59655
9549F330116p945505n277763K537862N263431J549158j817648r79866J381771
9541A041556K109715J724898J700079J301336o12550k411133j319573J646740
9533E181068J734579k532994n743029k985596J984985J922763k302636k947026
9525e687886J643502M067130L37023l417953j317180L012074L428430Q44349o30626
9516B278863j185588k228699j382528K309380L557435j015313n115702j948705
$$ plain form
9574 2666965 6653156 8749118 7100012 2622914 391840 3992772 9375826 9261376
9566 9261376 3019242 -2992178 -4323334 -2157325 1207573 4322543 4251283 -724451 -5449948
9557 -5449948 -2439688 6327666 10058380 4538262 -1220725 1322990 7289771 6330116
9549 6330116 -1615389 -6893152 -4355290 908141 2457299 639651 -340215 1041556
9541 1041556 3151271 4876169 6576248 7877584 7265034 4853901 3534328 5181068
9533 5181068 6915647 4382653 -1360376 -4345972 -2360987 -438224 -2740860 -5687886
9525 -5687886 -4044384 22746 359769 -3058184 -4375364 -1363290 2065140 2909489 2278863
9516 2278863 1093275 -1135424 -2517952 -208572 3348863 2333550 -2782152 -4730857
9508d730857L688317K577441l472720m731368N2903K593958L56498K84674M732856
9499A351702N786833j086016p982438o298228K71666K356856r59787k810596k54816
9490i624824K470051J808647k59967k86209J836860L571271K985871L27305k426465
9481D02540l121113j274742J411345K701031J995497Q19641J097704K627330K629553
9472I288786q46032n148978n129921n1312M419099L240202j622136m634395l947703
9463d432390j658845Q51632L387284M262987K005795r22984p82048J397000J143483
9454E251914k117750m075397k391690M77624K255981L471257L694240O75664m268247
9445B973596n358814m91740M306702K944066j936492l184477M70845L552522K114148
$$ plain form
9508 -4730857 -1042540 1534901 -1937819 -6669187 -6616284 -4022326 -3665828 -3381154 1351702
9499 1351702 7138535 6052519 -1929919 -8228147 -7956481 -5599625 -6559412 -9370008 -9624824
9490 -9624824 -7154773 -5346126 -5606093 -5892302 -4055442 -484171 2501700 2829005 402540
9481 402540 -2718573 -3993315 -2581970 119061 2114558 2934199 4031903 6659233 9288786
9472 9288786 8442754 3293776 -1836145 -1887457 2531642 5771844 4149708 -484687 -4432390
9463 -4432390 -6091235 -5239603 -1852319 2410668 4416463 3493479 2711431 4108431 5251914
9454 5251914 3134164 -941233 -3332923 -2855299 -599318 2871939 6566179 7241843 2973596
9445 2973596 -2385218 -2876958 1429744 4373810 2437318 -747159 -276314 3276208 5390356
9436E390356j930599m497230l486761N66739M665430M609955m83137n408351m344524
9427d918122J231272M313586K080188j171809j869081k245210m516848n273748
9419a2369772r21257M742628M683379r03372m437480j671914L043347L886883
9411c947558J068772j517516k254382j953009o77360J923890M377287M511488
9403A531612K317527l36828k098266k567886j489374N70449J674923O02973j146030
9394i40900j070468J129887L264614K919861o20749n412162p314870l598664K940337
9385h703114O026635L475209j65063l83300J228607N73522k343877m137361l286253
9376g714995j118473Q59352J598832K12652k230006k647124j74064K149838K310040
$$ plain form
9436 5390356 3459757 -1037473 -4524234 -3957495 707935 5317890 4834753 -573598 -4918122
9427 -4918122 -3686850 626736 2706924 1535115 -333966 -2579176 -7096024 -12369772
9419 -12369772 -13291029 -8548401 -3865022 -4768394 -9205874 -10877788 -7834441 -3947558
9411 -3947558 -2878786 -4396302 -6650684 -8603693 -9281053 -7357163 -2979876 1531612
9403 1531612 3849139 3512311 1414045 -1153841 -2643215 -2072766 -397843 205130 -940900
9394 -940900 -2011368 -881481 2383133 5302994 4682245 -729917 -8044787 -11643451 -8703114
9385 -8703114 -2676479 798730 633667 250367 1478974 2052496 -291381 -4428742 -7714995
9376 -7714995 -8833468 -7974116 -6375284 -6162632 -8392638 -11039762 -11213826 -9063988 -6753948
9367f753948K376520L779016L942017J431012l76908O00324O08058k846560n076595
9358b317064k169170J178728q63j063870L585261P978511L336308n346442n929454
9349g48055O26752K548751j462127q44706N506129N318537m691435j0931660n408433
9340a0086247J216409o55529l210444K380563P982047K674293o796603o759439
9332a3254950Q77825L990487J554039K170910N604707L428035l460163m819238
9324c908348P82696L404884m64168k173972K988904P170097L282486l782132n880353
9315A420094l314434j439883j819716k507257k629308k042499J95670L654342
9307h482991N659419M746605K322362r4444k134055k649929l12881L182298M168303
$$ plain form
9367 -6753948 -4377428 -598412 3343605 4774617 4397709 4998033 5606091 2759531 -2317064
9358 -2317064 -4486234 -3307506 -3308369 -4372239 -786978 7191533 10527841 5181399 -748055
9349 -748055 -121303 2427448 965321 120615 5626744 10945281 6253846 -4677814 -10086247
9340 -10086247 -8869838 -9525367 -12735811 -10355248 -2373201 301092 -6495511 -13254950
9332 -13254950 -12377125 -8386638 -6832599 -4661689 943018 4371053 910890 -3908348
9324 -3908348 -3125652 279232 -184936 -2358908 629996 7800093 11082579 7300447 1420094
9315 1420094 -1894340 -3334223 -5153939 -7661196 -10290504 -12333003 -12137333 -8482991
9307 -8482991 -2823572 1923033 4245395 4150951 2016896 -633033 -945914 2236384 6404687
9298F404687K031877l4346K53507J767495K294163P69869k340737m644148l311520
9289C190847N54700J654406k110544n339290k833953J894792J881795k304544
9281c411791l920025r14972J886384J348274m6380L13804J466998J793636J134634
9272c49438n75025l011811m099655k499408k83780M95432J623700M634282N851873
9263A786170J459702m846835n904954j251735L250151M592108M770323M779098
9255H634028L140529M8187k739968n164362o899385m762554J738368N787003K031902
9246A813748l476006j538073M886073M719134l215867q280007m936967K11202
9238i816763Q48804m29349M29761K271483L291596M105815L416828j245217o290534
$$ plain form
9298 6404687 8436564 8402218 8655725 10423220 12717383 13487252 11146515 6502367 3190847
9289 3190847 3745547 5399953 3289409 -2049881 -4883834 -2989042 -1107247 -3411791
9281 -3411791 -7331816 -8246788 -6360404 -5012130 -5058510 -4744706 -3277708 -1484072 -349438
9272 -349438 -924463 -3936274 -8035929 -10535337 -10819117 -10323685 -8699985 -4065703 1786170
9263 1786170 3245872 -1600963 -7505917 -8757652 -5507501 -915393 3854930 8634028
9255 8634028 11774557 11822744 9082776 3918414 -2980971 -7743525 -6005157 -218154 1813748
9246 1813748 -1662258 -3200331 1685742 6404876 3189009 -5090998 -10027965 -9816763
9238 -9816763 -8967959 -9397308 -8967547 -6696064 -3404468 701347 4118175 2872958 -3417576
9229c417576m529708K759488N803836J293086k733781p30950K119683O32050j636346
9220d40218p36145l6915k387535l069759J525117N571329K485298m070053n992718
9211g151599k728143J57309M31616K14281N89662J096496K022582K886718J791602
9202f89476m88381j67128K807403L220140p86892l877385k388274l04822j531907
9193d206722l000150j066244J691842J937893J532950K162349O47026m014945
9185d316001n785820r58928M217099L046485q46596n61404K418431K604786Q74169
9176F92221R40147O75165l029043n574219j567782L855202K216755l210709k086469
9167g088732N151244P456779J451023l664909j968647O32104j791755n312316
$$ plain form
9229 -3417576 -7947284 -5187796 616040 1909126 -824655 -1555605 564078 1196128 -440218
9220 -440218 -1176363 -1213278 -3600813 -6670572 -5145455 425874 2911172 -1158881 -7151599
9211 -7151599 -9879742 -9722433 -9290817 -9076536 -8486874 -7390378 -5367796 -2481078 -689476
9202 -689476 -1177857 -1344985 1462418 4682558 3895666 18281 -2369993 -2674815 -4206722
9193 -4206722 -7206872 -8273116 -6581274 -4643381 -3110431 -948082 -301056 -4316001
9185 -4316001 -10101821 -11060749 -6843650 -3797165 -4643761 -5205165 -2786734 -181948 692221
9176 692221 1632368 2307533 -721510 -6295729 -7863511 -4008309 -1791554 -5002263 -7088732
9167 -7088732 -1937488 5519291 6970314 3305405 1336758 1968862 177107 -5135209
9159e135209m023106K08211K000248P30326p77756j494603j727165q60539J009470
9150a0070123K034713J518221R77663Q85675j18107j401336J41804M607206O984532
9141E560248L523843k514041m593732j062476K993540J966155l631351p531329
9133e289143m905249J773446N843255M795230K181131J000941k7634j707029j208713
9124B456235K514286M875901K084692k443495l243172q56561O07257M48454Q6663
9115F530260j668430n453259o723959j729329M599101M878508J285010K167848
9107C885750P485503P691054j167169j0487733j0938850m079545J962181K986923
9099b661886Q55048j036229r00550O95326J479408L37704q41362l80102n7351
$$ plain form
9159 -5135209 -9158315 -8950104 -6949856 -6219530 -6997286 -8491889 -10219054 -11079593 -10070123
9150 -10070123 -8035410 -6517189 -5539526 -4653851 -4771958 -6173294 -6031490 -1424284 5560248
9141 5560248 9084091 6570050 1976318 913842 3907382 5873537 2242186 -5289143
9133 -5289143 -10194392 -8420946 -2577691 2217539 4398670 5399611 5371977 3664948 2456235
9124 2456235 4970521 9846422 11931114 9487619 6244447 5387886 5995143 6443597 6530260
9115 6530260 4861830 -591429 -7315388 -9044717 -4445616 432892 1717902 3885750
9107 3885750 11371253 19062307 17895138 7407405 -3531445 -7610990 -5648809 -2661886
9099 -2661886 -1806838 -2843067 -3743617 -3048291 -1568883 -1231179 -2072541 -2452643 -2509994
9090b509994j627502k545215o5306K882767J995050n27756M20947L254337K028770
9081C306098k571702l696465N3228K838177K332188K400023L255822l68256p713258
9072a64145r467382k235372M470162K570333k410575j674965K545594K713879
9064c652471l54040j73853L125843L724966J181724O17946K433617J201708m116128
9055C989312p120212l675320J758125K680808r99333m087628k907923J315782
9047i046389M440489L632995L01211j497865k22864J230868J29174j982816k080395
9038e095592j34798K067564M049310N248109L310289j934945n438494l110930
9030a039487J148717P55568k888412k559221K173940L279331k347075o522986
$$ plain form
9090 -2509994 -4137496 -6682711 -6748017 -3865250 -1870200 -2397956 -1977009 1277328 3306098
9081 3306098 734396 -2962069 -2908841 -70664 2261524 4661547 7917369 7549113 -164145
9072 -164145 -9631527 -11866899 -7396737 -4826404 -7236979 -8911944 -6366350 -3652471
9064 -3652471 -4006511 -4180364 -1054521 2670445 3852169 4470115 6903732 8105440 3989312
9055 3989312 -3130900 -6806220 -5048095 -2367287 -3366620 -7454248 -10362171 -9046389
9047 -9046389 -4605900 -972905 -671694 -2169559 -2392423 -1161555 -1032381 -3015197 -5095592
9038 -5095592 -5230390 -3162826 886484 6134593 9444882 7509937 2071443 -1039487
9030 -1039487 109230 864798 -2023614 -4582835 -2408895 870436 -1476639 -7999625
9022g999625k161461N123544N279273j075701m390156q47837L471840L327083
9014G26960R84757m1475o66128j977511j469638J773807L298301J55452k915413
9005a30888o20048L437636K358448j691771m45683N518490N771510k979314r565069
8996A653311m503024N291829O822064j30256m680470k050805J567300J057685
8988E027634o01826L22856J897553J140210n99008p39286o8391q12041k682736
8979B884965l558173k467630k06937J807006K578614K547988L290170M842152
8971A1718155M578230R23576l439394m963504m089931l365746k820533j365922
8963b825069n30639j677268j692308K356824O183736L420348l220865m586810
$$ plain form
9022 -7999625 -10161086 -5037542 241731 -833970 -5224126 -6071963 -2600123 726960
9014 726960 1711717 1670242 1004114 -973397 -2443035 -669228 2629073 2784525 -130888
9005 -130888 -750936 2686700 5045148 3353377 2907694 8426184 14197694 11218380 1653311
8996 1653311 -2849713 2442116 9264180 9133924 4453454 2402649 3969949 5027634
8988 5027634 4425808 4748664 6646217 7786427 7187419 6448133 6379742 5567701 2884965
8979 2884965 -673208 -3140838 -3347775 -1540769 1037845 3585833 6876003 11718155
8971 11718155 16296385 17219961 13780567 8817063 4727132 1361386 -1459147 -2825069
8963 -2825069 -3355708 -5032976 -6725284 -4368460 1815276 5235624 2014759 -2572051
8955b572051O65027L774265j560m447365l579768p39031p36057r70056K330495
8946f276101N496374L239144j593101k366407M89898J176962r94078j004248K542990
8937G11433N144982M244860K609602K100235K672n344168r620841p313984L34488
8928g130721N675571L304148l582359o835171k862754L504194N650769L281204
8920A004881R52913M50377n66017k652241k905314n46377J056593J41254n66175
8911c630106P18023J446754j30248j363971l44300K40530j484351k234300N02099
8902f279870K972510J297022j298432J43229L472945L111186l23411j523307L46361
8893A918233J417640O85393M60799L05599j946439l820155r27861L936038L102442
$$ plain form
8955 -2572051 -1907024 1867241 1865681 -2581684 -6161452 -6900483 -7636540 -8606596 -6276101
8946 -6276101 -779727 2459417 866316 -1500091 -1010193 166769 -827309 -1831557 711433
8937 711433 5856415 10101275 12710877 14811112 14813784 9469616 -151225 -7465209 -7130721
8928 -7130721 -1455150 1848998 -1733361 -8568532 -11431286 -7927092 -2276323 1004881
8920 1004881 1957794 2408171 1842154 -810087 -3715401 -4261778 -3205185 -3063931 -3630106
8911 -3630106 -2912083 -1465329 -1595577 -2959548 -3303848 -3063318 -4547669 -6781969 -6279870
8902 -6279870 -3307360 -2010338 -3308770 -3165541 307404 3418590 3095179 1571872 1918233
8893 1918233 3335873 4021266 4482065 4787664 2841225 -978930 -1906791 2029247 5131689
8884E131689l325910o066461p66302N056718L734086j428339k682507L99458K331395
8875B383827Q32763j930918m522831o582207n824179n97396N382846O427882L051124
8866a379089J466847L973180N132587L44799o045506n978437P08288N303186K045308
8857E571163l822172l665720J878167L826523j642299p254106n372760J015734
8849i465470L645454J341527j94750Q68633K91386k834112k814735K790808P037656
8840F66397L133890m705085o741492j404977L555664K939419J61076L0579J616666
8831g47863J651912N02522L12510P6379k441671n170243l455147K181772N133774
8822a956055J746372l151844l262868K30944J509896n12451j550743L4951R59872
$$ plain form
8884 5131689 1805779 -4260682 -5026984 29734 3763820 2335481 -347026 52432 2383827
8875 2383827 3216590 1285672 -3237159 -9819366 -15643545 -16240941 -10858095 -4430213 -1379089
8866 -1379089 87758 4060938 9193525 9538324 3492818 -2485619 -1777331 3525855 5571163
8857 5571163 1748991 -1916729 -38562 3787961 2145662 -5108444 -10481204 -9465470
8849 -9465470 -5820016 -4478489 -4673239 -3804606 -3513220 -6347332 -9162067 -6371259 666397
8840 666397 3800287 -904798 -7646290 -9051267 -5495603 -2556184 -2395108 -2364529 -747863
8831 -747863 904049 1406571 1719081 1795460 -646211 -5816454 -9271601 -7089829 -1956055
8822 -1956055 -209683 -3361527 -6624395 -6393451 -4883555 -5396006 -6946749 -6911798 -5951926
8813e951926q1455N75141M657050P311319L741838l145327o386625l951988J31129
8804c100844J902507P44697k094969m415687l402771J501827O715826Q235898
8796F086484O108820K734824j160911n471771p785073n828612j567535J183996
8788e699778J994779K702643K790610O41889j974565j906409j48932j5577p97674
8779b413014O60101K795710R46530l467318l266335K871485O852277L007752l337261
8770D649927m151261l7311K447756Q90752j394590j646943m55571P25216J220048
8761B248023R44880P13135J529445K509862J785782N1103m15281q56286m844045
8752C666618j0311804r467579n15918P225373N710012l19652j504686J586837
$$ plain form
8813 -5951926 -6033381 -5458240 -801190 6510129 10251967 7106640 720015 -3231973 -3100844
8804 -3100844 -1198337 -453640 -2548609 -6964296 -10367067 -8865240 -2149414 6086484
8796 6086484 12195304 14930128 13769217 8297446 512373 -5316239 -6883774 -5699778
8788 -5699778 -3704999 -1002356 1788254 2430143 455578 -1450831 -1599763 -1615340 -2413014
8779 -2413014 -1752913 1042797 1989327 -1477991 -4744326 -1872841 4979436 7987188 4649927
8770 4649927 498666 461355 2909111 3799863 2405273 758330 302759 1027975 2248023
8761 2248023 3192903 3906038 5435483 7945345 9731127 9782230 9366949 8510663 3666618
8752 3666618 -6645186 -16112765 -16628683 -9403310 -3693298 -4012950 -5517636 -3930799
8744c930799J235842l284422m610406L0945M714636M940413L259850K214204k96305
8735D273958m674505n842159j135094L595637J865990l410911m254972L65620
8727i216436L629876J698453r89505O77235M533868M707866O44860j991416L49379
8718D044180L826961K744572k062949m381203j864782M48343j980668n707986
8710d933532m007829K819219O898866L095837m184662o413684p88282P188688
8702c25379R780439M465366l968035q145373n319991K80373K754060J070583j058525
8693d66482o82493J298484K214725P34567k117561l623807j601545K649949M836522
8684C242359K840233l96318j494999j585255k844176k838143J779426P340229
$$ plain form
8744 -3930799 -2694957 -5979379 -10589785 -10558840 -5844204 -903791 2356059 4570263 4273958
8735 4273958 -400547 -6242706 -7377800 -3782163 -1916173 -5327084 -9582056 -9216436
8727 -9216436 -5586560 -3888107 -4877612 -4200377 333491 5041357 5686217 3694801 4044180
8718 4044180 7871141 10615713 8552764 4171561 2306779 2755122 774454 -4933532
8710 -4933532 -8941361 -6122142 776724 3872561 -312101 -6725785 -7514067 -325379
8702 -325379 9455060 13920426 9952391 1807018 -3512973 -3232600 -478540 592043 -466482
8693 -466482 -1148975 149509 2364234 3098801 981240 -2642567 -4244112 -1594163 3242359
8684 3242359 6082592 5686274 4191275 2606020 -238156 -3076299 -1296873 6043356
8676F043356O238514j356975o306814l475648J235232Q19923k501910k571685
8668a876007M08749J686611N59313K14797J053655P83975j401J357996L739825
8659G927513L219574j55946k325489k121823k431274l950466l833833j712246
8651e383990r24388j977661j053233K485675L661073N76901j124392K267423M862517
8642C389925J70765p040050o669794J348820O787470M108077j054551k188394
8634a147732p19476j002929k916955l830810l224549j316769K666218O928191
8626d564811O288390k73165n450469k876782K945385L008998k325341m162414
8618g410209N94629M671309K409361j952349k395202n74493j086078k443110J126
$$ plain form
8676 6043356 12281870 10924895 4618081 1142433 2377665 3197588 695678 -1876007
8668 -1876007 -1467258 219353 778666 993463 2047118 2831093 2829692 4187688 7927513
8659 7927513 11147087 10991141 8665652 6543829 4112555 162089 -3671744 -5383990
8651 -5383990 -6308378 -8286039 -9339272 -6853597 -3192524 -2615623 -3740015 -1472592 3389925
8642 3389925 3560690 -3479360 -10149154 -8800334 -2012864 2095213 1040662 -1147732
8634 -1147732 -1867208 -2870137 -5787092 -9617902 -12842451 -14159220 -11493002 -4564811
8626 -4564811 1723579 1450414 -4000055 -6876837 -3931452 -922454 -3247795 -7410209
8618 -7410209 -6815580 -2144271 265090 -1687259 -4082461 -4656954 -5743032 -8186142 -8185016
8609h185016M933195O101032J761911l019679l827541j583452P79528J874557
8601a165465J371759j65527m91645J610351L022467J47286m182111l419715K240841
8592a031759M773795K92630m527176k559460K912583L604632j316217m891166
8584b742138k739134K170064M591431K278768l248504p506581n871378P85982
8576a2281490N237793K672644k313958k506323J193033K505307P72032Q12513
8568c908449K709327J140128l968434n570679j158201K685011J476861r2197K281290
8559d405343M175808P95461l487981k358493J316523P44194k575846j635644L472044
8550c959277N479417J897082j878640j904231j78264J088267K298613K447822
$$ plain form
8609 -8185016 -3251821 2849211 4611122 1591443 -2236098 -3819550 -3040022 -1165465
8601 -1165465 206294 40767 -450878 1159473 4181940 4329226 147115 -3272600 -1031759
8592 -1031759 3742036 4034666 -492510 -3051970 -139387 3465245 2149028 -2742138
8584 -2742138 -5481272 -3311208 1280223 3558991 310487 -7196094 -13067472 -12281490
8576 -12281490 -7043697 -4371053 -6685011 -9191334 -7998301 -5492994 -4720962 -3908449
8568 -3908449 -1199122 -58994 -4027428 -9598107 -10756308 -8071297 -6594436 -6686633 -4405343
8559 -4405343 -229535 565926 -2922055 -5280548 -3964025 -3219831 -5795677 -7431321 -3959277
8550 -3959277 1520140 3417222 1538582 -365649 -543913 544354 2842967 5290789
8542E290789o15499m496655l752317J229047L736501J154326j245986K47755J732961
8533C280922p94855m277387m009853j125221N05709P48694J631636K729814K690173
8524A379632K283037J899487n14608m800314n768010k60075O402024O989054K722795
8515A0333022O16602K298584K617087q23216l806132k850293o13830j210762m205719
8506B355343o080607m980166j714846J977616M313982M091482J978061L14658
8498B255523O85816K206372K547704L11045l351815n258895l390897O8952Q00810
8489c125385j679216k869047j2413L218114K136136j673416l042240j236667M0644
8480h243490l16366K82773J906809R86888k715401l789291Q58459O339666O182823
$$ plain form
8542 5290789 4675290 178635 -3573682 -2344635 1391866 2546192 1300206 1547961 3280922
8533 3280922 2486067 -1791320 -5801173 -6926394 -6420685 -5671991 -4040355 -1310541 1379632
8524 1379632 3662669 5562156 5047548 247234 -5520776 -5780851 621173 7610227 10333022
8515 10333022 10949624 13248208 15865295 15042079 11235947 8385654 7771824 6561062 2355343
8506 2355343 -3725264 -8705430 -10420276 -8442660 -4128678 -37196 1940865 2255523
8498 2255523 2941339 5147711 7695415 8006460 4654645 -604250 -3995147 -3926195 -3125385
8489 -3125385 -4804601 -7673648 -7686061 -4467947 -2331811 -4005227 -7047467 -8284134 -8243490
8480 -8243490 -8559856 -8277083 -6370274 -5383386 -8098787 -11888078 -11029619 -4689953 1492870
8471A492870J059286l090339l176943r23799J511902L339218L340108P52942j850649
8462B454596o92680L300085M607400Q73615l088739j963328K252531L112857j052224
8453I804113n374202o024296m804284m312741k904799J750053O974186P755083
8445B863113M086058R67443R65396J269801p10172l027749k691652k77039J486262
8436D931461J495882M63071q31932j638662j264294l59500l64836q77977j17860
8427A435353J307661O30909j927700k587548n53306j32920l145472m539276l45992
8418i858291M889818M743742R51501k82678R98124m54203m704167n614721q23137
8409a0154012M484392N246051K096720j894108m657483m461679j072600J908599
$$ plain form
8471 1492870 2552156 -538183 -3715126 -4638925 -3127023 212195 3552303 4305245 2454596
8462 2454596 1761916 5062001 9669401 10543016 7454277 5490949 7743480 10856337 9804113
8453 9804113 4429911 -1594385 -6398669 -10711410 -13616209 -11866156 -4891970 2863113
8445 2863113 6949171 7916614 8882010 10151811 9441639 6413890 3722238 3445199 4931461
8436 4931461 6427343 6890414 6058482 4419820 3155526 2796026 2431190 1553213 1435353
8427 1435353 2743014 3373923 1446223 -1141325 -1694631 -1827551 -4973023 -9512299 -9858291
8418 -9858291 -4968473 -224731 726770 444092 1442216 988013 -3716154 -9330875 -10154012
8409 -10154012 -5669620 -423569 1673151 -220957 -4878440 -9340119 -10412719 -8504120
8401h504120J088120o38279J754764N814932M205271k573472n346801o31471L689595
8392a141461J461197k121026k71927M020927M140144J039938K3923J064608N70300
8383H786623q19892k62900L83821k264834n299023l121519K438925L944715O8411
8374C854327k639373o48335J598176q1884l046522k819247K37838K582132K506397
8365A543509Q86165o91730q35188P06427K288012K402331K042042K489083J907801
8356A2738452j939670o382793o247542j860939O57332j512628l768948j646181
8348i962917K242778K712331J37950m67294K793014N916824M488886m98478l672589
8339C690505j699594K389300K590128k265370o426974m619135J005127M421910
$$ plain form
8401 -8504120 -7416000 -8054279 -6299515 -484583 3720688 1147216 -4199585 -4831056 -1141461
8392 -1141461 319736 -1801290 -2073217 1947710 6087854 7127792 7151715 8216323 8786623
8383 8786623 7966731 7703831 8087652 5822818 523795 -2597724 -158799 3785916 3854327
8374 3854327 1214954 566619 2164795 2082911 -963611 -3782858 -3545020 -962888 1543509
8365 1543509 2429674 1737944 902756 1609183 3897195 6299526 8341568 10830651 12738452
8356 12738452 10798782 4415989 -1831553 -3692492 -3035160 -4547788 -8316736 -9962917
8348 -9962917 -7720139 -5007808 -4869858 -5337152 -2544138 3372686 7861572 7363094 3690505
8339 3690505 1990911 4380211 6970339 4704969 -1722005 -6341140 -5336013 -914103
8331i14103M011044K770825J716295j103398m735283m656040j02345L333854J591589
8322A912438j917136j964678P59640J881125L56741j335121k048641k493672k133236
8313f982540N6799K288394J590802j251909k307440m97169Q41216m55444j843902
8304h561193k79717K830019L690604J537179q75237j550003j258730j066437m40551
8295e974066R54893J587354J90581j575441j048359J130498J369137j456986l619976
8286h442365j448008L412479O139816M819553J636822j113796k959973l297796
8278a253268j083122K389497L490118R96013j493465k18972L346408M445963J492673
8269A2111845k280082l685435l324619l276980l308190j759551P47266J438816
$$ plain form
8331 -914103 3096941 5867766 7584061 6480663 1745380 -2910660 -3013005 320849 1912438
8322 1912438 -4698 -1969376 -1209736 671389 1028130 -306991 -2355632 -4849304 -6982540
8313 -6982540 -6925741 -4637347 -3046545 -4298454 -6605894 -7103063 -6261847 -6717291 -8561193
8304 -8561193 -8840910 -6010891 -2320287 -783108 -1658345 -3208348 -4467078 -5533515 -5974066
8295 -5974066 -5019173 -3431819 -3241238 -4816679 -5865038 -4734540 -3365403 -4822389 -8442365
8286 -8442365 -9890373 -6477894 -338078 4481475 6118297 5004501 2044528 -1253268
8278 -1253268 -2336390 53107 3543225 4539238 3045773 2826801 6173209 10619172 12111845
8269 12111845 9831763 6146328 2821709 -455271 -3763461 -5523012 -4775746 -3336930
8261c336930j91536r12827J325919L388150J250189l094629l674412L11343K708765
8252b225968l1813k829904Q1531N429467N359706n57734m679301k581152J579383
8243d55785K566784J055264J72713k46474k073164m519890n090905l281859n43813
8234a2417129K107090M132227M411596K429856k45339j486180j115663o82182
8226b865724j266552k357198k485304q10074J354578J323794j273446k860443
8218a1240369n06859L091347K975416m30291j781630Q23961L310510K799523J657483
8209F99091J829589Q23480k758021m859769k182848J484300P89558k648287l195996
8200a0018903j58105K401240K927011L089820K462714q03278m258800k892665
$$ plain form
8261 -3336930 -3528466 -4441293 -3115374 272776 1522965 -1571664 -5246076 -4934733 -2225968
8252 -2225968 -2257781 -5087685 -5006154 423313 5783019 5225285 545984 -2035168 -455785
8243 -455785 2110999 3166263 3338976 3092502 1019338 -3500552 -8591457 -11873316 -12417129
8234 -12417129 -10310039 -6177812 -1766216 663640 418301 -1067879 -2183542 -2865724
8226 -2865724 -4132276 -6489474 -8974778 -9784852 -8430274 -7106480 -8379926 -11240369
8218 -11240369 -11747228 -8655881 -5680465 -6110756 -7892386 -7068425 -3757915 -958392 699091
8209 699091 2528680 3352160 594139 -4265630 -6448478 -4964178 -4174620 -6822907 -10018903
8200 -10018903 -10177008 -7775768 -4848757 -1758937 703777 -99501 -4358301 -7250966
8192g250966K632095N860769M028490J415036J247868O98535k665170n325880
8184F40777l501534R7785N82662j201976p75616J824658J968851j559713l987134
8175e911240j656519K459014L104619R2479j852450J69352L504233L802455Q33092
8166D545035j377977j6828K687705K257341k204549o529328o116087j025455M235645
8157c544498N599154L330115P49728k99787j284772l616742n233105l042045J834105
8148e507847M546381K931266J64431m16080L08437L47364N54678J965136K276986
8139G170752m80099l118056j396955K550173K745054j233967l685258k210236
8131C41408j082535l069777m247919p86042M181372N079385J675577k083424m066457
$$ plain form
8192 -7250966 -4618871 1241898 5270388 6685424 7933292 8631827 5966657 640777
8184 640777 -2860757 -2762972 -2180310 -3382286 -4157902 -2333244 -364393 -1924106 -5911240
8175 -5911240 -7567759 -5108745 -2004126 -1911647 -3764097 -3594745 -90512 3711943 4545035
8166 4545035 3167058 3150230 5837935 8095276 5890727 -638601 -6754688 -7780143 -3544498
8157 -3544498 2054656 5384771 6134499 5834712 4549940 933198 -4299907 -7341952 -5507847
8148 -5507847 -961466 1969800 2134231 1718151 2026588 2373952 2928630 4893766 7170752
8139 7170752 6690653 3572597 2175642 4725815 7470869 6236902 2551644 341408
8131 341408 -741127 -3810904 -8058823 -8844865 -4663493 415892 2091469 8045 -4058412
8122d058412m410732k543230J535351M690750L903689R33741l83855k06336j496191
8113b035225l784046l411501j00852K068114J329016O70110J680789J236681k329930
8104d676844m582113j477801L064969K391975j908542j503439N562218J0523650
8096G394073O026958l360150p838281n129188m03157L211193O375354P212749
8088A3489551K092605n841396p529208j046344M036442O02613n114888l887532
8080c198157J760428K806004o82633n26353M518530O381592J604389l264232l296634
8071F102934k202858l371328l293696L42285K515850l08199k732354M96241M590886
8062B139761K530235k792964l621135k06823J243756K42384J119457K452399j333821
$$ plain form
8122 -4058412 -8469144 -11012374 -9477023 -4786273 -882584 51157 -332698 -539034 -2035225
8113 -2035225 -5819271 -9230772 -9331624 -7263510 -5934494 -5264384 -3583595 -2346914 -4676844
8104 -4676844 -9258957 -10736758 -7671789 -5279814 -7188356 -8691795 -3129577 7394073
8096 7394073 13421031 10060881 2222600 -2906588 -3309745 -98552 6276802 13489551
8088 13489551 15582156 9740760 2211552 1165208 5201650 5804263 689375 -3198157
8080 -3198157 -1437729 1368275 685642 159289 4677819 11059411 12663800 9399568 6102934
8071 6102934 3900076 528748 -2764948 -2422663 93187 -215012 -2947366 -2451125 2139761
8062 2139761 4669996 1877032 -1744103 -1950926 -707170 -464786 654671 3107070 1773249
8053A773249p853713p676890M71690O111545K609505l159716k302976K965363
8045g061943M538188R72290k341213k159051k72606Q22605M55960q17639j253612
8036g117021R47327M352045M812916J454339j285355k67201J535908K68163k590565
8027B110556l402988k323259j489029m95694J289058J087974k641120m787032
8019a0651534j05472O664342N864804j791147m612814K431036Q980917M497050
8011A1277182n631149q374735k565036J016041k085203l575388K236952P452882
8003b48454K829058o386107p270832J438495P853988M991967m33852p32279R83415
7994C025399j703862o588275o827361k439168O88194Q11666J202352K367793J530939
$$ plain form
8053 1773249 -6080464 -13757354 -13285664 -7174119 -4564614 -7724330 -10027306 -7061943
8045 -7061943 -2523755 -1551465 -3892678 -6051729 -6324335 -5501730 -5045770 -5863409 -7117021
8036 -7117021 -6169694 -1817649 2995267 4449606 3164251 2897050 4432958 4701121 2110556
8027 2110556 -1292432 -3615691 -5104720 -5600414 -4311356 -3223382 -5864502 -10651534
8019 -10651534 -10757006 -4092664 1772140 -19007 -4631821 -2200785 6780132 11277182
8011 11277182 5646033 -2728702 -5293738 -4277697 -6362900 -9938288 -7701336 -248454
8003 -248454 2580604 -3805503 -11076335 -9637840 -1783852 3208115 2774263 2041984 3025399
7994 3025399 1321537 -5266738 -12094099 -14533267 -13845073 -13033407 -11831055 -9463262 -7932323
7985g932323m25148M77931L251846K464912j867612l208225L45838K443232j60567
7976d610116j348174L317613P226884K572913o221295q276883k267507K653893
7968f952672R95541k641663k391625P53829K250241O44812j725423k009006O47775
7959a0428191M206056N272321L024085N12824K76907Q38981K81464M71025L472530
7950G928002O137434L702674k375706n823977m540478k597074k757929k636933
7942b963987n6283K633131K256246m86784k430967j852014N63616K762849K532511
7933B958318l97496l111757k430137R26441L264319K630214J91659k301147l541122
7924a810708k170120J236906K707784m86179m575464l448830K376858O265349
$$ plain form
7985 -7932323 -8357471 -7879540 -4627694 -2162782 -4030394 -7238619 -6892781 -4449549 -4610116
7976 -4610116 -5958290 -2640677 4586207 7159120 937825 -7339058 -9606565 -6952672
7968 -6952672 -5957131 -8598794 -10990419 -10236590 -7986349 -7341537 -9066960 -11075966 -10428191
7959 -10428191 -6222135 -949814 2074271 2587095 2864002 3702983 3984447 4455472 7928002
7950 7928002 14065436 17768110 15392404 9568427 5027949 2430875 -327054 -2963987
7942 -2963987 -3020270 -387139 1869107 1382323 -1048644 -2900658 -2337042 425807 2958318
7933 2958318 2560822 -550935 -2981072 -2054631 1209688 3839902 4031561 1730414 -1810708
7924 -1810708 -3980828 -2743922 -36138 -522317 -5097781 -8546611 -6169753 95596
7916I5596N068443K417743J465485M70603k174045m192812l783115k921705l106768
7907f660575k138451J452875M653652M189257J266967j060342k170878k625585
7899c093080j877641j49039N82805J47230J128104L532200K940854k244810o225566
7890e258943l476508K733258N079062K450001m49071j357900j820989j664883
$$ plain form
7916 95596 5164039 7581782 9047267 9517870 7343825 3151013 -632102 -3553807 -6660575
7907 -6660575 -8799026 -7346151 -2692499 1496758 2763725 1703383 -467495 -3093080
7899 -3093080 -4970721 -5119760 -4536955 -4389725 -3261621 270579 3211433 966623 -5258943
7890 -5258943 -8735451 -6002193 -923131 1526870 1077799 -280101 -2101090 -3765973
$$ [...]
##END NTUPLES=NMR SPECTRUM
##END=
