##TITLE=31Pdec_2ABPA1305-4
 CDCl3, 24 sc
 14.05.2021
##JCAMPDX= 6.0         $$ Bruker NMR JCAMP-DX V2.0
##DATA TYPE= NMR SPECTRUM
##DATA CLASS= NTUPLES
##ORIGIN= UXNMR, Bruker Analytische Messtechnik GmbH
##OWNER= root
$$ XWIN-NMR		Version 3.5
$$ Fri May 14 11:16:07 2021 Russian Standard Time (UT+4h)  she@DPX200
##.OBSERVE FREQUENCY= 81.013821
##.OBSERVE NUCLEUS= ^31P
##.ACQUISITION MODE= SIMULTANEOUS
##.ACQUISITION SCHEME= undefined
##.AVERAGES= 24
##.DIGITISER RES= 16
##SPECTROMETER/DATA SYSTEM= spect
##.PULSE SEQUENCE= zgpg30
##.SOLVENT NAME= CDCl3
##.SHIFT REFERENCE= (INTERNAL, CDCl3, 0, 248.564)
##AUDIT TRAIL= $$ (NUMBER, WHEN, WHO, WHERE, WHAT)
$$ ##TITLE= Audit trail, XWIN-NMR		Version 3.5
$$ ##JCAMPDX= 5.01
$$ ##ORIGIN= Bruker BioSpin GmbH
$$ ##OWNER= she
$$ F:/spectra/data/she/nmr/P31/1/pdata/1/auditp.txt
$$ ##AUDIT TRAIL=  $$ (NUMBER, WHEN, WHO, WHERE, WHAT)
(   1,<2021-05-14 11:14:47.53 +0400>,<she>,<DPX200>,
      <created by zg, POWCHK disabled, PULCHK disabled
       configuration hash MD5:
       00 E9 B6 7A A2 85 ED C7 34 08 36 98 17 FE 4E 26
       data hash MD5: 32K
       65 E1 2A 8E 0A EE DC 72 3F 24 01 8C 54 2F B2 D4>)
(   2,<2021-05-14 11:14:52.64 +0400>,<she>,<DPX200>,
      <Start of raw data processing
       efp BC_mod = 2 LB = 1 FT_mod = 6 PKNL = 1 PHC0 = -6410.016 PHC1 = -329.3994 SI = 64K 
       data hash MD5: 64K
       28 46 3B 0D 44 F6 47 1C C6 E4 38 29 07 56 9D 29>)
(   3,<2021-05-14 11:15:31.57 +0400>,<she>,<DPX200>,
      <pk PHC0 = -223.7486 PHC1 = 533.0002 
       data hash MD5: 64K
       BD F5 D7 09 32 79 6C 85 EB 0D E9 00 D1 2A 32 E0>)
(   4,<2021-05-14 11:15:35.65 +0400>,<she>,<DPX200>,
      <abs ABSG = 5 
       data hash MD5: 64K
       E9 27 B5 F9 32 15 11 F2 D3 D1 DA 04 63 1F 3F C4>)
$$ ##END=
$$ 
$$ hash MD5
$$ 87 F7 7A 24 45 DE 3B 94 A9 CE DA BC 3F F3 BC 0D
##$RELAX= 
##$RELAX= 
##$RELAX= 
##$RELAX= 
##$RELAX= 
##$RELAX= 
##$RELAX= 
##$RELAX= 
$$ Bruker specific parameters
$$ --------------------------
##$DU= <F:/spectra>
##$EXPNO= 1
##$NAME= <P31>
##$PROCNO= 1
##$TYPE= <nmr>
##$USER= <she>
##$AMP= (0..31)
100 100 100 100 100 100 100 100 100 100 100 100 100 100 100 100 100 100 
100 100 100 100 100 100 100 100 100 100 100 100 100 100 
##$AQSEQ= 0
##$AQ_mod= 1
##$AUNM= <au_zg>
##$AUTOPOS= <>
##$BF1= 81.014009
##$BF2= 200.13
##$BF3= 200.13
##$BF4= 200.13
##$BF5= 200.13
##$BF6= 200.13
##$BF7= 200.13
##$BF8= 200.13
##$BYTORDA= 1
##$CFDGTYP= 0
##$CFRGTYP= 5
##$CHEMSTR= <none>
##$CNST= (0..31)
1 1 145 1 1 1 1 1 1 1 1 1 1 1 1 1 1 1 1 1 1 1 1 1 1 1 1 1 1 1 1 1 
##$CPDPRG= <waltz16>
##$CPDPRG1= <>
##$CPDPRG2= <waltz16>
##$CPDPRG3= <>
##$CPDPRG4= <mlev>
##$CPDPRG5= <mlev>
##$CPDPRG6= <mlev>
##$CPDPRG7= <mlev>
##$CPDPRG8= <mlev>
##$CPDPRGB= <>
##$CPDPRGT= <>
##$D= (0..31)
0 1 0 0 0 0 0 0 0 0 0 0.03 2e-05 3e-06 0 0 0 0 0 0 0 0 0 0 0 0 0 0 0 0 
0 0 
##$DATE= 1620976487
##$DBL= (0..7)
120 120 120 11 120 120 24 19 
##$DBP= (0..7)
150 150 150 150 150 150 150 150 
##$DBP07= 0
##$DBPNAM0= <>
##$DBPNAM1= <>
$$ [...]
##$SUBNAM3= <"">
##$SUBNAM4= <"">
##$SUBNAM5= <"">
##$SUBNAM6= <"">
##$SUBNAM7= <"">
##$SUBNAM8= <"">
##$SUBNAM9= <"">
##$SW= 501.771253377433
##$SWIBOX= (0..15)
0 1 3 0 0 0 0 0 0 0 0 0 0 0 0 0 
##$SW_h= 40650.406504065
##$TD= 32768
##$TD0= 1
##$TE= 0
##$TE2= 300
##$TE3= 300
##$TEG= 300
##$TL= (0..7)
0 120 53 12 22 120 120 120 
##$TP= (0..7)
150 150 150 150 150 150 150 150 
##$TP07= 0
##$TPNAME0= <>
##$TPNAME1= <>
##$TPNAME2= <>
##$TPNAME3= <>
##$TPNAME4= <>
##$TPNAME5= <>
##$TPNAME6= <>
##$TPNAME7= <>
##$TPOAL= (0..7)
0.5 0.5 0.5 0.5 0.5 0.5 0.5 0.5 
##$TPOFFS= (0..7)
0 0 0 0 0 0 0 0 
##$TUNHIN= 0
##$TUNHOUT= 0
##$TUNXOUT= 0
##$USERA1= <user>
##$USERA2= <user>
##$USERA3= <user>
##$USERA4= <user>
##$USERA5= <user>
##$V9= 5
##$VALIST= <valist>
##$VCLIST= <CCCCCCCCCCCCCCC>
##$VD= 0
##$VDLIST= <DDDDDDDDDDDDDDD>
##$VPLIST= <PPPPPPPPPPPPPPP>
##$VTLIST= <TTTTTTTTTTTTTTT>
##$WBST= 1024
##$WBSW= 4
##$XGAIN= (0..3)
0 0 0 0 
##$XL= 0
##$YL= 0
##$YMAX_a= 14040
##$YMIN_a= -16081
##$ZGOPTNS= <>
##$ZL1= 120
##$ZL2= 120
##$ZL3= 120
##$ZL4= 120
##$ABSF1= 248.5645
##$ABSF2= -253.2056
##$ABSG= 5
##$ABSL= 3
##$ALPHA= 0
##$AQORDER= 0
##$ASSFAC= 0
##$ASSFACI= 0
##$ASSFACX= 0
##$ASSWID= 0
##$AUNMP= <proc_1d>
##$AZFE= 0.1
##$AZFW= 0.5
##$BCFW= 0
##$BC_mod= 2
##$BYTORDP= 0
##$COROFFS= 0
##$CY= -3
##$DATMOD= 1
##$DC= 0
##$DFILT= <>
##$DTYPP= 0
##$F1P= 0
##$F2P= 0
##$FCOR= 1
##$FTSIZE= 65536
##$FT_mod= 6
##$GAMMA= 0
##$GB= 0
##$INTBC= 1
##$INTSCL= 5.30512e-09
##$ISEN= 30
##$LB= 1
##$LEV0= 0
##$LPBIN= 0
##$MAXI= 10000
##$MC2= 0
##$MEAN= 0
##$ME_mod= 0
##$MI= 50
##$NCOEF= 0
##$NC_proc= -7
##$NLEV= 6
##$NOISF1= 182.463
##$NOISF2= 159.3651
##$NSP= 0
##$NTH_PI= 0
##$NZP= 0
##$OFFSET= 248.5645
##$PC= 4
##$PHC0= -6633.765
##$PHC1= 203.6008
##$PH_mod= 1
##$PKNL= yes
##$PPARMOD= 0
##$PSCAL= 0
##$PSIGN= 0
##$REVERSE= no
##$SF= 81.014009
##$SI= 65536
##$SIGF1= 159.3651
##$SIGF2= -187.1042
##$SINO= 113.3802
##$SIOLD= 16384
##$SREGLST= <1H.CDCl3>
##$SSB= 0
##$STSI= 65536
##$STSR= 0
##$SW_p= 40650.406504065
##$SYMM= 0
##$S_DEV= 0
##$TDeff= 32768
##$TDoff= 0
##$TI= <>
##$TILT= no
##$TM1= 0
##$TM2= 0
##$TOPLEV= 0
##$USERP1= <user>
##$USERP2= <user>
##$USERP3= <user>
##$USERP4= <user>
##$USERP5= <user>
##$WDW= 1
##$XDIM= 65536
##$YMAX_p= 454764440
##$YMIN_p= -73460211
$$ End of Bruker specific parameters
$$ ---------------------------------
##NTUPLES= NMR SPECTRUM
##VAR_NAME=  FREQUENCY,     SPECTRUM/REAL,   SPECTRUM/IMAG
##SYMBOL=    X,             R,               I
##VAR_TYPE=  INDEPENDENT,   DEPENDENT,       DEPENDENT
##VAR_FORM=  AFFN,          ASDF,            ASDF
##VAR_DIM=   65536,         65536,           65536
##UNITS=     HZ,            ARBITRARY UNITS, ARBITRARY UNITS
##FACTOR=    0.620285442955139, 1,           1
##FIRST=     20137.2065510759, 0,            0
##LAST=      -20513.1999529892, 0,           0
##MIN=       -20513.1999529892, -73460211,   0
##MAX=       20137.2065510759, 454764440,    0
$$ Real data points
##PAGE= N=1
##DATA TABLE= (X++(R..R)), XYDATA
$$ [...]
42682e708644l289420J751842N082087M377197J252321k029213m015824k835740
42674e415394K010926O395475M974899j025370m413378k185053L67596j213984
42666e04283l050103N0555M638206L219366l226548n672217p42614M113663K441487
42657A267512j563816j031660J836024L78420l422528q02771Q220496J1804511
42649A6686188L437733p094957p608308j190969J85238m882424o445225j023576
42641g936300K626919j238192n801669l443017K229124L714169J782714J854859
42633f211393L505134K391831p04308j167240J127860K271094J555050J324182
42625D092210J105533j215541l685443k659917K80837P13431o63236J20014J840010
$$ plain form
42682 -5708644 -8998064 -7246222 -2164135 2213062 3465383 1436170 -2579654 -5415394
42674 -5415394 -3404468 2991007 7965906 6940536 2527158 342105 709701 -504283
42666 -504283 -3554386 -3503831 1134375 4353741 1127193 -4545024 -5287638 -1173975 1267512
42657 1267512 -296304 -1327964 508060 886480 -2536048 -3338819 4881677 16686188
42649 16686188 20123921 13028964 5420656 4229687 4414925 -467499 -6912724 -7936300
42641 -7936300 -5309381 -6547573 -12349242 -15792259 -13563135 -9848966 -8066252 -6211393
42633 -6211393 -2706259 -314428 -1018736 -2185976 -1058116 1212978 2768028 4092210
42625 4092210 5197743 3982202 296759 -2363158 -2082321 -1368890 -2032126 -1912112 -72102
42616g2102k2096l550154k020719L993740N920943P51607m245988l577701r06887
42607c729357j90682J175548M640192M757337j487345o997216m416646K171790
42599d076379L840518M71076q80175J933036M217806K951264j48960k984913m340331
42590I82942k286683K850219N872566K995115j560858j676940O12053j087570
42582F700844n644981n329196J394512O820357N350797J80275l391585m262693
42574A818330k943210N09313L380312J553654l418294m781585p82701K363861
42566b300320Q98819n71273J746960L313882l74477m365357j549454N151597O916682
42557H867059K677459n42016L0468n11468m650828p355119m273652J431174M232223
$$ plain form
42616 -72102 -94198 -3644352 -5665071 -1671331 4249612 5001219 755231 -2822470 -3729357
42607 -3729357 -3920039 -2744491 1895701 6653038 5165693 -1831523 -6248169 -4076379
42599 -4076379 -235861 235215 -644960 1288076 5505882 8457146 8308186 5323273 982942
42590 982942 -1303741 1546478 7419044 10414159 8853301 7176361 7788414 6700844
42582 6700844 1055863 -4273333 -2878821 3941536 9292333 9472608 6081023 1818330
42574 1818330 -1124880 -615567 2764745 4318399 900105 -3881480 -4664181 -2300320
42566 -2300320 -1401501 -1972774 -225814 3088068 2713591 -1651766 -3201220 1950377 8867059
42557 8867059 11544518 11002502 11032970 10521502 5870674 -1484445 -5758097 -4326923 -94700
42548i4700L440264J677091N9217j437930j749803l53318Q92782M12024l15490
42539B530137Q12610K853355L020980M80496k960054m947914m073565p26427K334984
42530f75398K161732l28408q08416K316902N063193L567490l05627k334477k170810
42521F486181k078839j807106J92109J900698j32485m064882m094786O11255M045551
42512A057696K157640j860650l455167k711306j487180N04419L057587L433352
42504F96391J056278k2883K244622L380897j40183l600206j298151K895353J122260
42495F334378m686645m914772J742096N213004P1216n484817k535450M771229
42487E10239O055727N6600m973083l682651P19600K585387K27962l752047m992869
$$ plain form
42548 -94700 3345564 5022655 5081872 3643942 1894139 1540821 2433603 2845627 2530137
42539 2530137 3342747 6196102 9217082 9697578 6737524 1789610 -2283955 -3010382 -675398
42530 -675398 1486334 1157926 349510 2666412 7729605 11297095 10991468 8656991 6486181
42521 6486181 4407342 2600236 2792345 4693043 4560558 495676 -3599110 -2987855 1057696
42512 1057696 3215336 1354686 -2100481 -4811787 -6298967 -5794548 -2736961 696391
42504 696391 1752669 1729786 3974408 7355305 7215122 3614916 2316765 5212118 6334378
42495 6334378 1647733 -3267039 -1524943 3688061 3759277 -1725540 -4260990 510239
42487 510239 6565966 6622566 1649483 -2033168 -1313568 1271819 1499781 -2252266 -7245135
42478g245135j021577M951714N994594K06110n534064m541638M68891K563877
42470d157228J538002K330906M598794K788185k942485m903491J81830N416407
42462D850920M276900Q85j102641J68848p42647k938068j951670J340672J481501
42453E384700k195433m112721j460281J727701J651257L25445J020725K657715
42445D999108K390850M37982j229189k330234l029751j830287J552368L510823
42437D471670J011926l014774l429925p44343J31276j466606p67238L732654O607551
42428F532191L657912j484338l084785j504315q60679j721567j591671o83030
42420g40282j478439l255880k504837R47413L207768K536932J647554K412555
$$ plain form
42478 -7245135 -8266712 -3314998 2679596 2885706 -2648358 -7189996 -6721105 -4157228
42470 -4157228 -2619226 -288320 4310474 7098659 4156174 -747317 -565487 4850920
42462 4850920 9127820 9128705 8026064 8194912 7452265 4514197 2562527 3903199 5384700
42453 5384700 3189267 -923454 -2383735 -656034 995223 1320668 2341393 4999108
42445 4999108 7389958 7827940 6598751 4268517 1238766 -591521 960847 4471670
42437 4471670 5483596 2468822 -961103 -1705446 -1574170 -3040776 -3808014 -75360 6532191
42428 6532191 10190103 8705765 5620980 4116665 3255986 1534419 -57252 -740282
42420 -740282 -2218721 -5474601 -7979438 -7032025 -3824257 -1287325 360229 2772784
42412B772784K649784L31750k627497l352558k077838q33360j79168N17536J126162
42403a672405R79976K7939j323999k438000k187284j27914K025067K230608J225906
42394a260106J034576Q58609j542164m361398k834131K808657N956984K847311
42386C508338k039930l189302j420832K15256K504716O196086O887960J223240
42378A3885532n183405m322842J572012K822280k570182n943046k010908L114982
42370A364423K169238k460023l895261j314975R23641J178793J416824K142254
42362A524914J897850R35298P64620O04308j445519l981625l403623J28777K089942
42353h85058K65010j894134r24787J017215j78404l334602l048540J915250N848420
$$ plain form
42412 2772784 5422568 5754318 3126821 -225737 -2303575 -3136935 -3316103 -2798567 -1672405
42403 -1672405 -692429 -664490 -1988489 -4426489 -6613773 -6741687 -4716620 -2486012 -1260106
42394 -1260106 -225530 633079 -909085 -5270483 -8104614 -5295957 661027 3508338
42386 3508338 1468408 -1720894 -3141726 -2926470 -421754 5774332 12662292 13885532
42378 13885532 8702127 4379285 5951297 8773577 6203395 260349 -1750559 1364423
42370 1364423 3533661 1073638 -2821623 -4136598 -3212957 -2034164 -617340 1524914
42362 1524914 3422764 4358062 5122682 5726990 4281471 299846 -3103777 -2975000 -885058
42353 -885058 -620048 -2514182 -3438969 -2421754 -2600158 -5934760 -8983300 -7068050 -1219630
42344a219630L893048r42712k252531M73778J822985o92894l075931j775745O93071
42335c076561L98207j580286j728573l84505m39932j370691K0212L275171M128829
42326g58129J453972p17051K37616J594616L81511j630602j216490J066689K327278
42317B739410J895731J190096N20373q85517k518086k968843k296106j802685
42309d125627j655800o34267J608047L411719K726519m92575l611641l517563
42301f291188k31852K456601J519939j078404j201081J202477K329281R75077
42293c19150J50093J080495O90311k286810l722446p55895K400044P45069k883052
42284d901341j986265K858104M653902J095719k158181p70043K183171K143043
$$ plain form
42344 -1219630 2673418 1730706 -521825 -48047 1774938 1082044 -1993887 -3769632 -3076561
42335 -3076561 -2678354 -4258640 -5987213 -6371718 -6811650 -8182341 -8162129 -4886958 -758129
42326 -758129 695843 -21208 216408 1811024 2192535 561933 -654557 412132 2739410
42317 2739410 4635141 5825237 6345610 5460093 2942007 -26836 -2322942 -4125627
42309 -4125627 -5781427 -6415694 -4807647 -1395928 1330591 838016 -2773625 -6291188
42301 -6291188 -6523040 -4066439 -2546500 -3624904 -4825985 -3623508 -1294227 -319150
42293 -319150 -169057 911438 1601749 -685061 -4407507 -5163402 -2763358 -2018289 -4901341
42284 -4901341 -6887606 -4029502 624400 1720119 -438062 -1208105 975066 3118109
42276C118109k81338k069071k859362l386969k253089J477614M673120L350610
42268A769624j459133m536436k882795J233979L435372J597173k508690m584964
42260g935870j693226M076324P208513N228507J530933J13218J70769j213764
42252G485404l468856l607694j478578K30963N60016Q29953J122868M30976Q0139
42243B185191K343284N371985M560851q6088l226297k338931r41495j371537p09514
42234E787449K304571K892510j467424m471882m35838M738696J745589o164649
42226D929022o851326J427668O575124J486946n314469l996257J611784J985153
42218A853645k555793m283006j502929N90551L34286J181814L222906K109601
$$ plain form
42276 3118109 2836771 767700 -2091662 -5478631 -7731720 -6254106 -1580986 1769624
42268 1769624 310491 -4225945 -7108740 -5874761 -2439389 -842216 -3350906 -7935870
42260 -7935870 -9629096 -5552772 1655741 6884248 8415181 8528399 8699168 7485404
42252 7485404 4016548 408854 -1069724 -838761 -278745 551208 1674076 2105052 2185191
42243 2185191 4528475 9900460 14461311 14375223 11148926 8809995 7868500 6496963 5787449
42234 5787449 8092020 10984530 9517106 5045224 4609386 9348082 11093671 4929022
42226 4929022 -1922304 -494636 6080488 7567434 2252965 -1743292 -131508 1853645
42218 1853645 -702148 -4985154 -6488083 -5897532 -5563246 -4381432 -1158526 951075
42210I51075k382698m685095k367520L35266M21850P77634L546811N148954K484166
42201D230443j056476j047160N28767r38239m249177l977659N79869M014984K971415
42192A056767O33614J191822L591809L543913k11764m321203n147312k900268
42184b562622q38866j021746j890298o90166K446241M428269L304911N90768j205170
42175B561321j470336p70275O80540K016858J208683j909079l810989j708986
42167c202263J513596Q63988k822432l498268O73950M042623K439172N8896K259013
42158B328275N718298L153930l958349o038851p2903M974720J718588m219605
42150C604103l366222K539000L767059j647281n319012k295363J990144J700775
$$ plain form
42210 951075 -1431623 -6116718 -8484238 -8148972 -7727122 -6949488 -3402677 1746277 4230443
42201 4230443 3173967 2126807 2655574 1717335 -2531842 -6509501 -5929632 -1914648 1056767
42192 1056767 1690381 2882203 6474012 10017925 9806161 5484958 337646 -2562622
42184 -2562622 -3401488 -4423234 -6313532 -7003698 -4557457 -129188 3175723 3766491 2561321
42175 2561321 1090985 320710 1001250 3018108 4226791 2317712 -1493277 -3202263
42167 -3202263 -1688667 -824679 -3647111 -7145379 -6471429 -2428806 10366 69262 2328275
42158 2328275 8046573 11200503 7242154 1203303 1130400 6105120 7823708 3604103
42150 3604103 237881 2776881 6543940 4896659 -422353 -2717716 -727572 973203
42142I73203o24174k39369J414854N77155j410906r93630P20490L54342j008314
42133b36349J19536K689701K759054R16399J338518L737658L179344j226886m166608
42124I110367k573104j24898n53285j887044q89669J137070Q89804j577564l406889
42115A24788k818306k13767K542330K690422p46906l959496j920361L818992N856515
42106E374211J708403j810704J080063N893223M750575j662687n805155m423964
42098E103965j088005J121725K548208K738412N4346l436435k912844J404800
42090E534172L114506r38451n291405l749743J608830M063004K011726j56970
42082F195669K75318J114219J81220j126480j129062j154622k595276l082294
$$ plain form
42142 973203 349029 109660 1524514 2101669 690763 -302867 417623 771965 -236349
42133 -236349 -116813 2572888 5331942 6248341 7586859 11324517 14503861 13276975 9110367
42124 9110367 6537263 6412365 5859080 3972036 3082367 4219437 5109241 3531677 124788
42115 124788 -2693518 -2907285 -364955 2325467 1578561 -2380935 -4301296 -482304 5374211
42106 5374211 7082614 5271910 6351973 12245196 16995771 15333084 9527929 5103965
42098 5103965 4015960 5137685 7685893 10424305 10478651 7042216 4129372 5534172
42090 5534172 8648678 7710227 2418822 -1330921 277909 4340913 6352639 6195669
42082 6195669 6470987 7585206 7766426 6639946 5510884 4356262 1760986 -1321308
42074a321308N11158N988458P037838J766967l751995l353150O56881J139281
42066H674130l007036n057963o13943N625584O481494J985258j879039j984837
42058A0223648q28424j004001j549372q84699J72604R9548j057839k663300m588614
42049b080449n714806l587882J981747O584892N532384p562m141204l582703p43704
42040e759287J229771K849287N317295O363517L144958k220224m515638k595928
42032C813751l14573Q5413O76422K498012K604127n61395l312930k199677L31829
42023C620979J26696k002649k569106j607638j381097j222307Q09631L041987
42015a183504K642687J179928J807639K871413J009665j405643J23231K767118
$$ plain form
42074 -1321308 -810150 5178308 12216146 13983113 10231118 6877968 7534849 8674130
42066 8674130 5667094 609131 -4812 5620772 12102266 14087524 12208485 10223648
42058 10223648 9395224 8391223 6841851 5957152 6129756 6229304 5171465 2508165 -2080449
42049 -2080449 -7795255 -11383137 -9401390 -2816498 2715886 2708324 -1432880 -5015583 -5759287
42040 -5759287 -4529516 -1680229 3637066 10000583 13145541 10925317 6409679 3813751
42032 3813751 3499178 3584591 4261013 6759025 9363152 8801757 5488827 3289150 3620979
42023 3620979 3747675 1745026 -824080 -2431718 -3812815 -5035122 -4225491 -1183504
42015 -1183504 1459183 2639111 4446750 7318163 8327828 6922185 7045416 9812534
42007I812534q0239o253487o459313K11445L705043p14558m877921j728509L684254
41998b700751M127278J514166M95842m71160l102332k657869L176289O531431
41990F912894R54184o341324n321009K87529K77459l568877j171203O648680Q453400
41981G131733J750300k988974l19037K354062p52050m343397k941632k52260j031207
41972a392462k642863j223564J349006K408483L297888M064229Q54400n806607
41964I08510p741174p69441P163757O776579N14826k798788j421953o35734k653701
41955f57119m583595m658378l626752j091500L573932P523748O959384K834956
41947F274676l15315n01242O16505J573938K068955J063450k061164m872292l998830
$$ plain form
42007 9812534 9732295 3478808 -2980505 -2769060 935983 221425 -4656496 -6385005 -2700751
41998 -2700751 1426527 2940693 3436535 2965375 -136957 -2794826 381463 6912894
41990 6912894 7867078 1525754 -3795255 -3507726 -3230267 -6799144 -7970347 -1321667 7131733
41981 7131733 8882033 5893059 5574022 7928084 7176034 2832637 -108995 -361255 -1392462
41972 -1392462 -4035325 -5258889 -3909883 -1501400 1796488 5860717 6715117 908510
41964 908510 -6832664 -7602105 -438348 6338231 6853057 4054269 2632316 1996582 -657119
41955 -657119 -5240714 -9899092 -13525844 -14617344 -11043412 -3519664 3439720 6274676
41947 6274676 5959361 5458119 6074624 7648562 9717517 10780967 8719803 3847511 -151319
41938a51319M8195K948251J697223k200420m700009l340545K67148J903961k68389
41929c795904k820248j474931K422577L635416J006990j062086J36208K023779
41921G1801K033282J386889J295578K94766j919876k592187o29920J118087P99389
41912A857809K15963L52076m94906j787675l9856M063472M576702K8334l004105
41903E767814p03767J360475j529508m294414j246936K943936R93089l962885
41895f72196l447354K170302M999248K663208Q5095j92061j49069J43485K325094
41886G925752M058478J878646j481304r65005J235548q97290n658512n570042
41878E26271l85998K323140J45308j091453J309313K770930J048770J31011J563737
$$ plain form
41938 -151319 -103124 2845127 4542350 2341930 -2358079 -5698624 -5431476 -3527515 -3795904
41929 -3795904 -6616152 -8091083 -5668506 -2033090 -1026100 -2088186 -1951978 71801
41921 71801 2105083 3491972 4787550 5082316 3162440 570253 -59667 1058420 1857809
41912 1857809 2073772 2425848 1930942 143267 103411 4166883 8743585 8771919 5767814
41903 5767814 5064047 6424522 4895014 600600 -646336 2297600 3290689 -672196
41895 -672196 -4119550 -1949248 3050000 5713208 5798303 5606242 5457173 5600658 7925752
41886 7925752 11984230 13862876 12381572 11416567 12652115 11754825 6096313 526271
41878 526271 140273 2463413 2608721 1517268 2826581 5597511 6646281 6777292 8341029
41869H341029J197820k138621l677416j748486q34540k139715n06514M994809
41861C488366P007398J913320l198684k064079P00705j494099n636442m726359
41853d009874N90361M006157L247721J101007P7905J230995M498666O229556J585972
41844A8558466o700158q880968k407113K590141j188794n998300j817215O593719
41836G49778P409223Q71725k607404l94656R1615l379620l824597J405957N022182
41827E344203K040408k222400j605609J360928J016521k308121m219208l156441
41819c749719p32300J767660L468083K854384k64367l274090l271219o7674L911190
41810F41948N492833L038351j324756l005479p83949R11883j099030k813022N26109
$$ plain form
41869 8341029 9538849 7400228 3722812 1974326 1139786 -999929 -1506443 3488366
41861 3488366 10495764 12409084 9210400 7146321 7847026 6352927 716485 -4009874
41853 -4009874 -3419513 586644 3834365 4935372 5013277 6244272 10742938 16972494 18558466
41844 18558466 11858308 2977340 570227 3160368 1971574 -4026726 -5843941 749778
41836 749778 8159001 9030726 6423322 6028666 6120281 2740661 -1083936 322021 5344203
41827 5344203 7384611 5162211 3556602 4917530 5934051 3625930 -593278 -3749719
41819 -3749719 -4482019 -2714359 753724 3608108 3343741 69651 -3201568 -3269242 641948
41810 641948 6134781 9173132 7848376 4842897 4058948 4970831 3871801 1058779 1584888
41801A584888N004441K795086m786757p807740k371318L961609M154178P83617
41793C318004j064022k177265m527679m714519M55489O208441N436560l00248
41785B634761k930450j28405J944683r00056m378927k778928K295765M576938
41777C35381K166620n89164o6813J860105J755887K02532N0924Q50772l19277
41768F246967k543376j152606L920335N739304N37106n091064l423143K276407
41760F509930K848868k324784n233324k749923l38525j033595p01740K430679
41752e92414L009073j568020m832812j172270M875359O072774L207990J149765
41744A0149445l82930m041503p125008n211565o82233O46087p04996L25769L362227
$$ plain form
41801 1584888 6589329 9384415 4597658 -3210082 -5581400 -1619791 2534387 3318004
41793 3318004 2253982 76717 -4450962 -9165481 -8709992 -2501551 2935009 2634761
41785 2634761 -295689 -424094 1520589 620533 -3758394 -6537322 -4241557 335381
41777 335381 2502001 1912837 1846024 3706129 5462016 5664548 5715472 6566244 6246967
41768 6246967 3703591 2550985 6471320 12210624 12747730 7656666 4233523 6509930
41760 6509930 9358798 7034014 1800690 -949233 -1287758 -2321353 -3023093 -592414
41752 -592414 2416659 848639 -3984173 -5156443 -281084 5791690 8999680 10149445
41744 10149445 9766515 5725012 -1399996 -6611561 -7293794 -6647707 -7352703 -7026934 -3664707
41735c664707L091340o29538j856245J179562K933657r9040l853890l399694M51696
41726e846859L955754N108363L338012q95243m243716k743314K202437M590298
41718E465732K150929j038822j955647k804393m982774m951269n83199L534078
41710e165365K636359l07558P31731M857558N354805Q1931n057441m089682J666653
41701G08991N893659M714555M97519j183256J796228M965940K557385m284606
41693A5666415q180811n554402j416266j142242k282499J73917M164144L384225
41685D812481j786642l988904k92520L444536K253582l93752J005333M948032
41677A0002146N567968J426743l307387m879657k949899J057045M480094L492289
$$ plain form
41735 -3664707 -573367 -1202905 -3059150 -1879588 1054069 955029 -2898861 -6298555 -5846859
41726 -5846859 -1891105 3217258 6555270 5660027 1416311 -1327003 875434 5465732
41718 5465732 7616661 6577839 4622192 1817799 -3164975 -8116244 -8699443 -5165365
41710 -5165365 -2529006 -2836564 -2104833 2752725 8107530 8189461 3132020 -957662 708991
41701 708991 6602650 11317205 11814724 10631468 12427696 17393636 19951021 15666415
41693 15666415 7485604 1931202 514936 -627306 -2909805 -2735888 1428256 4812481
41685 4812481 3025839 -963065 -1255585 2188951 4442533 4048781 5054114 10002146
41677 10002146 15570114 16996857 13689470 8809813 5859914 6916959 11397053 14889342
41669A4889342k788322q733231p546555n16644L949743J637501k304073j831468
41661c243707J546919K874576J997100K149163K958368J126026k730706m006635
41653B671104j443742R17133L69803r52043r11789o76408q53291O04348L433142
41644C158257L048465k094623n712913j986489M865060N986592P94878k805196
41636E254031p92837J781102j39082l705952l120235J469730M234287J501404
41628F482448l638945m963797n33707M382771L355817k325985m468001M56259
41620a253140N339138K678896l667904m187659J602033M950965J838072k089761
41612E210640k121626j175876k597132m098545l139103j646492j044489J184645
$$ plain form
41669 14889342 12101020 3367789 -4178766 -4695410 -745667 891834 -1412239 -3243707
41661 -3243707 -1696788 1177788 3174888 5324051 8282419 9408445 6677739 2671104
41653 2671104 1227362 2144495 2514298 1562255 650466 -25942 -879233 -274885 3158257
41644 3158257 6206722 4112099 -1600814 -3587303 1277757 7264349 8059227 5254031
41636 5254031 4461194 6242296 6103214 2397262 -722973 746757 4981044 6482448
41628 6482448 2843503 -2120294 -2654001 1728770 5084587 2758602 -1709399 -1253140
41620 -1253140 4085998 6764894 3096990 -1090669 511364 5462329 7300401 5210640
41612 5210640 3089014 1913138 -683994 -4782539 -7921642 -9568134 -10612623 -9427978
41604i427978N566345P452121M519891J372307J620629J716291j544825l877129
41596G397652r14778L177649K507681l32031L87674K465353j89624n596301o065260
41587B838015j051333K264485Q85938q56063l67792m5057n75199N52036K640194
41578F285224J947515n68930J98997L883936M087160n63394l545844j572826O0931
41569A0212769k703466n605881l835441P4577J485910R00734P61443K12898j879336
41560c75793l170656j667888O74825J807818K694363L582404K385668k10289j22528
41551E597924K307850J048449m694251o412433M73147P363963M874753k573252
41543G986150m545470j251623r39137m367945m324004M40727K952919Q49349J72924
$$ plain form
41604 -9427978 -3861633 3590488 8110379 9482686 11103315 12819606 11274781 7397652
41596 7397652 6482874 9660523 12168204 11836173 12223847 14689200 14499576 8903275 2838015
41587 2838015 1786682 4051167 4937105 4081042 3713250 3668193 3092994 3645030 6285224
41578 6285224 8232739 7663809 7862806 11746742 15833902 15270508 11724664 10151838 10212769
41569 10212769 7509303 1903422 -1932019 -1857442 -371532 529202 1290645 1503543 -375793
41560 -375793 -3546449 -5214337 -4539512 -2731694 -37331 3545073 5930741 5720452 5597924
41551 5597924 7905774 8954223 4259972 -2152461 -1679314 5684649 10559402 7986150
41543 7986150 3440680 2189057 1249920 -3118025 -7442029 -7001302 -4048383 -3199034 -3026110
41534c026110L503839M688832K7493m234980j691146L874364M736349R65309j187189
41525G656761J57580O20222k147807m384925k312096J751783K526590o48202k805101
41516D14805m62066L275872L180525n88228l309122l152145k796799l084747r85534
41507g507439L660558N446552J775042j610383P12294M469622K260912m095340
41499E111818o232798k429630P33551j51813r34942J342479L306449J920379l63595
41490B301898o69127k99965o29167N01822M047662N691964J432061n373634p245792
41481b42278j951190M895972O582513K446970k133727k111182J423443K818924
41473A1729445l88523l820287k614646J278898K211410p18695l374151l659510
$$ plain form
41534 -3026110 477729 5166561 5194054 959074 -732072 3142292 7878641 8843950 7656761
41525 7656761 7814341 8434563 6286756 1901831 -410265 1341518 3868108 3219906 414805
41516 414805 -47261 3228611 6409136 5820908 2511786 -640359 -3437158 -6521905 -7507439
41507 -7507439 -3846881 1599671 3374713 1764330 2476624 6946246 9207158 5111818
41499 5111818 -1120980 -3550610 -2817059 -2968872 -3903814 -2561335 745114 2665493 2301898
41490 2301898 1632771 1332806 703639 1205461 5253123 10945087 12377148 7003514 -242278
41481 -242278 -2193468 2702504 9285017 11731987 9598260 7487078 8910521 11729445
41473 11729445 11340922 7520635 4905989 6184887 8396297 7677602 4303451 643941
41465F43941l333881l012352j171084J367014J696331L90249R48478K789595J413194
41456A731485k785821l227435K153453O223526L404572j511852j376281J991102
41448F602749J698315k680253n027483k583107P59422R35799j612324l916897
41440e823779l420383O29971N521662N934808o7939p046309p773656j901649M350318
41431i596956O078310L690969Q0189k187679j224723K746374O007888M598925
41423A0193297o31145m772580m685203j662444J400310K738189J740419q58575
41415C462268k475856r66868K116614K985311Q74762p33338O78675K683429J443310
41406A0068307k108672k774356J480103N452817L033638l709333o343080j942864
$$ plain form
41465 643941 -2689940 -5702292 -6873376 -5506362 -3810031 -3419782 -2471304 318291 1731485
41456 1731485 -1054336 -4281771 -2128318 4095208 7499780 5987928 4611647 6602749
41448 6602749 8301064 5620811 593328 -1989779 -1230357 -294558 -1906882 -5823779
41440 -5823779 -9244162 -8614191 -3092529 2842279 2774340 -4271969 -12045625 -13947274 -9596956
41431 -9596956 -3518646 172323 252512 -1935167 -3159890 -413516 5594372 10193297
41423 10193297 9562152 4789572 104369 -1558075 -157765 2580424 4320843 3462268
41415 3462268 986412 19544 2136158 5121469 5996231 5262893 5941568 8624997 10068307
41406 10068307 7959635 5185279 6665382 12118199 15151837 11442504 5099424 3156560
41398C156560K263226n0777l888417p40967O571323O744559k241012q864541n171092
41389b221138J816824K225575j626513j159169L517877M734566L56318l929406
41381C714934m496739l402310k141951L96859L090455K839701P03510J100916
41373A805375L722414K977618k644321p219427o079407j995235M17372J137099
41365g878512K051922K535807J625080Q32068J054828O9877l127842m654316p68920
41356h260008N555767P538548L260933k219849l386131j94315K872013K108867
41348G275825j440826l145888m65779L197852K551590j941722m059777o32578
41340A338697L600159K764994j794527m039246k221981o39705k373618m527152
$$ plain form
41398 3156560 5419786 5369009 1480592 739625 7310948 14055507 11814495 2949954 -2221138
41389 -2221138 -404314 1821261 194748 -964421 2553456 7288022 7644340 3714934
41381 3714934 -781805 -4184115 -6326066 -5929207 -2838752 949 704459 1805375
41373 1805375 5527789 8505407 5861086 -1358341 -7437748 -9432983 -9015611 -7878512
41365 -7878512 -5826590 -3290783 -1665703 -833635 221193 291070 -2836772 -7491088 -8260008
41356 -8260008 -2704241 4834307 8095240 5875391 2489260 2294945 5166958 7275825
41348 7275825 5834999 2689111 2223332 5421184 7972774 6031052 1971275 1338697
41340 1338697 4938856 7703850 5909323 1870077 -351904 -991609 -3365227 -7892379
41332g892379k550797L202333P592396O582961J272072l929452n722349l909938
41324e355153k74783K778650K879161n29013m219661l502842J700259N487106
41316a036276L316018j528699k493498R61210L382257J978075j41162j78363K27391
41307D486953p67520j531056n19727K56282j304999l446480l391437j641599k45365
41298h104948Q54248K388315K892299R73755j273301q93488J228169K009633J272802
41289A347484J194046J652554O43331r89991j09445K793682L149499m74283l320418
41280E886459j478160J960308J696827j670866l085668j182105J87727r88344
41272A326178j311413K086155N849699M614429r79711m811473l560339k83880
$$ plain form
41332 -7892379 -10443176 -7240843 351553 6934514 8206586 4277134 -1445215 -5355153
41324 -5355153 -5629936 -2851286 27875 -501138 -4720799 -8223641 -6523382 -1036276
41316 -1036276 2279742 751043 -1742455 -781245 2601012 4579087 4437925 4259562 4486953
41307 4486953 3719433 2188377 1668650 1924932 619933 -2826547 -6217984 -7859583 -8104948
41298 -8104948 -7250700 -4862385 -1970086 -996331 -2269632 -3163120 -1934951 74682 1347484
41289 1347484 2541530 4194084 4837415 3847424 3737979 6531661 9681160 9206877 5886459
41280 5886459 4408299 6368607 8065434 6394568 3308900 2126795 2314522 1326178
41272 1326178 14765 2100920 7950619 12565048 11585337 6773864 3213525 2929645
41264B929645J211539J382551J897858J349250j843734m645564k695956K273639
41256A859228L695751k97499l806779j925975K093812K095464j996704m744698
41248c027400k758475K282292O820946Q028271M507256j796745n385182k888630
41240E782333J742972J899201k440659m980991k662721O47284J311005R83156
41232B281580J787159J822557m95233k205613p82151N47569j829400m413429j367675
41223d654636N002745O343135R75816l418895j908693O79333r48758l219693k16480
41214a366126N268350N173989j234506o026098m337473n72280o18354l415601
41206g128099l898876p29869K857241M119476L296849J699202L2736j119886q78345
$$ plain form
41264 2929645 4141184 5523735 7421593 8770843 6927109 2281545 -414411 1859228
41256 1859228 5554979 5257480 1450701 -475274 1618538 3714002 1717298 -3027400
41248 -3027400 -5785875 -3503583 3317363 11345634 15852890 14056145 8670963 5782333
41240 5782333 7525305 9424506 6983847 2002856 -659865 -12581 1298424 2281580
41232 2281580 4068739 5891296 5396063 3190450 2408299 2955868 1126468 -3286961 -4654636
41223 -4654636 348109 6691244 7667060 4248165 2339472 3018805 2070047 -1149646 -1366126
41214 -1366126 3902224 9076213 7841707 1815609 -2521864 -3094144 -3712498 -7128099
41206 -7128099 -11026975 -11756844 -8899603 -4780127 -1483278 215924 248660 -871226 -1749571
41197a749571J114597L739341M505959J346878m597004q502312o234037M07266
41189i968883M919607L596988k29605j057592J532664L073617R04797k291758
41181D79835k527780M0638J626715J01809k302519k241016M09818L044229M142769
41172B774498M282685L621316J337158j619274k347272l62121Q34414r55027k706474
41163D859903r07570K483750L007536M65134j926611l178180m033839k712943
41155a942820K355694O682995M210017k283261l608555J621849M305494m22743
41147A0918670n157236k489462L237587L943735N39665j008728p77726k531571
41139F674934m216865q91678M865052N354124J40783l215047j441333K69296j812186
$$ plain form
41197 -1749571 -634974 3104367 7610326 8957204 4360200 -4142112 -10376149 -9968883
41189 -9968883 -5049276 -1452288 -1681893 -2739485 -1206821 1866796 2771593 479835
41181 479835 -2047945 -2007307 -380592 -278783 -2581302 -4822318 -4412500 -1368271 2774498
41172 2774498 7057183 10678499 12015657 10396383 8049111 7686990 8521404 7566377 4859903
41163 4859903 3952333 6436083 9443619 9908753 7982142 4803962 770123 -1942820
41155 -1942820 412874 7095869 11305886 9022625 5414070 7035919 11341413 10918670
41147 10918670 5761434 3271972 6509559 10453294 10992959 9984231 9206505 6674934
41139 6674934 2458069 1566391 6431443 11785567 11926350 8711303 7269970 7539266 5727080
41130E727080m019810k421147Q90972K352074K468161L099729L341418J677513
41122A3115990o45723j351519l38380P66047Q22563k810n00939L48201J334344
41113A3547774j81481l634945m245292J68149M566249L447244q75147k418668
41105A0373883j079526j176527k696893j882606N93486L29512k154472j801984
41097E04873J647562L194541K023640K394156M081652J879293l261401l341219
41089I123097K630800M620388k594560r863078p505159L03319L747803K342919
41081B805529J950618K735968M71879l637262m122428o06205K029410J747120
41073C374629R19873Q89405P87108O31925O95343n20586l268143m011502m60079
$$ plain form
41130 5727080 1707270 -713877 177095 2529169 4997330 8097059 11438477 13115990
41122 13115990 12470267 11118748 10780368 11546415 12368978 12366168 11865229 12213430 13547774
41113 13547774 13366293 9731348 5486056 5654205 10220454 13667698 12792551 10373883
41105 10373883 9294357 8117830 5420937 3538331 4131817 4461329 2306857 504873
41097 504873 2152435 5346976 7370616 9764772 13846424 15725717 12464316 9123097
41089 9123097 11753897 16374285 13779725 3916647 -3588512 -3285193 462610 2805529
41081 2805529 4756147 7492115 7963994 4326732 204304 -401901 1627509 3374629
41073 3374629 4294502 5183907 5971015 6602940 7298283 6777697 3509554 -501948 -962027
41064i62027L677015L688678O78382j290083j616458j902890j678793l12411K87278
41055E68691m89103M24120L701914M557279J124088n74996L026152M898181j174459
41046A6061867p902430m881484L580219M437824l272299p808227m289115n40720
41038d614365j622593k285971J068241L205726M54444k064461J75929L091988
41030b591062J653489j580784j722459L93424R95825k45342j119026n48304J500725
41021c263514M155563M478120Q39172k388922K17373N616187N836184J364912
41013A6855075Q93998N754483O304075j418022p303891l154848L532685J793781
41005B3257336n202240o287011m03824L216189K42704m051423m533269j910774
$$ plain form
41064 -962027 2714988 6403666 7082048 5791965 4175507 2272617 593824 281413 568691
41055 568691 79588 503708 4205622 8762901 9886989 9311993 12338145 17236326 16061867
41046 16061867 8159437 3277953 6858172 11295996 8023697 215470 -4073645 -4614365
41038 -4614365 -6236958 -8522929 -7454688 -4248962 -3794518 -5858979 -5683050 -2591062
41030 -2591062 -937573 -2518357 -4240816 -3847392 -2851567 -3096909 -4215935 -4764239 -3263514
41021 -3263514 892049 5370169 6209341 3820419 4037792 9653979 15490163 16855075
41013 16855075 17749073 23503556 29807631 28389609 21085718 17930870 21463555 23257336
41005 23257336 18055096 11768085 11364261 14580450 14823154 10771731 6238462 4327688
40997D327688J257810L275873K371089j114419k784559j3347K452070q15071n891972
40988C065162m125148M019954Q258812L046367m805722o192694j434420K237930
40980D070241J131753j388912o67236L184377N788069M115065L05930j245131
40972A5294156K00207J309227J68917j354568j734356k187868k972814j540770
40964G182131K579671M994451K267594k741721n063893m052740k020615K59856
40956C404734K671151L399765J537866o43395j402953k169106l363369k248982
40948A185711J136688J510655k956222n524677j228203L833351K083830k416554
40940b375421r98529M075084L528281k003667k606186L303480N906684J181212
$$ plain form
40997 4327688 5585498 8861371 11232460 10118041 7333482 7320135 9772205 8957134 3065162
40988 3065162 -1059986 2959968 11218780 14265147 9459425 3266731 1832311 4070241
40980 4070241 5201994 3813082 3145846 6330223 12118292 16233357 16539287 15294156
40972 15294156 15494363 16803590 16972507 15617939 13883583 11695715 8722901 7182131
40964 7182131 9761802 14756253 17023847 14282126 9218233 5165493 3144878 3404734
40956 3404734 6075885 9475650 11013516 10370121 8967168 6798062 3434693 1185711
40948 1185711 2322399 3833054 876832 -4647845 -5876048 -2042697 41133 -2375421
40940 -2375421 -3373950 701134 4229415 2225748 -380438 2923042 8829726 10010938
40932A0010938k265091J327565M825844R34953n320502n515607j210088O80316
40924C468328k08778L36970J513889q70584n253027n163333Q60902O617542O248659
40915G550568O03771m797152n208655l10246N449039O895118L704184J55675j257807
40906A2784495k438377m559960m959120k044881R32686O34551j493832k610638
40898c755076k938295l057654q20485M418452Q149918O379364J872747k53657
40890I995314l8432m20009p31661J212426L035180P18406l805235m793388j747748
40881C424853K48917r59757k187276j273202K33967J262593K315024K111830q66204
40872D310745l384765p65608M384795M459207q38729l118163R13100L594483n50535
$$ plain form
40932 10010938 7745847 9073412 13899256 14834209 9513707 3998100 2788012 3468328
40924 3468328 3259550 3596520 5110409 4239825 -1013202 -6176535 -5315633 1301909 7550568
40915 7550568 8154339 3357187 -1851468 -2161714 3287325 10182443 13886627 14042302 12784495
40906 12784495 10346118 5786158 827038 -1217843 -285157 349394 -1144438 -3755076
40898 -3755076 -6693371 -9751025 -10571510 -6153058 1996860 8376224 10248971 9995314
40890 9995314 9956882 9536873 8805212 10017638 13052818 13771224 9965989 5172601 3424853
40881 3424853 3673770 2714013 526737 -746465 -512498 750095 3065119 5176949 4310745
40872 4310745 925980 160372 4545167 9004374 8165645 5047482 5960582 9555065 9004530
40863I004530m837572j480725M712765L675519l617839p014849l237305Q56653
40855a938823J306482K551893O898591Q173480J656964o672950p707401j724216
40847B544020L242991K896258J80850j403931j797036j387671M77712K484170
40839G237363J328644l049566n791341l380697J192653K594374L57536j568907
40831a079941j145396r2132M34960J789828M070595M109855K6578m583992m393480
40822h63125O47537N189343N362184K887543J465478J526868N48627k443834m812037
40813I508584l397856J205635M772574M395602K167981J997205L225768R10880
40805B4786373n927722j0145148m860057N989985J0952059N110567m321878p875562
$$ plain form
40863 9004530 4166958 2686233 7398998 11074517 7456678 441829 -2795476 -1938823
40855 -1938823 -632341 1919552 8818143 16991623 18648587 11975637 4268236 2544020
40847 2544020 5787011 8683269 8864119 7460188 5663152 4275481 4753193 7237363
40839 7237363 8566007 5516441 -274900 -3655597 -2462944 131430 488966 -1079941
40831 -1079941 -2225337 -2317469 -1882509 -92681 3977914 8087769 8114347 3530355 -863125
40822 -863125 -215588 4973755 10335939 13223482 14688960 16215828 16764455 14320621 9508584
40813 9508584 6110728 7316363 12088937 16484539 18652520 20649725 23875493 24786373
40805 24786373 18858651 8713503 3853446 9843431 20795490 25906057 21584179 13708617
40797A3708617m376363Q64467L769441L549201O34809k871757l062861R80803
40789A3196357M156178J633224l616364m786694j366736Q41590m73460j214915
40781H369180Q96999K199926L50363o91749K361686N467890L352336j732720l724963
40772A6848948k337671j994433k956132j224331K682646K863899j802815l984325
40764H095786J239894P621350N827318l172551r239000o439238O94297M943646
40756I571502N106320M288524L347394M54671l689726m624850j43644N094054
40748A9404245M527386j263128m578812j087096L918553L358876j020825j718700
40740B1540499K428535M462812P17004l264000j829477J947804J907074j399398
$$ plain form
40797 13708617 9332254 10196721 13966162 17515363 18150172 15278415 12215554 13196357
40789 13196357 17352535 18985759 15369395 10582701 9215965 10057555 9584095 8369180
40781 8369180 9266179 11466105 11816468 11124719 13486405 18954295 22306631 20573911 16848948
40772 16848948 14511277 12516844 9560712 8336381 11019027 13882926 12080111 8095786
40764 8095786 9335680 16957030 22784348 19611797 10372797 3933559 4627856 9571502
40756 9571502 14677822 18966346 22313740 22768411 19078685 14453835 14310191 19404245
40748 19404245 23931631 22668503 18089691 17002595 20921148 24280024 23259199 21540499
40740 21540499 23969034 28431846 29148850 25884850 24055373 26003177 27910251 26510853
40732B6510853k835944j430066k81413K86274K455594M639310K749446j838210
40724C0255844k849770P65706K460352j330140n203344l698817J16081O72522
40716B1188434p08585O49201L548950K884451j016034k670945p95362m9767k380174
40707B0650169l411524J23510N019401O583859M374958K95781m392074p141520
40699B2102560m143779L473270P828591L910702k497244k534167K835286M867570
40691C5842789Q84149k073463J060401N669308N339318J450844l63017Q44866
40683D8655195J858803K266413M599783Q082300Q269896M277249J481519M481272
40675H3972430J0707781J3846169J1456833O615887L518676L972689P330033J1564545
$$ plain form
40732 26510853 23674909 22244843 21963430 22249704 24705298 29344608 32094054 30255844
40724 30255844 27406074 28171780 30632132 29301992 24098648 20399831 20515912 21188434
40716 21188434 20479849 21129050 24678000 27562451 26546417 23875472 23080110 23030343 20650169
40707 20650169 17238645 17362155 22381556 28965415 33340373 33636154 29244080 22102560
40699 22102560 17958781 21432051 29260642 33171344 30674100 28139933 30975219 35842789
40691 35842789 36726938 34653475 35713876 41383184 46722502 48173346 47810329 48655195
40683 48655195 50513998 52780411 57380194 65462494 73732390 78009639 79491158 83972430
40675 83972430 94680211 108526380 119983213 126599100 130117776 134090465 141420498 152985043
40667A52985043J4731818J6978627K0473794K5921930L0634048L2563690L4570542
40660C28859492M0033549M4011716L4632383P227300k6471059m8405362n2280944
40653C27607075m7048472m3201796m1502889l6946428k8303143j9278042j2958539
40646I8367766r450070p922216p508698o725415m854440l410746l796985m489354
40638E0209842l406909j953571l057855n813193o253929l600649j315999j058711
40630B3749026j66892K958158N282743L795826K87285j583774j188022R430J563507
40621C4707287L148267L074844R64030l67887J126961L237842L224977K310986
40613E1427307K618547K571843K03573j551683J276451O223627P134067L652954
$$ plain form
40667 152985043 167716861 184695488 205169282 231091212 261725260 294288950 328859492
40660 328859492 368893041 412904757 447537140 454764440 428293381 379888019 327607075
40653 327607075 280558603 237356807 195853918 158907490 130604347 111326305 98367766
40646 98367766 88917696 80995480 73486782 66761367 61906927 58496181 54699196 50209842
40638 50209842 46802933 44849362 41791507 35978314 29724385 26123736 24807737 23749026
40630 23749026 23582134 26540292 31823035 35618861 35906146 34322372 33134350 33143780 34707287
40621 34707287 37855554 40930398 41894428 41526541 42653502 45891344 49116321 51427307
40613 51427307 54045854 56617697 56821270 55269587 56546038 62769665 69903732 73556686
40605G3556686J526199L448155O240637P826178J0064835J2905975J2654526R048572
40597A37271763P767221J2148512J8017631K0855153K2717394K6998443L0848217
40590B76624334K8534739J9355855P140139n475986j7432487k6408577l0615269
40583B51722748l1688874l1583513k8808287k2126287j5313929j2870122j3074282
40576I6257454j1080996p288294o255952q048424p509849k969628O34666o67241
40568E3071736m287781n480539l418046o43174N50391m98763k632176l231581
40560C3430067j156301P57796p91258m067428m422698j712661n49860k508768
40552A8978889l624315j494595N71140n56912k600537k139844m0722J269331K357023
$$ plain form
40605 73556686 75082885 78531040 84771677 92597855 102662690 115568665 128223191 137271763
40597 137271763 145038984 157187496 175205127 196060280 218777674 245776117 276624334
40590 276624334 305159073 324514928 331655067 326179081 308746594 282338017 251722748
40583 251722748 220033874 188450361 159642074 137515787 122201858 109331736 96257454
40576 96257454 85176458 77888164 71632212 63583788 56073939 53104311 53738977 53071736
40568 53071736 48783955 43303416 39885370 39242196 39792587 39293824 36661648 33430067
40560 33430067 32273766 33031562 32240304 28172876 23750178 22037517 21487657 18978889
40552 18978889 15354574 13859979 14431119 13874207 11273670 9133826 9093104 10362435 12719458
40543A2719458M310656M744310J145545l731767m750497j800537K43078j100036
40535A1780210k833610j703411J031500J940963M27085p87850L33381K309436
40527A2497704K103960o51475k892459k218180l1916J178132J926866L979018
40519A5891650N729307L698476j267872l968414k148979P02277J443074J278607
40511B1358126J352702l47263m014440n037251r03340L302230K069160j613916
40503A6166008j175247K586260L093275q71730l599586k208997k99326m38187
40495A3252470j04413K514137M975591N506788N634906N277961J482573m570543
40487C3969470o025700o75389L700431P75185l596545o76997N773221M373472
$$ plain form
40543 12719458 17030114 21774424 22919969 19188202 14437705 12637168 12880246 11780210
40535 11780210 8946600 7243189 8274689 10215652 10642737 9854887 10188268 12497704
40527 12497704 14601664 13950189 11057730 8839550 8807634 9985766 11912632 15891650
40519 15891650 21620957 25319433 24051561 20083147 17934168 18636445 20079519 21358126
40511 21358126 22710828 22363565 18349125 13311874 12408534 15710764 17779924 16166008
40503 16166008 14990761 17577021 20670296 19798566 16198980 13989983 13690657 13252470
40495 13252470 13148057 15662194 20637785 26144573 31779479 37057440 38540013 33969470
40487 33969470 27943770 27268381 30968812 31743997 28147452 27470455 33243676 37617148
40479C7617148n051367r464040k063360P068359N749737l206291p772043m220650
40471A8657493J95240r7423k426320k646147j213802j14538Q74363K001159J776986
40462A7007011K46130L85842L104487M229577N15191l978596k570890L987059
40454B2925811P517916L435823k929985l646831J398686M984259K243347l652382
40446C2276644o225792l691553k07576K03062j398934j322769R30211K103615
40438B2666908M86830j457488j387734r98538k628274m228239j932369L185414
40430A3706510N468154K408441k038664l322711j902633q55461q38203k50454
40422A2374979J264159K099800R48725j681333l790190l287960j17809K925425
$$ plain form
40479 37617148 32565781 23101741 21038381 28106740 33856477 30650186 22878143 18657493
40471 18657493 18852733 18755310 16328990 13682843 12469041 12354503 13228866 15230025 17007011
40462 17007011 17253141 17638983 20743470 24973047 25488238 21509642 18938752 22925811
40454 22925811 30443727 33879550 30949565 27302734 28701420 33685679 35929026 32276644
40446 32276644 26050852 22359299 22151723 22354785 20955851 19633082 20563293 22666908
40438 22666908 23153738 21696250 20308516 19309978 16681704 12453465 10521096 13706510
40430 13706510 19174664 21583105 19544441 16221730 14319097 13463636 12625433 12374979
40422 12374979 13639138 15738938 16687663 15006330 11216140 7928180 7810371 10735796
40414A0735796L028224Q71747o95544r99218j588356k344536j559878j12919p80912
40405F554404k492069q81905L526296M201203p57260l718036R56929O742484M255232
40396A8387278l874527o825121j873572K985810K419070R1836j2547K41827j095319
40387A0444735j539645O00559K342501J157017r77436j842802k398742k953428
40379D832759j147289K864440M478468J695398j113853o36171k42234l002250
40371G729268m657908m73668N207020M274634k590073o572550l240415K729558
40363B405866N542622M574835J835951j105185k293662l13199K608787K539472
40355A5795487k27068j330636P55619K419679Q23672k113195l412452k953248
$$ plain form
40414 10735796 13764020 14635767 13940223 12941005 11352649 9008113 7448235 7335316 6554404
40405 6554404 4062335 3180430 6706726 10907929 10150669 6432633 7389562 14132046 18387278
40396 18387278 14512751 7687630 5814058 8799868 11218938 11310774 11298227 11540054 10444735
40387 10444735 8905090 9505649 11848150 13005167 12027731 10184929 7786187 4832759
40379 4832759 3685470 6549910 11028378 12723776 11609923 10973752 10731518 7729268
40371 7729268 3071360 2597692 7804712 12079346 9489273 2916723 -323692 2405866
40363 2405866 7948488 12523323 14359274 13254089 10960427 10647228 13256015 15795487
40355 15795487 15568419 14237783 14993402 17413081 18236753 16123558 12711106 9757858
40347I757858j771843J44310K224019K342531k92101l289495l700443r25794L459033
40338G948075O628208N389722n74624o118366n243138Q17788M414887J832341
40330A5094893j942417j391582J384700R33664k670412m334110j730446K010348
40322G354638L093462J162872j419472k097767j38941K363116K340952k68364
40314A2390496k087067j066611Q27029J508425K179926L933880M197115P53073
40306B2636266l257561l359573j043470j459920m549522m596363M88703N257867
40298A0116427M509047L47384j711479m01562R06440m23395l385733m947602k924491
40289B085036J888965N655650M951130Q87219j948231j158341J006905J431477
$$ plain form
40347 9757858 7986015 8130325 10354344 12696875 12404774 9115279 5414836 4489042 7948075
40338 7948075 14576283 19966005 19391381 13273015 8029877 8847665 13262552 15094893
40330 15094893 13152476 11760894 13145594 14079258 11408846 7074736 5344290 7354638
40322 7354638 10448100 11610972 10191500 8093733 7954792 10317908 12658860 12390496
40314 12390496 10303429 9236818 10063847 11572272 13752198 17686078 21883193 22636266
40306 22636266 19378705 16019132 14975662 13515742 8966220 4369857 4858560 10116427
40298 10116427 14625474 14972858 13261379 12859817 13766257 13342862 9957129 5009527 2085036
40289 2085036 3974001 9629651 14580781 15468000 13519769 12361428 13368333 14799810
40281A4799810k08450k478008m057499l314625R00411O116366O992039J889410
40273B0639454l903366m512158p65005K106861J909154P20385J99284o219K70815
40264A6659205J657471K685113J314373p94800J29077L351719L413696j418523
40256B6997331n169360k248725M116268O265376K741190p48023m80269O00839
40248C2074627j103779l689348k896308J104282L818958K765022N21520O42918
40240C3237892K695081L091090K15637l020969k594412J367243M269725K701082
40232D1962369r74144j653154J338690L056895J47041l644154k323052L447938
40224D1358429O471080K671038l174968l726568J384463N516811L733156j470550
$$ plain form
40281 14799810 14591360 12113352 8055853 4741228 5641639 11758005 18750044 20639454
40273 20639454 16736088 12223930 11458925 13565786 15474940 16195325 16394609 16388390 16659205
40264 16659205 18316676 21001789 22316162 21521362 21650439 25002158 28415854 26997331
40256 26997331 21827971 19579246 23695514 29960890 32702080 31954057 31473788 32074627
40248 32074627 30970848 27281500 24385192 25489474 29308432 32073454 32594974 33237892
40240 33237892 35932973 39024063 39239700 36218731 33624319 34991562 39261287 41962369
40232 41962369 40988225 39335071 40673761 43730656 43877697 40233543 37910491 41358429
40224 41358429 47829509 50500547 47325579 43599011 44983474 50500285 54233441 52762891
40216E2762891l838252p86702M258909O388386M689898K359219J821263J708494
40208F9364106M2386j489529L03495M245848N279637J873577j290502k97999K516053
40199H0547072L477061L848912O266879Q361253O409361L233162M931422J0198197
40191A27273319J1053420N656356K058570N592010J0329663Q929962M633715N813123
40183A81340138J2466191J6371388J3460534Q650743P809134J0905412J4555978
40176B65559518J6681211J6870672J5507692J4067246J4006670J4734282J4612005
40169C72039296J3555403J2184338R340690L841090j994980m599900m819935p032438
40161C92513564j2228058j6540272j7697636j8125382j9634274j9802372j6892539
$$ plain form
40216 52762891 48924639 48137937 52396846 58785232 63475130 65834349 67655612 69364106
40208 69364106 69406492 67916963 68220458 72466306 77745943 79619520 78329018 78031019 80547072
40199 80547072 84024133 87873045 94139924 102501177 108910538 112143700 117075122 127273319
40191 127273319 138326739 143983095 146041665 151633675 161963338 170893300 175527015 181340138
40183 181340138 193806329 210177717 223638251 232288994 240098128 251003540 265559518
40176 265559518 282240729 299111401 314619093 328686339 342693009 357427291 372039296
40169 372039296 385594699 397779037 407119727 410960817 408965837 404365937 399546002 392513564
40161 392513564 380285506 363745234 346047598 327922216 308287942 288485570 271593031
40154B71593031j4313799j5876196j9289152j9015563j4328435j0196139j0270492
40147A68303255j2628647j3154175j0485930o705787m869097o468311j0035083
40140A03956225j2004864j0203585o492318m572488n246603n681101l725620q67232
40132E5162414L05983k48119q58063j353063k870949m871143n286770m176985
40124C5803305m072118n164209l571327K486985P705828N625983j917176o705530
40116C0191741n312278k479107k281032k362593J2556K173297R88239j164017
40108A9766806p11734P05183j46941j515988j16822J652029q02718n302405n192715
40099H334695j66549L011302J299081p00277O81258K867148K885125K021333J620134
$$ plain form
40154 271593031 257279232 241403036 222113884 203098321 188769886 178573747 168303255
40147 168303255 155674608 142520433 132034503 125328716 120459619 113991308 103956225
40140 103956225 91951361 81747776 75255458 70682970 65436367 59755266 56029646 55162414
40132 55162414 55468397 55220278 54362215 53009152 50138203 45267060 39980290 35803305
40124 35803305 31731187 26566978 22995651 25482636 33188464 38814447 36897271 30191741
40116 30191741 24879463 22400356 20119324 17756731 17769287 19942584 20930823 19766806
40108 19766806 19055072 19760255 19613314 18097326 17980504 19632533 18829815 13527410 8334695
40099 8334695 8168146 11179448 12478529 11778252 12459510 15326658 18211783 20233116 21853250
40090B1853250J70116k240720k220114Q00632K235367k49965k500777j069848
40082A6777941R43097Q7019q09420J848591M835916K883142k072868l443918k07530
40073B0841970J929269p74306n581915p621089m745596J612270P113355P056282
40065A9830240J554370l262411k534267Q82770J136540j859304l446805k305277
40057I995856j683348k861515k964004k18081L096041M249349L270021J577774
40049A4462093N4212r91782j926236l538539m976122l536660J031535M361872
40041D940373L188362Q12778K109179N072075L320892l599838q704158p223350
40033h3687k230738R76341J261643L78211n44898q15813M98402K923319M310299
$$ plain form
40090 21853250 22023366 19782646 17562532 18363164 20598531 20348566 17847789 16777941
40082 16777941 17721038 17808057 16998637 18847228 23683144 26566286 24493418 21049500 20841970
40073 20841970 22771239 21996933 16415018 8793929 4048333 5660603 12773958 19830240
40065 19830240 21384610 18122199 15587932 16470702 17607242 15747938 12301133 9995856
40057 9995856 8312508 5450993 2486989 2268908 5364949 9614298 12884319 14462093
40049 14462093 14516305 13524523 11598287 8059748 3083626 -453034 578501 4940373
40041 4940373 8128735 8941513 11050692 16122767 19443659 15843821 7139663 -83687
40033 -83687 -2314425 -1338084 -76441 301770 -243128 -1058941 -560539 2362780 6673079
40024F673079L476729J408504m36629j082731K13755K634540L094293L3659l150382
40015A2864817k370364N47599M30103k630232l063296J073178M776732L925869
40007A5554406R90324j8782L30159n73329k209699k091225J3289K135092L077263
39998A7207498L100113K630738J770139M00069j604457l359886k897906M5608
39990A7291916K282564R11158k330201l644718k749421j947002j142500J231110
39982I902906L410214K265608k49978J164710O560544J0043775Q370941M034024
39974D5502744p09805n769072q294006m082269L746403N842290q2347n090894
39966C1063044k293810L799816O145996N243754M347672K500762o01349k07610
$$ plain form
40024 6673079 10149808 11558312 11121683 10038952 10252707 12887247 15981540 16015199 12864817
40015 12864817 10494453 11042052 11472155 8841923 5778627 6851805 11628537 15554406
40007 15554406 16544730 16525948 16856107 16282778 14073079 11981854 11995143 14130235 17207498
39998 17207498 20307611 22938349 24708488 25108557 23504100 20144214 17246308 17291916
39990 17291916 19574480 20485638 18155437 14510719 11761298 9814296 8671796 9902906
39982 9902906 13313120 15578728 15328750 16493460 23054004 33097779 41468720 45502744
39974 45502744 44792939 39023867 30729861 26647592 30393995 36236285 36153938 31063044
39966 31063044 28769234 32569050 38715046 43958800 48306472 50807234 50205885 49998275
39958D9998275N098756P559396J603720n442519l960470K416308L189646j432809
39950E9030303j928650L605624O672885L013875j604846k278795j424447j565138
39942F3520811o97382J830557K539277J52005j897182j779336j772375k637461
39934E9258914k208595j233111l291770o957391n990281o5733L013724m42326
39926D2083431l922309j723014K071357J685980p95531j129286j425562m792908
39918C2052158p191248l788765R18123p61256o287730o057573R77205N503130
39910A5364044K794445q50622J00242J723943o97103l280893m49505M183417K655221
39901B1543189m017265o300260n22884N280712L116725l732098o330961k831258
$$ plain form
39958 49998275 55097031 62656427 64260147 58817628 54857158 57273466 60463112 59030303
39950 59030303 57101653 60707277 67380162 70394037 68789191 66510396 65085949 63520811
39942 63520811 62823429 64653986 67193263 67345268 65448086 63668750 61896375 59258914
39934 59258914 57050319 55817208 52525438 45568047 39577766 39512033 42525757 42083431
39926 42083431 38161122 36438108 38509465 40195445 39399914 38270628 36845066 32052158
39918 32052158 24860910 21072145 21990268 21229012 14941282 8883709 9860914 15364044
39910 15364044 18158489 17307867 17408109 19132052 18434949 15154056 14704551 18887968 21543189
39901 21543189 17525924 11225664 10702780 15983492 19100217 15368119 9037158 6205900
39893F205900O51558K94457p68549R36068L379147K688802r37071m238449n487525
39884B724338m971092k649193J373244M945429N459165L117704M48766r53638
39876I494723j286309r95383m89647o34176j624278k292800k076574j943931j702483
39867c550858P47108M776244N246245k84938n958644m990742J30585J762350p38828
39858b861478j396310P53628K69491l134053k087160N383020J0120577N358914
39850A2406629k490032m146998j320554j338684l723537k428888J944367K829010
39842A731313m54005j548019J557869L239990M49226k099456m37035J877237l1097
39833D286023m431574n941309l104820R68118L332468L399506K000398O65720
$$ plain form
39893 6205900 6857458 7151915 6383366 7319434 10698581 13387383 12450312 8211863 2724338
39884 2724338 -2246754 -4895947 -3522703 1422726 6881891 9999595 10448361 9494723
39876 9494723 8208414 7213031 6723384 6089208 4464930 2172130 95556 -1848375 -3550858
39867 -3550858 -2803750 1972494 7218739 6933801 975157 -4015585 -3885000 -2122650 -2861478
39858 -2861478 -4257788 -3504160 -3234669 -6368722 -8455882 -3072862 7047715 12406629
39850 12406629 9916597 5769599 4449045 3110361 -613176 -3042064 -1097697 1731313
39842 1731313 1277308 -270711 1287158 4527148 4976374 2876918 2439883 4317120 4286023
39833 4286023 -145551 -6086860 -9191680 -8223562 -4891094 -1491588 508810 1174530
39825A174530O35487J161823K67916j983407l093865j907445l31799n1573j2575
39816d140908J185394K581233K407264P50052r27673j667980j363186n58874n57300
39807b291978k041458l170177j292726K793100M973519L340668P72805L78116
39799C461869J223438Q93126l00746o51179p10383k283297m677117n046228k380968
39790a0471485J207501L249820L143547J636731l01606j872648k625291k240506
39782h273937p4539L829799O875160N282377j012652o746754o863036k287307
39774i270889J982549L040672J774954n6432j176014j71023K911874M761004K222664
39765F019359k541500m177797j714064L06667o91889j462929R96507L955245L348201
$$ plain form
39825 1174530 1810017 2971840 3239756 1256349 -1837516 -3744961 -4076760 -4128333 -4140908
39816 -4140908 -2955514 -374281 2032983 2783035 1855362 187382 -1175804 -1734678 -2291978
39807 -2291978 -4333436 -7503613 -8796339 -6003239 -1029720 2310948 3083753 3461869
39799 3461869 4685307 5578433 5277687 4626508 3916125 1632828 -3044289 -8090517 -10471485
39790 -10471485 -9263984 -6014164 -2870617 -1233886 -1535492 -3408140 -6033431 -8273937
39782 -8273937 -8348476 -4518677 2356483 7638860 6626208 -120546 -6983582 -9270889
39774 -9270889 -7288340 -4247668 -2472714 -2529146 -3705160 -3876183 -964309 3796695 6019359
39765 6019359 3477859 -699938 -2414002 -2107335 -2799224 -4262153 -3265646 689599 4037800
39756D037800L42510r97612l90297q17692k466516k259495L81720K018441O51433
39747E00292j345659j537057j114091j881974k528532r10623J952677L297969
39739c566998K796167K330708K379743J649854Q8443p58618p37364j496905l010009
39730c24979k584697Q65858L980902K932242j251763m135080l876682k766750
39722g160949k675521k117584P55274M632329O646891O139702M653648K929372
39714A3803162K40622l172762n100708l755340r6782K999397L325989Q32168k663476
39705F412270m832194m527395k501923k28939J579799K563368J747621j051761
39697h39154l184420j302194L576480N906169K428284l171781m994646k454351
$$ plain form
39756 4037800 4380310 3382698 2992401 2174709 -291807 -2551302 -2169582 -151141 500292
39747 500292 -845367 -2382424 -3496515 -5378489 -7907021 -8817644 -6864967 -3566998
39739 -3566998 -770831 1559877 3939620 5589474 5677917 4919299 4181935 2685030 -324979
39730 -324979 -2909676 -2043818 1937084 4869326 3617563 -517517 -4394199 -7160949
39722 -7160949 -9836470 -11954054 -11198780 -6566451 80440 6220142 10873790 13803162
39714 13803162 14043784 10871022 5770314 2014974 1918192 4917589 8243578 9075746 6412270
39705 6412270 1580076 -2947319 -5449242 -5678181 -4098382 -1535014 212607 -839154
39697 -839154 -4023574 -5325768 -1749288 4156881 6585165 3413384 -1581262 -4035613
39689d035613J26748J87984o72153p68608p27195q25394L38663K658952L215606
39680e01010O64024j762393p72410J523734M97300l698268n972470l761590m53023
39671a4236106L67426L59216K867342O416313O223694J756847j840443j341117
39663E73172k54523k710826n753933l109966M237866P476363J965788n616142
39655c192201o193917l21078M062573L320978J205422R46175R40208l36457j099032
39646f67329m83984q17631k513508j653876L214640O422889K688829m205917o403622
39637d419509l239055p48671j189185o21498K418055L476677J90187k813577j117157
39628h063733K585990L444385J950789J227004M38087k811604n792378l355955
$$ plain form
39689 -4035613 -3908865 -3720881 -4393034 -5161642 -5888837 -6714231 -6375568 -3716616 -501010
39680 -501010 163014 -1599379 -2371789 -848055 -350755 -4049023 -10021493 -13783083 -14236106
39671 -14236106 -13868680 -13509464 -10642122 -4225809 1997885 3754732 1914289 573172
39663 573172 318649 -2392177 -8146110 -11256076 -7018210 458153 2423941 -3192201
39655 -3192201 -9386118 -9707196 -5644623 -2323645 -1118223 -172048 768160 431703 -667329
39646 -667329 -1151313 -1968944 -4482452 -6136328 -2921688 3501201 6190030 1984113 -4419509
39637 -4419509 -7658564 -8407235 -9596420 -10217918 -7799863 -4323186 -4132999 -6946576 -8063733
39628 -8063733 -5477743 -2033358 -82569 1144435 1582522 -1229082 -7021460 -10377415
39620a0377415L091542O160345L104488n40293k00713J102044p00072l028771
39612a388845j278041K535551K450098j675194l792351j228618J720658J333191
39604a323551j86549K74868J315225M68632p39511L65884K358104J897443m58522
39595C972023j133513N43481J477584j78918k703003l704480k506444K46874K758231
39586a228165K519053n28642k284942N76472N026509N200641P15450l277630l900608
39577B818138l023655j882006O21935L159054K030138j830751k423819J646383
39569A115417L713772m04352m960634l349108J080920P79279l485158m225798
39561i735662N32949M788679M347663J959708J396346K134346J881457L19308
$$ plain form
39620 -10377415 -7285873 -1125528 1978960 1438667 1237954 2339998 1639926 -1388845
39612 -1388845 -2666886 -131335 2318763 643569 -3148782 -4377400 -2656742 -1323551
39604 -1323551 -1510100 -1235232 79993 548625 -190886 174998 2533102 4430545 3972023
39595 3972023 2838510 3381991 4859575 4680657 1977654 -1726826 -4233270 -3986396 -1228165
39586 -1228165 1290888 762246 -1522696 -946224 4080285 9280926 9996376 6718746 2818138
39577 2818138 -205517 -2087523 -1465588 1693466 3723604 1892853 -530966 1115417
39569 1115417 4829189 4424837 -535797 -3884905 -2803985 -2024706 -5509864 -9735662
39561 -9735662 -9202713 -4414034 -66371 1893337 3289683 5424029 7305486 7624794
39553G624794j405979k314052k026761j434114k179599l514173j820326L654049
39545c416161P382718M436604j653888l475108l80781J740546L45915j118189
39537C861656p51690j243325l542264l875617m8096M254030M546462J218978k281249
39528B138885l632832k133172J704500N268198N464964K535322l86050j833757
39520I126058k759235k789654k78655L222355L384227n01093l901572l412648
39512B089783o88261J298095J693410K71139k906558m964735k256457L365444
39504b098140N369114J654144k386683k335524p82936j567009l140466j946606
39496g234106J506596M057229M441675L238730J101008m63609L33726K172205
$$ plain form
39553 7624794 6218815 3904763 1878002 443888 -1735711 -5249884 -7070210 -3416161
39545 -3416161 3966557 8403161 6749273 3274165 2893384 4633930 4979845 3861656
39537 3861656 3109966 1866641 -1675623 -5551240 -5599336 -1345306 3201156 4420134 2138885
39528 2138885 -1493947 -3627119 -1922619 3345579 8810543 11345865 10959815 9126058
39520 9126058 6366823 3577169 3298514 6520869 9905096 9404003 5502431 2089783
39512 2089783 1401522 2699617 4393027 4664166 1757608 -3207127 -5463584 -2098140
39504 -2098140 3270974 4925118 2538435 202911 -580025 -2147034 -5287500 -7234106
39496 -7234106 -5727510 -1670281 2771394 6010124 7111132 6647523 6981249 9153454
39488I153454J387881k137129m144995k876649j756408k869030l190715m31877
39480f865468K612806K995938J966157J207481p1388j264390N37290M248735M072116
39471I439277j084563m458336k081210J054474O00938Q8154J988429P47114o421862
39462a27585j0553798l819679N932771O064559j061373k695425L620499P987836
39454E347805N194905L99772k149201l709310l991472j207553O47778l577350
39446c044626q342228l295652Q260598J1337492K433082m448562k09927N883781
39438H573958L150498l762144n384965l251384l569939m143913Q7835N098540
39430c201514L565586j929285k972217O08475J753796o96404o86696L349579N268072
$$ plain form
39488 9153454 10541335 8404206 4259211 1382562 -373846 -3242876 -6433591 -6865468
39480 -6865468 -4252662 -1256724 709433 1916914 1845526 581136 1118426 5367161 9439277
39471 9439277 8354714 3896378 1815168 2869642 3470580 3558734 5547163 6294277 -127585
39462 -127585 -10681383 -14501062 -8568291 -2503732 -3565105 -6260530 -2640031 5347805
39454 5347805 10542710 10942482 8793281 5083971 1092499 -115054 532724 -3044626
39446 -3044626 -11386854 -14682506 -6421908 4915584 7348666 2900104 2690177 8573958
39438 8573958 11724456 7962312 2577347 -674037 -4243976 -8387889 -8300054 -3201514
39430 -3201514 364072 -1565213 -4537430 -3928955 -2175159 -2871563 -3558259 -208680 5059392
39421E059392J335726m226830o078139m232264j618447L00925J598481K606313
39413e254843L588626L845085J824076j846721l317077m70151L065509K455627
39405C890131j457542l622250j854595J257963K611604J480401r57799k297670
39397i49757m52491L083731L644253k81791l910369k713372R61813K071113O87622
39388B140752L96058J244331L48354j700224j290693J407969K032364p55332k984859
39379H38720j772536P14884J583815J404360J719151J615617m63908l407060m362447
39370b129404k326763O22641J648352L52574o01818J134063L845559L509649k70093
39361E784760l200345k574706q33297l56727Q73991M214868N369127P08882m680930
$$ plain form
39421 5059392 6395118 2168288 -3909851 -8142115 -9760562 -9459637 -7861156 -5254843
39413 -5254843 -1666217 2178868 4002944 2156223 -1160854 -1631005 1434504 3890131
39405 3890131 2432589 -1189661 -3044256 -1786293 825311 2305712 1347913 -949757
39397 -949757 -1402248 1681483 5325736 5043945 1133576 -1579796 -617983 1453130 2140752
39388 2140752 2536810 3781141 4129495 2429271 1138578 2546547 4578911 3823579 838720
39379 838720 -933816 -218932 1364883 2769243 4488394 6104011 5640103 2233043 -2129404
39370 -2129404 -4456167 -3833526 -2185174 -1832600 -2434418 -1300355 2545204 6054853 5784760
39361 5784760 2584415 9709 -823588 -1180315 -306324 3908544 9277671 9986553 5305623
39352E305623l026961L583138N199041j008560o430461m173488J513784L223969
39344D186085R78517o15121m44757r7471J022863L541964M036502l64650n191895
39335G052037l376237L610877O335363N44334o581843o426773j92668M146222
39327E111312K879992l34731j115027N18845K105499K333001J345312k88848j585902
39318A0969453j630576j029022j443527k776527k526078O41837M297030N196117
39310A1698707L590263K206538J787725N72806j843448l310891k735473k011609
39302I954618k623534k758651k86744L066196L587989J115317m27241J236781
39294A2864731L206209J654504k123414l056511L04934L218340J592726j609344
$$ plain form
39352 5305623 2278662 5861800 11060841 10052281 3621820 -551668 962116 4186085
39344 4186085 5164602 4549481 4104724 4007253 5030116 8572080 12608582 12243932 7052037
39335 7052037 3675800 7286677 13622040 14166374 7584531 1157758 965090 5111312
39327 5111312 7991304 7656573 6541546 7060391 9165890 11498891 12844203 12555355 10969453
39318 10969453 9338877 8309855 6866328 4089801 1563723 2205560 6502590 11698707
39310 11698707 15288970 17495508 19283233 19856039 18012591 14701700 11966227 9954618
39302 9954618 7331084 4572433 4285689 7351885 10939874 12055191 11627950 12864731
39294 12864731 16070940 17725444 15602030 12545519 12850453 16068793 17661519 16052175
39286A6052175q32448K897778K953075k217526n807961l101252R46433j01596
39278A0788678l557109k474419K451569M435447K283859J260090K409818Q92449
39270A8490382l327346l348222K233591M682283j058765o922983m042336L114184
39262I820788M504150O43055R4630M083708M981482m7785m210692k127654K359784
39253B0101466K711645j579232n790389n915511k024638J935016J746847j397038
39245I788166q95085N947719J1739860P955026k489871q820259p020390k831461
39237A3373705p57181R28956L112046K866861K72704j63425J759652J34287n781048
39228A5746557p085921J447595J0980597R799224k54983p279658n993255k052476
$$ plain form
39286 16052175 15219727 18117505 21070580 18853054 13045093 9943841 10890274 10788678
39278 10788678 7231569 4757150 7208719 11644166 13928025 15188115 17597933 18490382
39270 18490382 15163036 11814814 14048405 18730688 17671923 10748940 6706604 9820788
39262 9820788 14324938 14967993 15062623 19146331 24127813 24080028 19869336 17741682 20101466
39253 20101466 22813111 21233879 15443490 9527979 7503341 9438357 11185204 9788166
39245 9788166 8893081 14840800 26580660 34535686 32045815 23225556 16205166 13373705
39237 13373705 12616524 13545480 16657526 19524387 19797091 19633666 21393318 21527605 15746557
39228 15746557 8660636 10108231 21088828 30888052 30633069 23353411 17360156 15307680
39220A5307680r53797j278565k35208J073129P17844l24387l43638J4124q72150
39211A3105032k750245l664244k251685Q30294L336298L272865P68062k083701
39203A0562676l358793k682375p19434J343641J917621M51853j139019n31595
39195E844575J482163J963319L30887j073551j042488n60282M68278L094428N009209
39186A5516538J673282n939840j0092096o318040J48973K242242P35474Q20740
39178a212727L022002L761124K344989J112622K69910j573373l124904k419041
39170B180602j624305l618921n147037p44656O828151Q307073J612759m296572
39162C497094k558057K076275J795682k436352l936668r43022K441047L490432
$$ plain form
39220 15307680 14353883 13075318 12840110 13913239 14631083 14306696 13963058 13977182 13105032
39211 13105032 10354787 6690543 4438858 5269152 8605450 11878315 12646377 10562676
39203 10562676 7203883 4521508 3802074 5145715 7063336 7515189 6376170 5844575
39195 5844575 7326738 9290057 9620944 8547393 7504905 6944623 7412901 10507329 15516538
39186 15516538 17189820 11249980 1157884 -5160156 -5011183 -2768941 -2033467 -1212727
39178 -1212727 1809275 5570399 7915388 9028010 9297920 7724547 4599643 2180602
39170 2180602 556297 -3062624 -8209661 -8954317 -2126166 6180907 7793666 3497094
39162 3497094 939037 3015312 4810994 2374642 -1562026 -2505048 -64001 3426431
39154C426431K836451O11906l376373o027919l332706K839393N579219K241021
39146D797423j773706j035456K278771K460995j005433l390098k175220J5477
39138A72753L50074k96294J02075J240488J644755J254421P87995J50607n50504
39129D856370m4171J777793K229613n82640l897159l487696J60467K814461L185357
39120G012395L930199N457807M133704j091259n256687m214731q87266m19758
39112H664404k258923k036474O63758J762265n04837k845198j645937K680978
39104D480036O489559N885000l71586q447324j1128155n174017L842252P348751
39096B924516L604443j715283l626280k174570P53282L910119N306810L080502
$$ plain form
39154 3426431 6262882 6874788 3498415 -2529504 -5862210 -3022817 2556402 4797423
39146 4797423 3023717 1988261 4267032 6728027 5722594 2332496 157276 172753
39138 172753 522827 226533 328608 1569096 3213851 4468272 5256267 5406874 4856370
39129 4856370 4812199 6589992 8819605 8236965 4339806 852110 1012577 3827038 7012395
39120 7012395 10942594 16400401 20534105 19442846 14186159 9971428 9084162 8664404
39112 8664404 6405481 4369007 5032765 6795030 6290193 3444995 1799058 4480036
39104 4480036 10969595 16854595 16483009 8035685 -3092470 -8266487 -4424235 2924516
39096 2924516 6528959 4813676 1187396 -987174 -233892 3676227 8983037 12063539
39088A2063539p50242j383290K222910N340874L661262j542312n884396o703124
39080G025221m236695o55212J163704L34186n09452Q15030J709111r89956l770552
39071H85385l43180O962936Q055172n3809p711776o585707j043502Q32906N9434
39062A057859K041634M997086L173772j799886k867764P49199L160401K230106
39054A2742407J229962M78138l106154p469148o212215J60267L220377k92407
39046G51227l498305j143647K700633L356381L113706M282566L072204k542381
39038A0092384o355780l198518J973547K527911J248062L595206N912315J555326
39030A7350453n605737o172331j237156m99695n011835n352367J168755M996000
$$ plain form
39088 12063539 11313297 9930007 12152917 17493791 21155053 19612741 13728345 7025221
39080 7025221 2788526 2133314 3297018 3631204 3121752 3936782 5645893 4655937 885385
39071 885385 542205 7505141 15560313 15506504 7794728 1209021 165519 998425 1057859
39062 1057859 3099493 8096579 11270351 9470465 6602701 7351900 10512301 12742407
39054 12742407 13972369 14450507 11344353 3875205 -2337010 -2176743 1043634 751227
39046 751227 -2747078 -3890725 -1190092 2166289 5279995 9562561 12634765 10092384
39038 10092384 3736604 538086 2511633 5039544 6287606 9882812 15795127 17350453
39030 17350453 11744716 5572385 4335229 3835534 -1176301 -6528668 -5359913 -363913
39022c63913N55641m330956j940132L083236L108936L39698R57857L210964J217221
39013E838552l757963n308294k562987l91034n92222n17851N89714Q18466M00736
39004e482883J038873J295075j237058m152583l009553Q83572K113108J69551
38996h381898k58854J809000K018323o76550j348855K110500M498279J628712
38988A398657k592174k153767K245214N035861L469995n32969l935943m673117
38980a738243k200758J347881K466360O55100r00644m96327l14042j683314k029168
38971d893155L74980K518355J417028o16271J27112K368944K103264q39841l221881
38962f61465l785191l533003j997947J748299N072192L925935p54676l501986
$$ plain form
39022 -363913 191728 -4139228 -6079360 -2996124 112812 452510 1410367 4621331 5838552
39013 5838552 2080589 -3227705 -5790692 -6181726 -6773948 -7291799 -6702085 -5883619 -5482883
39004 -5482883 -4444010 -3148935 -4385993 -8538576 -11548129 -10664557 -8551449 -8381898
38996 -8381898 -8640752 -6831752 -4813429 -5489979 -6838834 -4728334 -230055 1398657
38988 1398657 -1193517 -3347284 -1102070 3933791 7403786 6870817 2934874 -1738243
38980 -1738243 -3939001 -2591120 -124760 530340 -370304 -866631 -1180673 -2863987 -4893155
38971 -4893155 -4518175 -1999820 -582792 -1199063 -1071951 1296993 3400257 2560416 -661465
38962 -661465 -4446656 -7979659 -9977606 -8229307 -3157115 768820 14144 -3487842
38954c487842j922563M25895j5216j797538j277355K225325N825359O151205K354505
38945H481775k706863m613797k249856N99307O18268p7944J995064M607830K324086
38936H977870m191582p499624l608788K635957M990501L706192K522803K035517
38928I568846N40078j333174j526286p63332j759040m563547n931491l632389
38920i400335O78008L209765J750621k057633l945529j670070J790770J981975
38912g662428l76035k90418L305931N227639K245620j547257j550499l2261j230087
38903a909795l074882o59052M501009O106516L033965L06995J06806p21937l122621
38894D567004l367680n96442L05311l058376n850329l787074P3770J193772Q80798
$$ plain form
38954 -3487842 -5410405 -4984510 -4999726 -6797264 -8074619 -5849294 -23935 6127270 8481775
38945 8481775 5774912 1161115 -1088741 -489434 128834 50890 2045954 6653784 8977870
38936 8977870 4786288 -2713336 -6322124 -3686167 1304334 5010526 7533329 9568846
38928 9568846 10108924 8775750 7249464 6486132 4727092 163545 -5767946 -9400335
38920 -9400335 -8722327 -5512562 -3761941 -5819574 -9765103 -11435173 -9644403 -7662428
38912 -7662428 -8038463 -8328881 -5022950 204689 2450309 903052 -647447 -679708 -1909795
38903 -1909795 -4984677 -5643729 -1142720 4963796 7997761 8304756 8411562 7689625 4567004
38894 4567004 1199324 602882 908193 -2150183 -8000512 -11787586 -11713816 -10520044 -9639246
38885i639246K106852K768180j84462l479936j722276L290680M766948J461866
38877f31394j121985j17201J025088n59702k645819k274427K06980L055331M797245
38868A734116L172610k652254p934310o154624J306248N303525J331355m348089
38860h241423m520433o78248K096504L925693P052714Q614162M561083j759370
38852A1050682l123330M48478K053532n06335j740012J079292K548569j588435
38844A0222441o363377m680047J704185M689072J447081k490618j860666J670257
38836D338328L175510J351992q44451r26463K03165J64286j569155l157583k774071
38827c8442n49002J979049L378961K758674j79467m172471o142388l736875J559235
$$ plain form
38885 -9639246 -7532394 -4764214 -4948676 -8428612 -10150888 -6860208 -2093260 -631394
38877 -631394 -1753379 -1870580 -845492 -1405194 -4051013 -6325440 -6118460 -3063129 1734116
38868 1734116 4906726 2254472 -5679838 -11834462 -10528214 -5224689 -3893334 -8241423
38860 -8241423 -12761856 -13440104 -11343600 -7417907 -365193 8248969 12810052 11050682
38852 11050682 7927352 8375830 10429362 9923027 8183015 9262307 11810876 10222441
38844 10222441 3859064 -820983 883202 5572274 7019355 4528737 2668071 4338328
38836 4338328 7513838 8865830 8021379 7094916 7298081 7462367 5893212 2735629 -38442
38827 -38442 -587444 1391605 4770566 7529240 7349773 3177302 -2965086 -6701961 -5142726
38818e142726N167919L896641r64916n218580n746301k813404Q10870K512845
38810g497652J791166m8932j501103j573233K97322L320210M604866J853187k633176
38801a387345l619922j11239K427031k77150m588197m042125J085005M403780
38793f110162K829464N1143p9116J231419R20991j252074l369964m007350k569250
38784a2354899O56353L522343L520567J384471O67357K625706M279723K940067
38776G241688j10497k112513k376288j499849M74347L040227M428695L764345
38768A2850155K205076M57197k486442o282936p520192l847126J867582M308419
38760A551733J841470k200826l696150j634125J540951K511336O85404p93629
$$ plain form
38818 -5142726 25193 3921834 2956918 -2261662 -8007963 -10821367 -10010497 -7497652
38810 -7497652 -5706486 -5755418 -7256521 -8829754 -8532432 -5212222 -607356 1245831 -1387345
38801 -1387345 -5007267 -5118506 -2691475 -2968625 -7556822 -11598947 -10513942 -6110162
38793 -6110162 -3280698 -3229555 -3308671 -2077252 -1156261 -2408335 -5778299 -9785649 -12354899
38784 -12354899 -11698546 -8176203 -4655636 -3271165 -2603808 21898 4301621 7241688
38776 7241688 7131191 5018678 2642390 1142541 1616888 4657115 9085810 12850155
38768 12850155 15055231 15512428 13025986 6743050 -777142 -4624268 -2756686 1551733
38760 1551733 3393203 1192377 -2503773 -4137898 -2596947 -85611 599793 -193836
38752a93836P44605K859669Q95884m338647o431337k660107J570996J080755r54972
38743g426990J488939O957698Q294970L683379o97620j10296K286585J096227
38735A5572892l228386n573314l512616J9233J321871N50063M26826J700596K154608
38726I431773N45293q36340L68763K231596R20212l144408n350428l611499j100118
38717e45156q93372j705352j158678R7385L63370L24142J570398L557047M473410
38708F083194L640569J456014j168143k332628q06523J097396j3716k510122j246056
38699D199985L189403L297007l563118r049827n405181K751844N613213K527957
38691C561283O81408K516687L547087J583617m23802r32775j651428k362944r09102
$$ plain form
38752 -193836 550769 3410438 4306322 -32325 -6463662 -9123769 -7552773 -6472018 -7426990
38743 -7426990 -5938051 1019647 9314617 12997996 12300376 12190080 14476665 15572892
38735 15572892 12344506 6771192 3258576 3277809 4599680 5149743 5576569 7277165 9431773
38726 9431773 9977066 9140726 9509489 11741085 12661297 9516889 4166461 554962 -545156
38717 -545156 -1438528 -3143880 -4302558 -4205173 -3841803 -3517661 -1947263 1609784 6083194
38708 6083194 9723763 11179777 10011634 7679006 6872483 7969879 7956163 5446041 4199985
38699 4199985 7389388 10686395 7123277 -1926550 -7331731 -4579887 1033326 3561283
38691 3561283 4242691 6759378 10306465 11890082 11466280 10533505 8882077 6519133 5610031
38682E610031J118620l91458m329892m816526p15713K200343N92410j567485k07530
38673b507200K700183L506938K480532J697992J247403M38463k76650o38192j119269
38664G530200j193141q0769P23466n28893j742146K54610L275155K100298k516780
38655G822000l892742K25617M122792L131591k28035j792891j453373n09277J041690
38646H467372J963362N3665k891695k338679J022545J587456j069554r54698K664744
38637H504518K373457l655350n730077J846645R371038O045980k734249m454672
38629A1567290N58523J710871l060837n098499r73373K551943J242469m33487
38621H064900J149772K968354K648427K830194M348447L021447k325325n745442
$$ plain form
38682 5610031 6728651 6337193 2007301 -2809225 -3524938 -1324595 -732185 -2299670 -2507200
38673 -2507200 192983 3699921 6180453 7878445 9125848 9564311 9287661 8649469 7530200
38664 7530200 6337059 6256290 6979756 6450863 4708717 4963327 8238482 10338780 7822000
38655 7822000 3929258 4154875 8277667 11409258 11181223 9388332 7934959 7425682 8467372
38646 8467372 10430734 10484399 7592704 5254025 6276570 7864026 6794472 5839774 8504518
38637 8504518 10877975 7222625 1492548 3339193 12710231 18756211 16021962 11567290
38629 11567290 12125813 13836684 10775847 5677348 4703975 7255918 8498387 8064900
38621 8064900 9214672 12183026 14831453 17661647 22010094 25031541 22706216 16960774
38613A6960774l044470J311702J419768j092280r76420J774712K958162J609110
38605B0921058P46446J608376J941359K33889j911634k373684j152308L40418
38597B0353920J234646J803266K677102L746464L874179K039221j197788l802475
38589C0728535l913634j276887K487646M788072M093764J662636L67232J225005
38581D0162369K213210J231266j037337k111686n12336K907788N302823L844632
38573E2000729n76081k531554J518350O760356N419438j116659k848948L633967
38565F2259598Q734168M123091m261245n663966p62442J762462P37933K618967
38557F9548566P244159O100611k556179q102383k614631O930445Q308624L41492
$$ plain form
38613 16960774 13916304 15228006 16647774 15555494 14579074 16353786 19311948 20921058
38605 20921058 21667504 23275880 25217239 25451128 23539494 21165810 20013502 20353920
38597 20353920 21588566 23391832 26068934 29815398 33689577 35728798 34531010 30728535
38589 30728535 26814901 25538014 28025660 32813732 36907496 38570132 38937364 40162369
38581 40162369 42375579 43606845 42569508 40457822 39945486 42853274 48156097 52000729
38573 52000729 51424648 48893094 50411444 57171800 62591238 61474579 58625631 62259598
38565 62259598 70993766 75116857 70855612 65191646 64429204 66191666 66929599 69548566
38557 69548566 76792725 82893336 80337157 72234774 69620143 76550588 84859212 85200704
38549H5200704p113882o369056M53235N618468L859787l070198q147501o534859
38541F3896698j490246o7184l071181m055091L80783M815920K971493l071356
38533F0309836o333471m811755k876934l789679n317136l649778J044898M499411
38525C9075392L171891j547589m565073k907762P03479J477305j263247l711178
38517C0433218k857461L27993K933566L017705M05917l338529n641561n250111
38509B0030737l513250k085449o98326J125493K237551K106751K407439L418375
38501B5029321J897809l438460p569234n540641l46627J566895Q2276j64082J179220
38492A2696477P24787n22065J576203N230027M158665j229314l503961o09466
$$ plain form
38549 85200704 78086822 71717766 72171001 77789469 81649256 78579058 70431557 63896698
38541 63896698 62406452 62339268 59268087 55212996 55593779 60409699 63381192 60309836
38533 60309836 53976365 49164610 46287676 42497997 37180861 33531083 34575981 39075392
38525 39075392 42247283 40699694 36134621 33226859 33930338 35407643 34144396 30433218
38517 30433218 27575757 27903750 30837316 33855021 34260938 30922409 25280848 20030737
38509 20030737 16517487 14432038 13733712 14859205 17096756 19203507 21610946 25029321
38501 25029321 26927130 23488670 15919436 10378795 10032168 11599063 11681339 11517257 12696477
38492 12696477 13421264 12899199 14475402 19705429 23864094 22634780 19130819 18521353
38484A8521353R99684j973559m644219l980254l982383o284423n331592J157621
38476e517772N968420L508458r24118l04175L034427L147839O80112n65181j297991
38467G730019l189442l248794N10654L276348J056979j629310J45747K069621
38459F721822j524246n910847l035517M090413N664048Q73943k252656j107545
38451C519415r15870l180879l054022N31377K263700m3689k181412j694082j281693
38442f037155k243365j916205N96608K676308L221067L370892K309468j118586
38434H59032l449040p49695L277912J800532l370294l967631R64400L784350J492288
38425F41854n27298K08267o29567l750911k985580L127333O868702L699689n26722
$$ plain form
38484 18521353 19521037 17547478 12903259 8923005 4940622 -1343801 -6675393 -5517772
38476 -5517772 450648 3959106 3034988 2730813 5765240 8913079 9593191 9028010 7730019
38467 7730019 4540577 1291783 1802437 5078785 6135764 4506454 4652201 6721822
38459 6721822 5197576 -713271 -3748788 341625 6005673 6879616 4626960 3519415
38451 3519415 2603545 -577334 -3631356 -3099979 -836279 -879968 -3061380 -4755462 -6037155
38442 -6037155 -8280520 -10196725 -9600117 -6923809 -3702742 -331850 1977618 859032
38434 859032 -2590008 -3339703 -61791 1738741 -1631553 -5599184 -4634784 -850434 641854
38425 641854 114556 322823 -306744 -4057655 -7043235 -3915902 2952800 6652489 6125767
38416F125767k79170J051343n98531k087032l31121P60155k112250m546809k264979
38407d282627R63611N50450n79321J496675L480593J285687j491793q9079K088677
38398C422873l61200m292589k980481K295769M748560K935533N45179j481771
38390D831873m104170m599078n52959L429924J781547k104093j126889L120327
38382F76482L159929j249041l315833j416490l81600r38209J125372M613410L019619
38373E293639l057286m662085J084819N798570L364227j222582j784155m89482
38365D325665j179007j476284J180570K645157r77130n166166l835493K82949
38357d199739N46662j782575J65803O128458P547778N90972p380395p683349j189544
$$ plain form
38416 6125767 5846597 6897940 6299409 4212377 3881256 4641411 2529161 -2017648 -4282627
38407 -4282627 -3319016 -2768566 -3347887 -1851212 1629381 2915068 1423275 1334196 3422873
38398 3422873 3061673 -1230916 -4211397 -1915628 2832932 5768465 6313644 4831873
38390 4831873 727703 -3871375 -4424334 -994410 787137 -1316956 -2443845 676482
38382 676482 3836411 2587370 -728463 -2144953 -2526553 -3464762 -2339390 2274020 5293639
38373 5293639 2236353 -2425732 -1340913 4457657 7821884 6599302 4815147 4325665
38365 4325665 3146658 1670374 2850944 5496101 4518971 -647195 -4482688 -4199739
38357 -4199739 -3653077 -5435652 -5269849 858609 8406387 8997359 1616964 -6066385 -7255929
38348g255929M676124O085776N210651M053554J106415m234173p735715m853564
38340b946861J870056M518378J79771m632719k933886K985027N293211J699963
38332F032940k682474l675080k534733j497927m9518K417480M064081K973084
38324E047853j83030l043337l494271q28154L035266M395121K238652J25783N67196
38315G861079L92111l486564o810213l455354L797427O222819K281776j086664
38307E716417p66395j292299m256732m099875J216833M812137J939813j988131
38299A281768j034024J293755p76525m777587m881211j950928n49658l61977J345155
38290a0411232K615242K90053k647092j223003K749178L784565K058708J820297
$$ plain form
38348 -7255929 -2579805 3505971 8716622 12770176 13876591 9642418 1906703 -2946861
38340 -2946861 -1076805 3441573 3621344 -1011375 -3945261 -960234 4332977 6032940
38332 6032940 3350466 -324614 -2859347 -4357274 -4406792 -1989312 2074769 5047853
38324 5047853 4864823 1821486 -1672785 -2500939 534327 4929448 7168100 7293883 7861079
38315 7861079 8253190 4766626 -2043587 -5498941 -1701514 4521305 6803081 5716417
38307 5716417 4950022 3657723 -599009 -4698884 -3482051 1330086 3269899 1281768
38299 1281768 247744 1541499 764974 -4012613 -8893824 -10844752 -11394410 -11756387 -10411232
38290 -10411232 -7795990 -7505937 -10153029 -11376032 -8626854 -4842289 -2783581 -963284
38282i63284K752977R29195l194154n330842m576992l124373p57224L218423N125206
38273e921068J929886j602420N15379M677854L422927r15514k54371L410267L47076
38264E610016q163494q836793J888383J0151923N702224k918539l378110K026643
38256B082253L781011J332689K0520p69670m285174o750804k956058K612635J945664
38247b986934k391994j448705L824662L408650m272532q490860l022627M524806
38239a0855534N308785J705243O59003J971789Q73549k272632k473365J338958
38231c744204M439288L262547M8570o03014K293411M762596K384177m005580q239364
38222E98427n845540J06368K875164Q75319j180659k2936J874261J369178l16798
$$ plain form
38282 -963284 1789693 2718888 -475266 -5806108 -10383100 -13507473 -14264697 -11046274 -5921068
38273 -5921068 -3991182 -5593602 -5078223 -400369 3022558 2107044 1852673 5262940 5610016
38264 5610016 -2553478 -11390271 -9501888 650035 6352259 3433720 55610 2082253
38256 2082253 5863264 7195953 7216473 6446803 2161629 -4589175 -7545233 -4932598 -2986934
38247 -2986934 -5378928 -6827633 -3002971 405679 -3866853 -12357713 -15380340 -10855534
38239 -10855534 -5546749 -3841506 -3182503 -1210714 -337165 -2609797 -5083162 -3744204
38231 -3744204 695084 3957631 4006201 3403187 5696598 10459194 12843371 8837791 598427
38222 598427 -5247113 -5140745 -2265581 -1390262 -2570921 -2593857 -719596 649582 332784
38213C32784o94673p46064k621176m684832l181252J697952N278379M494115J469000
38204A344233o8407M98275J140951O73121k09726o96565q84840r85038q11248
38195G56m04847k19646k92334k4526P61472J264080O91315p98076k441839l322919
38185d786564k320284Q39244L846399L258594o65973k743943P36613N965732N637168
38176I766986j389116q237871q434649k828859K962322N004178L383382N04946
38168G31319j152756q86479k44952o06254p03169J322936M045759M053067R64503
38159G523974k229799l736592m050914k705908J214242M888048L646555j573362
38151B976244m381007k442701o46728k087111k772523L65536K933907N29567k981521
$$ plain form
38213 332784 -361889 -1107953 -3729129 -8413961 -11595213 -9897261 -4618882 -124767 1344233
38204 1344233 1275826 1774101 2915052 3588173 3378447 2681882 1797042 812004 756
38195 756 -404091 -623737 -916071 -940597 -179125 1084955 1776270 978194 -1463645 -4786564
38185 -4786564 -7106848 -6267604 -2421205 837389 171416 -2572527 -1835914 4129818 9766986
38176 9766986 8377870 139999 -8294650 -11123509 -8161187 -3157009 226373 731319
38168 731319 -421437 -1307916 -1552868 -2159122 -2862291 -1539355 2506404 6559471 7523974
38159 7523974 5294175 1557583 -2493331 -5199239 -3984997 903051 4549606 2976244
38151 2976244 -1404763 -3847464 -4494192 -6581303 -9353826 -8988290 -6054383 -5524816 -8506337
38142h506337j631027K653482L629927J013842l62325N75882M93473j300465j893600
38133e327148m65879O66731L11410p59535k002814k324846K65622M196186L649975
38124a790298k482109o179177j767433L897169J961556l088094n23505P743944
38116b227947R196620R88480n861540m427840o97036q29276j991237q11445R2693
38107f568528o65180M21385L273735K271291k342237k096164M859202Q214412
38099G367916K252331l647863o82862M454731J896348m053420l365588J594987
38091E816580J041796m170344m346357J513189M212717M71263k277527Q46577
38083C107894M783808L401757k278106p248856q007613l889840K088432M320163
$$ plain form
38142 -8506337 -10137364 -7483882 -3853955 -2840113 -3202438 -2626556 -2133083 -3433548 -5327148
38133 -5327148 -5793027 -5126296 -4814886 -5574421 -7577235 -9902081 -9636459 -5440273 -1790298
38124 -1790298 -4272407 -10451584 -12219017 -8321848 -6360292 -9448386 -9971891 -2227947
38116 -2227947 6968673 7957153 2095613 -2332227 -3029263 -3858539 -5849776 -6661221 -6568528
38107 -6568528 -7233708 -6812323 -3538588 -1267297 -3609534 -5705698 -846496 7367916
38099 7367916 9620247 5972384 5289522 9744253 11640601 7587181 4221593 5816580
38091 5816580 6858376 2688032 -1658325 -145136 4067581 4538844 2261317 3107894
38083 3107894 7891702 11293459 9015353 1766497 -6241116 -10130956 -8042524 -3722361
38075c722361J297810j111017J558808M347512R24481m811106m673653p4024J072026
38066e191524j150066M76462N670315N880632m36830m405084j711747Q26452j952046
38057a993436n128367l454245J30600J494753K236228L908356L343009n23265
38049A3633k698825o42861P51489j606198k614259J505102M925366J403749m719948
38040c682752n275113q24482K128821K211594K705428L297906J162429j739221
38032a5390q70503K395188K365337j212555k451020R64206M099164K481081j860694
38023E894814m099705k553510P47384K808320K067205j34885n96672J638681L402276
38014I173908J683835j881817l522171k736898k096401k779841l357608k371325
$$ plain form
38075 -3722361 -2424551 -3535568 -1976760 2370752 3295233 -1515873 -6189526 -6263550 -5191524
38066 -5191524 -6341590 -5865128 -194813 5685819 5248989 843905 -867842 -41390 -1993436
38057 -1993436 -7121803 -10576048 -10445448 -8950695 -6714467 -2806111 536898 13633
38049 13633 -2685192 -3328053 -2576564 -4182762 -6797021 -5291919 -366553 1037196 -3682752
38040 -3682752 -8957865 -9782347 -7653526 -5441932 -2736504 561402 1723831 -15390
38032 -15390 -885893 1509295 3874632 2662077 211057 1175263 5274427 7755508 5894814
38023 5894814 1795109 -758401 -11017 2797303 4864508 4729623 4132951 5771632 9173908
38014 9173908 10857743 8975926 5453755 2716857 620456 -2159385 -5516993 -7888318
38006g888318K13952L308405M794320K974557m75657j451597P77720J908427o21778
37997C540031k973156r88450K570465K129555j718588l168784k15174K843697
37989B019596K218105o76354k287361j277381J095231K582108J565874j253354
37981C986464l165109k685963j189496j85086N73396P16571j414144m444666l269418
37972a1077451L130128P441540L475569l568560l557198L747495Q289003M193529
37964A2074055l095249n922568l846246r45240P78451J501173R10873p65543j331149
37955f41443O99433L260778K862876r58583m654103m229550J84714L546008J213717
37946A283847m570700o388424j431725M133686L858081J29105o30518J267990
$$ plain form
38006 -7888318 -7674366 -4365961 428359 3402916 2927259 1475662 2253382 4161809 3540031
37997 3540031 566875 -421575 2148890 4278445 2559857 -608927 -824101 2019596
37989 2019596 4237701 3561347 1273986 -3395 1091836 3673944 5239818 3986464
37981 3986464 821355 -1864608 -3054104 -3239190 -2665794 -1949223 -3363367 -7808033 -11077451
37972 -11077451 -7947323 -505783 2969786 -598774 -4155972 -408477 7880526 12074055
37964 12074055 8978806 3056238 -790008 -1735248 -956797 544376 1455249 689706 -641443
37955 -641443 57990 3318768 6181644 5223061 568958 -3660592 -3475878 70130 1283847
37946 1283847 -3286853 -9675277 -11107002 -6973316 -3115235 -2986130 -3616648 -2348658
37938b348658r5081n375595p769604l087214M212901P462820N467230J365041
37930a68160k150444l912304l520354j718275J47145J679287K693655J801548
37922e147902j186162k584711J065756O734057P651884K526011k948753m231747
37914A878433k388661L45841L697047O229899M647052r53671n566952n759720
37906B129268l795336k958997k789786j622554k03287J07419j25574L7980L53622
37897h867245Q32692J914304K329596K55600k705531k809192k25313Q28660r69839
37888i416268k092546n16853J430226K282839L631836M983989K723965k895705
37880A31483o021756l848822p70632l77356r9006J991714K409668k87444o71028
$$ plain form
37938 -2348658 -2443739 -7819334 -15588938 -18676152 -14463251 -7000431 -1533201 -168160
37930 -168160 -2318604 -6230908 -9751262 -11469537 -11322392 -9643105 -6949450 -5147902
37922 -5147902 -6334064 -8918775 -7853019 -1118962 6532922 9058933 6110180 1878433
37914 1878433 -510228 -164387 3532660 9762559 14409611 13455940 7888988 2129268
37906 2129268 -1666068 -4625065 -7414851 -9037405 -9240692 -9133273 -9258847 -9220867 -8867245
37897 -8867245 -8034553 -6120249 -3790653 -3535053 -6240584 -9049776 -9275089 -8446429 -9416268
37888 -9416268 -11508814 -12025667 -10595441 -8312602 -4680766 303223 3027188 131483
37880 131483 -5890273 -9739095 -10509727 -10887083 -10986089 -8994375 -6584707 -6872151 -7543179
37871g543179M250181P940345M342568j609782k350685m13806k467784n749896
37863c602038k481908N071466O592429K72962m706786l437389j476766l072105
37855f840135m051431r72026J957046O63933j549564k99613K382846K457724Q73636
37846e377584P64154J575428J099694L52719J700516M157820M444307J374181
37838A0091235l390102p298675p796133l615304K788586O386926N045715J713552
37830C925800j77319p82698j752078k891652k930397j522366R04747L320627L602249
37821A696913N69769l192066l818350j594620J0605N13033K234616L708223L82338
37812E10461n981022o544408J420131Q055400M347917m154851n465631J322995
$$ plain form
37871 -7543179 -3292998 4647347 8989915 7380133 5029448 4615642 2147858 -3602038
37863 -3602038 -6083946 -1012480 5579949 5852911 1146125 -2291264 -3768030 -6840135
37855 -6840135 -10891566 -11863592 -9906546 -9242613 -10792177 -11091790 -8708944 -6251220 -5377584
37846 -5377584 -4613430 -3038002 -1938308 -1585589 114927 4272747 8717054 10091235
37838 10091235 6701133 -597542 -8393675 -12008979 -9220393 -2833467 2212248 3925800
37830 3925800 3748481 2965783 1213705 -1677947 -4608344 -6130710 -5225963 -1905336 1696913
37821 1696913 2266682 -925384 -4743734 -6338354 -6327749 -5814716 -3580100 128123 510461
37812 510461 -5470561 -12014969 -10594838 -2539438 1808479 -2346372 -7812003 -6489008
37804f489008O149904L654671r61790k170803j249271q19680J18952K078063K082493
37795B393531r96332k871864j41885L491993K223307k923383n205429j608390
37787e638452L266010L604504n31530m176068l745411n18757J813219J656336
37779d270149P06148R59416J908956J784138O89240N26534J657274J756501q24927
37770D893131m080742m436487j184155K675018L878246K061401m97110j372878
37762A936424j65018J262990R01678o63237n63057K181007M021856R34545n190990
37753D656198p596358l436678J796286J563850k565745l420135J129081N197542
37745b675959L744675l12351r12900K376098M337710J648380l046473m819966
$$ plain form
37804 -6489008 -339104 3315567 2353777 182974 -1066297 -1885977 -1767025 311038 2393531
37795 2393531 1397199 -1474665 -1616550 1875443 4098750 1175367 -4030062 -5638452
37787 -5638452 -2372442 1232062 700532 -3475536 -7220947 -7739704 -5926485 -4270149
37779 -4270149 -3564001 -2604585 -695629 1088509 1777749 2304283 3961557 5718058 4893131
37770 4893131 812389 -3624098 -4808253 -2133235 1745011 3806412 3309302 1936424
37762 1936424 1771406 3034396 3936074 3272837 2709780 4890787 8912643 9847188 4656198
37753 4656198 -2940160 -6376838 -4580552 -3016702 -5582447 -9002582 -7873501 -2675959
37745 -2675959 1068716 756365 -156535 2219563 6557273 8205653 5159180 339214
37737C39214k071945K042880K919472o35663m676282m376638o9314L229081K850017
37728d49178J671331K475352K930275j95273m829867o223995l846382q63888J743798
37719g587827N095591P247104M414230j846042m791262j884561J534482Q31963
37711C013678j000761P63174M136013L389824j796041n659934m417233m95425
37703b066705J847344J630632P06241O39166J465946K317001K256058J099562
37695I895245j45423k35534N67562L58638j999485m549366l730666Q38807M474677
37686E474455K701062k279986l988884r52205J143825j213632l289689j22251
37678b527305M208790K531617l209643m350048P08545M294459K284375j42286
$$ plain form
37737 339214 -1732731 310149 3229621 2593958 -2082324 -6458962 -6528276 -3299195 -449178
37728 -449178 1222153 3697505 6627780 6432507 1602640 -4621355 -8467737 -9331625 -7587827
37719 -7587827 -2492236 4754868 9169098 7323056 2531794 647233 2181715 3013678
37711 3013678 2012917 2776091 6912104 10301928 8505887 2845953 -1571280 -2066705
37703 -2066705 -219361 1411271 2117512 2756678 4222624 6539625 8795683 9895245
37695 9895245 9749822 9514288 10081850 10440488 8441003 3891637 160971 999778 5474455
37686 5474455 8175517 5895531 1906647 954442 2098267 884635 -2405054 -2527305
37678 -2527305 1681485 4213102 1003459 -3346589 -2638044 1656415 3940790 3798504
37670C798504J167326K161677q66704l313713n0177M668769L271234k782536m958343
37661C096037m03536M679488M344858n13929n426559p233594n021550k50666L288571
37652c440880K723946l47257j856784k64964K652360M686041M267830M24859n154942
37643C690209p738318m777047M3226J590390K85073J33758J598606J578914l61139
37634c956328j107893M78510J959951J872421J676407K407577K999916K507182
37626H837743R60643j660240m076876k672369L603158Q550201N006752m276166
37618A4272846q782779m467110J196917J065944j910499j588193P81441k42944
$$ plain form
37670 3798504 4965830 7127507 6260803 2947090 2896913 7565682 10836916 8054380 3096037
37661 3096037 2692501 7371989 11716847 11202918 5776359 -1457235 -6478785 -6729451 -3440880
37652 -3440880 -716934 -1064191 -2920975 -3185939 -533579 4152462 8420292 8845151 3690209
37643 3690209 -4048109 -8825156 -8781930 -7191540 -6906467 -6772709 -5174103 -3595189 -3956328
37634 -3956328 -5064221 -4585711 -2625760 -753339 923068 3330645 6330561 8837743
37626 8837743 9798386 8138146 4061270 1388901 4992059 13542260 18549012 14272846
37618 14272846 5490067 1022957 2219874 3285818 1375319 -212874 568567 325623
$$ [...]
##END NTUPLES=NMR SPECTRUM
##END=
