##TITLE=31Pdec_2ABPA-20906
 D2O, 24 sc
 10.06.2021
##JCAMPDX= 6.0         $$ Bruker NMR JCAMP-DX V2.0
##DATA TYPE= NMR SPECTRUM
##DATA CLASS= NTUPLES
##ORIGIN= UXNMR, Bruker Analytische Messtechnik GmbH
##OWNER= root
$$ XWIN-NMR		Version 3.5
$$ Thu Jun 10 10:19:05 2021 Russian Standard Time (UT+4h)  she@DPX200
##.OBSERVE FREQUENCY= 81.013821
##.OBSERVE NUCLEUS= ^31P
##.ACQUISITION MODE= SIMULTANEOUS
##.ACQUISITION SCHEME= undefined
##.AVERAGES= 24
##.DIGITISER RES= 16
##SPECTROMETER/DATA SYSTEM= spect
##.PULSE SEQUENCE= zgpg30
##.SOLVENT NAME= CDCl3
##.SHIFT REFERENCE= (INTERNAL, CDCl3, 0, 248.564)
##AUDIT TRAIL= $$ (NUMBER, WHEN, WHO, WHERE, WHAT)
$$ ##TITLE= Audit trail, XWIN-NMR		Version 3.5
$$ ##JCAMPDX= 5.01
$$ ##ORIGIN= Bruker BioSpin GmbH
$$ ##OWNER= she
$$ F:/spectra/data/she/nmr/P31/1/pdata/1/auditp.txt
$$ ##AUDIT TRAIL=  $$ (NUMBER, WHEN, WHO, WHERE, WHAT)
(   1,<2021-06-10 10:17:39.98 +0400>,<she>,<DPX200>,
      <created by zg, POWCHK disabled, PULCHK disabled
       configuration hash MD5:
       00 E9 B6 7A A2 85 ED C7 34 08 36 98 17 FE 4E 26
       data hash MD5: 32K
       4A B2 79 FD 30 E6 09 44 8A 5E 82 BD 65 5E 55 19>)
(   2,<2021-06-10 10:17:58.07 +0400>,<she>,<DPX200>,
      <Start of raw data processing
       efp BC_mod = 2 LB = 1 FT_mod = 6 PKNL = 1 PHC0 = -5988.433 PHC1 = 357.8748 SI = 64K 
       data hash MD5: 64K
       37 20 13 8A F5 9F 61 7D 1B EC B9 19 5B 7B B9 44>)
(   3,<2021-06-10 10:18:18.25 +0400>,<she>,<DPX200>,
      <pk PHC0 = -17.59742 PHC1 = 0 
       data hash MD5: 64K
       33 DD DA 7B F5 E3 BA 44 3F B0 E8 59 12 C1 CB 7D>)
(   4,<2021-06-10 10:18:23.81 +0400>,<she>,<DPX200>,
      <abs ABSG = 5 
       data hash MD5: 64K
       71 21 82 35 38 CD 49 83 12 7D 76 13 3E 40 C1 14>)
$$ ##END=
$$ 
$$ hash MD5
$$ 87 0D 68 F5 54 A6 62 07 2C 99 85 9E E8 12 07 30
##$RELAX= 
##$RELAX= 
##$RELAX= 
##$RELAX= 
##$RELAX= 
##$RELAX= 
##$RELAX= 
##$RELAX= 
$$ Bruker specific parameters
$$ --------------------------
##$DU= <F:/spectra>
##$EXPNO= 1
##$NAME= <P31>
##$PROCNO= 1
##$TYPE= <nmr>
##$USER= <she>
##$AMP= (0..31)
100 100 100 100 100 100 100 100 100 100 100 100 100 100 100 100 100 100 
100 100 100 100 100 100 100 100 100 100 100 100 100 100 
##$AQSEQ= 0
##$AQ_mod= 1
##$AUNM= <au_zg>
##$AUTOPOS= <>
##$BF1= 81.014009
##$BF2= 200.13
##$BF3= 200.13
##$BF4= 200.13
##$BF5= 200.13
##$BF6= 200.13
##$BF7= 200.13
##$BF8= 200.13
##$BYTORDA= 1
##$CFDGTYP= 0
##$CFRGTYP= 5
##$CHEMSTR= <none>
##$CNST= (0..31)
1 1 145 1 1 1 1 1 1 1 1 1 1 1 1 1 1 1 1 1 1 1 1 1 1 1 1 1 1 1 1 1 
##$CPDPRG= <waltz16>
##$CPDPRG1= <>
##$CPDPRG2= <waltz16>
##$CPDPRG3= <>
##$CPDPRG4= <mlev>
##$CPDPRG5= <mlev>
##$CPDPRG6= <mlev>
##$CPDPRG7= <mlev>
##$CPDPRG8= <mlev>
##$CPDPRGB= <>
##$CPDPRGT= <>
##$D= (0..31)
0 1 0 0 0 0 0 0 0 0 0 0.03 2e-05 3e-06 0 0 0 0 0 0 0 0 0 0 0 0 0 0 0 0 
0 0 
##$DATE= 1623305859
##$DBL= (0..7)
120 120 120 11 120 120 24 19 
##$DBP= (0..7)
150 150 150 150 150 150 150 150 
##$DBP07= 0
##$DBPNAM0= <>
##$DBPNAM1= <>
##$DBPNAM2= <>
$$ [...]
##$SUBNAM3= <"">
##$SUBNAM4= <"">
##$SUBNAM5= <"">
##$SUBNAM6= <"">
##$SUBNAM7= <"">
##$SUBNAM8= <"">
##$SUBNAM9= <"">
##$SW= 501.771253377433
##$SWIBOX= (0..15)
0 1 3 0 0 0 0 0 0 0 0 0 0 0 0 0 
##$SW_h= 40650.406504065
##$TD= 32768
##$TD0= 1
##$TE= 0
##$TE2= 300
##$TE3= 300
##$TEG= 300
##$TL= (0..7)
0 120 53 12 22 120 120 120 
##$TP= (0..7)
150 150 150 150 150 150 150 150 
##$TP07= 0
##$TPNAME0= <>
##$TPNAME1= <>
##$TPNAME2= <>
##$TPNAME3= <>
##$TPNAME4= <>
##$TPNAME5= <>
##$TPNAME6= <>
##$TPNAME7= <>
##$TPOAL= (0..7)
0.5 0.5 0.5 0.5 0.5 0.5 0.5 0.5 
##$TPOFFS= (0..7)
0 0 0 0 0 0 0 0 
##$TUNHIN= 0
##$TUNHOUT= 0
##$TUNXOUT= 0
##$USERA1= <user>
##$USERA2= <user>
##$USERA3= <user>
##$USERA4= <user>
##$USERA5= <user>
##$V9= 5
##$VALIST= <valist>
##$VCLIST= <CCCCCCCCCCCCCCC>
##$VD= 0
##$VDLIST= <DDDDDDDDDDDDDDD>
##$VPLIST= <PPPPPPPPPPPPPPP>
##$VTLIST= <TTTTTTTTTTTTTTT>
##$WBST= 1024
##$WBSW= 4
##$XGAIN= (0..3)
0 0 0 0 
##$XL= 0
##$YL= 0
##$YMAX_a= 2331
##$YMIN_a= -2546
##$ZGOPTNS= <>
##$ZL1= 120
##$ZL2= 120
##$ZL3= 120
##$ZL4= 120
##$ABSF1= 248.5645
##$ABSF2= -253.2056
##$ABSG= 5
##$ABSL= 3
##$ALPHA= 0
##$AQORDER= 0
##$ASSFAC= 0
##$ASSFACI= 0
##$ASSFACX= 0
##$ASSWID= 0
##$AUNMP= <proc_1d>
##$AZFE= 0.1
##$AZFW= 0.5
##$BCFW= 0
##$BC_mod= 2
##$BYTORDP= 0
##$COROFFS= 0
##$CY= -3
##$DATMOD= 1
##$DC= 0
##$DFILT= <>
##$DTYPP= 0
##$F1P= 0
##$F2P= 0
##$FCOR= 1
##$FTSIZE= 65536
##$FT_mod= 6
##$GAMMA= 0
##$GB= 0
##$INTBC= 1
##$INTSCL= 5.30512e-09
##$ISEN= 30
##$LB= 1
##$LEV0= 0
##$LPBIN= 0
##$MAXI= 10000
##$MC2= 0
##$MEAN= 0
##$ME_mod= 0
##$MI= 50
##$NCOEF= 0
##$NC_proc= -8
##$NLEV= 6
##$NOISF1= 182.463
##$NOISF2= 159.3651
##$NSP= 0
##$NTH_PI= 0
##$NZP= 0
##$OFFSET= 248.5645
##$PC= 4
##$PHC0= -6006.031
##$PHC1= 357.8748
##$PH_mod= 1
##$PKNL= yes
##$PPARMOD= 0
##$PSCAL= 0
##$PSIGN= 0
##$REVERSE= no
##$SF= 81.014009
##$SI= 65536
##$SIGF1= 159.3651
##$SIGF2= -187.1042
##$SINO= 113.3802
##$SIOLD= 16384
##$SREGLST= <1H.CDCl3>
##$SSB= 0
##$STSI= 65536
##$STSR= 0
##$SW_p= 40650.406504065
##$SYMM= 0
##$S_DEV= 0
##$TDeff= 32768
##$TDoff= 0
##$TI= <>
##$TILT= no
##$TM1= 0
##$TM2= 0
##$TOPLEV= 0
##$USERP1= <user>
##$USERP2= <user>
##$USERP3= <user>
##$USERP4= <user>
##$USERP5= <user>
##$WDW= 1
##$XDIM= 65536
##$YMAX_p= 389222820
##$YMIN_p= -308849099
$$ End of Bruker specific parameters
$$ ---------------------------------
##NTUPLES= NMR SPECTRUM
##VAR_NAME=  FREQUENCY,     SPECTRUM/REAL,   SPECTRUM/IMAG
##SYMBOL=    X,             R,               I
##VAR_TYPE=  INDEPENDENT,   DEPENDENT,       DEPENDENT
##VAR_FORM=  AFFN,          ASDF,            ASDF
##VAR_DIM=   65536,         65536,           65536
##UNITS=     HZ,            ARBITRARY UNITS, ARBITRARY UNITS
##FACTOR=    0.620285442955139, 1,           1
##FIRST=     20137.2065510759, 0,            0
##LAST=      -20513.1999529892, 0,           0
##MIN=       -20513.1999529892, -308849099,  0
##MAX=       20137.2065510759, 389222820,    0
$$ Real data points
##PAGE= N=1
##DATA TABLE= (X++(R..R)), XYDATA
$$ [...]
43295 3111445 3179512 -297320 -5540903 -9017792 -8890635 -6471599 -4192152 -2824526 -1635906
43286 -1635906 -886821 -1938374 -3732039 -1891587 5319286 11887655 9809941 26900
43278 26900 -7690491 -7308509 -3595809 -3718899 -7137830 -8671066 -7410372 -6493668 -6359836
43269 -6359836 -4415030 -686729 1506558 495251 -2363811 -5796484 -8991055 -9582511
43261 -9582511 -5754445 -143284 2521213 1526341 234987 811016 2787306 5580560
43253 5580560 7879368 6129841 -812773 -6888009 -5174945 1684975 4492412 762337
43245 762337 -2901206 -2571034 -2499072 -6073706 -9380172 -8096860 -4245060 -1703656 -712636
43236 -712636 -774974 -3235155 -6870938 -6741203 -1899473 1372960 -1317770 -5756273 -6416609
43227 -6416609 -4698999 -4331180 -4253445 -2456124 -1693872 -4378486 -6267442 -2499584 3904782
43218 3904782 6735744 6134191 6126813 6252803 3652346 477678 786972 2371632 276784
43209 276784 -3397062 -2253643 2940229 4929066 2027203 87134 1449594 1298184
43201 1298184 -2599441 -5171373 -2588757 1706444 3235184 2590399 1865436 637839
43193 637839 -1019847 -599626 2426954 4756408 4694338 4963959 7267048 8500400 5510620
43184 5510620 -183334 -5105446 -7651575 -7111791 -3042531 1959147 3049720 -529518
43176 -529518 -3728409 -2837083 -360306 -8863 -1000987 -839410 -186665 -1123166 -3150922
43167 -3150922 -4395028 -4789168 -5267364 -5622468 -5367964 -4808800 -3621643 -764074 2694351
43158 2694351 3479379 632323 -2594329 -3057310 -1271381 776009 2473041 3933047
43150 3933047 5419630 8225853 12641038 14706258 9910912 1226927 -2337597 2392362
43142 2392362 8095537 7415508 2338149 -1173907 -2474369 -4568249 -7233149 -7742136
43134 -7742136 -5975629 -3837679 -1620921 968997 2461321 1878973 644599 -845697
43126 -845697 -4650355 -9699895 -9797030 -2392132 5486705 6443020 3401353 3695852 6575218
43117 6575218 5668234 1356383 551030 4385076 6018136 2329894 -1196690 -81389
43109 -81389 2720105 3636809 4515062 7267415 8532553 4928047 -755369 -3597480 -3525693
43100 -3525693 -3819282 -5345961 -6472909 -6661500 -6362765 -4918547 -1900602 797850 1213370
43091 1213370 511282 1180537 2970055 3209306 637233 -3201615 -5988601 -6471020 -4827950
43082 -4827950 -2544590 -1336994 -1232293 -594169 1203814 2587637 2356265 1757186 2308811
43073 2308811 2982294 1692217 -1222893 -3223202 -3101853 -2315368 -2382873 -2521721 -839845
43064 -839845 2833015 6354065 7632763 6837095 5497751 3831417 489810 -4470212
43056 -4470212 -8119747 -7899089 -5283094 -4096907 -5624303 -7514435 -7370917 -5190989
43048 -5190989 -2143929 708441 2002329 737245 -1820401 -3030007 -2480415 -2346418
43040 -2346418 -3107395 -1815881 3125251 7953096 7659446 2926980 -536420 522170
43032 522170 3409867 4233969 2948725 1662818 348827 -2546776 -5987543 -6308693 -2325422
43023 -2325422 2127727 2722773 4607 -2119886 -2096245 -1926646 -2890867 -3458989 -2557137
43014 -2557137 -1907849 -3086876 -4429797 -3163410 855759 5476589 8748526 9136776
43006 9136776 5317750 -1361403 -5944473 -4995738 -1719330 -2166204 -6821479 -10158239
42998 -10158239 -8751368 -5143677 -2193684 1657620 8212051 14173900 14491588 9598466
42990 9598466 5049491 3884701 3081307 -1047932 -6813825 -9171039 -6663743 -3324537
42982 -3324537 -2860413 -3518683 -1228083 3513600 5561912 2423871 -2079740 -3430474
42974 -3430474 -2438252 -2653973 -4516363 -6005448 -7091741 -8888882 -9546891 -6088995 -89804
42965 -89804 3681163 4611652 6720463 10825523 12437847 9835511 7899675 9869487 11097102
42956 11097102 6593727 -41034 -2145546 -1009010 -3308956 -8980684 -10311566 -4352968
42948 -4352968 1743428 1243468 -2701090 -2950395 829290 3031200 1413057 -256613
42940 -256613 1251696 4145960 5010156 3496318 1803685 1381118 1992107 3147111 4779750
42931 4779750 6494468 7275758 6509254 4951812 4189635 5018861 6602771 7437840 7017522
42922 7017522 6300632 6628085 8400868 10626769 11399778 9145297 4270424 -272741 -1110971
42913 -1110971 1984229 5192409 4406431 -211715 -4614765 -5959995 -5705105 -6554744 -7898838
42904 -7898838 -6676904 -2378390 1623264 2583668 1745757 1586241 1973680 1570452 1382980
42895 1382980 3614923 7552836 9953876 9750552 9077659 8810305 6560361 1108909 -4055149
42886 -4055149 -4591420 -1155103 1478159 462442 -2464871 -4253573 -4210143 -3775173 -4030102
42877 -4030102 -4352948 -3429601 -1402680 -466544 -2336790 -5437518 -6388571 -4486387 -2432644
42868 -2432644 -1925796 -1376923 443030 1656520 864890 458939 2570077 4322055 2048455
42859 2048455 -1565290 -616447 4194853 5725371 1728565 -1057385 2297160 6483782
42851 6483782 3999299 -3084752 -6270264 -2924664 1609253 3144644 2878651 2058147
42843 2058147 -790459 -5216819 -7185900 -5049558 -2579312 -2958862 -3979468 -2683977
42835 -2683977 -766641 -1084054 -2217744 -1448480 -435021 -2312738 -4849251 -2670048
42827 -2670048 3938043 8410446 6956728 2818419 94428 -1336801 -2489730 -2056527
42819 -2056527 43092 190660 -3710698 -7780603 -7261601 -3627095 -2097739 -3714027
42811 -3714027 -4480547 -1785406 2455480 5077705 4688689 1398174 -3325539 -6397427
42803 -6397427 -5596940 -2544946 -779923 -1126508 -1713245 -2194189 -4459386 -8643500 -11748222
42794 -11748222 -11547398 -9502749 -8618160 -10073253 -12566572 -13462578 -10562175 -4433485
42786 -4433485 1321147 3817007 3864157 3118480 501787 -4552005 -7343728 -2499575 6852339
42777 6852339 11092564 6788030 1011964 491949 2834838 2523269 -223504 -1967848
42769 -1967848 -2811641 -4530143 -5184078 -1865727 3104302 4587291 2108818 -341650
42761 -341650 -1048953 -1849459 -3098814 -2519328 505050 3691689 5256568 5022062 2505750
42752 2505750 -2249141 -6366778 -6700727 -4347716 -2676176 -1764542 492721 2733465
42744 2733465 1521887 -1692402 -1612758 1817479 2218675 -2964958 -7752820 -6899891 -3680165
42735 -3680165 -3378187 -4229287 -1150206 4830555 7421257 4039563 -1531573 -5000006
42727 -5000006 -5545346 -4086145 -1548220 749425 1906477 2792975 4382361 5323423 3622025
42718 3622025 105701 -2353535 -2647728 -2152464 -2155983 -2782481 -3890170 -4894686 -4369577
42709 -4369577 -1891406 585953 1286245 1363747 2728994 4489200 4454772 3007233 2205050
42700 2205050 1986305 847024 -362646 688942 3212339 3651118 1184879 -1039164
42692 -1039164 -1083425 -718388 -1328413 -1182865 945683 2641788 1112399 -2490459 -4421589
42683 -4421589 -2589973 2114890 6997761 8691749 5299010 -835493 -4495171 -3469585
42675 -3469585 -952508 -385417 -732148 384608 1616992 22224 -3359814 -4632306
42667 -4632306 -3420228 -3563997 -6542185 -8487164 -6091676 -2213419 -2107100 -5596965
42659 -5596965 -6783838 -1993066 5060253 8064834 6386565 5479201 8685624 11821795
42651 11821795 8692782 354244 -5191022 -3115799 2247936 3709155 378073 -2846581
42643 -2846581 -2921104 -1584710 -1132874 -1480893 -2340473 -4605995 -7556063 -7529613 -2293056
42634 -2293056 4656798 6978707 2551282 -4283833 -7624284 -5597308 -869664 2826401
42626 2826401 3755274 2648477 1311783 936905 1348269 1630214 1353729 977823 1012635
42617 1012635 1155394 647758 -615745 -1750528 -1663805 200589 3709995 7738619 9913879
42608 9913879 8126602 3338410 -377967 -247943 1733680 1801768 -80135 -768708 363050
42599 363050 350183 -1663625 -2027022 1406932 4810292 3983969 1298640 1891136 5074591
42590 5074591 5738460 3612668 4125143 8624479 10698197 5903894 -579199 -1249100 2784680
42581 2784680 4096628 -112351 -5385856 -7551301 -7190951 -6070862 -4113477 -1364545
42573 -1364545 997942 3115691 6408239 9756853 9567221 5566421 2542483 3353032
42565 3353032 3953580 -393519 -6838609 -8211313 -3271628 1949538 3214240 2813305
42557 2813305 3643857 4056906 1970324 -391439 -479190 -863995 -5220868 -10820263 -11204601
42548 -11204601 -6027496 -1859996 -2048382 -2284319 800636 2964524 -485704 -5667095
42540 -5667095 -5038505 1232606 5821645 5154323 2752783 1482225 -231802 -2488508
42532 -2488508 -1244295 4608178 9260650 7922937 4203368 4247943 7231758 7772987 5238971
42523 5238971 3902897 4819356 4358696 1472453 96203 2265997 4249113 2664368
42515 2664368 243391 1556016 5560542 6470682 1365621 -6026998 -9449552 -6507203
42507 -6507203 -641238 2772542 2096838 551137 1131599 2151847 255097 -3451940
42499 -3451940 -4231419 -916411 1904689 509512 -2827316 -3749884 -1923415 -432430
42491 -432430 -1267490 -4070804 -7558387 -9715219 -8342601 -3889460 -15684 1065270
42483 1065270 1725871 4577748 7349564 6055764 1622047 -1252710 -1218727 -1554190 -4055111
42474 -4055111 -6257990 -5982931 -4529381 -3454701 -1658163 2009669 6002175 8341408
42466 8341408 9434444 10367830 10381209 8463013 5844683 4375506 3593414 1927174 -5258
42457 -5258 130586 2861243 6099420 7848325 7640554 5188253 -949 -6582382 -10796566
42448 -10796566 -9805442 -5111780 -1209540 -761625 -2188049 -2351821 -569020 1084099
42440 1084099 997518 162833 641254 2900536 5461080 6618551 5806706 3668533 1355236
42431 1355236 -591456 -2831335 -5887597 -8217425 -7362344 -3661914 -561887 246100
42423 246100 1444493 5353919 9111401 8367723 4007666 588130 -905007 -3418959
42415 -3418959 -7043708 -7921787 -5422029 -4326028 -6829344 -7858399 -2627416 5636518
42407 5636518 10410478 10651437 9554034 7633118 3228247 -1796053 -3252240 -1459066
42399 -1459066 -1386247 -5353754 -10141349 -12046587 -10775841 -7698082 -4021705 -1365375
42391 -1365375 -785486 -871200 202371 1274710 397601 -723658 829226 3344696 2848771
42382 2848771 730149 2029798 5649476 4313580 -3345160 -8792669 -5822162 675077
42374 675077 3416426 3219380 4293472 5351177 3353307 1335140 3964616 8668596
42366 8668596 9673183 8132535 9247305 11317499 7640171 -990228 -5799451 -3383369
42358 -3383369 128530 606530 1862128 6103447 7904760 3677766 -918045 -199826
42350 -199826 1641657 -2029330 -8368635 -9668999 -6344816 -5604933 -8563341 -8435286 -2626670
42341 -2626670 2237751 527106 -4165129 -5213040 -2183984 746962 1960652 3104965
42333 3104965 4491386 4142787 1162320 -2874421 -5860546 -6537685 -4421513 -436912
42325 -436912 2551071 1850592 -2086643 -6214876 -8471385 -9233275 -9093005 -7391071 -4230725
42316 -4230725 -2084409 -3084565 -5518601 -5593531 -2722428 -364520 -809344 -1949380 -1025552
42307 -1025552 1089127 2167566 2942443 5176404 6662482 3079619 -4558497 -8959754
42299 -8959754 -5131561 3540552 9949140 10906876 7879293 3451526 418818 1710035
42291 1710035 7075915 11301365 9666994 4319271 1372647 2345565 2842862 -49586
42283 -49586 -3779886 -5365996 -6132677 -8368009 -10338540 -8612424 -3927383 -669563 -439284
42274 -439284 111361 3642120 7505839 7477600 4066151 1432878 615722 -1839566 -7206509
42265 -7206509 -10835229 -8475194 -3240196 -1536059 -3639417 -3815364 176752 3540327
42257 3540327 2303072 -561897 -362836 1979463 2156599 -480166 -2453765 -1549559 989555
42248 989555 3068445 3688597 2898727 2136728 3704014 7651326 10306820 8242627 2663869
42239 2663869 -2229153 -3893458 -2478456 808971 3858784 4238277 2461550 2554673 6318742
42230 6318742 9526647 7499079 1849707 -2640310 -5115548 -7341760 -7936422 -4463513
42222 -4463513 344395 1631961 899668 3760694 9255151 9933075 4070673 -1006345
42214 -1006345 -874131 -612182 -4721963 -8577742 -6554938 -2088814 -1832615 -4427228 -3185960
42205 -3185960 2767840 7608164 7640179 4448512 153825 -4392922 -7079475 -5713871
42197 -5713871 -1857958 895540 1969560 3008617 3413919 1736921 408130 3181499
42189 3181499 7985309 8319455 2613517 -3426386 -5140268 -4179866 -3642481 -3270782 -2219033
42180 -2219033 -1892427 -2688766 -1832177 1894129 4518660 2043866 -3006805 -4271919 395282
42171 395282 7098774 11455787 12668946 12001998 10149856 7309233 4413734 3073767
42163 3073767 4167936 6512517 7418224 5602207 3263369 3479045 5404306 4572627 -837541
42154 -837541 -6510668 -6930483 -2056068 3338651 5595942 4666112 1704474 -2262168 -4960555
42145 -4960555 -3612401 1234315 4919908 3811229 -151858 -2080913 -402583 1720147
42137 1720147 1010297 -2089419 -4764697 -5210242 -3652951 -1365938 67232 -539387 -2626736
42128 -2626736 -3868633 -2804732 -935258 -780630 -2452272 -3967653 -4576378 -5428937 -6689791
42119 -6689791 -6534124 -4097356 -1217119 252535 930982 1935419 2229097 332555 -2503514
42110 -2503514 -3462735 -2030804 -285811 528372 1341071 2888252 4208897 4202826 2928857
42101 2928857 682569 -2469130 -5330946 -5506537 -2183519 2146227 4324505 4132464
42093 4132464 3633451 3509584 2331221 -53947 -789932 2306016 6593547 6994589 2860984
42084 2860984 -298225 2277812 7936571 9608384 4780667 -1523436 -3362946 -924671
42076 -924671 713961 -1619928 -5738318 -7407627 -5599194 -3260523 -2870313 -2691678 626476
42067 626476 6106557 8326038 4798105 238871 294687 3698271 5111447 3828272 3930814
42058 3930814 6327877 6999014 4256980 1654346 1608670 2040722 2049124 4735769 10432271
42049 10432271 13142034 9102339 3741796 3908855 7531440 7929242 4841979 3420076
42041 3420076 4570195 4438931 2550139 2494874 4379654 4042002 503795 -2859149 -5431566
42032 -5431566 -10214911 -15925963 -15897604 -8030359 804900 3943164 2634265 1006541
42024 1006541 -647702 -3011018 -3559165 -616112 2452717 2186248 683726 1454638 3006986
42015 3006986 1845340 -947876 -1666238 -547985 -1029921 -3696805 -5869070 -6297856 -5862511
42006 -5862511 -4645663 -2668215 -2304226 -5182333 -7692127 -4890771 1430865 4136590
41998 4136590 729843 -3512668 -3681531 -1144222 912256 2777121 5554740 7109493
41990 7109493 4867558 405489 -2471705 -2731999 -2010349 -943984 923664 2362587
41982 2362587 1099749 -2604530 -5862417 -6939012 -6621990 -5685749 -3908491 -2222760
41974 -2222760 -2613368 -4430111 -4031344 -415218 1964890 -472967 -3970923 -2182973
41966 -2182973 4007477 7247809 4587782 1463168 2743634 5672915 5536834 3389177
41958 3389177 3034612 4016756 3332928 1578643 1428164 1721892 -721251 -4326613 -4193317
41949 -4193317 -159165 2952945 3495964 4674550 7021476 6470955 2346157 94852
41941 94852 2364215 4016063 693205 -3845066 -4565235 -3693691 -5699613 -8454033 -7110713
41932 -7110713 -3463015 -3148678 -5469122 -4593728 -386029 838615 -2368010 -3209354 1991418
41923 1991418 6642809 3497673 -4028777 -6490044 -1370033 4682086 5483631 1755093
41915 1755093 -2440481 -5054914 -6049331 -5257821 -2884162 -652159 -83436 -159692 1182600
41906 1182600 3329227 3248520 386621 -1329470 1239231 5185941 5203766 1633984 378193
41897 378193 4024011 7756022 6673334 3166480 2918912 6086284 7349289 4277487
41889 4277487 1168390 3158425 9265082 13296650 10870607 4159271 -766671 -915434
41881 -915434 589026 -671349 -4363142 -6907388 -7684923 -9281953 -11386843 -9699297
41873 -9699297 -2902322 4109449 6807698 6350116 5138439 1994489 -3728777 -7801736
41865 -7801736 -6571587 -3198907 -2537394 -3079622 -551601 3466907 4133828 2511814 3813843
41856 3813843 7353567 7032448 2332269 -129455 2030632 2721333 -2102111 -7569777
41848 -7569777 -8017102 -5124408 -2930398 -801887 2964487 5638591 4249345 1348851
41840 1348851 672645 388896 -3243820 -8160937 -8881306 -5163694 -2110265 -2095334 -2350816
41831 -2350816 -1013394 -253636 -1796263 -3468942 -2485002 338157 1623351 -531344
41823 -531344 -4694179 -7670742 -7640261 -6059879 -5907540 -7663935 -8460171 -6230504 -2933417
41814 -2933417 -1772663 -2647995 -2742263 -912834 811978 101238 -2912270 -5790063 -5848833
41805 -5848833 -2538347 1505010 2592233 -117490 -3848467 -5820286 -5995096 -5430768
41797 -5430768 -4023802 -1583708 477608 499429 -1259857 -3165094 -4070306 -3830320 -3122440
41788 -3122440 -3234575 -4454898 -4618134 -1722043 1972494 2054190 -1176987 -2477541 42576
41779 42576 1568325 -1351115 -4617842 -3137902 1043340 2913046 2944071 4701830 6933601
41770 6933601 5473366 1274139 -1157993 -2342368 -6545148 -11905159 -10934353 -2894527
41762 -2894527 3170871 1512693 -2292866 -1383019 1750652 1238871 -1615625 -1605806 619108
41753 619108 241496 -2406522 -2045246 2586885 6905418 7850515 6893826 5222642 2158550
41744 2158550 -356895 2114549 9337439 14616122 13414128 9400811 8296972 9459757
41736 9459757 7984816 2744665 -2200299 -3280326 -897758 2326447 3942975 2793844
41728 2793844 271862 -119065 3086957 6390557 5428350 1471388 422644 4970465
41720 4970465 11058183 13331905 11184036 7567572 4207234 661429 -2810127 -4033805
41712 -4033805 -1339053 3673690 6691385 4790767 122655 -1901531 728785 3486759
41704 3486759 1267665 -4027799 -5738574 -1865990 2402411 2563215 361384 -800853
41696 -800853 -1410165 -3246902 -5059550 -5069542 -4790399 -5911540 -6062354 -2575967 1847080
41687 1847080 2658755 793965 579379 1762067 322633 -3351501 -4456589 -2470664
41679 -2470664 -2184166 -4399066 -3678932 1440304 4141574 300727 -3676559 -802060
41671 -802060 4868652 4757233 -481852 -2794109 -40377 1688724 -1080864 -4485757
41663 -4485757 -4922732 -4139364 -4319337 -4066829 -2149140 -411566 -154837 310931 1915714
41654 1915714 2466062 725360 -702251 398650 1727381 -212834 -4873155 -8638622
41646 -8638622 -9237302 -6711608 -2043004 2415260 3069499 -964773 -5115711 -3902924
41638 -3902924 2084539 6721483 5884658 1601860 -1849794 -3096729 -3242138 -2360086 805216
41629 805216 5636576 8407494 5960188 179710 -2984941 96096 6395716 9714925
41621 9714925 7875897 4402159 2920925 2516461 396066 -2779980 -3387601 -620648
41613 -620648 1355502 -1109836 -5464081 -5734090 -756025 3634383 2243704 -2259657
41605 -2259657 -2878385 2178240 7312818 7261094 3236118 -333748 -1867145 -2486378 -2128165
41596 -2128165 402244 4085536 5786480 4353542 2428982 3246974 6690138 9077815
41588 9077815 6703838 3122 -5869540 -6039751 -1651824 1625369 1213258 238966 1107138
41579 1107138 1128445 -1781308 -3483159 565005 6945778 8530181 5348579 3833751
41571 3833751 5839977 6554163 4275612 3693910 6510304 6995982 1613079 -4076616 -3933655
41562 -3933655 -572417 372863 -57152 2202783 5106582 3604381 -549971 -884499 2728246
41553 2728246 3652228 -377746 -3904652 -3231022 -1573004 -1963651 -2051787 207303 1810120
41544 1810120 199916 -1628289 -421497 1332462 52903 -1957035 -159895 4105362
41536 4105362 5389692 2691731 114847 -660169 -2372108 -5746739 -6936446 -3753261
41528 -3753261 216324 720225 -1455899 -2868927 -2501746 -1267310 1007414 4384953
41520 4384953 6304593 4219873 95213 -1409395 697634 2505351 866043 -2708346
41512 -2708346 -4801866 -4180149 -1927923 259727 625642 -1749834 -5121783 -5964086 -3163536
41503 -3163536 425010 2086940 2813615 4706617 6922796 7107934 5408750 3813346
41495 3813346 2448634 110627 -1932693 -765442 2821941 3805097 -289812 -5239705
41487 -5239705 -5365951 -766773 3359350 3204148 -405354 -4373338 -6397551 -5772853 -3244949
41478 -3244949 -629000 488694 7713 -1080866 -1904882 -1982618 -1034408 516363 1330897
41469 1330897 393604 -1732343 -3468426 -3752605 -2712515 -1388400 -1019417 -1800622 -2196564
41460 -2196564 -644615 1904679 2840564 1762100 1252353 2535298 2897083 -34622 -3466599
41451 -3466599 -2678606 1392109 1952942 -4705815 -13193816 -14904637 -8715178 -2613223
41443 -2613223 -3936846 -10552882 -14112505 -10852993 -5515257 -3572336 -3577105 -987727 3054073
41434 3054073 2644676 -3146552 -7699993 -6558292 -4228327 -6758389 -11618852 -11012842
41426 -11012842 -3457532 4077601 5770366 3395336 1830148 2479102 3549629 4025345
41418 4025345 4670573 6049773 7197679 6344250 2984580 -674278 -1596008 -51703 173966
41409 173966 -2613495 -4860008 -3105201 310906 1115705 166603 1041412 2358396 -451364
41400 -451364 -5920818 -6895149 -1739168 2545840 1542091 137808 3245877 6928297
41392 6928297 5484598 1746744 2381150 6710562 8474856 6469526 5127391 5478795
41384 5478795 3852727 -4262 -1522770 303392 489905 -3375241 -6868614 -6351037
41376 -6351037 -4540752 -4220379 -2216520 4662285 12111134 13270826 8531255 3907190
41368 3907190 1099219 -3935034 -12071156 -17324198 -14819620 -7698034 -2432114 -400164
41360 -400164 1813024 5431157 7341271 5397156 2174184 1391180 2760844 2947181 641990
41351 641990 -2067390 -3383725 -4024875 -4755306 -4333122 -1960177 214933 -305193 -2522592
41342 -2522592 -3513548 -2940766 -2780023 -2952391 -1022730 3027817 5389600 3493011 -475647
41333 -475647 -3142180 -4380792 -5687513 -6324612 -4283148 -178455 2667779 2063827 -979567
41324 -979567 -3966097 -5277449 -4853340 -3569411 -2103552 -372141 1324824 1151803 -2233591
41315 -2233591 -6400520 -6725332 -2356647 2297057 3688118 3482424 4230580 4207559 816931
41306 816931 -3357632 -3179486 1261009 4655465 4329567 3029858 2938794 1954419 -1740578
41297 -1740578 -5492424 -5727683 -3083899 -1057791 -1187784 -1942617 -1188805 1962689 6481192
41288 6481192 9219785 7047689 764378 -4698320 -5660003 -3837585 -3499554 -5992785
41280 -5992785 -8947664 -9660939 -7414552 -3474552 -442417 -521233 -2866616 -3912301 -1893079
41271 -1893079 575044 377720 -1553735 -2450560 -2897581 -5954705 -11355333 -14515058 -12422147
41262 -12422147 -7463105 -3805166 -2314225 -918916 1618673 4282743 5397282 4163700
41254 4163700 1066190 -2117948 -3052859 -658956 3690716 7278106 8362026 7192581
41246 7192581 4930117 2017426 -1961662 -6566274 -9151142 -6619940 731210 8265864
41238 8265864 11341075 10043915 8139455 7827566 7633937 5647620 2380621 -924400
41230 -924400 -4777938 -9791717 -13388136 -11176168 -2767006 5701900 6985018 377031
41222 377031 -7722033 -10967535 -8895242 -4857013 -660750 3893791 7371171 6728101
41214 6728101 2161971 -1432467 -269498 3339577 4520558 2580194 976414 1625295
41206 1625295 2933061 3500459 4198170 5640521 6668213 6691752 6867004 7345986 5899107
41197 5899107 1424359 -3216911 -4392369 -2398720 -549138 -536405 -1157636 -1084542 -464038
41188 -464038 112925 68088 -1654798 -5246425 -7997245 -6103020 516065 7192455 9537804
41179 9537804 7928471 5785285 5020267 4998923 4999081 5553700 7192414 9114305 9549653
41170 9549653 7301119 3373283 1029346 2763820 6579321 7216703 2669220 -2458044
41162 -2458044 -2578898 1479825 4063955 2715573 442897 -203495 -754510 -2867289 -4809035
41153 -4809035 -4504080 -2881026 -1420466 672951 3802580 5357265 3330536 45572
41145 45572 -1530557 -2615145 -5321851 -7141542 -4376159 578676 1715816 -1394456
41137 -1394456 -3328538 -1792052 -145505 -184696 443861 1888335 650456 -2547391 -1012189
41128 -1012189 7377805 14851646 14417376 9521239 6856281 5617093 1560115 -3193960
41120 -3193960 -3186515 604130 2494307 1587946 1508847 2423542 1631155 814417 3942849
41111 3942849 8499712 7988763 3521182 3185583 8203897 9786629 3400390 -3377534
41103 -3377534 -2733511 1838517 2568004 -563863 -2289323 -1875297 -2796987 -5122608 -5112364
41094 -5112364 -1625418 2291037 4003639 3830552 3334362 3580779 4411697 4118444 1489420
41085 1489420 -1199587 -343079 3045270 3850461 787557 -1457921 -540430 -868955 -5411896
41076 -5411896 -8909931 -5446526 1572971 4039146 1058646 -771107 2131979 5972643
41068 5972643 5915863 1803150 -3051537 -5340907 -3975758 -1150747 -287768 -1381150 -1010633
41059 -1010633 1234886 789617 -4040997 -7335563 -3900402 2215505 3913154 1755513
41051 1755513 1227857 2634046 1878560 -895004 -1822924 -1006085 -1273673 -586839 5018098
41042 5018098 11366047 9354665 -290670 -5609658 82688 9508440 13300995 11895569
41034 11895569 10350151 8979660 5549424 1195406 -1858906 -4307843 -6717105 -6680579
41026 -6680579 -3340989 -439804 -707831 -1666083 -1026852 -1178237 -3536173 -3745412 1459768
41017 1459768 7135022 6698409 2299126 1525806 5788992 8882200 6413362 663336
41009 663336 -3996266 -5636262 -4521537 -2224887 -1058530 -1639481 -1981491 -1390188 -2823699
41000 -2823699 -7865397 -12040057 -9878659 -2853409 2585903 3569356 2558516 1651578
40992 1651578 374634 -1012526 -864694 668530 1671184 1858142 2412687 2685900 929039
40983 929039 -1698515 -1812507 1003260 3174156 2014523 -1172393 -3338959 -2802783 -226853
40974 -226853 1592919 -137959 -4329699 -6201170 -3913708 -2117690 -4949179 -8679741
40966 -8679741 -7062258 -1562314 876660 -773701 -513593 3552488 5183849 317324
40958 317324 -5489734 -4708105 1735549 6444231 5081604 40264 -3498245 -2359343
40950 -2359343 2270920 5686057 4551291 1328156 935856 3056602 2363437 -2613496
40942 -2613496 -6324446 -4480324 -372578 738350 -830665 -1475089 -525423 312653 925037
40933 925037 1859728 1805900 102768 -582191 1679535 3650075 1306625 -3227116 -4360748
40924 -4360748 -1595160 46971 -1840971 -3754305 -2348102 590299 1287454 -915272
40916 -915272 -3621754 -4675456 -3923659 -2819328 -2961384 -4242369 -4664580 -3018927 -839200
40907 -839200 -2885 526270 3110480 7260453 9879427 9721754 8946903 9649306 10982023
40898 10982023 10530110 7158709 2113738 -1733165 -2089973 107363 1030037 -1498336
40890 -1498336 -4801214 -4714136 -1134601 2249233 2945230 1608458 -364284 -2073464 -2099123
40881 -2099123 578249 4212681 5485630 3361389 -504604 -4684186 -8316806 -9249713
40873 -9249713 -5907567 -1060001 685666 -317484 683318 4415555 5433251 1057071
40865 1057071 -3185423 -1417583 3908605 6484326 5661157 5394621 6079778 4220943 -276811
40856 -276811 -2869936 -1360457 1178383 1835591 1531761 1575030 971534 -515551 -493073
40847 -493073 2063168 4099014 2827743 243935 61750 2118436 3308115 2847879 2933505
40838 2933505 4319871 4651986 2166545 -1319388 -2513930 -475257 2809602 4951472
40830 4951472 5237534 4357040 2999644 1461250 454387 1012103 2531273 1957902 -2943432
40821 -2943432 -9628758 -12599429 -9959662 -5627953 -3575276 -2599853 452717 4468296
40813 4468296 5088857 1465102 -2066684 -2091272 -625840 -1581569 -4957512 -6967344 -4986918
40804 -4986918 -321397 3773543 5340088 4811162 3910881 4039213 5441959 7396985 8729151
40795 8729151 8207894 5330179 1362954 -1117759 -720482 1237789 2730926 3844262
40787 3844262 6000497 8732299 9241158 5689856 -451377 -5794763 -7707423 -5599085
40779 -5599085 -1011318 3273673 5397777 5768302 5309329 3426013 -99634 -2285332
40771 -2285332 238823 5398697 6814793 2177971 -3513624 -5242366 -4403092 -4674469
40763 -4674469 -5290068 -3156164 799464 2642096 1726591 1088153 1902565 2194210 1203432
40754 1203432 543025 371184 -1288704 -4378559 -6046421 -5352228 -4695625 -4927187 -3266259
40745 -3266259 1387139 4940275 3345525 -1441298 -4261510 -3512918 -1770498 -1210468
40737 -1210468 -1775008 -3010481 -4629268 -5457368 -4221355 -1435468 925349 1206814 -1234890
40728 -1234890 -5540783 -8413565 -6139590 173634 3763745 -152817 -7646632 -10558835
40720 -10558835 -6466915 -316158 3026540 3436050 2688025 1488072 618274 1310244 2739376
40711 2739376 2089486 -1299205 -4533638 -5397097 -5198127 -5611634 -5402464 -2682777 1616693
40702 1616693 4952582 6405758 6754967 6769428 7204269 8882368 10938508 10716582 7401388
40693 7401388 3881859 2817308 3047275 2664934 3128219 6269847 9209826 7486710 2578074
40684 2578074 589839 2812878 3455927 -1156952 -6784020 -8118397 -6434501 -5710538
40676 -5710538 -5270522 -2214101 1550171 1387731 -1954884 -2987397 -509725 588231
40668 588231 -1912062 -3542546 -997656 1956264 1049226 -809305 1777847 7470390
40660 7470390 9932423 7326126 4022102 3090706 2791638 1353146 55261 -240214 -1375876
40651 -1375876 -4450958 -7277444 -7338206 -4753813 -852393 3461482 6476188 5861775 2077379
40642 2077379 -1015703 -878839 804011 1629495 2044096 3398434 5340880 7397709 10089526
40633 10089526 11997375 9347088 2027802 -3556771 -2291064 1933308 1673892 -3186932
40625 -3186932 -6232283 -4915081 -3293681 -4048732 -4549047 -2715298 -826885 -773922 -600084
40616 -600084 1192478 2484860 2078141 3107007 7787041 12244007 11306911 6221110 2996268
40607 2996268 4298631 7015927 7163502 3740028 -1683904 -6060197 -6216067 -2266176
40599 -2266176 926985 -1062364 -6085053 -7990717 -5108173 -2027825 -2135540 -2732061
40591 -2732061 -54481 4278277 5605899 3360698 1761582 3117386 4078976 682976
40583 682976 -5065652 -6850379 -2092642 4634031 7362146 5376840 2137941 -71731
40575 -71731 -1164099 -491110 2560496 5307415 3598264 -2054913 -6362088 -6670268 -5905071
40566 -5905071 -5986329 -3709306 2684529 7783447 5892097 276993 -1313362 1624605
40558 1624605 2543127 -742041 -2708259 267985 4259546 4922737 4133650 5276367 6768075
40549 6768075 5152933 1303258 -1214366 -1713315 -2049264 -2441356 -1716026 -555044 -669804
40540 -669804 -1389859 -516763 1774369 2999050 2172075 696572 -565691 -2352606 -4641632
40531 -4641632 -5571700 -3768114 -521844 1160314 -452793 -3540852 -3752562 904180
40523 904180 6174102 5483715 -1024641 -5048616 -689293 6920624 8160865 1880266
40515 1880266 -3806620 -3081520 1045779 2829472 1181531 -1354250 -3007339 -3430427
40507 -3430427 -2811557 -2737596 -5554653 -10717549 -13947885 -12071464 -6794512 -2017560 421667
40498 421667 653021 -973191 -3195298 -3630611 -1758357 -153676 -357828 191968 4082859
40489 4082859 8862638 9749881 6105168 1501854 -1757758 -4375892 -6770081 -8019803
40481 -8019803 -8406171 -9479775 -11023460 -11057156 -9280433 -7365385 -5523202 -2305567 1669256
40472 1669256 3724136 3733680 4335502 5115901 1820777 -5616950 -9591690 -4502289 4077214
40463 4077214 6310466 1836700 -578084 3344123 7722975 6525123 2498447 1766232
40455 1766232 4130691 4223527 249237 -3577936 -3332675 -250007 1755293 1003775 -908833
40446 -908833 -1900579 -2027549 -3065718 -5580928 -7219606 -5250127 -547196 3089355 4077398
40437 4077398 4865936 7138041 8086667 4400745 -2127909 -6699215 -8031037 -8651269 -9026936
40428 -9026936 -6207860 267529 5336577 4030913 -2500549 -8956555 -11545839 -9462948
40420 -9462948 -3455493 3719630 7290870 4764736 -434260 -2777303 -1381244 241840
40412 241840 255404 182725 618121 -110202 -1860537 -1690007 1050752 2787191 1634122
40403 1634122 1250191 4935734 9227094 8282301 2533378 -2343092 -3999265 -5300387
40395 -5300387 -7531820 -7589201 -3793689 456964 1669998 1068434 1459673 2564575 2687246
40386 2687246 2253675 2202500 1189543 -1847043 -4262351 -3025208 -216457 -731262 -4807045
40377 -4807045 -7241435 -4626990 574360 4209821 5094362 4090528 1883419 -312016
40369 -312016 -449727 1790886 4051252 4611874 4775927 6290237 8333889 8958192 7832005
40360 7832005 5699753 2737165 -652745 -2998024 -3671384 -4031921 -4655974 -3422850 903134
40351 903134 5031358 4711758 1004359 -846655 1321476 4191777 4311094 2159419 -275132
40342 -275132 -2498590 -4132541 -3485300 -150823 2948258 2861606 728227 -22914 1187615
40333 1187615 1470127 -1066006 -4786766 -7148304 -7682115 -7140068 -5400365 -2155655 1198560
40324 1198560 2676168 2861414 4688515 8954145 12126644 10807113 6890907 5134691
40316 5134691 6091813 5433483 1290737 -2018075 -579879 2245729 182309 -6335469
40308 -6335469 -9967130 -6186491 1241094 5854455 5854208 3779725 1802833 221879 -798386
40299 -798386 -596068 1003123 3356371 5517186 6598580 6163449 4516736 2080155 -1174782
40290 -1174782 -4718253 -6744714 -6234089 -4845709 -4303569 -2862988 1995981 7737636
40282 7737636 8421787 3305045 -1200249 -631787 1369447 -59876 -2434567 -60182
40274 -60182 5851948 7924326 3381470 -1916305 -1881583 1933739 3439959 -14041 -5440544
40265 -5440544 -8430995 -7429756 -4399991 -2597205 -3631603 -6272457 -8051945 -7577465
40257 -7577465 -5037017 -1609409 642043 -412694 -4597660 -8699245 -9665590 -7718154
40249 -7718154 -4886899 -1901065 1260426 3015622 1361221 -2874591 -6545139 -7952284
40241 -7952284 -7963655 -7641431 -7028806 -6081998 -4526456 -1044020 4927718 10684708 12132376
40232 12132376 8514346 3229046 -72553 -267527 1801839 4123070 4096466 1048262
40224 1048262 -2030755 -1924274 120639 294568 -1660233 -2120429 396958 2903815 2593928
40215 2593928 250608 -2050090 -3290614 -2669432 61777 2441318 1184327 -2647239
40207 -2647239 -4225772 -1919599 597657 777466 994829 3439324 5846011 5669249 4560684
40198 4560684 5174640 7059387 9110935 12324405 16211782 16264346 9760869 1246420 -2475117
40189 -2475117 -453957 3487148 6964273 9214504 7990982 2362779 -3068321 -2844515
40181 -2844515 1305984 2891647 520930 -781839 1545354 3477784 907467 -4398928
40173 -4398928 -7367480 -5048304 1458384 7795592 9165173 5326665 1925122 3344918
40165 3344918 6003205 3733401 -1949592 -3775367 -345080 2082811 587708 -7023
40157 -7023 3127645 4781147 666637 -4286955 -3229135 1934913 4269736 2881431 2908296
40148 2908296 6025107 8030124 6146667 2861071 1226076 838533 104068 -820370 -1020092
40139 -1020092 -601007 -258769 -400750 -1087954 -1648983 -558864 2771913 6287662 7012501
40130 7012501 4604030 1934191 2001373 5022440 8352651 8746467 5340867 932839 -635044
40121 -635044 1125333 2830073 1687158 -1223000 -3105572 -3038922 -1980387 -835842 -86375
40112 -86375 112806 857643 3820750 8104143 9734672 6434133 1255432 -874608 1032356
40103 1032356 3900303 5059004 4453693 3207981 2200728 1732786 1265523 228843 -279869
40094 -279869 1449426 4126688 4010145 934402 15678 4008618 7717303 4928222 -2054406
40085 -2054406 -5869284 -5217712 -5482929 -8491857 -9208898 -4614620 860334 2292311 1317178
40076 1317178 2141907 4804991 6902710 8636053 11171903 12180210 8152985 501918
40068 501918 -5008732 -5023790 -1453271 2296508 4537004 4540768 2153778 -660310 -853802
40059 -853802 1473335 2292437 -887790 -4802006 -4427931 -147179 2337978 -344555 -4682525
40050 -4682525 -5207348 -1825894 741377 134356 -594047 1636684 4456284 2950410 -3023019
40041 -3023019 -7655961 -6074256 -233850 3479606 1472302 -3644403 -6585519 -5130169
40033 -5130169 -1816336 -489119 -2203720 -4997325 -6774840 -7014179 -5859104 -3363592
40025 -3363592 -271426 2010121 3095669 3862049 4216555 2568762 -1060007 -3516857
40017 -3516857 -2377383 368577 1144840 -206975 -1486464 -2969428 -6926423 -12226362
40009 -12226362 -13900734 -9797407 -4178340 -2337172 -4150218 -5440136 -3873648 -880589
40001 -880589 1231302 1605289 529335 -1339289 -3185292 -4370798 -4613028 -3658830 -1541090
39992 -1541090 526412 765988 -755893 -1447500 824230 4778809 7065782 6222750 4039683
39983 4039683 2953198 3233391 3330838 2337618 1106516 753030 948185 605887 -248141
39974 -248141 -679072 -812193 -1836534 -3671867 -4663564 -4403589 -4497256 -5200450 -4122349
39965 -4122349 -618999 1385276 -1501565 -6423741 -7831628 -5174604 -2492925 -1522646
39957 -1522646 -431678 1000606 661105 -846026 -105634 2850564 3823701 1792208 1087880
39948 1087880 3576699 4736060 1469100 -1843815 -242714 3607625 3987137 1223804
39940 1223804 41458 1529298 3053312 4283297 6941859 9516801 8364185 3965043
39932 3965043 632735 -58717 -418641 -1175576 -171309 2850094 5085365 5242078 4851746
39923 4851746 4326706 2184031 -1092605 -3020749 -3709581 -5620496 -7832483 -6023866
39915 -6023866 -3201 4199147 2479463 -2001145 -4563664 -5194365 -5402303 -3734254
39907 -3734254 707356 3862608 1159470 -5621572 -10381536 -10054096 -6230140 -1423022
39899 -1423022 2228267 2250992 -1752876 -5864319 -5885546 -2888966 -1271893 -2352320 -3696695
39890 -3696695 -3902703 -3963452 -4356475 -4809470 -6615603 -10909526 -14624813 -12756804 -5532105
39881 -5532105 899491 2238280 645291 115472 1103091 1887925 1986970 1720297 852756
39872 852756 -272079 -542766 -603579 -2723184 -6361836 -7316614 -3971867 -854352 -2135570
39863 -2135570 -4740973 -2980491 2091654 4013012 1118368 -1035967 1112972 3616234
39855 3616234 2074388 -831418 113573 3832543 4662968 1802935 884181 4906060 9056186
39846 9056186 7769985 2997857 998175 3133840 5016635 4417957 4521534 7391168
39838 7391168 9037502 5045732 -1901314 -5154920 -3512336 -2054541 -3177252 -2631262
39830 -2631262 2687072 8068613 7166310 1838210 -244766 2973868 5167237 1626815
39822 1626815 -3728438 -4681373 -1633298 369828 -428818 -1867076 -3660385 -7792999
39814 -7792999 -12620773 -12606339 -6627623 -1560570 -3305944 -7833505 -6581623 1107976
39806 1107976 7035344 5702377 798490 -1782834 -1815705 -1860503 -1101015 2309470 5206886
39797 5206886 2164716 -5641323 -10123241 -6665934 -217563 1682612 -1648510 -4843647
39789 -4843647 -4145983 -601604 3074074 5432079 6390695 6840337 7991462 9561895 9512517
39780 9512517 7159976 4947779 4890644 5187039 3602236 2412456 5380463 10397461 10419508
39771 10419508 2977763 -5774189 -8616116 -5276755 -745354 1184336 286727 -1460469
39763 -1460469 -1346544 1643882 4330112 2279331 -3298104 -5786537 -2714860 -110289
39755 -110289 -3235867 -7911646 -7036438 -1830401 822304 -183823 300054 3353728 3909280
39746 3909280 478026 -1251347 2175616 6000518 5068734 1835181 1443907 3263398
39738 3263398 2871035 -346584 -2722918 -1922928 973849 3811795 4747766 2758956 -711837
39729 -711837 -2434652 -1815571 -2016380 -4433723 -5699625 -3479998 -1278730 -2761208 -4796149
39720 -4796149 -2039778 3970802 6756957 4620966 1865432 788757 -647986 -2481702
39712 -2481702 -1095521 3727359 6195744 2467531 -3446713 -5449519 -3375631 -1510607
39704 -1510607 -1939930 -3199718 -3817982 -3883745 -4032979 -5198604 -8313047 -12396145 -14295815
39695 -14295815 -12265298 -8527013 -6392888 -6065921 -5274334 -3060148 -894416 -524766
39687 -524766 -2265663 -4941011 -6348834 -4616819 -493497 2431298 1318351 -2464053
39679 -2464053 -4750464 -3158716 889233 4390107 5556222 4204885 899904 -2951523
39671 -2951523 -4638474 -1644290 5275431 11572227 13160431 10695669 7688457 5075801
39663 5075801 1038919 -3511843 -3889333 1482198 7283470 8175271 5982240 5501935 6414388
39654 6414388 5152881 2378893 1747016 2485519 621647 -2652503 -1956106 1860816 1026529
39645 1026529 -6315310 -11162026 -6817832 466545 985220 -4092922 -5998859 -2271410
39637 -2271410 1156006 507198 -1038108 102497 2644931 3494767 2053738 -49361
39629 -49361 -1115318 -814358 -1137356 -4927265 -11371055 -14785765 -11080596 -3926344 -774527
39620 -774527 -3591488 -7271380 -6953979 -3367084 -460749 -453180 -2062829 -2459396 -906852
39611 -906852 -414030 -3911026 -8782937 -9025173 -4144086 -968096 -3530465 -6429284 -3284469
39602 -3284469 2870489 4300354 410641 -2485961 -1463649 342695 765263 1258986
39594 1258986 2177076 1686405 114925 -167208 304505 -1446479 -5183334 -7501227 -7475916
39585 -7475916 -6922736 -5562370 -2008538 1025560 -462933 -3854368 -2481652 3381777
39577 3381777 6349486 3924875 1815582 3064785 3237933 55798 -1541658 1028928
39569 1028928 2281607 -1329104 -4064250 -736679 3899413 3806600 2559059 6038584
39561 6038584 10226803 7214579 -461168 -2844855 1682725 4536922 1019608 -3692098
39553 -3692098 -4287641 -2228087 -172946 2955063 7644837 10296207 8017579 3172281
39545 3172281 -33285 -920191 -1951784 -4627223 -7210170 -6061773 188679 7161907
39537 7161907 7920774 1617703 -4428264 -4514893 -2271941 -3547367 -5874277 -2679676 4455277
39528 4455277 6676744 1067785 -5419499 -6791298 -5188354 -4817517 -5560295 -5799513 -5834298
39519 -5834298 -5272401 -2137765 2415937 3487446 -312175 -3759832 -2598001 315422
39511 315422 232399 -2192141 -3047629 -1375155 973404 3297015 6019571 8329170 8922463
39502 8922463 7894535 5939652 3324297 951291 70693 -196931 -2057178 -4705070
39494 -4705070 -4587442 -1429824 445118 -1123720 -2968872 -2961901 -4087243 -7979710 -9688141
39485 -9688141 -4623249 3312098 6740122 4877592 2380926 1002720 -525618 -297867
39477 -297867 5033982 12444308 14240306 9051432 4245593 5122322 7999629 7217405 3411720
39468 3411720 672053 -125608 -476941 113597 2810603 5562154 5079429 1996895 126757
39459 126757 666428 732716 -1710699 -4558708 -4576769 -1593823 1814335 3440773 2899292
39450 2899292 1060668 -545194 -545961 605194 412590 -2519961 -5576979 -4557066 834494
39441 834494 6350936 8715017 8867804 8211726 5148535 -1128790 -6150695 -4678210 1098607
39432 1098607 3270924 -1202103 -6787147 -7964626 -6408337 -6431162 -7636412 -6622902
39424 -6622902 -3374455 -1315461 -2109608 -4192612 -5843969 -6501349 -5570717 -3023272 -977695
39415 -977695 -1864067 -4862055 -6534568 -5302460 -3342785 -3612667 -6359409 -8948271 -8474952
39406 -8474952 -4661744 -397626 1306473 819019 853489 2113819 2526902 1222240 121898
39397 121898 472610 1076674 1225686 1565118 633120 -4357727 -10706295 -10317762 -1290799
39388 -1290799 6645901 4952191 -956974 -511925 4745433 3822110 -5209173 -11450940
39380 -11450940 -8071789 -1887378 -1409152 -4608091 -4784645 -1377227 1857784 3998375
39372 3998375 5682380 5001902 1086973 -1699679 560172 4290298 3279853 -1657424
39364 -1657424 -4271524 -2685687 -1161712 -2439842 -4450135 -5246632 -5675557 -5844409 -3845784
39355 -3845784 158682 2830287 2897284 3866998 8662570 14307205 15313124 11001782 6274221
39346 6274221 5282156 6991328 7748392 6139931 3606089 1385788 -691567 -2143670
39338 -2143670 -1150086 2478168 5711151 6021964 4957573 5020557 4761214 1335864 -3061393
39329 -3061393 -3043981 1068752 2485550 -1454186 -4139738 386618 7626177 8809084
39321 8809084 3359683 -1522287 -1918340 -1010905 -1879167 -2652897 -483159 3998595 7962037
39312 7962037 9323079 7609283 4351428 2731869 4287175 6245340 4909689 1077701
39304 1077701 -1140219 -259026 1519915 2712692 3884302 4635816 3632365 2050149
39296 2050149 2587742 4344580 3309577 -868192 -3377496 -1374240 1971772 2914310
39288 2914310 2193140 1773336 758250 -1787877 -3470511 -2027310 620096 1676395
39280 1676395 2234413 4428419 5964801 2448943 -5573597 -12385671 -14013444 -11700970
39272 -11700970 -8272365 -4607350 -741992 2303018 3322080 2284150 262541 -1155451
39264 -1155451 -596378 1866837 4538870 6024869 6489944 6154914 4216443 903525 -1277244
39255 -1277244 -822947 -66971 -1531097 -2799955 705964 7864420 11348872 6835060
39247 6835060 -770848 -3134346 1438152 6650676 6330445 1385147 -1943631 690176
39239 690176 7420318 12722969 12982182 8789882 2943250 -1683192 -2454375 1777852 8134483
39230 8134483 10859438 7463330 2077374 220640 1890359 2872937 1399949 -470441
39222 -470441 -1496156 -2828497 -4321882 -3527564 -158500 1905092 -478030 -5156772
39214 -5156772 -7389566 -5474903 -1698726 998505 1406831 -28788 -2045283 -3546182
39206 -3546182 -4361337 -4651631 -3911576 -1873326 101975 612218 810882 2716734 5138510
39197 5138510 4775767 1782204 204881 1696175 3034887 1742671 -324624 -1470106
39189 -1470106 -3284111 -5744499 -4546918 1406978 4924002 118416 -6834671 -5379706
39181 -5379706 3216423 7475428 3500293 76401 2989691 5289044 -178695 -7649057
39173 -7649057 -7222026 -780166 1380247 -2970865 -5424044 -983242 4909736 5976556
39165 5976556 3853357 3198319 4062969 3920953 3030769 2825808 1858156 -1706676 -5287824
39156 -5287824 -4525736 -255724 1850730 -500979 -2451430 1317354 8852669 12964281
39148 12964281 9973780 3486145 -893901 -1984682 -2444252 -3436641 -2831308 860021
39140 860021 5233621 6478294 3955646 526530 -1125800 -846434 -12791 95856 -1152826
39131 -1152826 -3374537 -5152311 -5542633 -5496289 -6467844 -7864393 -7588744 -5124685 -2303050
39122 -2303050 -872936 -1047950 -2347886 -3758080 -3317808 -438606 1424496 -1705637
39114 -1705637 -7379099 -8027477 -1423571 5192104 5282998 2418627 3724110 7982775 8211478
39105 8211478 4257088 3684124 9027243 12988945 9883152 4218608 2669916 3812281
39097 3812281 2371906 -1050837 -1953863 -721364 -1747121 -4919113 -5360991 -1917885
39089 -1917885 864928 328549 -1036605 -1571348 -3376931 -6501343 -6237131 -469573 5132769
39080 5132769 4349500 -635925 -2755100 -82142 3074867 3746324 3490879 3986917 4262248
39071 4262248 3440809 2655280 2840105 3046841 1880250 -1140381 -5664464 -9950732 -10738310
39062 -10738310 -6440747 -303382 2585846 1450415 -142614 -320241 -853945 -2105464
39054 -2105464 -568817 5726142 12600756 13889612 8453913 465991 -5591970 -7705771
39046 -7705771 -5849084 -1841911 941834 248951 -2729741 -5023810 -5014114 -2782663 887786
39037 887786 3948991 3340279 -1549783 -6870103 -8312766 -6087877 -3503235 -2069910
39029 -2069910 -1095445 -765294 -1724571 -2157594 663319 5840294 9725857 11464305 13364966
39020 13364966 15223799 13351737 7191253 1975962 1561786 2747365 723291 -3268976
39012 -3268976 -4499101 -2547099 -1243967 -1911925 -1936386 -179997 1092553 740429 788344
39003 788344 2133661 2088005 -1113008 -4240538 -2742170 2998957 7869212 7805259 3299718
38994 3299718 -2140217 -4982666 -3643536 378815 3311155 2788753 790238 1230462
38986 1230462 4565854 6798329 4542878 -727913 -4677052 -4944902 -2661323 -287487
38978 -287487 456190 -669876 -2057590 -1221561 2080345 4278844 1798722 -3801059 -7200008
38969 -7200008 -6174702 -4007563 -3920021 -4526503 -3304736 -1573241 -2295190 -4794039 -5809560
38960 -5809560 -4970026 -5025769 -6762446 -7884478 -7455105 -7224853 -7474997 -5917405 -2652332
38951 -2652332 -1875612 -5607920 -9434932 -8315736 -3778224 -1116612 -1555078 -1833536 -458158
38942 -458158 390087 -715470 -2162672 -2158382 -768979 1340210 3348134 3304329 -119869
38933 -119869 -4495142 -5552162 -3031155 -1327212 -3125408 -5654585 -4954517 -835141
38925 -835141 4484044 9817203 14419428 16266149 14108815 10003525 6993985 5160540
38917 5160540 2571629 -633019 -2078769 -1073025 107382 -330863 -1072327 231833
38909 231833 3562787 6466823 6790145 4538185 1330026 -1106398 -1813892 -841290 623850
38900 623850 703460 -1354091 -3440148 -2117136 2909533 7194625 6491097 2395648 290342
38891 290342 1856968 3073500 675879 -2877046 -3266561 -465786 2042691 2461808 1785122
38882 1785122 670146 -1318866 -3297164 -2979450 178192 3984812 6378059 7332403
38874 7332403 7260951 5593606 2176624 -1431347 -3422078 -3593220 -2756925 -1214247 1056253
38865 1056253 3305721 4317167 3783981 2661191 2024818 1963634 1780274 1198148 1040248
38856 1040248 2166641 3734621 3571168 1083243 -1149930 -183035 3303224 5642459
38848 5642459 5095644 4211342 6022194 9201657 9094574 3754147 -2742307 -4372833 -96361
38839 -96361 4902079 5480742 2538998 1068445 3237540 6251375 7413706 8060135 10415960
38830 10415960 13025065 12366996 7861963 2391209 -1524872 -3391992 -3207341 -1254320
38822 -1254320 753161 1285384 1647658 3816017 5810464 3498687 -2111905 -4220702
38814 -4220702 569895 6696669 7112612 3054992 1640183 5582417 10284339 10814486
38806 10814486 7331342 2885304 -549743 -2543436 -3240905 -3199253 -2705256 -906014 2835456
38797 2835456 6881706 8597726 7572387 5490196 3118942 58276 -2586219 -2475142
38789 -2475142 198380 2080723 993300 -1548457 -3212746 -3639709 -3016970 -539404
38781 -539404 3817952 8114037 10765392 12054339 11939567 9094375 4184090 1161080
38773 1161080 2289549 4383455 3523323 1288678 1968612 5118505 6043116 3518874 1783050
38764 1783050 3572479 5920399 5359036 3568763 4542443 8411870 11410440 10984045 8283757
38755 8283757 5931611 5307905 6021433 6673677 6000301 3882442 1087796 -1971251 -5168235
38746 -5168235 -7139246 -5559607 -124732 6054550 9556637 10363180 11056524 12926893
38738 12926893 14456570 13627495 10470836 7001656 5281467 5736687 7053937 7661233
38730 7661233 7308630 6974420 7482728 8970540 11568716 15348201 19131087 20489097 17860268
38721 17860268 12309165 6848199 4364910 5867675 9557734 11654027 9710947 5581201
38713 5581201 3676626 5855106 9588789 11620180 11414384 10142463 8586013 7705570
38705 7705570 9184415 13091302 16448031 16551501 14710258 14228369 15471973 15772514 14160045
38696 14160045 13231223 15182372 18149621 18458680 15813123 14296418 17344273 22740290
38688 22740290 24624600 21026265 16964355 17703304 21096121 20972235 17223522 16506364
38680 16506364 21452715 25624602 23238549 18324358 18242968 22267394 23951430 22459966
38672 22459966 23353748 28272439 31829075 30570776 28142251 28723306 31141128 32733834
38664 32733834 33971937 35693979 36284728 35465853 36911024 42977050 50237045 54398070
38656 54398070 56536400 60098403 64675049 67745206 70291759 75214452 81518202 85663685
38648 85663685 88264521 93917736 103850310 113962454 121598219 129508423 140844293 154317105
38640 154317105 167326061 180643520 196331445 213115715 227985200 241859769 259603858
38633 259603858 283106379 307306188 325608858 337863743 350000316 365608845 380823519
38626 380823519 389191729 389222820 384229647 376204047 363866444 346916692 328092820 309415291
38618 309415291 289819441 268666090 248481473 231487883 216200166 200675025 186544138
38611 186544138 175845574 165999663 152884324 137899716 126580736 119922711 112624514
38604 112624514 101716965 91752209 87966233 88145416 85795127 79330907 73393304 71300705
38596 71300705 70481327 66795825 60358505 54700928 51612237 49335390 45868527 41940797
38588 41940797 39517706 38413530 36063096 30860065 24566992 20634255 20490425 22156981
38580 22156981 22750364 22121000 23227157 27937717 32986654 32488332 25570902 18953317
38572 18953317 19351043 25355496 30371118 31832922 32505650 33365017 31620313 27290425
38564 27290425 25284910 27554876 28879885 25010903 19922704 19331416 21372887 20537698
38556 20537698 17663116 18299582 22779828 25851719 25955920 27040095 30168781 30914297
38548 30914297 27286495 23325385 21845170 20034767 16011137 13856766 17431836 23835966
38540 23835966 27811228 28726288 28479911 26320280 21318810 17094266 17987958 22008236
38532 22008236 23269970 20720389 18863563 19704697 19543621 15332614 9605942 6557457
38524 6557457 6456369 6747842 6613170 7522931 9973282 12081956 11838948 9448036 6829550
38515 6829550 5503365 5716088 7282339 9980604 12597965 12994255 10651463 8283927
38507 8283927 8911056 11726156 13116323 11712633 9844773 9502970 9563867 8220187 5897597
38498 5897597 4327698 4465178 6398044 9494939 11687372 10668899 6938022 3656405
38490 3656405 2490983 1832886 173432 -1336970 -1089916 774104 3825522 8330429
38482 8330429 13134641 15304967 13668121 10091947 5987990 1123252 -2598917 -1132409
38474 -1132409 4765511 7577244 2741044 -3864642 -3661056 2943864 8741589 10566879
38466 10566879 10913730 10766353 8629206 6216544 7378905 10661373 10329174 6294108
38458 6294108 5621090 11421533 17180696 16129049 10378251 6030548 4111443 1795019
38450 1795019 -935271 -1757690 -1449314 -3510954 -8373421 -11805641 -9806510 -3067280
38442 -3067280 3609490 5348933 1418825 -3727851 -4759912 -1392675 1677576 1182585
38434 1182585 -916162 -1038443 1424823 4781223 7692009 9227084 8562477 6489386
38426 6489386 5073546 4316180 1819944 -2587387 -5142860 -3367194 289892 2758881
38418 2758881 4812702 7758426 9236360 6961336 3869955 4313131 7129973 8052580
38410 8052580 7513313 9779823 14585680 16152286 11846297 6009377 3087016 2205340
38402 2205340 1314096 1775984 4912174 7746670 6749727 3579840 2791336 5140231 7275978
38393 7275978 7531227 7842259 9163655 8676143 3890098 -2490098 -4719285 -1019455 3870595
38384 3870595 4483871 1548219 754325 4782121 9649549 10672611 9245693 10268610
38376 10268610 14284096 16414103 13366677 7619872 3375131 1625731 1046119 1068442
38368 1068442 1862830 3060103 4301860 5634092 6266020 4877470 2195695 879924
38360 879924 1694453 2659628 3261952 5606034 9145941 9025472 3766783 -20882 3352400
38351 3352400 8699436 6861269 -577570 -2900468 3057412 7965227 5106025 728254
38343 728254 2863533 7807015 6698373 427497 -2111141 1513235 4541168 3099257
38335 3099257 1627656 3644446 5229612 2184125 -2492887 -3491239 -1117076 923152
38327 923152 2315952 5140688 8086708 7304821 2678337 -1418083 -1941002 18579 2476703
38318 2476703 4722341 5439118 2566128 -2956693 -6218809 -3680131 2143050 5502722
38310 5502722 3837354 -450565 -3574713 -3662794 -1123818 1983549 2823798 77425 -4010274
38301 -4010274 -5625092 -4268496 -3701000 -6353839 -8717118 -5450442 2509872 7824203
38293 7824203 5872450 398157 -2386412 -2050413 -2393284 -4033614 -3934192 -1876023 -1651581
38284 -1651581 -4334610 -5642231 -2888963 -387 -1497430 -4985987 -4641212 -135301
38276 -135301 3118494 1961433 -1096217 -2668497 -2328089 -784523 1826215 4308757
38268 4308757 4274871 1455895 -1258685 -1692698 -1224302 -2264023 -4741989 -6678949 -6925443
38259 -6925443 -6088377 -5743554 -7352800 -10710185 -13154759 -11996009 -8056830 -4886059
38251 -4886059 -4108564 -3816739 -2056877 730742 3552695 6210211 7584084 5738152
38243 5738152 1547798 -956137 -130187 781028 -389120 -134751 4644012 9165171 6012061
38234 6012061 -3049604 -7575942 -2183854 6613066 10354582 9699515 10524366 13049891
38226 13049891 11699677 5037316 -571884 750038 6792646 10855818 10144838 7272147
38218 7272147 5014735 3403391 2098587 2077225 3290051 3200749 210719 -2896879 -1949119
38209 -1949119 2432676 4727034 1577255 -3624179 -5089268 -1750605 2383297 4033146
38201 4033146 4082175 4943328 6758174 7420362 5346778 1318882 -1958324 -1858856 1806442
38192 1806442 6088424 7453744 5543672 3451253 3600015 4542586 3251960 -281447
38184 -281447 -2887488 -2738613 -1734641 -2227486 -3331017 -2548775 140314 2365677 3093863
38175 3093863 3505547 3846933 2312105 -1714092 -5860037 -7959618 -8841150 -9978525 -10601802
38166 -10601802 -9643241 -8415672 -8213766 -7170369 -3389722 294560 -511385 -4375895
38158 -4375895 -5152607 -1103203 2581184 2175128 873260 2687356 5804564 6479910 5747648
38149 5747648 6969456 9064551 7693942 2370794 -2416416 -3141119 -435141 3395831
38141 3395831 6225672 5707011 1219755 -3318553 -2689192 2496805 5698190 3015464
38133 3015464 -1707508 -2537520 901800 4350873 5316466 5189043 5721271 6459102 6285976
38124 6285976 5577585 5566973 6164534 5569341 2572902 -1306663 -3098500 -1823795 694201
38115 694201 2747316 4443784 5514044 4085881 60882 -2662533 -946600 2129526
38107 2129526 840723 -4776315 -8789799 -8064796 -6194121 -7035572 -8829429 -7729928
38099 -7729928 -3891571 -608131 637782 1187066 2289338 3422529 3013731 -48947
38091 -48947 -4437949 -5877526 -1318270 5814669 8164726 3699378 -1602816 -2587334 -1853532
38082 -1853532 -4083183 -7915030 -9000412 -7844262 -7996770 -8385153 -4801986 1223196
38074 1223196 2625745 -2431435 -6844233 -4679445 839147 3368310 2416912 1324853
38066 1324853 92798 -3850494 -9360117 -11562299 -8307789 -2731575 1005444 1504845
38058 1504845 -476948 -3424452 -5205103 -4230321 -1337390 1078748 2124861 3037745
38050 3037745 4709034 6390696 7112373 6652293 4823050 1625577 -1371080 -1653434 1230048
38041 1230048 4570305 5296026 2898538 -959066 -4457460 -6376655 -5983063 -3447774
38033 -3447774 -123467 2198808 2206842 -449107 -4569555 -7431531 -6976896 -4418872 -3133402
38024 -3133402 -4335924 -5606583 -4766448 -3365498 -4499723 -8420264 -12264492 -13301817
38016 -13301817 -10630913 -4650952 2748516 7905987 7947076 4116621 654193 28228
38008 28228 1070899 1865312 2073383 1792567 618011 -905208 -1080676 240822 884484
37999 884484 -14524 100791 3146337 6189883 4795008 -289513 -3496309 -1701756 2360573
37990 2360573 4880282 5758962 6599044 6712258 4304205 433669 -1377722 292970 2851084
37981 2851084 2985968 336984 -2864123 -4597440 -4563635 -3594050 -2465295 -1150554 1083541
37972 1083541 4456114 7388043 7395155 4141260 856159 1306893 5534442 10050887 12251082
37963 12251082 12663446 12233058 9973216 5547012 2223173 3727198 8530077 10869731
37955 10869731 8190801 4230352 3284600 4735371 5685173 6025057 7305601 8499762
37947 8499762 7028671 3395961 923682 677954 116360 -2574539 -5848274 -7276137
37939 -7276137 -5915589 -1745566 4043425 7599285 5393783 473407 1361051 11252612
37931 11252612 21816021 22337420 12872958 3375343 899498 3057576 4451309 4068423
37923 4068423 3847179 3893358 2643073 58364 -1980260 -1718200 1359269 6167976 9648953
37914 9648953 8632326 3905441 789105 3361932 9206682 12288015 10255169 6226908
37906 6226908 3651411 2429191 879777 -1083402 -2262321 -1881531 474678 5081221
37898 5081221 10529744 13269658 10879512 5329829 1064548 70619 725223 1283740 1974350
37889 1974350 2950492 2733754 491680 -1895781 -2190792 -1087624 -925154 -1948190 -2456536
37880 -2456536 -2399323 -3851800 -7227097 -9757902 -9149451 -6481429 -3850216 -1366413 1262962
37871 1262962 2197339 -352475 -4448498 -6185902 -4792822 -2896582 -1948728 -1017243 -480753
37862 -480753 -2540165 -6172845 -5819795 1397259 10238694 13292652 10205405 6399639
37854 6399639 4235151 1263854 -2658658 -2938980 2522439 8899165 11126448 11054960 13260262
37845 13260262 16623395 15728318 9576237 3273827 504357 -645471 -2750420 -4469018
37837 -4469018 -3748930 -2300835 -3314397 -6390672 -7970724 -6180320 -2711065 -70281
37829 -70281 1025644 1421949 2171664 3624299 5038836 5199881 3876106 2093470 563013
37820 563013 -1099982 -2963623 -3982520 -3625891 -2820052 -1994950 94170 3801316 6662715
37811 6662715 6621823 5726390 7339585 10462498 10641720 6751038 2935834 2375161 2560185
37802 2560185 -703005 -6870167 -11129714 -10417944 -6661932 -4103452 -4844675 -7244228
37794 -7244228 -8129096 -6458185 -4405792 -4188671 -4811554 -3924263 -2236546 -2905352 -6020420
37785 -6020420 -7279707 -3966759 974777 3395693 3504438 3633350 3104452 -193464 -4692028
37776 -4692028 -6685869 -6584468 -8327788 -11865504 -11802188 -5903485 147973 443754 -2542751
37767 -2542751 -1930369 3340410 7541114 6634439 2725893 -308782 -1190488 -199652 2211625
37758 2211625 4208180 3510898 1252074 1370193 4231468 4941465 1056913 -2327145 -23739
37749 -23739 4262818 2989956 -2947314 -4610099 1734201 9275784 11165996 9449676
37741 9449676 9158145 9396251 6360663 1235547 -1573213 -1903066 -3158581 -5290075 -4688561
37732 -4688561 -1044481 1510151 825120 -948546 -2344657 -4581608 -7135767 -6674905
37724 -6674905 -2802722 -49578 -1254236 -3388403 -3242961 -2889682 -5139672 -7160638
37716 -7160638 -3992286 3337160 8218652 6598075 868815 -4218835 -6353816 -6303380
37708 -6303380 -6216283 -7403624 -8509755 -6960582 -3506305 -2972571 -7934950 -13940539 -14553660
37699 -14553660 -9567750 -4478763 -3065578 -4520689 -7036248 -9716621 -10899403 -8883663
37691 -8883663 -5036392 -2535626 -1524634 701324 4079708 4644325 617688 -4198766
37683 -4198766 -5356558 -2990715 127443 2936874 5845889 8282155 9220523 8972372
37675 8972372 8421793 7478576 5787836 3859133 2248020 818151 -262689 -409273 -471950
37666 -471950 -2691381 -7370157 -11504418 -12384169 -10729521 -8481834 -5531420 -1196537
37658 -1196537 2537804 2395244 -1704867 -5888197 -6445959 -3370302 273377 1523961
37650 1523961 268666 -521653 2103575 7195388 10303000 8664590 4592781 2267901
37642 2267901 2506473 2676773 944269 -1628804 -3128286 -3094845 -2429667 -2121744 -2323530
37633 -2323530 -2130331 -525858 1996172 3494962 3012401 2051613 2576472 4334212 5406919
37624 5406919 4818112 3284265 1719791 220800 -1433574 -2951358 -3213940 -890895
37616 -890895 3751502 7679751 7350582 2769640 -2256088 -4556093 -4386015 -3080028 -735185
37607 -735185 1878107 1946945 -1694869 -5510556 -5530002 -3372235 -3967785 -7741522 -9400880
37598 -9400880 -5332781 1558787 5989076 6274339 4250029 1560301 -1570208 -4899140
37590 -4899140 -7374235 -7697705 -5223282 -899791 2700466 3554475 2577956 2491746 4139562
37581 4139562 5524127 4809287 2467100 -228387 -3032118 -5904856 -7748215 -7379014
37573 -7379014 -5203847 -2997844 -2188113 -2574529 -2538959 -922286 900947 26771 -3692567
37564 -3692567 -6046734 -3639763 670116 1037263 -3150755 -6404196 -4913132 -898669
37556 -898669 2037447 3378952 3277909 248011 -5138649 -8114761 -5795166 -2490223
37548 -2490223 -3969738 -8565944 -9538212 -5176311 -608895 602823 737700 2317981
37540 2317981 3738944 3210951 2534478 3477978 3898347 1322710 -2165156 -2656744 -393878
37531 -393878 983108 313175 177890 2365365 5569967 8056440 9463193 9196755 6105508
37522 6105508 1105961 -2589354 -3657731 -4694727 -7859233 -10657761 -9104360 -3785746
37514 -3785746 686254 1998032 2405156 4039107 5399034 4330488 1697652 -485509
37506 -485509 -2602550 -6148174 -10113918 -11829684 -10946023 -9440407 -7671295 -3835502
37498 -3835502 1821182 5654946 5332368 3137936 2274542 2159203 224053 -3258344 -5376534
37489 -5376534 -4920379 -3591754 -3091958 -3618089 -5136001 -7417141 -8585694 -6439223 -1975733
37480 -1975733 957987 553015 -847886 -684792 401444 888175 1523010 3405996 4819418
37471 4819418 3376700 456426 -94412 2232631 3639042 1881420 -255173 509066
37463 509066 2637063 2128110 -1365763 -4377431 -5181099 -5624686 -6455510 -4745455 1178245
37454 1178245 7057868 7151431 2382518 -368118 2302932 5799629 4368212 -1225687
37446 -1225687 -6007669 -7961212 -8746817 -8883268 -7039344 -4136429 -3444591 -5233301 -5504254
37437 -5504254 -2313087 441646 -1106960 -4215781 -3347543 1147843 3432120 1364244
37429 1364244 -68241 3304674 7922767 7512413 2370632 -1162114 177194 2809656
37421 2809656 2712558 1059452 609865 54349 -3439732 -7746039 -7349314 -2020619 1365554
37412 1365554 -1649782 -6158745 -4762494 1564932 5005971 2278166 -1492246 -1452684
37404 -1452684 -31563 -1903865 -5880814 -6551640 -2542523 1379589 996540 -1822187
37396 -1822187 -1874864 2758144 8645857 11320900 10313334 8896297 9154440 9113103 6103719
37387 6103719 1466178 -845040 24354 736395 -926893 -2933885 -2773166 -1270209 -300286
37378 -300286 571021 2191202 2834951 619399 -2653181 -3690961 -2672072 -2327860 -2923895
37369 -2923895 -2315891 -872250 -1869009 -5927205 -9015816 -7848471 -4218045 -1964777
37361 -1964777 -1988717 -2162467 -385326 3797535 8991699 12186132 10863940 5902602 788342
37352 788342 -2465961 -4317592 -4377685 -845979 4950239 7246923 2525593 -4934332 -7935849
37343 -7935849 -5326782 -2358469 -2893922 -5150753 -5546120 -3386316 -468017 1604967
37335 1604967 2123812 669063 -2635875 -6463051 -8620340 -7486195 -3627432 -15182
37327 -15182 472144 -1592407 -2475787 93373 3883072 5233161 4020172 3459528 5447081
37318 5447081 8329277 9604151 9004663 8085038 7888989 7985390 7489502 6427772 5778492
37309 5778492 6001930 5932935 4001712 500542 -2488717 -3572827 -3170326 -1997479 -129947
37300 -129947 1932153 3122563 3434047 3682151 2986384 -741406 -6378860 -8822087 -5216129
37291 -5216129 706693 3589101 3305470 3159913 3395451 1248157 -3342339 -6797292 -6955269
37282 -6955269 -5141879 -2876822 -344118 1328036 153738 -3206057 -5326836 -4504532
37274 -4504532 -2420533 -705274 768478 1405529 -430206 -3838506 -5231153 -3501265
37266 -3501265 -1672194 -1514135 -672270 2057403 2841570 -1546752 -7303642 -7747537 -2306728
37257 -2306728 3213263 4562918 3023215 1640842 1487897 2321365 3727994 4530328 3339757
37248 3339757 640872 -1240852 -689566 1900982 5067122 6896536 5279727 -110201
37240 -110201 -5980262 -7809283 -4686215 -105156 2360730 2367233 1455913 615193 335553
37231 335553 1343043 3607828 5528391 5633908 4644295 4400172 4895968 4069935 1249559
37222 1249559 -805942 745497 4089422 4191241 -126808 -3522919 -1170955 3876391
37214 3876391 4499120 -268729 -3904081 -2195172 766428 -746250 -5608203 -8170249
37206 -8170249 -6390182 -3104087 -535632 1954302 4641317 5733008 3840811 -66622
37198 -66622 -3588336 -4253743 -643721 5666299 9944414 8679347 3913971 863920 1588214
37189 1588214 3628187 4623147 5095752 5996518 6286962 4436125 843940 -2224133 -2530417
37180 -2530417 73812 2715945 1794170 -2369174 -4838928 -2264602 2174589 3248435
37172 3248435 1186356 222212 850385 -786122 -5349767 -7962905 -5479704 -1230792
37164 -1230792 251233 -742125 -1220741 -168591 1851343 4645566 6983679 6192618 2280392
37155 2280392 -278161 1787137 5546928 6041547 3230461 1006601 1015044 1404972 756857
37146 756857 -341230 -1152189 -1387373 -632973 484893 -88232 -2563167 -3519414 -467645
37137 -467645 3797254 5078479 4023462 4067729 4884274 3324238 176944 90775 4157323
37128 4157323 8098379 9118184 9292151 10306398 10016384 6929184 3432192 1304965
37120 1304965 -1806497 -7692692 -13034488 -13852304 -11622060 -10408669 -10158308 -7820078
37112 -7820078 -3812331 -2052898 -3453338 -4251163 -2021581 766157 1151743 272602 811492
37103 811492 2147513 1420662 -1324791 -2511730 -512733 1067516 -1787919 -6853767
37095 -6853767 -7675601 -2877818 737819 -2553616 -8448474 -8075285 -882720 4209397
37087 4209397 1325882 -4881459 -6929292 -4241318 -1228813 -95850 -363059 -2206895
37079 -2206895 -5156321 -5906779 -2413412 1946679 3186859 3237227 5948250 8999393 7017580
37070 7017580 1529702 -363759 2403552 3074557 -1243292 -4672606 -2914314 -304841
37062 -304841 -1293432 -2241104 1470413 6132241 5402148 1056069 -173490 2247018 2900285
37053 2900285 353984 -1298328 -696431 -1365172 -4654080 -7334875 -7747244 -8244055 -9779774
37044 -9779774 -9696416 -6785944 -3324465 -379121 3397539 6385651 3575301 -5225687
37036 -5225687 -12359535 -11574931 -5672094 -897104 1616298 3992260 5349333 3183500
37028 3183500 -1368983 -4670372 -5241445 -3407872 1016583 6338252 7395467 1879557
37020 1879557 -4259524 -3893405 653628 933868 -4445218 -7402921 -2187142 7078925
37012 7078925 12763905 12130668 7225920 1499467 -1026331 2095515 7715279 9245876
37004 9245876 5136442 1051300 1511871 4259107 5695340 6423847 7095589 4001374 -5135885
36995 -5135885 -14582685 -16382689 -10763228 -4794730 -2302194 -1355474 -693703 -1563485 -2602803
36986 -2602803 167549 6046166 8341578 3620341 -2589222 -3230092 845789 3121099
36978 3121099 636059 -3302116 -4542712 -2649692 -225139 -98218 -3004877 -6507481
36970 -6507481 -6982629 -4034315 -1498267 -2268720 -3967123 -2614786 707299 661988 -4694510
36961 -4694510 -10589877 -11341991 -7086284 -2834777 -2213444 -4033081 -4693592 -2453872 1245832
36952 1245832 4134821 5781914 7139316 7957763 6544853 2830417 -370714 -1026521
36944 -1026521 -1159566 -3751187 -7438022 -7729760 -3535104 995199 1976264 -97164 -2972323
36935 -2972323 -5940350 -8344182 -7925741 -3828802 875247 2918903 3447649 5469288
36927 5469288 8062871 7258383 2458733 -2107814 -3210522 -2468409 -2993606 -4962813 -6308423
36918 -6308423 -5958230 -4773826 -4270902 -5124823 -6023547 -4302777 490791 4290815 2744316
36909 2744316 -2283952 -4197259 -573660 3518633 3102647 8165 -1336913 -1190134
36901 -1190134 -2836469 -5745066 -5574805 -784396 5016665 7799693 6915670 3884127
36893 3884127 595726 -749402 1015056 3782284 3798718 391039 -3224468 -4512679
36885 -4512679 -4455008 -4828975 -5227623 -4404681 -2632208 -1024365 70487 611359 177430
36876 177430 -862793 -810961 1098228 2832386 1683080 -2162143 -5738520 -7057143 -7388985
36867 -7388985 -9050191 -11547970 -11231350 -5582017 2792587 7979170 6787342 1423876
36859 1423876 -4167824 -8260447 -10381442 -9355371 -5396274 -2277347 -3695835 -8226232
36851 -8226232 -11188893 -10712623 -8399920 -5028175 -226676 3890391 4109472 1922959
36843 1922959 2535342 6488055 7898174 3681700 -1094257 -992994 1730546 1863001 -114877
36834 -114877 28249 2413063 3061572 345953 -3684162 -7213041 -9247778 -7818179 -2575436
36825 -2575436 2166776 2158718 -403011 -795332 -365673 -4088071 -10276075 -11232469 -5561332
36816 -5561332 -1308944 -3611695 -7274305 -6400493 -3887273 -4759454 -6282547 -2857618
36808 -2857618 3312736 5083244 1892738 170720 2746254 5627662 5970922 5893391 6564748
36799 6564748 5280167 1385041 -585554 2667363 8044049 10754233 10305167 8482513
36791 8482513 5381233 1529890 392761 3817575 7464708 5874907 477169 -2532416
36783 -2532416 -1214011 605230 618732 1182496 3942519 6287954 5390495 2109912 -1121981
36774 -1121981 -3145022 -3296128 -1355882 99521 -2562272 -7583201 -7696965 -148463
36766 -148463 7547364 6986479 479430 -3008388 -1121882 101201 -2803334 -5867772
36758 -5867772 -5619848 -4710190 -6004688 -6904594 -4313594 -889697 -950838 -2999874 -1925420
36749 -1925420 2609803 5167417 2035799 -4318535 -8906690 -9272424 -6381000 -3013574
36741 -3013574 -1799422 -2923083 -3725510 -2254960 -431803 -1199310 -3299622 -2326436 2791986
36732 2791986 7812001 8651238 5724652 1522694 -2898739 -6837964 -8226767 -6139417
36724 -6139417 -3336222 -3092489 -4409083 -3584731 -184253 2079431 1093054 -487187 233711
36715 233711 1473989 -517292 -5293900 -8266638 -6860890 -3414076 -1198737 -592945
36707 -592945 -647415 -1459985 -2546724 -1473057 2447370 4990738 1865998 -4100250 -5442599
36698 -5442599 -166108 5531642 6293185 4544436 5339891 8340325 9244182 6684407 3213020
36689 3213020 691801 -1199514 -2384069 -1927682 -136541 1724095 3603480 6076138
36681 6076138 8218932 8747187 8466791 8650799 7925415 4295855 -503292 -2848498 -3131323
36672 -3131323 -5033461 -8290922 -7494409 -439823 6916914 7430940 1636508 -3942677
36664 -3942677 -5200978 -3603576 -2237942 -2221678 -2984898 -3611887 -3382846 -2132557 -145256
36655 -145256 2577226 5988049 8606140 8177651 4772732 1642876 1669397 4184014 6339685
36646 6339685 6226603 3707921 -39060 -2602250 -1860355 1116424 2565610 893983
36638 893983 -1129149 -747193 827948 1286761 1279953 2039580 1258379 -3896056 -10546375
36629 -10546375 -11929403 -6138532 1193631 4191859 2943060 761945 -1054193 -2947876
36621 -2947876 -4139593 -3220473 -738625 1241254 1666852 856866 -981976 -3763047 -6350937
36612 -6350937 -7064849 -5581319 -3430666 -2591293 -4000971 -6759710 -8089849 -5173289
36604 -5173289 1493689 7267660 7674303 3369899 -963572 -2565811 -3122657 -4661983
36596 -4661983 -5580518 -3127842 1540382 3805299 1367773 -2725991 -3847065 -984069
36588 -984069 3003485 5087800 4480497 2011414 -1099300 -3561044 -4386642 -3723961 -2838408
36579 -2838408 -2740204 -3083569 -2880836 -2148400 -2095129 -3160118 -3474370 -668245 4517046
36570 4517046 8144700 7884338 6214567 6535984 7611411 5694786 1796475 1685461 6762928
36561 6762928 10005221 5128539 -3998153 -8508433 -6731477 -4963495 -6805266 -8551072
36553 -8551072 -6669102 -3678375 -3321659 -4577351 -4400418 -3040227 -2601268 -2803191 -2246797
36544 -2246797 -2135841 -4561575 -7980939 -8479100 -5573614 -3199185 -4247749 -7059550
36536 -7059550 -8331547 -7080039 -4412950 -1267577 1941183 4370289 4996730 3847807
36528 3847807 2318775 2081021 3623296 5644101 5938960 3239773 -1618455 -6229787
36520 -6229787 -8181305 -6465032 -2171651 1959170 3308073 1281675 -2360176 -4789951
36512 -4789951 -3770179 850205 6386121 9021143 7543158 4538935 2620499 1017989
36504 1017989 -1860249 -4269629 -3263115 -127738 799483 -1066349 -1783406 25688
36496 25688 659947 -1607653 -2373556 1689666 5869292 3352962 -4435930 -9345006 -7315749
36487 -7315749 -2243483 888304 1542958 1276320 337190 -1275887 -2318438 -1989009 -1476448
36478 -1476448 -2382255 -4617213 -6662692 -7236064 -6445357 -5629824 -5512540 -4319138 508218
36469 508218 7760765 12092318 10396452 6288597 5209331 6964792 6903882 3351438 -326315
36460 -326315 -1022884 454934 1532640 704739 -2126726 -5530847 -6678609 -4142442 -438179
36451 -438179 787991 -313240 -522984 1360344 3485751 4655795 5439623 5539476 3739605
36442 3739605 921342 -330130 365636 922607 682043 1088163 2222867 2363762 1361399
36433 1361399 699543 37154 -2019139 -3493594 -556941 5488231 8165540 4738812
36425 4738812 13223 -1196383 -324538 -858497 -2857051 -5192822 -8586830 -12356284
36417 -12356284 -12483886 -7545626 -2792812 -3359440 -6552018 -6068474 -1365866 2452616
36409 2452616 2328383 -143643 -2492032 -3208999 -1001101 3428923 5876336 3105497
36401 3105497 -2039903 -3877699 -1220530 2314489 3998934 3825154 1881695 -1490399
36393 -1490399 -3514809 -1326741 3767168 8093746 10686028 12432404 11634776 5872539
36385 5872539 -2118257 -6117879 -4565617 -1891578 -1073793 -287971 1674193 2123050 -734992
36376 -734992 -3845292 -2899091 2800859 10449365 15859120 15084534 8015907 1183568 2303253
36367 2303253 10440958 16246379 13883673 7801244 5016563 5762561 5731470 3473401 1006708
36358 1006708 -217724 -46397 1471522 2830939 1323024 -2559391 -4055467 -610973
36350 -610973 4086674 6140833 7406221 10549201 12225165 7848144 519702 -2293109
36342 -2293109 17080 829855 -2624213 -5433325 -3981528 -1497506 -1365543 -1231807 1746196
36333 1746196 4907740 4659169 3237949 5049276 8620661 8471429 4414834 2888501
36325 2888501 7639899 14084192 15655676 12279572 9159697 9191141 10239612 9498119 7255722
36316 7255722 5473752 4906067 4973419 5022961 4383330 2380530 -164355 -490757 2993381
36307 2993381 7545666 8268371 3891273 -1405698 -2649591 815569 5476967 7615566
36299 7615566 6419087 4083546 3265236 3912212 3296332 420470 -1169320 1999436 6941114
36290 6941114 6960387 1193132 -3603545 -2511376 1398310 3199293 3222181 3840758 3934861
36281 3934861 2031940 988403 3160313 4131243 -1407329 -9642627 -11532614 -5940909
36273 -5940909 -721093 -450590 -1560436 -1173293 -2093624 -5746516 -8053629 -6662307 -5326437
36264 -5326437 -6382752 -5515737 433240 6429556 6271062 1675021 -1880163 -3687372
36256 -3687372 -5563678 -5578361 -1617163 2228287 738536 -3390627 -3286747 1321595 4830152
36247 4830152 5485803 6133211 6540320 3974575 1161495 4133086 10967721 12178965 4903651
36238 4903651 -2343775 -2731866 -312460 -1299072 -3983972 -3558663 -857903 198628 -632958
36229 -632958 -1532758 -3104583 -5986948 -7652661 -6495654 -5325671 -6001290 -4934102 412592
36220 412592 4853286 2186775 -4606993 -7144690 -3510995 862955 2693798 3571615
36212 3571615 3511520 -314682 -6701983 -9005049 -3701111 4276394 7703403 5319636
36204 5319636 1509992 130611 789299 234220 -3437299 -7668247 -7624398 -2506215 2606077
36195 2606077 3420916 2153030 3095082 5236886 4140743 -574048 -4772572 -5810182
36187 -5810182 -4106721 122144 6317780 10638837 9408165 5184731 3597745 4539205
36179 4539205 3012083 -1342554 -3120680 -722647 806513 -951146 -1277099 3120360
36171 3120360 7901074 8125333 5659303 4684233 4963356 4497557 4127484 4501193 3027230
36162 3027230 -958739 -2501898 1799551 7165175 7420230 4547373 4498250 6700374 5630381
36153 5630381 1089863 -1145867 1228797 4268537 5104237 5448831 6602447 6984761 6251985
36144 6251985 6444966 7301588 5626396 1412155 -446234 2677135 6708341 6950217 4896689
36135 4896689 5084259 7670648 8305111 4522938 -1073070 -4190990 -3324679 -531136 937423
36126 937423 -706823 -4862643 -9514118 -12573219 -12543850 -9330095 -5177400 -3411308 -4942023
36117 -4942023 -7192865 -7696796 -7121321 -7145308 -7388129 -6775641 -5896137 -5071793 -2223555
36108 -2223555 3487000 7690093 5385244 -1168461 -4270235 -854904 4139125 5419397
36100 5419397 3506232 1551490 562241 339666 1480161 3673883 4812004 4029335 2958352
36091 2958352 2204256 -78573 -3872196 -5263723 -1986238 2166272 2315728 -508566
36083 -508566 -1381517 1335535 4998136 7601408 9294947 9390198 6261534 1010551 -2300714
36074 -2300714 -1345551 2012586 4788021 5988520 5780625 4001736 1077760 -1165170
36066 -1165170 -1096671 1120806 4199926 6883499 7896469 6252714 2712081 -185880
36058 -185880 -746044 -16291 -25142 -919660 -1169705 -139450 1055844 1366095 1143785 1039759
36048 1039759 468664 -1764596 -5317597 -7593135 -5952360 -880782 3660345 4067609
36040 4067609 1392768 550707 4407194 9897911 11591064 8073735 2474301 -2650088
36032 -2650088 -7451308 -11322289 -11525950 -7771534 -4518694 -4984799 -5831407 -2619496 1786233
36023 1786233 575489 -5884400 -9308358 -5335204 536041 1786058 -454262 -1789562
36015 -1789562 -2237898 -4047204 -5873622 -5140623 -3464877 -3843544 -4553102 -1911544 2358952
36006 2358952 2888749 -727338 -3258693 -1990828 378970 1661367 3036390 4588442
35998 4588442 3771105 655614 -420601 2649479 5882774 4863714 664098 -2796391
35990 -2796391 -4115632 -4264418 -3838240 -3230186 -3353637 -4000188 -3628663 -2414831 -2848363
35981 -2848363 -5634412 -7979750 -7760326 -6173204 -4354369 -1192727 2853515 3844263
35973 3844263 37921 -3968950 -3138236 740286 2300785 851465 303468 2265049
35965 2265049 4389822 5134726 5272994 4571216 1707976 -1718120 -1617739 2513467 5760256
35956 5760256 4201316 136153 -1547750 105104 2024727 2148596 1608140 2011360 2951169
35947 2951169 3084095 2271561 1455279 992844 338158 -610395 -1010458 -404051 478550
35938 478550 933522 1177671 1064592 -634752 -3938162 -6000171 -4256602 -408506 1491836
35929 1491836 373471 -1520623 -3174503 -5723004 -8334545 -7426867 -1854261 4468145
35921 4468145 7237127 6464831 4865751 4245005 5103318 7032568 7814745 4941294 -386008
35912 -386008 -3804681 -3744575 -3113068 -3407096 -1897607 2421593 5097633 2852473 -363940
35903 -363940 728074 4343454 5177200 3661225 4855539 9174179 10974151 6989621
35895 6989621 586402 -3623417 -4950288 -5182781 -5696734 -7202050 -9469979 -10555301
35887 -10555301 -8607595 -4423701 -10874 4322311 8465919 9581084 4921955 -2941018
35879 -2941018 -8052521 -8374533 -7255209 -7496842 -7992631 -6804132 -3883398 -94986 3237707
35870 3237707 3713769 323079 -3490070 -3155398 480574 2110218 -194431 -2638052
35862 -2638052 -2120161 -429033 -430426 -2156063 -4466474 -6864706 -7845142 -5014336 1163749
35853 1163749 6863759 9767163 11303444 12714824 12586393 10162948 7502777 6041060
35845 6041060 4245284 998292 -1769343 -2199121 -1343632 -576882 818234 2898614 2920381
35836 2920381 -817446 -5221144 -5697794 -1713324 3496960 7191173 8590215 7549630
35828 7549630 4431388 684692 -2172549 -3494335 -2685602 795731 5471000 7912373
35820 7912373 6393156 2848356 -18297 -1646608 -2430853 -1964775 -299124 913503
35812 913503 316127 -1491506 -3288686 -4584869 -4961247 -4279723 -4180710 -6567060 -9686383
35803 -9686383 -8975330 -3269911 3035578 5658819 4941580 3020008 393049 -2164678
35795 -2164678 -2089094 1265554 4510462 5017909 4825657 6525297 8490485 8037739 6395910
35786 6395910 6247987 6753417 5439013 3093275 2441326 3602160 4974001 6840729 9758025
35777 9758025 11138164 8242128 3239119 455608 -161946 -1649326 -3225252 -997680
35769 -997680 4486187 7657309 6217844 4278150 5083355 5944953 3606394 253926 102521
35760 102521 2755705 3956738 1639034 -1965004 -3689390 -2527334 450253 3573717
35752 3573717 5832389 7396973 8809808 9708293 9265222 7938308 7378479 8078051 8469013
35743 8469013 7240224 5412396 4820763 5096648 3760224 -91194 -3376069 -2112318
35735 -2112318 2939788 5997049 3348125 -1320070 -1855981 1527084 2976925 425657
35727 425657 -1456985 396587 2145065 138682 -1926675 1015948 5794694 4459501
35719 4459501 -3890741 -11447548 -12083852 -7489766 -2041607 2755605 6569791 7713097
35711 7713097 5464314 2229904 975773 2196654 4702453 7479077 9595069 9955938
35703 9955938 8251945 5231727 1961013 -269366 -292603 1036248 785777 -1853193 -3224513
35694 -3224513 -477818 2758904 791173 -5084410 -7606476 -3955381 644726 1240826
35686 1240826 -482250 -793351 96826 377077 1168474 4337031 7933562 7930858 3813440
35677 3813440 -612566 -1922835 -554132 594232 -175659 -1634793 -1640483 -474769 -566501
35668 -566501 -2227884 -2304187 694526 2989458 805303 -3309954 -4386198 -3109847 -3787866
35659 -3787866 -5673350 -3974727 376500 466137 -5081527 -8825820 -6399166 -3393073
35651 -3393073 -5060312 -6926296 -2940594 3322359 4267367 834438 373221 4246839
35643 4246839 6472919 4241439 1510860 1079756 255378 -3399526 -7625562 -9236510
35635 -9236510 -8136056 -5552320 -1849727 1971120 3527644 1746545 -1451821 -3115893
35627 -3115893 -1622531 2611504 6910984 7598365 3852874 -528749 -1757992 -1077158
35619 -1077158 -1880872 -3405054 -1914380 2395257 4871098 3503307 1684143 2310276
35611 2310276 3557550 2867910 1482701 2151458 4817617 7155592 7722586 6700872 5004775
35602 5004775 4017271 4667591 5801185 5280236 3431414 3011493 4721835 5599713 3717916
35593 3717916 1778809 3286810 7035622 8581942 6375512 3318798 2060988 1510587
35585 1510587 -679605 -3979732 -5466623 -4157846 -2665496 -3215467 -3621363 -7286
35577 -7286 6649102 10227600 7341640 2344949 1648928 5577519 9447028 10651230 10159800
35568 10159800 8210429 3798829 -1348300 -3416808 -2299370 -2119831 -4401507 -5278737
35560 -5278737 -1754575 3546720 6671721 7470462 7226557 4818067 -760237 -6701244
35552 -6701244 -9182946 -7982805 -5040542 -775822 4451689 7569634 5960818 1897237
35544 1897237 -447170 -908221 -1723327 -1723243 1969777 6920043 6672905 530666 -3977893
35535 -3977893 -1172136 5211985 7900061 5355849 1316629 -1561112 -3193323 -3359286
35527 -3359286 -1766463 223218 1267773 2329770 4286302 4870343 1712557 -2849514
35519 -2849514 -4331572 -2917188 -3056088 -5982402 -7561757 -5056848 -1322585 331217
35511 331217 1275932 3924730 6259924 4578912 -99327 -3079975 -2919703 -2858387 -4828151
35502 -4828151 -6173657 -4071168 -83809 2077436 1456031 169479 -230116 -584621 -2267398
35493 -2267398 -4837803 -6205681 -5065354 -2909152 -2842752 -5743601 -8491399 -7480096
35485 -7480096 -3323121 -100637 -30390 -1173008 -947313 422951 1220435 1116023 1140162
35476 1140162 1917513 3209925 4406626 4765841 4174280 3862991 4667497 4545895 731626
35467 731626 -4783203 -5666548 364841 7034248 7168114 2176616 -852547 269499 937644
35458 937644 -1655874 -4085920 -2864750 -10326 873162 402768 1301240 2723116 1008641
35449 1008641 -4354930 -9091592 -9180783 -5291652 -1309448 115965 -368943 -485035 803999
35440 803999 2273381 2245516 988841 487180 1740065 3370971 3505930 2025155 -76929
35431 -76929 -2817127 -7111933 -12272041 -14976006 -12187102 -5206588 422852 254645 -4219041
35422 -4219041 -7472130 -6575130 -3869896 -2466689 -1897495 -463335 572837 -1141425
35414 -1141425 -4193909 -4755146 -2843574 -2773625 -6120556 -8647411 -6769844 -3242918 -2750200
35405 -2750200 -4605308 -4151052 81840 4925497 7658731 8304341 6799485 2391772
35397 2391772 -2777729 -3719150 915382 5381059 3506813 -2838014 -5895250 -2347781
35389 -2347781 2523927 2367343 -1948323 -4431677 -2389373 967444 2152515 1930154
35381 1930154 2665315 3993669 3819600 2126701 897816 725810 182317 -1369814 -2805750
35372 -2805750 -3442891 -3837047 -3866310 -2629639 -1149041 -2169704 -5436933 -6170477 -1356159
35363 -1356159 4588013 4417564 -2415458 -8843299 -9135558 -4983085 -1288580 629296
35355 629296 2884889 6184850 8418699 7801685 5061517 2127107 112828 -1094519
35347 -1094519 -2351485 -4572477 -7577981 -9506682 -8360251 -4337971 276782 3637405
35339 3637405 5556957 6042739 4377492 785279 -2428146 -3103362 -1793904 -492978
35331 -492978 400045 1886095 3819895 5041120 5812074 7263216 8214583 6015225 1699035
35322 1699035 552874 5052853 10434793 10617365 5986370 1505269 -708580 -2299970
35314 -2299970 -3581383 -2851681 -825275 -659042 -2626175 -3402303 -1992096 -1762078 -4581676
35305 -4581676 -7350970 -7034746 -5162774 -4206035 -3219244 -871930 443393 -1919872 -5458920
35296 -5458920 -5280792 -1218815 2033536 1525161 -802821 -1471717 905030 4995930 7274690
35287 7274690 4141352 -3654364 -9856734 -9200236 -3967499 -555627 -807353 -1202428 166882
35278 166882 1237834 1052307 1674293 3350522 2875174 -598494 -2695320 -192242 3544031
35269 3544031 3460442 189460 -1840394 -1587305 -1974661 -4062474 -5109677 -2980763 935214
35260 935214 4138296 5758010 5913422 4484278 1785290 -863487 -2297320 -2525983 -2131346
35251 -2131346 -1453109 -810779 -831307 -1981849 -3906612 -5297602 -4448642 -582198 4725392
35242 4725392 7881198 5999005 -454295 -7884231 -12239595 -11587139 -7105573 -2260785
35234 -2260785 -259313 -1409887 -3345796 -4229961 -4710163 -5843267 -6396557 -4079259 992657
35225 992657 5937332 8325998 8200455 6682447 4249129 1107358 -2033773 -4489014
35217 -4489014 -6045098 -6287755 -4588330 -1623710 266165 -354588 -1814101 -1235568 1738186
35208 1738186 4696197 5688357 4835943 2663423 -814391 -4428345 -5697330 -4192956
35200 -4192956 -3018686 -4385511 -5446995 -2035636 4429128 8105053 7012264 5330959
35192 5330959 5802689 4978976 -250742 -5771002 -5489958 -965974 645749 -2324543 -3686895
35183 -3686895 490598 5546403 5321997 892297 -2091380 -1655062 -494974 -394651 -93528
35174 -93528 1567243 3920019 6151161 7992108 8484953 6474485 2814546 169493 150441
35165 150441 2037578 4265462 5546149 4720853 1572964 -1887911 -2822170 -796640 1833313
35156 1833313 2986570 2599289 1155977 -1218515 -3293772 -2633809 1280585 5335341
35148 5335341 6072528 3793699 1753801 2107868 4396685 7300524 9687711 10027120 7096687
35139 7096687 2103585 -1603024 -2060450 -835247 -665430 -1961761 -2805429 -1706200 870738
35130 870738 3361826 4471744 4045087 3480800 4686046 7485204 8896201 6789554 3628114
35121 3628114 3918176 7732433 9893820 7061953 2668205 2084843 5050941 6526026
35113 6526026 4124197 684580 -999271 -2145817 -4738600 -7136408 -5875102 -800996
35105 -800996 4251779 6076061 5468907 5143660 5483876 4068484 -260522 -4504471 -4713442
35096 -4713442 -1724398 -865660 -4729077 -9082033 -8612674 -4355749 -1446351 -939527 974539
35087 974539 5322110 7471551 4341955 -95689 -360412 2541476 2983519 -970568 -5312969
35078 -5312969 -5915482 -3135748 -6774 1613297 2000847 2122324 2352469 2514082 2878280
35069 2878280 4373015 6768847 7497560 4668734 1020368 1405448 5510183 7154752
35061 7154752 3039669 -1973352 -1935358 1503894 2401370 -52167 -1148272 1373212 4740200
35052 4740200 6706434 8303697 9840364 8852149 4085178 -1836096 -5464123 -5725652
35044 -5725652 -3245961 680790 3762050 4298190 3631216 3955895 3718729 -613169 -7647845
35035 -7647845 -10919745 -7478540 -1927147 595007 872997 1866240 2937326 2123984 709472
35026 709472 795005 849699 -1477482 -3901148 -1884263 4153436 8518150 7368328 2707370
35017 2707370 -991092 -1363379 732669 2450908 1521420 -810224 -686690 2658136 4433260
35008 4433260 670523 -5293278 -7130167 -4673743 -3494347 -5924926 -8288338 -7877318
35000 -7877318 -7017365 -7933109 -8435545 -5987842 -2483391 -1423946 -2722101 -3605635 -3113016
34991 -3113016 -2746474 -3599771 -5291538 -7235278 -9059275 -10018851 -9299729 -6792249 -3121423
34982 -3121423 488039 2391199 1869377 346652 -377476 -1033299 -3736823 -7784602 -9510365
34973 -9510365 -7208229 -3222868 105675 3337186 6901590 8508032 6362398 2298931
34965 2298931 -1112250 -3894679 -6041221 -4737841 1304772 7145794 6701572 1513530
34957 1513530 -1097140 1447909 3943110 1888399 -2464842 -4837710 -5040252 -5285216
34949 -5285216 -5914540 -6039195 -5912816 -5873692 -5068997 -3514631 -3000023 -3663950 -2526962
34940 -2526962 1713737 5363994 4791432 2157454 1908443 3855556 4645872 4337300 5764144
34931 5764144 8124119 7483487 4184246 3346298 6223931 7388656 3680438 90282
34923 90282 2124569 7131384 8865045 7174040 6861561 8944385 9558009 7104952 4430178
34914 4430178 3224727 1743593 -444612 -436227 2866697 5620007 4008789 -447268 -3370062
34905 -3370062 -3284797 -2360881 -2852011 -5058830 -7900532 -9718276 -9136018 -6352380 -3052349
34896 -3052349 -554764 930217 1068813 -734798 -3632783 -5420204 -5229259 -4353272 -3608411
34887 -3608411 -1962192 1155814 4291943 5968154 6266718 5376542 2966759 288229
34879 288229 33263 2100511 2340423 -1804827 -6959605 -8328014 -6435702 -5615509 -7121075
34870 -7121075 -7847606 -5795741 -3205935 -3346190 -6452833 -9747602 -10383331 -8209694 -6054861
34861 -6054861 -6421850 -7722297 -5996764 -1206231 1400458 -1699437 -7232235 -10118478
34853 -10118478 -10239485 -10173117 -9291884 -5544964 -1203198 -824005 -3996342 -5703836 -3985448
34844 -3985448 -1850186 -1125237 79761 2492498 3400751 1220862 -1900560 -3903405
34836 -3903405 -5387045 -6688769 -6179196 -3357066 -324087 1487989 3024223 4837593
34828 4837593 5766494 5373922 4594947 3499821 1864443 1750957 4975255 8217888 6372122
34819 6372122 1103225 -614671 2315643 2970890 -1991658 -6541517 -5299264 -1836957
34811 -1836957 -1511470 -2791248 -1981164 -517558 -773079 -111102 3667040 6095902 3033600
34802 3033600 -881964 794529 5111985 4670377 299512 -1039892 1538371 3079026
34794 3079026 3540876 7337148 12511862 11695012 4976342 728700 1523297 563456 -4456924
34785 -4456924 -5742467 544904 5574407 1321315 -6206790 -6607689 -1037391 1590792
34777 1590792 -499545 -1410685 558475 774701 -2115747 -3519281 -1424777 -8923
34769 -8923 -2014735 -3692065 -1053382 3224784 3487581 -550466 -3244204 -580497 4832826
34760 4832826 7593942 6438134 4955716 5658373 6400604 4526807 1868694 1983813 3894077
34751 3894077 3177647 -714486 -3026124 -850397 2641689 3185849 895601 -1627212
34743 -1627212 -3376813 -4535470 -4651095 -3677909 -2730769 -2118874 -1029233 -360786 -2590405
34734 -2590405 -7185688 -9785493 -8142647 -5363692 -4863880 -5678951 -5415090 -4305452 -3531913
34725 -3531913 -2911723 -2754782 -4165636 -5138820 -1324253 6128752 9232287 4200311 -2043140
34716 -2043140 -2220530 345726 -1335193 -5439999 -5352869 -2460918 -3967688 -9248765 -9747486
34707 -9747486 -3637652 229232 -3704981 -9349521 -9268802 -5205244 -2685355 -1871506 -192256
34698 -192256 1003730 -852482 -3445252 -2388295 1665363 3935453 2384121 -737793
34690 -737793 -3393798 -5837357 -8361925 -10041744 -9819483 -7069562 -1909274 3368123
34682 3368123 4762312 1000152 -3586775 -3334909 2001762 7081855 7401418 3854054
34674 3854054 730171 856816 3280096 4832463 3393636 -324528 -4002923 -6013437
34666 -6013437 -5851118 -3330148 741741 3485823 2089465 -2345658 -5264246 -3853780
34658 -3853780 174502 3766183 6020607 6985661 5421967 550916 -4987851 -6658342
34650 -6658342 -2902704 2930739 5956814 4422246 910961 -680268 930715 3758037
34642 3758037 5583127 6339059 6731696 6220450 4385286 2972982 3713904 4746385 2572753
34633 2572753 -2295618 -5210619 -3830810 -1221412 -890506 -2010712 -2029567 -1342458 -2217988
34624 -2217988 -4602757 -6058450 -5352721 -3734150 -2785207 -2802718 -3288470 -3723508 -3810090
34615 -3810090 -3722436 -3994380 -4868003 -6262476 -8269985 -10364697 -10089513 -4794636 4026669
34606 4026669 10070971 8166214 315533 -6012738 -5669206 -675009 2874117 1711067
34598 1711067 -1654180 -2831742 -1290581 -666237 -3340329 -6953264 -7725436 -5249613
34590 -5249613 -1731267 1790072 5394094 7687730 6990394 4811845 4471832 6077954
34582 6077954 6501882 4750281 3477744 4190522 4790450 3417976 1259669 -165171 -1248396
34573 -1248396 -2079413 -1236281 1233681 2685322 1822050 931519 2120401 4030943 4286194
34564 4286194 2600805 -192432 -3320035 -4794334 -2411570 2227039 4373386 2640427
34556 2640427 776250 1120218 1384722 563185 2037389 6610036 8513472 4156103 -629455
34547 -629455 893402 5284838 4525814 -877707 -3509017 -1735392 -1198896 -3854021 -4869898
34538 -4869898 -1900705 891788 328654 -1491376 -2519603 -3456459 -3114223 1530599 7966314
34529 7966314 8509628 1880035 -2999286 371057 6646062 7722191 4695538 3482320
34521 3482320 3964620 2113097 -601238 948465 5686760 6980450 3298825 295178
34513 295178 1047223 1752408 -351391 -1671419 1125267 4653890 3967947 517988 -282697
34504 -282697 2498053 4276498 1993476 -1913294 -3294638 -1197599 2028366 3728911
34496 3728911 3196827 1993451 2381394 4661601 6347648 5134780 2206433 837012
34488 837012 1869168 2777090 1735278 346194 1039874 3589065 5801084 6247489 4766956
34479 4766956 1778770 -1088228 -1337329 1022671 1968203 -1647068 -6921971 -8354184
34471 -8354184 -5735243 -4059260 -5204768 -4787711 629027 7600905 10216211 7257274
34463 7257274 1906505 -2844412 -5251281 -3924513 312042 3396029 2387315 -494160
34455 -494160 -1313892 -266779 -551748 -2773741 -4297968 -3483294 -1085998 1948733 4779123
34446 4779123 5399867 2501915 -1784960 -4165871 -4705597 -6008081 -8624434 -10634853
34438 -10634853 -11137736 -10708781 -9108318 -6181785 -4277381 -5744734 -8553031 -8535804 -5544446
34429 -5544446 -3081295 -2376468 -1697788 -1298017 -3618520 -7983446 -10311885 -9043918 -6432685
34420 -6432685 -3282897 2125106 8794746 12442721 11854084 10394884 9691076 7676604
34412 7676604 4613162 4414672 7370588 8266825 4990497 2220937 2906261 3410054 1750417
34403 1750417 2758413 8645350 12000494 6336610 -2712808 -5713183 -3488843 -3022053
34395 -3022053 -3988760 -738072 5029845 5595014 788068 -1293073 1787417 3184237
34387 3184237 -530192 -3571989 -1649794 1111299 753955 389513 2866693 4092939
34379 4092939 92792 -5319785 -6270653 -3239072 30226 3021165 5764389 4596945
34371 4596945 -2258287 -8679517 -7704207 -1924660 530752 -1760612 -3165300 -1747117
34363 -1747117 -1907564 -5397060 -7494833 -4722125 -102674 2348065 3277286 4923115
34355 4923115 6694220 7220888 7396594 8134649 7991230 6085546 4664259 5541278 6491450
34346 6491450 4791736 2272343 2720921 5486801 6093731 3195968 745510 2073613
34338 2073613 5184874 5913914 3540880 1017358 626886 1443201 1218858 -393639 -1357724
34329 -1357724 -159147 1477696 220104 -4115891 -7277917 -5608172 -822207 2479198
34321 2479198 2770073 2049688 1162081 -1344515 -5115289 -6706400 -4233683 -281527 1763774
34312 1763774 1615262 478612 -1514339 -3880573 -4593297 -3097371 -1932586 -2431827 -1646163
34303 -1646163 2848016 7897990 8916608 6570371 4339636 1871569 -2901894 -6627276
34295 -6627276 -3202991 5968999 11970460 10479808 6765908 5854165 5064958 962859
34287 962859 -2805165 -1129813 3346197 3377358 -2642470 -9244988 -11387315 -8718784 -3633917
34278 -3633917 605378 932809 -2287649 -4111533 -807959 4470812 5688063 2286476
34270 2286476 -771727 -557073 723926 281338 -1593813 -3173376 -3664590 -3280606 -2899654
34261 -2899654 -3608428 -5161452 -5912345 -5607614 -6065879 -7190127 -5510674 98249 4586087
34252 4586087 2994606 -2266185 -5249216 -4785903 -3415449 -853343 4455813 9065894
34244 9065894 7694497 2320018 301704 2926069 3745940 -351025 -4557424 -5071899
34236 -5071899 -4645957 -5664676 -5248818 -1908730 -238683 -3356630 -6425498 -3921126
34228 -3921126 1150249 1644979 -3340121 -8394459 -9786978 -8323942 -6006459 -4240908
34220 -4240908 -3806096 -3291424 87246 5234727 6342848 947053 -5308040 -6516117
34212 -6516117 -4798877 -5081724 -5830027 -2343242 3552885 5250318 1799319 -1016739
34204 -1016739 47714 2516746 4575275 7311622 9361324 6588156 -365975 -4701511
34196 -4701511 -2955942 -233153 -2028369 -5755203 -5297423 -562146 2859987 2143872
34188 2143872 540406 1832430 4881615 5485473 2527874 282673 3231169 9283749
34180 9283749 11127287 5688800 -1015036 -1626323 2871159 5776234 4664943 2786075
34172 2786075 1582262 -1060441 -4204483 -2674198 4629194 11157050 11071447 6306148
34164 6306148 1798702 -1356963 -3708708 -3101000 1878698 7229955 7905478 4900665
34156 4900665 2980723 3027135 1777787 -1814288 -5015621 -5971174 -5639901 -5063525 -4468133
34147 -4468133 -4830861 -6436287 -6081813 -63850 9507274 15536192 14249039 9052524
34139 9052524 4871473 2364168 -191051 -2514198 -2810249 -911058 1668632 4044071
34131 4044071 6410734 8472932 8778421 5973736 709307 -3629558 -3096503 2515279
34123 2515279 8201196 8542346 3855819 -386987 -228525 2865416 4918158 3824276
34115 3824276 176628 -3881703 -5480536 -2753206 2757373 6750629 6343885 2559876
34107 2559876 -1765181 -4845972 -6037179 -5046655 -2442239 270971 2019253 2569142
34099 2569142 1433989 -1665911 -4846063 -5101305 -2362530 58535 449813 1235841 4402747
34090 4402747 7303970 6330337 2805529 1496600 4091599 7548513 8658745 7229833
34082 7229833 4719653 2501681 1825873 3082202 4599323 4136309 1916082 458130
34074 458130 1315840 3704284 6214415 7899774 7786571 5580873 3037004 2322031 2649584
34065 2649584 922688 -3585153 -7606304 -8176054 -6508256 -5865522 -6860032 -6770567 -3411048
34056 -3411048 1512181 3643000 877959 -3546017 -4556505 -2127233 -1836594 -6647128
34048 -6647128 -11348467 -9201921 -1775240 3331121 3525408 3424464 5351001 4958403 -376005
34039 -376005 -5341832 -4271469 -188619 18726 -3574585 -4653364 -891010 3122209
34031 3122209 3458105 1533968 -81678 -1476366 -2822303 -2084005 1830565 6208197
34023 6208197 7359454 4740928 668639 -2303461 -2270435 1616383 7403601 10467859
34015 10467859 7907152 2264612 -1244385 -963334 -92419 -1516799 -3801700 -4033536
34007 -4033536 -2952594 -4213101 -8272308 -10117840 -5356678 3226169 8243332 6316241
33999 6316241 1101016 -2261138 -2226432 500062 5489109 11147547 13631822 10670480
33991 10670480 5151691 2010576 2397757 3334286 2206892 -829401 -4126396 -5833249
33983 -5833249 -4550752 -899357 2151200 2425620 1148372 620629 777483 417099 210864
33974 210864 1365662 2502344 1359109 -1045676 -1415257 944000 3495249 4521659
33966 4521659 4661497 4669058 4853026 6374008 9584353 11367952 8086134 1374713 -2965329
33957 -2965329 -2397249 -125664 417033 -504785 -1431286 -2033513 -1655946 551010 2701937
$$ [...]
##END NTUPLES=NMR SPECTRUM
##END=
