##TITLE=31Pdec_1xp
 CDCl3
  24 sc
 3.11.2023
##JCAMPDX= 6.0         $$ Bruker NMR JCAMP-DX V2.0
##DATA TYPE= NMR SPECTRUM
##DATA CLASS= NTUPLES
##ORIGIN= UXNMR, Bruker Analytische Messtechnik GmbH
##OWNER= root
$$ XWIN-NMR		Version 3.5
$$ Fri Nov  3 15:27:58 2023 Russian Standard Time (UT+4h)  she@DPX200
##.OBSERVE FREQUENCY= 81.013821
##.OBSERVE NUCLEUS= ^31P
##.ACQUISITION MODE= SIMULTANEOUS
##.ACQUISITION SCHEME= undefined
##.AVERAGES= 24
##.DIGITISER RES= 16
##SPECTROMETER/DATA SYSTEM= spect
##.PULSE SEQUENCE= zgpg30
##.SOLVENT NAME= CDCl3
##.SHIFT REFERENCE= (INTERNAL, CDCl3, 0, 248.564)
##AUDIT TRAIL= $$ (NUMBER, WHEN, WHO, WHERE, WHAT)
$$ ##TITLE= Audit trail, XWIN-NMR		Version 3.5
$$ ##JCAMPDX= 5.01
$$ ##ORIGIN= Bruker BioSpin GmbH
$$ ##OWNER= she
$$ F:/spectra/data/she/nmr/P31/1/pdata/1/auditp.txt
$$ ##AUDIT TRAIL=  $$ (NUMBER, WHEN, WHO, WHERE, WHAT)
(   1,<2023-11-03 15:27:13.10 +0400>,<she>,<DPX200>,
      <created by zg, POWCHK disabled, PULCHK disabled
       configuration hash MD5:
       00 E9 B6 7A A2 85 ED C7 34 08 36 98 17 FE 4E 26
       data hash MD5: 32K
       B0 8D 8C 3C 03 5B 43 AF E9 F3 E7 EE 52 42 20 11>)
(   2,<2023-11-03 15:27:15.59 +0400>,<she>,<DPX200>,
      <Start of raw data processing
       efp BC_mod = 2 LB = 5 FT_mod = 6 PKNL = 1 PHC0 = -10647.43 PHC1 = 296.0902 SI = 64K 
       data hash MD5: 64K
       2F 26 E7 AD 9C A2 C5 2E C7 B3 C7 77 62 4A F6 C8>)
(   3,<2023-11-03 15:27:36.29 +0400>,<she>,<DPX200>,
      <pk PHC0 = 296.0256 PHC1 = -696.9998 
       data hash MD5: 64K
       E7 97 66 38 4F 6D CC 92 93 82 14 FE 33 6B 93 E0>)
(   4,<2023-11-03 15:27:39.65 +0400>,<she>,<DPX200>,
      <abs ABSG = 5 
       data hash MD5: 64K
       CD F0 84 C5 6B 18 86 FA A0 CF EC AB 2E 37 76 F0>)
$$ ##END=
$$ 
$$ hash MD5
$$ 74 CF 4C BB EF C0 73 37 B8 78 43 62 34 34 C1 6A
##$RELAX= 
##$RELAX= 
##$RELAX= 
##$RELAX= 
##$RELAX= 
##$RELAX= 
##$RELAX= 
##$RELAX= 
##$RELAX= 
$$ Bruker specific parameters
$$ --------------------------
##$DU= <F:/spectra>
##$EXPNO= 1
##$NAME= <P31>
##$PROCNO= 1
##$TYPE= <nmr>
##$USER= <she>
##$AMP= (0..31)
100 100 100 100 100 100 100 100 100 100 100 100 100 100 100 100 100 100 
100 100 100 100 100 100 100 100 100 100 100 100 100 100 
##$AQSEQ= 0
##$AQ_mod= 1
##$AUNM= <au_zg>
##$AUTOPOS= <>
##$BF1= 81.014009
##$BF2= 200.13
##$BF3= 200.13
##$BF4= 200.13
##$BF5= 200.13
##$BF6= 200.13
##$BF7= 200.13
##$BF8= 200.13
##$BYTORDA= 1
##$CFDGTYP= 0
##$CFRGTYP= 5
##$CHEMSTR= <none>
##$CNST= (0..31)
1 1 145 1 1 1 1 1 1 1 1 1 1 1 1 1 1 1 1 1 1 1 1 1 1 1 1 1 1 1 1 1 
##$CPDPRG= <waltz16>
##$CPDPRG1= <>
##$CPDPRG2= <waltz16>
##$CPDPRG3= <>
##$CPDPRG4= <mlev>
##$CPDPRG5= <mlev>
##$CPDPRG6= <mlev>
##$CPDPRG7= <mlev>
##$CPDPRG8= <mlev>
##$CPDPRGB= <>
##$CPDPRGT= <>
##$D= (0..31)
0 1 0 0 0 0 0 0 0 0 0 0.03 2e-05 3e-06 0 0 0 0 0 0 0 0 0 0 0 0 0 0 0 0 
0 0 
##$DATE= 1699010832
##$DBL= (0..7)
120 120 120 11 120 120 24 19 
##$DBP= (0..7)
150 150 150 150 150 150 150 150 
##$DBP07= 0
##$DBPNAM0= <>
##$DBPNAM1= <>
$$ [...]
##$SUBNAM3= <"">
##$SUBNAM4= <"">
##$SUBNAM5= <"">
##$SUBNAM6= <"">
##$SUBNAM7= <"">
##$SUBNAM8= <"">
##$SUBNAM9= <"">
##$SW= 501.771253377433
##$SWIBOX= (0..15)
0 1 3 0 0 0 0 0 0 0 0 0 0 0 0 0 
##$SW_h= 40650.406504065
##$TD= 32768
##$TD0= 1
##$TE= 0
##$TE2= 300
##$TE3= 300
##$TEG= 300
##$TL= (0..7)
0 120 53 12 22 120 120 120 
##$TP= (0..7)
150 150 150 150 150 150 150 150 
##$TP07= 0
##$TPNAME0= <>
##$TPNAME1= <>
##$TPNAME2= <>
##$TPNAME3= <>
##$TPNAME4= <>
##$TPNAME5= <>
##$TPNAME6= <>
##$TPNAME7= <>
##$TPOAL= (0..7)
0.5 0.5 0.5 0.5 0.5 0.5 0.5 0.5 
##$TPOFFS= (0..7)
0 0 0 0 0 0 0 0 
##$TUNHIN= 0
##$TUNHOUT= 0
##$TUNXOUT= 0
##$USERA1= <user>
##$USERA2= <user>
##$USERA3= <user>
##$USERA4= <user>
##$USERA5= <user>
##$V9= 5
##$VALIST= <valist>
##$VCLIST= <CCCCCCCCCCCCCCC>
##$VD= 0
##$VDLIST= <DDDDDDDDDDDDDDD>
##$VPLIST= <PPPPPPPPPPPPPPP>
##$VTLIST= <TTTTTTTTTTTTTTT>
##$WBST= 1024
##$WBSW= 4
##$XGAIN= (0..3)
0 0 0 0 
##$XL= 0
##$YL= 0
##$YMAX_a= 270
##$YMIN_a= -209
##$ZGOPTNS= <>
##$ZL1= 120
##$ZL2= 120
##$ZL3= 120
##$ZL4= 120
##$ABSF1= 248.5645
##$ABSF2= -253.2056
##$ABSG= 5
##$ABSL= 3
##$ALPHA= 0
##$AQORDER= 0
##$ASSFAC= 0
##$ASSFACI= 0
##$ASSFACX= 0
##$ASSWID= 0
##$AUNMP= <proc_1d>
##$AZFE= 0.1
##$AZFW= 0.5
##$BCFW= 0
##$BC_mod= 2
##$BYTORDP= 0
##$COROFFS= 0
##$CY= -3
##$DATMOD= 1
##$DC= 0
##$DFILT= <>
##$DTYPP= 0
##$F1P= 0
##$F2P= 0
##$FCOR= 1
##$FTSIZE= 65536
##$FT_mod= 6
##$GAMMA= 0
##$GB= 0
##$INTBC= 1
##$INTSCL= 6.047779e-11
##$ISEN= 30
##$LB= 5
##$LEV0= 0
##$LPBIN= 0
##$MAXI= 10000
##$MC2= 0
##$MEAN= 0
##$ME_mod= 0
##$MI= 50
##$NCOEF= 0
##$NC_proc= -12
##$NLEV= 6
##$NOISF1= 182.463
##$NOISF2= 159.3651
##$NSP= 0
##$NTH_PI= 0
##$NZP= 0
##$OFFSET= 248.5645
##$PC= 4
##$PHC0= -10351.4
##$PHC1= -400.9096
##$PH_mod= 1
##$PKNL= yes
##$PPARMOD= 0
##$PSCAL= 0
##$PSIGN= 0
##$REVERSE= no
##$SF= 81.0140089999694
##$SI= 65536
##$SIGF1= 159.3651
##$SIGF2= -187.1042
##$SINO= 113.3802
##$SIOLD= 16384
##$SREGLST= <1H.CDCl3>
##$SSB= 0
##$STSI= 65536
##$STSR= 0
##$SW_p= 40650.406504065
##$SYMM= 0
##$S_DEV= 0
##$TDeff= 32768
##$TDoff= 0
##$TI= <>
##$TILT= no
##$TM1= 0
##$TM2= 0
##$TOPLEV= 0
##$USERP1= <user>
##$USERP2= <user>
##$USERP3= <user>
##$USERP4= <user>
##$USERP5= <user>
##$WDW= 1
##$XDIM= 65536
##$YMAX_p= 370501005
##$YMIN_p= -18388174
$$ End of Bruker specific parameters
$$ ---------------------------------
##NTUPLES= NMR SPECTRUM
##VAR_NAME=  FREQUENCY,     SPECTRUM/REAL,   SPECTRUM/IMAG
##SYMBOL=    X,             R,               I
##VAR_TYPE=  INDEPENDENT,   DEPENDENT,       DEPENDENT
##VAR_FORM=  AFFN,          ASDF,            ASDF
##VAR_DIM=   65536,         65536,           65536
##UNITS=     HZ,            ARBITRARY UNITS, ARBITRARY UNITS
##FACTOR=    0.620285442955139, 1,           1
##FIRST=     20137.2065510682, 0,            0
##LAST=      -20513.1999529968, 0,           0
##MIN=       -20513.1999529968, -18388174,   0
##MAX=       20137.2065510682, 370501005,    0
$$ Real data points
##PAGE= N=1
##DATA TABLE= (X++(R..R)), XYDATA
$$ [...]
38578E189804n91113o55792o77678o10228m95342l98234l10942j97369p5956K1846
$$ 5189804 4598691 3942899 3265221 2654993 2159651 1761417 1450475 1253106 1177150 1198996
38568A198996J30537K98135M69294N02038L16150j8070l36764m89279m08323j43991
$$ 1198996 1329533 1627668 2096962 2599000 2915150 2897080 2560316 2071037 1662714 1518723
38558A518723J52944L27290L27035K08664N8117m9532l4172J57607M67978P31610
$$ 1518723 1671667 1998957 2325992 2534656 2592773 2543241 2509069 2666676 3134654 3866264
38548C866264Q11603P02694M73950J64206k03214n37311p03083o57232n14209
$$ 3866264 4677867 5380561 5854511 6018717 5815503 5278192 4575109 3917877 3403668
38539C403668m43485n12580o39436o83455n77280l79892j98420n3518J47223M63041
$$ 3403668 2960183 2447603 1808167 1124712 547432 167540 -30880 -84398 62825 525866
38529E25866P69122Q22358N04696l7816n18938p38791o79520m51664k15766j19537
$$ 525866 1294988 2117346 2622042 2584226 2065288 1326497 646977 195313 -20453 -139990
38519a39990k17231m19208n60734n45041m05125k30699p1527P6269K21178L40851
$$ -139990 -357221 -776429 -1337163 -1882204 -2287329 -2518028 -2589555 -2513286 -2292108 -1951257
38509a951257L92872L56291K62729J70160R1374k7925k28612m56275o02766o15250
$$ -1951257 -1558385 -1202094 -939365 -769205 -677831 -705756 -934368 -1390643 -1993409 -2608659
38499b608659n14632l22741m7373K50955M60443N27904N06696M54491L47473J53161
$$ -2608659 -3123291 -3446032 -3493405 -3242450 -2782007 -2254103 -1747407 -1292916 -945443 -792282
38489g92282o9615k18738k59330k13625p7367J61141M28867N87916N68324M23605
$$ -792282 -861897 -1080635 -1339965 -1553590 -1630957 -1469816 -1040949 -453033 115291 538896
38479E38896K54239J41261J44999K67305L82605L01871k2190l99728n70742m42279
$$ 538896 793135 934396 1079395 1346700 1729305 2031176 2008986 1609258 1038516 596237
38469E96237j33771J59414K97747K42504N0549j66237l12137l53681l13132k60301
$$ 596237 462466 621880 919627 1162131 1212680 1046443 734306 380625 67493 -192808
38459a92808l09133n42483q89823j134934j106840q32861m65769j18826J66311
$$ -192808 -501941 -1044424 -1934247 -3069181 -4176021 -5008882 -5474651 -5593477 -5427166
38450e427166L56596M40404M79344N44895O04324N58712L96612K18324R5164J629
$$ -5427166 -5070570 -4630166 -4150822 -3605927 -3001603 -2442891 -2046279 -1827955 -1732791 -1731162
38440a731162p8896p5643P2704K94306M23738L53411J20850j33649k87833l49733
$$ -1731162 -1810058 -1885701 -1812997 -1518691 -1094953 -741542 -620692 -754341 -1042174 -1391907
38430a391907m52388o94988r96802j171466j140080r85444p93536n62175l11114
$$ -1391907 -1844295 -2539283 -3536085 -4707551 -5847631 -6833075 -7626611 -8188786 -8499900
38421h499900j51740j43423j70314p8700J24180L27899N23960Q07936J180938
$$ -8499900 -8651640 -8795063 -8965377 -9044077 -8919897 -8591998 -8068038 -7260102 -6079164
38412f079164J483922J565205J421934J153824Q67272O48087N29376M36920K45389
$$ -6079164 -4595242 -3030037 -1608103 -454279 412993 1061080 1590456 2027376 2272765
38403B272765n5326l10532l68468k43715o4057R0200K27507L59689M45430M21984
$$ 2272765 2217439 1906907 1538439 1294724 1230667 1320867 1548374 1908063 2353493 2775477
38393B775477K62794J2792k17458l21771k91449k18696j89384k01690k07469j88885
$$ 2775477 3038271 3051063 2833605 2511834 2220385 2001689 1812305 1610615 1403146 1214261
38383A214261j58488j23290r6161j16398k09971l40658m37043m58381m10607l21772
$$ 1214261 1055773 932483 836322 719924 509953 169295 -267748 -726129 -1136736 -1458508
38373a458508k34179j97974k34362l14356l91130m25907l67781j67149J39483
$$ -1458508 -1692687 -1890661 -2125023 -2439379 -2830509 -3256416 -3624197 -3791346 -3651863
38364c651863M07540N19659N16542N23997N74098N78864M69584K74654N2692j65290
$$ -3651863 -3244323 -2724664 -2208122 -1684125 -1110027 -531163 -61579 213075 265767 100477
38354A00477l42428m20555l74082k24619J5368L38592O49714P64391N83605K32265
$$ 100477 -241951 -662506 -1036588 -1261207 -1245839 -907247 -257533 506858 1090463 1322728
38344A322728m1840q8071O5871L00377M91025N29919L58989L2508k84005m20438
$$ 1322728 1280888 1192817 1258688 1559065 2050090 2580009 2938998 2971506 2687501 2267063
38334B267063l31224j33747q733k1983l7050J38362M86142P22608N84830J40907
$$ 2267063 1935839 1802092 1793359 1771376 1734326 1872688 2358830 3081438 3666268 3807175
38324C807175k64324l60416j74902P3035J90810R9912j75436n10346p19110o86996
$$ 3807175 3542851 3182435 3007533 3080568 3271378 3371290 3195854 2685508 1966398 1279402
38314A279402m68708k18334m2190L9423K5249q8376k57499l91196m33389m03463
$$ 1279402 810694 592360 550170 589593 614842 526466 268967 -122229 -555618 -959081
38304i59081l38632k46482j46642j09179j89055l35900m25189l91325k98098k67588
$$ -959081 -1297713 -1544195 -1690837 -1800016 -1989071 -2324971 -2750160 -3141485 -3439583 -3707171
38294c707171l59505n18494o11748n21368k44325P9142K74506L04105L07141M37187
$$ -3707171 -4066676 -4585170 -5196918 -5718286 -5962611 -5883469 -5608963 -5304858 -4997717 -4560530
38284d560530O80976Q76004Q86565P09179M17679Q7640j89385k90906j51463J40816
$$ -4560530 -3879554 -3003550 -2116985 -1407806 -990127 -902487 -1091872 -1382778 -1534241 -1393425
38274a393425M00754N15019N13720M67729L74548J89944o4740k91599m15365m44152
$$ -1393425 -992671 -477652 36068 503797 878345 1068289 1003549 711950 296585 -147567
38264a47567m15186l25850j58155N4443K37436L56402M44624N29899N65551M66834
$$ -147567 -562753 -888603 -1046758 -992315 -754879 -398477 46147 576046 1141597 1608431
38254A608431K06941j44273m70489o83011p59716p37905o69748n70705m18095
$$ 1608431 1815372 1671099 1200610 517599 -242117 -980022 -1649770 -2220475 -2638570
38245b638570k14098l1863L5404k8173j41507k06267j82928r1806K4384J26010
$$ -2638570 -2852668 -2884531 -2849127 -2877300 -3018807 -3225074 -3408002 -3499808 -3475424 -3349414
38235c349414J92792K32875K63751K82596K73413K34606J67165M9725j15138k27120
$$ -3349414 -3156622 -2923747 -2659996 -2377400 -2103987 -1869381 -1702216 -1652491 -1767629 -1994749
38225a994749j41756J58532N10853P44411Q46191Q82937Q23323N62389J14687
$$ -1994749 -2136505 -1977973 -1467120 -722709 123482 1006419 1829742 2392131 2506818
38216B506818l41613o51794q20880r14448r12467p43309m14678l4249K75934M30610
$$ 2506818 2165205 1513411 692531 -221917 -1134384 -1877693 -2292371 -2326620 -2050686 -1620076
38206a620076L86675J78819n8227j75198j28560K2112K11228L89898M71604L72240
$$ -1620076 -1233401 -1054582 -1112809 -1288007 -1416567 -1394455 -1183227 -793329 -321725 50515
38196E0515J50909J8277J21387L64078N09362M22455J47187k04448n24138o80646
$$ 50515 201424 219701 341088 705166 1214528 1636983 1784170 1579722 1055584 374938
38186C74938n60513k05817J65965L56942L67179L26130K93272K01460k1876l47968
$$ 374938 -185575 -391392 -225427 131515 498694 824824 1118096 1319556 1297680 949712
38176I49712o58709q12367p14048l99165o1400P3111n9259l20607n35378o39607
$$ 949712 291003 -521364 -1235412 -1634577 -1695977 -1622866 -1682125 -2002732 -2538110 -3177717
38166c177717o51005n70389l87839j56302J8061P4818N6121O1148J65990L81305
$$ -3177717 -3828722 -4399111 -4786950 -4943252 -4925191 -4850373 -4794252 -4733104 -4567114 -4185809
38156d185809O57687R21460J111546J183331J097993Q61848N96475N01964O63401
$$ -4185809 -3528122 -2606662 -1495116 -311785 786208 1648056 2244531 2746495 3409896
38147C409896Q94560Q48874L34059m90555j233450j570765j443529j020193n18675
$$ 3409896 4304456 5153330 5487389 4996834 3763384 2192619 749090 -271103 -789778
38138g89778o9673K81403M94233N09106L14990L815k77902m20513l83372j82111
$$ -789778 -859451 -578048 -83815 425291 740281 744096 466194 45681 -337691 -519802
38128e19802R8719K98937K66385j0461l69265n89447n45836k80582L3092K10314
$$ -519802 -421083 -122146 144239 133778 -235487 -824934 -1370770 -1651352 -1618260 -1407946
38118a407946J95967J07160J03719K11731L15395L26815L00832L42931M51372
$$ -1407946 -1211979 -1104819 -1001100 -789369 -473974 -147159 153673 496604 947976
38109I47976N14380M55482L29388K60084L15799M61568O06525O61276N57461K71241
$$ 947976 1462356 1917838 2247226 2507310 2823109 3284677 3891202 4552478 5109939 5381180
38099E381180j23321m53922n81379n47538n21032n61993n25167k75676P0158K45587
$$ 5381180 5257859 4803937 4222558 3675020 3153988 2591995 2066828 1791152 1861310 2106897
38089B106897J56194k7117j13878j01683q0238m5676P9582K94069M82553N23640
$$ 2106897 2263091 2235974 2122096 2020413 1940175 1894499 1974081 2268150 2750703 3274343
38079C274343L79739J10482j47320k46831j50707K0603J04544M6032j01331k79283
$$ 3274343 3654082 3764564 3617244 3370413 3219706 3240309 3344853 3390885 3289554 3010271
38069C010271m62487o16989o97329o84572n71254l22825P2422N14655Q33897R48212
$$ 3010271 2547784 1930795 1233466 548894 -22360 -345185 -272763 241892 1075789 2024001
38059B024001R25733Q69714Q00324O76304M70622J78615j94868n86407q35816
$$ 2024001 2949734 3819448 4619772 5296076 5766698 5945313 5750445 5164038 4328222
38050D328222p79836m21703J9620K64585J92372q4342l48336m68154m60017l88580
$$ 4328222 3548386 3126683 3146303 3410888 3603260 3518918 3170582 2702428 2242411 1853831
38040A853831k59986m6816K12084L99736M26699L12149J37197n3910k70170m98391
$$ 1853831 1593845 1547029 1759113 2158849 2585548 2897697 3034894 2980984 2710814 2212423
38030B212423o52169o33262m54421k77072k82527m85097p00778p33212n73101
$$ 2212423 1560254 926992 472571 195499 -87028 -572125 -1272903 -2006115 -2579216
38021b579216l76057k60764j92113p9928P0475J64559J52857R9563J06905K12054
$$ -2579216 -2955273 -3216037 -3408150 -3488078 -3417603 -3253044 -3100187 -3000624 -2893719 -2681665
38011b681665L77504N44571O54849O41553M66631J91082l8579j15655n8377O3772
$$ -2681665 -2304161 -1759590 -1104741 -463188 3443 194525 155946 40291 -18086 45686
38001D5686K41358M88201P21233P85402O23226L28916j040l68701p60159j038065
$$ 45686 287044 775245 1496478 2281880 2905106 3234022 3232982 2864281 2104122 1066057
37991A066057j074160r32365p84786o68668m67654j43385J59145K90499K61023
$$ 1066057 -8103 -940468 -1725254 -2393922 -2861576 -3004961 -2845816 -2555317 -2294294
37982b294294J53124k3436k80354n22307n96730m67882k51361o5854P8257K22204
$$ -2294294 -2141170 -2164606 -2444960 -2967267 -3563997 -4031879 -4283240 -4349094 -4270837 -4048633
37972d048633L47780L64234J96615j23873m53234o25849n69236l35339l4872K24861
$$ -4048633 -3700853 -3336619 -3140004 -3263877 -3717111 -4342960 -4912196 -5247535 -5282407 -5057546
37962e057546L44442K55914P720k15354k45585j12960m735k4759n6539Q8709M26742
$$ -5057546 -4713104 -4457190 -4449470 -4664824 -4910409 -5023369 -5028104 -5052863 -5109402 -5020693 -4593951
37951d593951P58177Q65756P19090M87783L82946M83773O80417P64533N95375
$$ -4593951 -3835774 -2970018 -2250928 -1763145 -1380199 -896426 -216009 548524 1143899
37942A143899K07274k32637n64305p26724p37392o40619n05222m24035m48542
$$ 1143899 1351173 1118536 554231 -172493 -909885 -1550504 -2055726 -2479761 -2928303
37933b928303n29768n75936n61067n11449l86898p5336M39065R77066J312603
$$ -2928303 -3458071 -4034007 -4595074 -5106523 -5493421 -5568757 -5129692 -4152626 -2840023
37924b840023J375997J238825R55241N39687R3858j77894j45197J17967M19029
$$ -2840023 -1464026 -225201 730040 1269727 1363585 1185691 1040494 1158461 1577490
37915A577490O04731N99689L67429p1489n85713r61751j025975p55507k91759
$$ 1577490 2182221 2781910 3149339 3077850 2492137 1530386 504411 -251096 -542855
37906e42855J50328M14628M71918L70566J55762j25584l71920m59120l48183j18251
$$ -542855 -392527 22101 494019 864585 1020347 894763 522843 63723 -284460 -402711
37896d02711J14234K66559K95759K17144J33549J63021K98930M08104L96861K98949
$$ -402711 -288477 -21918 273841 490985 624534 787555 1086485 1494589 1891450 2190399
37886B190399J62042m8612l48889o18869o97134n57995l11065o1757J45125K87374
$$ 2190399 2352441 2303829 1954940 1336071 638937 80942 -230123 -291880 -146755 140619
37876A40619L77229M90109O74420Q32833P90706M92947M9325m15300q51731j205846
$$ 140619 517848 1007957 1682377 2515210 3305916 3798863 3848188 3432888 2581157 1375311
37866A375311j359341j224205q44107l55299J07488M37005N57301M75976L11684
$$ 1375311 15970 -1208235 -2052342 -2407641 -2300153 -1863148 -1305847 -829871 -518187
37857e18187K14804K53285L80422M84381M57341K65082n946j89827j71468J4535
$$ -518187 -303383 -50098 330324 814705 1272046 1537128 1531182 1341355 1169887 1184422
37847A184422K17147K90101J88484j6768k02968k97838l32779l80051m39660m20675
$$ 1184422 1401569 1691670 1880154 1863386 1660418 1362580 1029801 649750 210090 -210585
37837b10585k42670P1622M08347O40579P05288O52117O15011O72861P22708N61520
$$ -210585 -453255 -381633 26714 667293 1372581 2024698 2639709 3312570 4035278 4596798
37827D596798J33799l63702o77854p44853o69929n12758k12631K48537P02455
$$ 4596798 4730597 4366895 3689041 2944188 2274259 1761501 1548870 1797407 2499862
37818B499862Q89013O77533J62059m31743q83350j042232q49793l69877K16535
$$ 2499862 3388875 4066408 4228467 3796724 2913374 1871142 1021349 651472 868007
37809H68007P08894J005484J106858J013380O87236J56581l97952p44066p93011
$$ 868007 1576901 2582385 3689243 4702623 5389859 5546440 5148488 4404422 3611411
37800C611411o52516m93207m13031m26229n06965n98209o17548n07529k84067
$$ 3611411 2958895 2465688 2052657 1626428 1119463 521254 -96294 -603823 -887890
37791h87890k0439K12807L87907N08054N57655M71790J92407k19984n73366p01670
$$ -887890 -908329 -695522 -307615 200439 758094 1229884 1422291 1202307 628941 -72729
37781g2729o17834m58339l06095j49324M407R0021Q9727O9418N1267o0720l41759
$$ -72729 -690563 -1148902 -1454997 -1604321 -1599914 -1509893 -1420166 -1350748 -1299481 -1360201 -1701960
37770a701960o84027q55711p04637k61488L10372Q01535J033251R38562N86790
$$ -1701960 -2385987 -3241698 -3946335 -4207823 -3897451 -3095916 -2062665 -1124103 -537313
37761e37313J04998m03925q50308j135151j211799j135674r84968p62615m44698
$$ -537313 -432315 -836240 -1686548 -2821699 -4033498 -5169172 -6154140 -6916755 -7361453
37752g361453q8495J98283L79222M91252N39174M94412M09517M19800N77050P60704
$$ -7361453 -7449948 -7251665 -6872443 -6381191 -5842017 -5347605 -4938088 -4518288 -3941238 -3180534
37742c180534Q11442O93483M74161K06890q9514l69484n58215o15859n62544m41906
$$ -3180534 -2369092 -1675609 -1201448 -994558 -1084072 -1453556 -2011771 -2627630 -3190174 -3632080
37732c632080k91104j35190K8150K34267M98113P39201P94026N47169O8819l89624
$$ -3632080 -3923184 -4058374 -4030224 -3795957 -3297844 -2558643 -1764617 -1217448 -1148629 -1538253
37722a538253n72044m27850j55639j7367r4945k38132k51624j07791M1812M3370
$$ -1538253 -2110297 -2538147 -2693786 -2711153 -2806098 -3044230 -3295854 -3403645 -3361833 -3318463
37712c318463j04541k74391l56482l54383l38148l36680l06205j93839P528K74908
$$ -3318463 -3423004 -3697395 -4053877 -4408260 -4746408 -5083088 -5389293 -5583132 -5575604 -5300696
37702e300696N80631Q68955J039784J009490P93619N03664K62294J33985J12742
$$ -5300696 -4720065 -3851110 -2811326 -1801836 -1008217 -504553 -242259 -108274 4468
37693D468J38645J39392R7785P1273J03366J29867L7244j78454l80757m53276
$$ 4468 143113 282505 380290 451563 554929 684796 722040 543586 162829 -290447
37683b90447m30813m18717m29764l78771k30000p2067j3932n3903r8458q8136
$$ -290447 -721260 -1139977 -1569741 -1948512 -2178512 -2250579 -2264511 -2318414 -2416872 -2505008
37673b505008m5701J2947J58485M80394R51077J413697J718210J827183J779659
$$ -2505008 -2550709 -2537762 -2379277 -1898883 -947806 465891 2184101 4011284 5790943
37664E790943J619308J408165J261498J294925J540334J944079K406475K768767
$$ 5790943 7410251 8818416 10079914 11374839 12915173 14859252 17265727 20034494
37656B0034494K819391K432955J721810R75025M34674J85803K22758M75029P30650
$$ 20034494 22853885 25286840 27008650 27983675 28418349 28604152 28826910 29301939 30032589
37647C0032589O88365K15165n02671j152747j588461j847967j954814j844760
$$ 30032589 30720954 30936119 30433448 29280701 27692240 25844273 23889459 22044699
37639B2044699j503363j068806p49145o79581q66778j209191j541503j704439
$$ 22044699 20541336 19472530 18723385 18043804 17177026 15967835 14426332 12721893
37631A2721893j621780j327718r33397n68928l17698j69724o2679J306p6453l48862
$$ 12721893 11100113 9772395 8838998 8270070 7952372 7782648 7719969 7721275 7644822 7295960
37621G295960o87106q74972q38275p03018o15028n80587n19608m11565l29936
$$ 7295960 6608854 5733882 4895607 4192589 3577561 2996974 2477366 2065801 1735865
37612A735865l50692m61575n63593n65130m87643m56309n48715o74765o62406
$$ 1735865 1385173 923598 360005 -205125 -692768 -1149077 -1697792 -2372557 -3034963
37603c034963m49584j29043J81826M30937N94146O54854O53440O58766O44005
$$ -3034963 -3484547 -3613590 -3431764 -3000827 -2406681 -1751827 -1098387 -439621 204384
37594B04384M90413J78435j29636k91548l69281m80329n49164l95316n8035J63697
$$ 204384 694797 873232 743596 452048 82767 -397562 -946726 -1342042 -1400077 -1236380
37584a236380O7462j96629l20065j84409Q5203L33213N09708O17054O41970N76016
$$ -1236380 -1168918 -1365547 -1685612 -1870021 -1784818 -1451605 -941897 -324843 317127 893143
37574H93143M42785K72957P6389j52834m16726o83213q57882q26482n79911k73353
$$ 893143 1335928 1608885 1685274 1532440 1115714 432501 -425381 -1251863 -1831774 -2105127
37564b105127r1779n6077k6099R7604K49816L10450K71741K37954K95939M42531
$$ -2105127 -2196906 -2252983 -2279082 -2181478 -1931662 -1621212 -1349471 -1111517 -815578 -373047
37554c73047O16055P40979P52414O39213M75159L59752L07160K27625L9174k29359
$$ -373047 243008 983987 1736401 2375614 2850773 3210525 3517685 3745310 3784484 3555125
37544C555125m64790n71949n28079l64482j37344Q1893K18705K22605R5644r2863
$$ 3555125 3090335 2518386 1990307 1625825 1488481 1570374 1789079 2011684 2107328 2014465
37534B014465k25266k05608m2160J48646K41220J96305N0790j44838l25155l72473
$$ 2014465 1789199 1583591 1541431 1690077 1931297 2127602 2178392 2033554 1708399 1335926
37524A335926j80886J89637M82323M51600J08964k81879m56534l62166j35206
$$ 1335926 1155040 1344677 1827000 2278600 2387564 2105685 1649151 1286985 1151779
37515A151779N9340J37169J09092N9586R6839K57058M36794M59593K42024j12006
$$ 1151779 1211119 1348288 1457380 1516966 1613805 1870863 2307657 2767250 3009274 2897268
37505B897268l89566m34644k50609K0003J95920J66329n5195l61882o28444p52784
$$ 2897268 2507702 2073058 1822449 1842452 2038372 2204701 2149506 1787624 1159180 406396
37495D06396o58536l24804J53765N80346P88693P65292O14616M20244J82133j16345
$$ 406396 -252140 -576944 -423179 157167 945860 1711152 2325768 2746012 2928145 2811800
37485B811800m32095o74140p65778o87298m88437k72588j38951j13824j42192
$$ 2811800 2379705 1705565 939787 252489 -235948 -508536 -647487 -761311 -903503
37476i03503j46283p7314P7995K99632N32422P17959Q44472R35094R77185R05621
$$ -903503 -1049786 -1127100 -1049105 -749473 -217051 500908 1345380 2280474 3257659 4163280
37466D163280O80222L42918k8565l84715o86275q61446q40530o34058l49124j31842
$$ 4163280 4843502 5186420 5157855 4773140 4086865 3225419 2384889 1750831 1401707 1269865
37456A269865r4045k49023m83839o33108o23631n15880l72515j54049J74080M82405
$$ 1269865 1175820 926797 442958 -190150 -813781 -1329661 -1702176 -1856225 -1682145 -1199740
37446a199740N48642L00778j02044m49507o56327p37882p09777n77307l66450
$$ -1199740 -651098 -350320 -452364 -901871 -1558198 -2296080 -3005857 -3583164 -3949614
37437c949614j04666J91043M62137N91441N02932K64819M7599j9971N8326J70103
$$ -3949614 -4054280 -3863237 -3401100 -2809659 -2306727 -2041908 -1994309 -2014280 -1955954 -1785851
37427a785851J88909P7641p7467j61822j68074j86877k50563k66344j60347j9198
$$ -1785851 -1596942 -1519301 -1596768 -1758590 -1926664 -2113541 -2364104 -2630448 -2790795 -2809993
37417b809993j371j38806l07677l82255l41497k22129l9594K11291N04566P50335
$$ -2809993 -2811364 -2950170 -3257847 -3640102 -3981599 -4203728 -4243322 -4032031 -3527465 -2777130
37407b777130Q22790O61144L63408J22379J7515p2272k73773m95586n16741k82514
$$ -2777130 -1954340 -1293196 -929788 -807409 -789894 -862166 -1135939 -1631525 -2148266 -2430780
37397b430780J5024J74222J86249J55704J31515J05728J11748K20797M51440P42124
$$ -2430780 -2415756 -2241534 -2055285 -1899581 -1768066 -1662338 -1550590 -1329793 -878353 -136229
37387a36229R99166J124635J023501O59476J26841l74510o72809p40024o74913
$$ -136229 862937 1987572 3011073 3670549 3797390 3422880 2750071 2010047 1335134
37378A335134n78630m60136k76482m9142J16227J57347J51829K22802L77207N11091
$$ 1335134 756504 296368 19886 -29256 86971 244318 396147 618949 996156 1507247
37368A507247N55813N31256M62376L52240K59489K85895M26266N27464M75485
$$ 1507247 2063060 2594316 3056692 3408932 3668421 3954316 4380582 4908046 5383531
37359E383531L46732K88860L16858L21128K25388L6174k22865n11249p21402p43374
$$ 5383531 5730263 6019123 6335981 6657109 6882497 6918671 6695806 6184557 5463155 4719781
37349D719781n99532m30954l31226k64159j60003k3023P9268Q0721m1806k40827
$$ 4719781 4120249 3689295 3358069 3093910 2933907 2910884 2990152 3070873 3029067 2788240
37339B788240m08175m65058m40540m07704l64630k65203j55949j62004l00153
$$ 2788240 2380065 1915007 1474467 1066763 702133 436930 280981 118977 -181176
37330a81176m09884l30330o9807K46591N06249O20622N09432J92962j44018k91831
$$ -181176 -591060 -921390 -991197 -744606 -238357 382265 891697 1084659 940641 648810
37320F48810k12957k9809J53132L26198M92470O10730O40228N75478M25032K12153
$$ 648810 435853 406044 559176 885374 1377844 1988574 2628802 3204280 3629312 3841465
37310C841465n711j84434l59359n87796q16971q94321p40756m42424j37743J12497
$$ 3841465 3835754 3651320 3291961 2704165 1887194 992873 252117 -190307 -328050 -215553
37300b15553K99936L96678L88736L33989L04487K88526K12244M2773j82960m10214
$$ -215553 84383 481061 869797 1203786 1508273 1796799 2009043 2051816 1868856 1458642
37290A458642n88621o63662o15467n01615m00201l15389j99064n1324Q2077K07537
$$ 1458642 870021 206359 -409108 -910723 -1310924 -1626313 -1825377 -1876701 -1794624 -1587087
37280a587087L74893N45968N84266M42145K62872K01505K14918J42590m8657k27079
$$ -1587087 -1212194 -666226 -81960 360185 623057 824562 1039480 1182070 1133413 906334
37270I06334k89106k58703j75742j9916J86455L06343K23629L015j75453k19517
$$ 906334 617228 358525 182783 162867 349322 655665 879294 882309 706856 487339
37260D87339j90144j82555k18329k58477k55083j67751J9744K60168M38158M37527
$$ 487339 297195 114640 -103689 -362166 -617249 -785000 -765256 -505088 -66930 370597
37250C70597K32385p3026k94891k95687r8348J26961K08509J00649j31766m07127
$$ 370597 602982 529956 235065 -60622 -158970 -32009 176500 277149 145383 -261744
37240b61744o63460q39309q88419q14540o44647l77537j9030L37925N55923O16403
$$ -261744 -925204 -1764513 -2652932 -3467472 -4112119 -4489656 -4508686 -4170761 -3614838 -2998435
37230b998435O73747Q79135J177699J343546J217296Q65591M94372K35218M3112
$$ -2998435 -2324688 -1445553 -267854 1075692 2292988 3158579 3652951 3888169 3931281
37221C931281j97474m90108o84954o37556l83650j16923k377n6888k09907m10703
$$ 3931281 3733807 3243699 2558745 1921189 1537539 1420616 1418239 1361351 1151444 740741
37211G40741o31094q03361q16729n87146j25956M38317R00438J091476R99386
$$ 740741 109647 -693714 -1510443 -2097589 -2223545 -1785228 -884790 206686 1206072
37202A206072P58611M86540J57549l15903r03541j426033j706222j692589j421704
$$ 1206072 1964683 2451223 2608772 2292869 1389328 -36705 -1742927 -3435516 -4857220
37193d857220r33359k87931L61979Q01413R03811P45746N49296M98888O05373
$$ -4857220 -5790579 -6078510 -5716531 -4915118 -4011307 -3265561 -2716265 -2217377 -1612004
37184a612004P31094P29906N69488L49530K20732K62673M05138M75117L55789
$$ -1612004 -880910 -151004 418484 768014 988746 1251419 1656557 2131674 2487463
37175B487463J01225j33771k66321l39245m09160m61267m69766m63812m61013
$$ 2487463 2588688 2454917 2188596 1849351 1440191 978924 509158 45346 -415667
37166d15667l93236j96845M8588J80012J56978J02330J03755Q5867l5196j54042
$$ -415667 -808903 -1005748 -957160 -777148 -620170 -517840 -414085 -328218 -363414 -517456
37156e17456p0368K19537M45372L39198o8226m89007o86683o79569o41012o68281
$$ -517456 -587824 -368287 77085 416283 348057 -140950 -827633 -1507202 -2148214 -2816495
37146b816495o95960o06289l66590n1119K27904L87478M07819L42540K89297L17412
$$ -2816495 -3512455 -4118744 -4485334 -4536453 -4308549 -3921071 -3513252 -3170712 -2881415 -2564003
37136b564003M15626N19297N76453N69506M93812L56239J92919M8134p3677k02763
$$ -2564003 -2148377 -1629080 -1052627 -483121 10691 366930 559849 607983 534306 331543
37126C31543l44839m64014n35799n74483n86122n38998m18078k70798j48851l2297
$$ 331543 -13296 -477310 -1013109 -1587592 -2173714 -2712712 -3130790 -3401588 -3550439 -3582736
37116c582736J27830L03628L96139L62700K84852K82651L94585N56186O58046
$$ -3582736 -3454906 -3151278 -2755139 -2392439 -2107587 -1824936 -1430351 -874165 -216119
37107b16119O12963M21515K02330R8245R6745n389l77063r14756j312506j364200
$$ -216119 396844 818359 1020689 1118934 1215679 1210290 833227 -81529 -1394035 -2758235
37097b758235j114092p16948k78736J09336L09292K52956Q4806N6567K55390N20435
$$ -2758235 -3872327 -4589275 -4868011 -4758675 -4449383 -4196427 -4111621 -4055054 -3799664 -3279229
37087c279229O52433O30353N82162N99698O36638N71330L41773K5140k19294l09433
$$ -3279229 -2626796 -1996443 -1414281 -814583 -177945 393385 735158 760298 541004 231571
37077B31571l23751l75426m26917l28962o5822J51099J17799j05662k71846k39014
$$ 231571 -92180 -467606 -894523 -1223485 -1289307 -1138208 -1020409 -1126071 -1397917 -1636931
37067a636931q4371N8714J60524K56960L35814L24841J67860j19142m49656p08925
$$ -1636931 -1721302 -1662588 -1502064 -1245104 -909290 -584449 -416589 -535731 -985387 -1694312
37057a694312q16942p67984o06159l75635j15224J22221K93029M01718M76430
$$ -1694312 -2511254 -3279238 -3885397 -4261032 -4376256 -4254035 -3961006 -3559288 -3082858
37048c082858N15548N08995M99269N44655O10752N84593M39975L12344L36993
$$ -3082858 -2567310 -2058315 -1559046 -1014391 -403639 180954 620929 933273 1270266
37039A270266M61062M97868L47752Q8324j48546l07263l91490l89457k83524j21032
$$ 1270266 1731328 2229196 2576948 2665272 2516726 2209463 1817973 1428516 1144992 1023960
37029A023960k3901j02204l59388o81868r14645r49845p65568m17171j1613L36772
$$ 1023960 1000059 897855 538467 -143401 -1058046 -2007891 -2773459 -3190630 -3202243 -2865471
37019b865471N75417P48104R20545J055317J011988P24145L48597J60597K70984
$$ -2865471 -2290054 -1541950 -621405 433912 1445900 2170045 2518642 2679239 2950223
37010B950223M90186N17006K52043j12595l17978l10881k56281l03806m19209
$$ 2950223 3440409 3957415 4209458 4096863 3778885 3468004 3211723 2907917 2488708
37001B488708m86374n05672n82477p22312p64409n95922l46664k51352l45309
$$ 2488708 2002334 1496662 914185 191873 -572536 -1168458 -1515122 -1766474 -2111783
36992b111783m20904l06367p5785P4967O9014k2322j27444k36099l25529l39011
$$ -2111783 -2532687 -2839054 -2914839 -2839872 -2770858 -2793180 -2920624 -3156723 -3482252 -3821263
36982c821263k76472k27377k57868l15272l02663k16163j45971j49905j77741
$$ -3821263 -4097735 -4325112 -4582980 -4898252 -5200915 -5417078 -5563049 -5712954 -5890695
36973e890695j23792Q1513M22351P87609J009720R78850P51916N06845L60774
$$ -5890695 -6014487 -5932974 -5510623 -4723014 -3713294 -2734444 -1982528 -1475683 -1114909
36964a114909K78778J94464J51623K37997M10175M99362M19423K74000J98312
$$ -1114909 -836131 -641667 -490044 -252047 158128 657490 1076913 1350913 1549225
36955A549225J75251J05273J1819M1730K29409L72227K33774j69902n69742p16119
$$ 1549225 1724476 1829749 1841568 1883298 2112707 2484934 2718708 2548806 1979064 1262945
36945A262945n78352k78188P4132M17170O74474P50534O11421L35324O9962n9443
$$ 1262945 684593 406405 480537 897707 1572181 2322715 2934136 3269460 3339422 3279979
36935C279979l3234L6624q666k11506m31528m93536l87320k53505j78176r5170
$$ 3279979 3246745 3283369 3274703 3063197 2631669 2138133 1750813 1497308 1319132 1223962
36925A223962P6106K86428M20542M48846M38712M43077M44254L92316K43832k1105
$$ 1223962 1300068 1586496 2007038 2455884 2894596 3337673 3781927 4174243 4418075 4396970
36915D396970l65104o86650q96557r94856j034962j033025r56424p73580m61943
$$ 4396970 4031866 3345216 2448659 1453803 418841 -614184 -1570608 -2344188 -2806131
36906b806131n006N35300R63198J071758Q53857N28812L36090L47585M78427O06136
$$ -2806131 -2811137 -2275837 -1312639 -240881 612976 1141788 1477878 1825463 2303890 2910026
36896B910026O57817O46195O48813P04696P26666N83376K77695l7524k41608l51886
$$ 2910026 3567843 4214038 4862851 5567547 6294213 6877589 7155284 7117760 6876152 6524266
36886F524266m10405l71211j86721O1409K13668J89014K4891k06560m54909o84300
$$ 6524266 6113861 5742650 5555929 5617338 5831006 6020020 6044911 5838351 5383442 4699142
36876D699142q68062r81105r68517p61981l75750N0076L56470M90308M84592L65099
$$ 4699142 3831080 2849975 1881458 1119477 743727 793803 1150273 1640581 2125173 2490272
36866B490272J44001j28072l78474n71206o99699p46059p00253n90499m37823
$$ 2490272 2634273 2506201 2127727 1556521 856822 110763 -589490 -1179989 -1617812
36857a617812k15566P8146L43159M59841M37919M05426M53211N56153O34947O21246
$$ -1617812 -1833378 -1755232 -1412073 -952232 -514313 -108887 344324 900477 1535424 2156670
36847B156670M71303J97861j02653l17346m10454m02998l06900j79553k02403
$$ 2156670 2627973 2825834 2723181 2405835 1995381 1592383 1285483 1105930 903527
36838I03527n40425j077741j425530j281302p16270o3840L88692N45731M57535
$$ 903527 363102 -714639 -2140169 -3421471 -4137741 -4201581 -3812889 -3267158 -2809623
36829b809623K57550J11894J20511K42494L53999L77168L36987L19713L92088
$$ -2809623 -2552073 -2440179 -2319668 -2077174 -1723175 -1346007 -1009020 -689307 -297219
36820b97219N23041N74092M31921J81062P0392K49283N95580Q66800R59040R33707
$$ -297219 225822 799914 1231835 1412897 1483289 1732572 2328152 3194952 4153992 5087699
36810E087699Q45885O71002M05708J37576k8547o4134j8718K4323k1827k09950
$$ 5087699 5933584 6604586 7010294 7147870 7119323 7055189 7036471 7060794 7038967 6829017
36800F829017n14222q38811j086297j206574j184156j016677p33146m18941j89134
$$ 6829017 6314795 5475984 4389687 3183113 1998957 982280 249134 -169807 -358941
36791c58941j13105j62804k52992l42364m65975o35488p44429o52796l71547p7640
$$ -358941 -472046 -634850 -887842 -1230206 -1696181 -2331669 -3076098 -3728894 -4100441 -4178081
36781d178081R3852K00355L78555O42505Q68533R44095Q63118P03961N78353N67517
$$ -4178081 -4084229 -3883874 -3505319 -2862814 -1994281 -1050186 -187068 516893 1095246 1662763
36771A662763O29179N93176L40217k3631k64198k95161k57349k96904l69946l38891
$$ 1662763 2291942 2885118 3225335 3201704 2937506 2642345 2384996 2088092 1718146 1379255
36761A379255j91543p0384j01231k64832m44446n46563n48324m56704k72039k0351
$$ 1379255 1187712 1117328 1016097 751265 306819 -239744 -788068 -1244772 -1516811 -1537162
36751a537162J99909K64973J52590j9341j28926j91173k99335m55754n58089n61783
$$ -1537162 -1337253 -1072280 -919690 -939031 -1067957 -1259130 -1558465 -2014219 -2572308 -3134091
36741c134091n52908o08053o63121o00173m21127k53852j93475j96150j33200
$$ -3134091 -3686999 -4295052 -4958173 -5558346 -5979473 -6233325 -6426800 -6622950 -6756150
36732f756150Q7888M52734Q49007J135470J227686J133957R17777O44542L67376
$$ -6756150 -6668262 -6215528 -5366521 -4231051 -3003365 -1869408 -951631 -307089 60287
36723F0287J32540k4656p5787Q813K22295M61394N64183M59424K43369O0074n3363
$$ 60287 192827 168171 92384 101197 323492 784886 1349069 1808493 2051862 2111936 2058573
36712B058573j36042j61185m0884K04323L79386K89819n2582m43687o75595o73172
$$ 2058573 1922531 1761346 1720462 1924785 2304171 2593990 2541408 2097721 1422126 748954
36702G48954m83674k03415P5104K91565M28767M98122N15675M95020M46003L55396
$$ 748954 265280 61865 136969 428534 857301 1355423 1871098 2366118 2812121 3167517
36692C167517J72068j58583o23426j107436j446625j530953j365089j033163o15703
$$ 3167517 3339585 3181002 2557576 1450140 3515 -1527438 -2892527 -3925690 -4541393
36683d541393j62108K56991N21834N47485L92591K30131J90821K70343L92824
$$ -4541393 -4703501 -4446510 -3924676 -3377191 -2984600 -2754469 -2563648 -2293305 -1900481
36674a900481M97669N30633M30109K12793L4041N4464K38145L77063L45110K43663
$$ -1900481 -1402812 -872179 -442070 -229277 -195236 -140772 97373 474436 819546 1063209
36664A063209K48210L88515N52584O47644O59477N76741L65973N4418k32041l61909
$$ 1063209 1311419 1699934 2252518 2900162 3559639 4136380 4502353 4556771 4324730 3962821
36654C962821l04446j27103P2396K00245J71026n4466m06697p04070p58142n23827
$$ 3962821 3658375 3531272 3603668 3803913 3974939 3920473 3513776 2809706 2051564 1527737
36644A527737j53279J28467K23443K20519K43904K82099K13754j8837l21224n33087
$$ 1527737 1374458 1502925 1726368 1946887 2190791 2472890 2686644 2667807 2346583 1813496
36634A813496n56962m04847j75066N082O8163N9943O1413N3296o9649l22710n59586
$$ 1813496 1256534 851687 676621 681703 749866 809809 871222 924518 854869 532159 -27427
36623b7427o50704o63831p57237r21998r59073p42944l99227j46651l2232Q0912
$$ -27427 -678131 -1341962 -2099199 -3021197 -3980270 -4723214 -5122441 -5269092 -5301324 -5220412
36613e220412K88703N12590O15670N70381M50239L05443J30760n0239j51974j08653
$$ -5220412 -4931709 -4419119 -3803449 -3233068 -2782829 -2477386 -2346626 -2396865 -2548839 -2657492
36603b657492O4789L17268O01292Q29241Q74751P10516M93045L98297L95024K98468
$$ -2657492 -2592703 -2275435 -1674143 -844902 29849 740365 1233410 1631707 2026731 2325199
36593B325199M3424k29330l80861m23193l96894k39511J07435N46431Q90969J027005
$$ 2325199 2368623 2139293 1758432 1335239 938345 698834 806269 1352700 2243669 3270674
36583C270674R26946N96186J29150k59636m16429m26364m71594n52018n16821
$$ 3270674 4197620 4793806 4922956 4663320 4246891 3820527 3348933 2796915 2280094
36574B280094l61107k93987m58393p49525r90221j141347j233846j209848r65106
$$ 2280094 1918987 1625000 1166607 417082 -573139 -1714486 -2948332 -4158180 -5123286
36565e123286n02642M3828N01462P24509O48172L63787R4418J7535J29406L08121
$$ -5123286 -5625928 -5582100 -5080638 -4356129 -3707957 -3344170 -3249752 -3232217 -3102811 -2794690
36555b794690M44270M76216L97097L04925L57785N78163P64299O95363L76785
$$ -2794690 -2350420 -1874204 -1477107 -1172182 -814397 -236234 528065 1223428 1600213
36546A600213l54k73888l82985l05556p0327K01676M02406N61713P42156Q48331
$$ 1600213 1599859 1325971 942986 637430 567103 768779 1171185 1732898 2475054 3323385
36536C323385P08190L44460q184j94136k88002m07069n38725o41693p65336r35817
$$ 3323385 4031575 4376035 4367851 4173715 3885713 3478644 2939919 2298226 1532890 597073
36526E97073j028651q96250n64652j87402J40625M02190N38146M60654K06036
$$ 597073 -431578 -1327828 -1892480 -2079882 -1939257 -1537067 -998921 -538267 -332231
36517c32231l6590r7928J9807J76483K29661J32859m4937j77698j92100j27750
$$ -332231 -368821 -466749 -446942 -270459 -40798 92061 47124 -130574 -322674 -450424
36507d50424p1981n8613p2470j26271k57034m31132n15258l87876o8353K83689
$$ -450424 -522405 -581018 -653488 -779759 -1036793 -1467925 -1983183 -2371059 -2439412 -2155723
36497b155723M98011N31108M87953M98291N61220N34839L00120r1865m63414o67317
$$ -2155723 -1657712 -1126604 -638651 -140360 420860 955699 1255819 1163954 700540 33223
36487C3223o59380m55078r8982L09079O21824P22032N86495K81606p1265l36339
$$ 33223 -626157 -1081235 -1180217 -871138 -249314 472718 1059213 1340819 1269554 933215
36477I33215m31428l91043l39748l78583n00329o10718o11739m71775k49601n6572
$$ 933215 501787 110744 -229004 -607587 -1107916 -1718634 -2330373 -2802148 -3051749 -3108321
36467c108321L4190N1765Q2450J65065K63209L41606M21972N30088O09505N31502
$$ -3108321 -3074131 -3022366 -2939916 -2774851 -2511642 -2170036 -1748064 -1217976 -608471 -76969
36457g6969K18922k32761n79750o21834l87949q9353J34349L54419O71516R63442
$$ -76969 141953 -90808 -670558 -1292392 -1680341 -1769694 -1635345 -1280926 -609410 354032
36447C54032R50434N23517j06562o22628q59675q10675n12359n2599L79550O02320
$$ 354032 1304466 1827983 1721421 1098793 239118 -571557 -1083916 -1136515 -756965 -154645
36437a54645O11265N46749M83124L38944K2679m07980p77409r40879q74539o63704
$$ -154645 456620 1003369 1486493 1825437 1848116 1440136 662727 -278152 -1152691 -1816395
36427a816395m45694l37129l61425m24308l70331r1657L74421Q28839J025987
$$ -1816395 -2262089 -2599218 -2960643 -3384951 -3755282 -3846939 -3472518 -2643679 -1617692
36418a617692Q70458N14041K21287J28912J66615K04301K06562K07283J94555
$$ -1617692 -747234 -233193 -11906 117006 283621 487922 694484 901767 1096322
36409A096322J01047r3920l11108m41274m40601l44398k14124r3975k645O3714
$$ 1096322 1197369 1103449 792341 351067 -89534 -433932 -648056 -742031 -744676 -680962
36399f80962J23745J81067J89365P1564j92287m98654o76892o28989l95474q0084
$$ -680962 -557217 -376150 -186785 -115221 -307508 -806162 -1483054 -2112043 -2507517 -2587601
36389b587601K47870N45632P37703P40447N55967K87894M0042j64514l43917m79189
$$ -2587601 -2339731 -1794099 -1056396 -315949 240018 527912 567954 403440 59523 -419666
36379d19666n16302m29211k48511l9932J17785J53452N1689j10710k15238k10060
$$ -419666 -935968 -1365179 -1613690 -1653622 -1535837 -1382385 -1330696 -1441406 -1656644 -1866704
36369a866704j45575q5768j5646J20465K95970L72169K32326o3704k91770k47604
$$ -1866704 -2012279 -2098047 -2113693 -1993228 -1697258 -1325089 -1092763 -1156467 -1448237 -1695841
36359a695841P6964M87817P44000P34183N35556L16891J76390P3600p1700k36158
$$ -1695841 -1618877 -1131060 -387060 347123 882679 1199570 1375960 1449560 1377860 1141702
36349A141702k96263j81469K9388J94977K46298J89229K6623k29716m77989n61064
$$ 1141702 845439 663970 693358 888335 1134633 1323862 1350485 1120769 642780 81716
36339H1716m34240k43511j83361l03679m91969o10921o05395m99722l51705k15452
$$ 81716 -352524 -596035 -779396 -1083075 -1575044 -2185965 -2791360 -3291082 -3642787 -3858239
36329c858239j08495m970J14965K14044K32408J76495J34355J85970L28264N05181
$$ -3858239 -3966734 -3971704 -3856739 -3642695 -3410287 -3233792 -3099437 -2913467 -2585203 -2080022
36319b080022O76439Q23047R08876Q82434P17751M25570L4994l88181p01767p37376
$$ -2080022 -1403583 -580536 328340 1210774 1928525 2354095 2389089 2000908 1299141 561765
36309E61765m55341l1350K71394L30812K41437J71592J92035K49104K48852J34861
$$ 561765 106424 75074 346468 677280 918717 1090309 1282344 1531448 1780300 1915161
36299A915161p6784k99947m39053m76242m73102m66691m15119k92199j80603j87682
$$ 1915161 1838377 1538430 1099377 623135 150033 -316658 -731777 -1023976 -1204579 -1392261
36289a392261k95524l88498m25551m81432n87328o27755m63153j00039L16705
$$ -1392261 -1687785 -2076283 -2501834 -2983266 -3570594 -4198349 -4661502 -4761541 -4444836
36280d444836O33986P61346O68839M02192R2092j16574j57636m8886J58995L88344
$$ -4444836 -3810850 -3049504 -2380665 -1978473 -1886381 -2002955 -2160591 -2209477 -2050482 -1662138
36270a662138N23468M76954K81706O6099p3076j33387j48157j26279o9185K008
$$ -1662138 -1138670 -661716 -380010 -313911 -386987 -520374 -668531 -794810 -863995 -861987
36260h61987O4105J04840J06558O0834J4332M0431J25929J45499J8594j47890
$$ -861987 -797882 -693042 -586484 -525650 -511318 -470887 -344958 -199459 -180865 -328755
36250c28755j67294k0217J04374M7320j34795k89671l90205n12293o25019n59332
$$ -328755 -496049 -516266 -411892 -364572 -499367 -789038 -1179243 -1691536 -2316555 -2875887
36240b875887k41582J57100L96849M21642L39622K14212P185k83160n60795p42229
$$ -2875887 -3117469 -2960369 -2563520 -2141878 -1802256 -1588044 -1580859 -1864019 -2424814 -3167043
36230c167043q25117q08632o48433l56736o4833R5914J27858J21417J27753J33878
$$ -3167043 -3992160 -4800792 -5449225 -5805961 -5870794 -5774880 -5647022 -5525605 -5397852 -5263974
36220e263974J00067m8763l91894q61132j174590j067498n94245q1172K34915
$$ -5263974 -5163907 -5212670 -5604564 -6465696 -7640286 -8707784 -9302029 -9383201 -9148286
36211i148286M00379N51641O77917O84501O04399O06844P92496J066921J240256
$$ -9148286 -8747907 -8196266 -7518349 -6833848 -6229449 -5622605 -4830109 -3763188 -2522932
36202b522932J205751J006864P71018O06853N45228N37750M91075L25375N0651
$$ -2522932 -1317181 -310317 460701 1067554 1612782 2150532 2641607 2966982 3017633
36193C017633j94037k23440J4408L46399N03147L43711o2470n39286r30939j148670
$$ 3017633 2823596 2600156 2614564 2960963 3464110 3807821 3745351 3206065 2275126 1126456
36183A126456j179287j077504r01611o39793k47952K26705O19352P77871O80963
$$ 1126456 -52831 -1130335 -2031946 -2671739 -2919691 -2692986 -2073634 -1295763 -614800
36174f14800M09682N9766k76939m97150n30225m10549k73550k53688l66540m82834
$$ -614800 -205118 -145352 -422291 -919441 -1449666 -1860215 -2133765 -2387453 -2753993 -3236827
36164c236827m49759k72224j38526k02565l68747l88344j70016J11185K39744
$$ -3236827 -3686586 -3958810 -4097336 -4299901 -4668648 -5056992 -5227008 -5115823 -4876079
36155d876079J84829N1931p2629j38175q7835P4362K24505K47522K03276K56973
$$ -4876079 -4691250 -4639319 -4711948 -4850123 -4937958 -4863596 -4639091 -4391569 -4188293 -3931320
36145c931320M54039O64926P50450O77835M61648J03564l51481p72452j023499
$$ -3931320 -3477281 -2812355 -2061905 -1384070 -922422 -818858 -1170339 -1942791 -2966290
36136b966290j065923r55155p72894n84668m21131k58996l4804K93038O88877
$$ -2966290 -4032213 -4987368 -5760262 -6344930 -6766061 -7025057 -7059861 -6766823 -6077946
36127f077946J039628J204228J095739P63477L92800J79641J85407L18480M31091
$$ -6077946 -5038318 -3834090 -2738351 -1974874 -1582074 -1402433 -1217026 -898546 -467455
36118d67455M07964K10741q2271k93641k97531j76368j49042l06819m91179m85590
$$ -467455 -59491 151250 68979 -224662 -522193 -698561 -847603 -1154422 -1645601 -2131191
36108b131191k69517j4402J32836J79047J99989K03924J27551n3690k58134l68071
$$ -2131191 -2400708 -2415110 -2282274 -2103227 -1903238 -1699314 -1571763 -1625453 -1883587 -2251658
36098b251658l58659l18557l20686l12467j91918K2567J73721J39344l0515j77687
$$ -2251658 -2610317 -2928874 -3249560 -3562027 -3753945 -3731378 -3557657 -3418313 -3448828 -3626515
36088c626515j87427m7249J84718M10094N24762M92205L81141K88337K31148J53929
$$ -3626515 -3813942 -3861191 -3676473 -3266379 -2741617 -2249412 -1868271 -1579934 -1348786 -1194857
36078a194857K6968j11799k16080k84223l31623l36343k34535K6660M16675P87302
$$ -1194857 -1167889 -1279688 -1495768 -1779991 -2111614 -2447957 -2682492 -2655832 -2239157 -1451855
36068a451855R44759Q18659N68329M61593O04253Q14884Q07465M89699N4650k07850
$$ -1451855 -507096 311563 879892 1341485 1945738 2760622 3568087 4057786 4112436 3904586
36058C904586j58506J09185L66251M09896J93449j42084l84258m48613m58319
$$ 3904586 3746080 3855265 4221516 4631412 4824861 4682777 4298519 3849906 3391587
36049C391587n87285q43077j067706j141809j090743r57237o83298k28669K51076
$$ 3391587 2804302 1961225 893519 -248290 -1339033 -2296270 -2979568 -3208237 -2957161
36040b957161M86465L79880J17092m0947l619J46393L08217M34913M90316M36837
$$ -2957161 -2470696 -2090816 -1973724 -2014671 -2018290 -1871897 -1563680 -1128767 -638451 -201614
36030b01614L00057J95179K33830L90948M85528L32704n7255m43293n49151l02841
$$ -201614 98443 293622 527452 918400 1403928 1736632 1679377 1236084 686933 384092
36020C84092J23450M83646O32266N63075L59103J32190m0532j57097k50570l13181
$$ 384092 507542 991188 1623454 2186529 2545632 2677822 2637290 2480193 2229623 1916442
36010A916442l09023k60922k49181k95518l21398k69264j98292j95976k48850
$$ 1916442 1607419 1346497 1097316 801798 480400 211136 12844 -183132 -431982
36001d31982k73950k35742j51443j2284K07688M68333O70295P57443P55363P09792
$$ -431982 -705932 -941674 -1093117 -1105401 -897713 -429380 240915 998358 1753721 2463513
35991B463513O49615O07575N97803N51274L46652m4018m68584o83516n28992m7812
$$ 2463513 3113128 3720703 4318506 4869780 5216432 5172414 4703830 4020314 3491322 3443510
35981C443510N14129Q46249Q04230N35011L16406K59507K37792J17585n2858j45427
$$ 3443510 3957639 4803888 5608118 6143129 6459535 6719042 6956834 7074419 7021561 6876134
35971F876134j41403j10394o2051M6367J56476Q9652k55538p43745j094858j119523
$$ 6876134 6734731 6624337 6562286 6608653 6765129 6854781 6599243 5855498 4760640 3641117
35961C641117q47572m59039j26815Q1628J87702K27436K15189J66531J13421P8258
$$ 3641117 2793545 2334506 2207691 2289319 2477021 2704457 2919646 3086177 3199598 3277856
35951C277856O5082R3208J89913L08413L08708J05306j83446l26229k36194o1319
$$ 3277856 3342938 3436146 3626059 3934472 4243180 4348486 4165040 3838811 3602617 3541298
35941C541298P729n8802j64260k45064l08317l47233l15179j94059k2689J58407
$$ 3541298 3549027 3490225 3325965 3080901 2772584 2425351 2110172 1916113 1893424 2051831
35931B051831L34677M70868M96822L88702K30795J38512J24170Q9137l7562j96360
$$ 2051831 2386508 2857376 3354198 3742900 3973695 4112207 4236377 4325514 4287952 4091592
35921D091592k65964k10275j14401q0872j37089k57427m24322o20331p85981q43742
$$ 4091592 3825628 3615353 3500952 3420080 3282991 3025564 2601242 1980911 1194930 351188
35911C51188p68837n99168l78425j35497Q0724K11710K62326L06631L80678M22624
$$ 351188 -417649 -1016817 -1395242 -1530739 -1450015 -1238305 -975979 -669348 -288670 133954
35901A33954L74530K94245K87167L54457M00545L90374M05292N12405O54009P11071
$$ 133954 508484 802729 1089896 1444353 1844898 2235272 2640564 3152969 3806978 4518049
35891D518049O22247M02472J02271j98441m04008m75634m67696m42346l74784
$$ 4518049 5140296 5542768 5645039 5446598 5042590 4566956 4099260 3656914 3282130
35882C282130j97129Q5085L74395N62666N83772M19513J31591j22963j95013q3730
$$ 3282130 3085001 3170086 3544481 4107147 4690919 5110432 5242023 5119060 4924047 4840317
35872D840317Q3639K15514L25513M29137M71858M18043L35132L09619L23178K89669
$$ 4840317 4923956 5139470 5464983 5894120 6365978 6784021 7119153 7428772 7751950 8041619
35862H041619J91684J11005J35296K91628N55441Q58947J096834J193998J183268
$$ 8041619 8233303 8344308 8479604 8771232 9326673 10185620 11282454 12476452 13659720
35853A3659720J167216J198198J249320J306257J416018J616013J875401K145520
$$ 13659720 14826936 16025134 17274454 18580711 19996729 21612742 23488143 25633663
35845B5633663K415390K671899K859822K957091L071470L391768M032957M970289
$$ 25633663 28049053 30720952 33580774 36537865 39609335 43001103 47034060 52004349
35837E2004349O120992P436832Q905952J0520180J2282685J4231345J6426264
$$ 52004349 58125341 65562173 74468125 84988305 97270990 111502335 127928599
35830A27928599J8908499K1657153K4550685K7344262K9666811L0986092L0528761
$$ 127928599 146837098 168494251 193044936 220389198 250056009 281042101 311570862
35823C11570862K7338387K0711444J0880312o59264j1661587k0206331k5486603
$$ 311570862 338909249 359620693 370501005 369841741 358180154 337973823 312487220
35816C12487220k7776980k7854069k6491929k4301018k1744982j9152689j6731741
$$ 312487220 284710240 256856171 230364242 206063224 184318242 165165553 148433812
35809A48433812j4608880j2837711j1366689j0064537q829049p653946o572021
$$ 148433812 133824932 120987221 109620532 99555995 90726946 83073000 76500979
35802G6500979n580217m667042l874796l262944k815779k452972k144131j951560
$$ 76500979 70920762 66253720 62378924 59115980 56300201 53847229 51703098 49751538
35794D9751538j929132k027257k137003k187518k148931j971771j603430j086044
$$ 49751538 47822406 45795149 43658146 41470628 39321697 37349926 35746496 34660452
35786C4660452n90858l19295l69989o86003j086344j343587j298935r71806n56482
$$ 34660452 34069594 33750299 33380310 32694307 31607963 30264376 28965441 27993635 27437153
35777B7437153k69372j82578k09144k26825j81424q2249M7499J87707L15221M09100
$$ 27437153 27167781 26985203 26776059 26549234 26367810 26285561 26333060 26520767 26835988 27245088
35767B7245088M57061M49878L86767K97838K39832K44950K81678K88659K47765
$$ 27245088 27702149 28152027 28538794 28836632 29076464 29321414 29603092 29891751 30139516
35758C0139516K06563K19577K68836K45349K1562m32438r90257j440634j642836
$$ 30139516 30346079 30565656 30834492 31079841 31101403 30668965 29678708 28238074 26595238
35749B6595238j626147j543937j534304j612519j675298j606784j397532j155720
$$ 26595238 24969091 23425154 21890850 20278331 18603033 16996249 15598717 14442997
35741A4442997r78206q27548n93754k83398o9561j04025l37281n89667p53749
$$ 14442997 13464791 12637243 12043489 11760091 11690530 11586505 11249224 10659557 9905808
35732I905808q43238q74877q12540o44183m23925k04276K486J63792K03438R4766
$$ 9905808 9062570 8187693 7375153 6730970 6307045 6102769 6105255 6269047 6472485 6567251
35722F567251p5436j95322k49345l07385m26246o06316q11695r80030j036234
$$ 6567251 6491815 6296493 6047148 5739763 5313517 4707201 3895506 2915476 1879242
35713A879242r52518p87690o24821m76971k89838k9968K59209M80088N44340M48499
$$ 1879242 926724 139034 -485787 -962758 -1252596 -1282564 -1023355 -543267 1073 449572
35703D49572L20945L56153O41763J052105J340286J318000R37798K81407m48012
$$ 449572 770517 1126670 1768433 2820538 4160824 5478824 6416622 6698029 6250017
35694F250017r74781j120276r51044o92583m97656l72570l10958l70352n69789
$$ 6250017 5275236 4154960 3203916 2511333 2013677 1641107 1330149 959797 390008
35685C90008q11297r66360r68301p75042l45209K51667P78075J010880R64427
$$ 390008 -421289 -1387649 -2355950 -3130992 -3476201 -3224534 -2446459 -1435579 -471152
35676d71152Q33985P34850O08900L96639J76973O7024N6096J8475j34176l65054
$$ -471152 362833 1097683 1706583 2103222 2280195 2347219 2403315 2421790 2287614 1922560
35666A922560n53696n77255l73042J1415M13118O48765O62357N76216N72631P19426
$$ 1922560 1368864 791609 418567 429982 843100 1491865 2154222 2730438 3303069 4022495
35656D022495R16537J001265Q85230O00233K57927j1715j27037j22199j43630
$$ 4022495 4939032 5940297 6825527 7425760 7683687 7671972 7544935 7422736 7279106
35647G279106l21249o23674q80430r63645r04321q04992o88353m85423j51456
$$ 7279106 6957857 6334183 5453753 4490108 3585787 2780795 2092442 1607019 1455563
35638A455563K53642N89780P08513N29038J07749l57903o42471o42281m19928
$$ 1455563 1709205 2298985 3007498 3536536 3644285 3286382 2643911 2001630 1581702
35629A581702j27702Q3759J16166l7123k75408m57907n20922n18554n45176o39370
$$ 1581702 1454000 1537759 1653925 1616802 1341394 883487 362565 -155989 -701165 -1340535
35619a340535p59121q14990p26375m89294k02657J0377J22610K13251L59013N70751
$$ -1340535 -2099656 -2914646 -3641021 -4130315 -4332972 -4322595 -4199985 -3986734 -3627721 -3056970
35609c056970Q46582J196090J539792J648950J308042N65880k39397p46580q50845
$$ -3056970 -2210388 -1014298 525494 2174444 3482486 4048366 3808969 3062389 2211544
35600B211544p26399o17479o25119o64932n96046l82716j31902K4776P2686J28528
$$ 2211544 1485145 867666 242547 -422385 -1018431 -1401147 -1533049 -1508273 -1435587 -1307059
35590a307059L23776O77531J057614J248429J091436O09364j604n18371q19551
$$ -1307059 -983283 -305752 751862 2000291 3091727 3701091 3699487 3181116 2361565
35581B361565q74266o84385l22804R268R0065j08885l81703n00267m16922k31876
$$ 2361565 1487299 802914 480110 489378 579443 470558 88855 -411412 -828334 -1060210
35571a060210l6201J45588L03154M08778M34136L60605J93226k824j18426j05082
$$ -1060210 -1096411 -950823 -647669 -238891 195245 555850 749076 746252 627826 522744
35561E22744l2551J2125M4829J28141K25450K17252P7300o0880n4417R7458K89310
$$ 522744 490193 502318 547147 675288 900738 1117990 1195290 1134410 1079993 1177451 1466761
35550A466761M34501N08131N18420M93679M69937M45703L69299K02680k9884k84702
$$ 1466761 1901262 2409393 2927813 3421492 3891429 4337132 4706431 4909111 4879227 4594525
35540D594525n47588p94604r42976r06072o87050l71400m2778K46151M42881N06202
$$ 4594525 4046937 3252333 2309357 1403285 716235 344835 302057 548208 991089 1497291
35530A497291M53629L42551J97418O854k02281l49585l82491l24911k26559j19587
$$ 1497291 1950920 2293471 2490889 2497743 2295462 1945877 1563386 1238475 1011916 892329
35520H92329n3815j09116l05613n28576o05460m59858j62746J42844L24170K98596
$$ 892329 838514 729398 423785 -104791 -710251 -1170109 -1332855 -1190011 -865841 -567245
35510e67245P6524k12779l97928m10067l26937k53784j98785j01658M9539J90292
$$ -567245 -490721 -703500 -1101428 -1511495 -1838432 -2092216 -2291001 -2392659 -2343120 -2152828
35500b152828K66438K96839L30829L79376M13124M01370L20772J42889j42117
$$ -2152828 -1886390 -1589551 -1258722 -879346 -466222 -64852 255920 398809 256692
35491B56692m76115p34258q04452o76552m55247k79968k12550j86039p3293J73312
$$ 256692 -219423 -953681 -1758133 -2434685 -2889932 -3169900 -3382450 -3568489 -3641782 -3468470
35481c468470M56052O28567O51056O10642N80618N11551L08554n987k64385l06670
$$ -3468470 -3012418 -2383851 -1732795 -1122153 -541535 -29984 278570 272583 8198 -298472
35471b98472j38663P3467J51604M5942j48648k95292l36396l23430l33798l71067
$$ -298472 -437135 -363668 -212064 -166122 -314770 -610062 -946458 -1269888 -1603686 -1974753
35461a974753l65072k72163j52646j23444k30619l86582m48338l49802j39154
$$ -1974753 -2339825 -2611988 -2764634 -2888078 -3118697 -3505279 -3953617 -4303419 -4442573
35452d442573J03423L39812N45132O54198O03321M19611K05044J7593j71633l75081
$$ -4442573 -4339150 -3999338 -3454206 -2800008 -2196687 -1777076 -1572032 -1554439 -1726072 -2101153
35442b101153n08403m77564l14822j62368j25222j85601k53198k51269j55433
$$ -2101153 -2609556 -3087120 -3401942 -3564310 -3689532 -3875133 -4128331 -4379600 -4535033
35433d535033J966J51841K43119K85781L23063L76587M48064N46061O52432O77532
$$ -4535033 -4533067 -4381226 -4138107 -3852326 -3529263 -3152676 -2704612 -2158551 -1506119 -828587
35423h28587N27742K38004k5413j26068p8007J3931P7563R6163N0604j03232l92897
$$ -828587 -300845 -62841 -88254 -214322 -292329 -278398 -200835 -104672 -54068 -157300 -550197
35412e50197p71261j087860j143046q40209k99819K43488O79482J076368J453236
$$ -550197 -1321458 -2409318 -3552364 -4392573 -4692392 -4448904 -3769422 -2693054 -1239818
35403a239818J606706J293514N60838k17052o47417o02538k22067K50443N98448
$$ -1239818 366888 1660402 2221240 2004188 1356771 754233 532166 782609 1381057
35394A381057O98109N41503J91993k89043q30367j273603j409788j168017p19617
$$ 1381057 2079166 2620669 2812662 2523619 1693252 419649 -990139 -2158156 -2877773
35385b877773l17546n3003J61727L91037N54915N42517L73435J81947P2122N2537
$$ -2877773 -3195319 -3248322 -3086595 -2695558 -2140643 -1598126 -1224691 -1042744 -970622 -918085
35375i18085J08733K70080N59170Q97315J108831J045101P08811K59536j00973
$$ -918085 -809352 -539272 19898 917213 2026044 3071145 3779956 4039492 3938519
35366C938519k59355k29507r0799P9391K01578J73303o2609m05107o24455n76946
$$ 3938519 3679164 3449657 3358858 3438249 3639827 3813130 3750521 3345414 2720959 2144013
35356B144013l62449k03269j88132k11963j57828m3179L4808J0196j30358l48407
$$ 2144013 1781564 1578295 1390163 1178200 1020372 977193 1012001 1022197 891839 543432
35346E43432n25274n26004l71912k68456l57653n05889m60759j77899J44641L37179
$$ 543432 18158 -507846 -879758 -1148214 -1505867 -2011756 -2472515 -2650414 -2505773 -2168594
35336b168594M09259M19403L68131K94573L30571N38910P93575R36542R72138
$$ -2168594 -1759335 -1339932 -971801 -677228 -346657 192253 985828 1922370 2894508
35327B894508R79733R09154O35127K04108j39214k16577q8666P6787J88637K19551
$$ 2894508 3874241 4783395 5418522 5622630 5483416 5266839 5178173 5254960 5443597 5663148
35317E663148J24459j18876m45601p69490j061907j278836j276932r47286m28600
$$ 5663148 5787607 5668731 5223130 4453640 3391733 2112897 835965 -111321 -539921
35308e39921m4417K3682r7590j77880j45261o5020L8915K00044L79381M58535
$$ -539921 -584338 -560656 -658246 -836126 -981387 -1046407 -1007492 -807448 -428067 30468
35298C0468L89421K57895J73763J81354K98078N28814P75070Q33315O05774K69094
$$ 30468 419889 677784 851547 1032901 1330979 1859793 2634863 3468178 4073952 4343046
35288D343046J07652J78603K55105J28974j36953l20028l15234k08341j21239
$$ 4343046 4450698 4629301 4884406 5013380 4876427 4556399 4241165 4032824 3911585
35279C911585r8926j54939l17703n64664p69002p95213o42182m35091k76982j65253
$$ 3911585 3812659 3657720 3340017 2775353 2006351 1211138 568956 133865 -143117 -308370
35269c08370o0643L5940J18935K26940L81058N07497N04718L76725K14533M7192
$$ -308370 -369013 -333073 -214138 12802 393860 901357 1406075 1782800 1997333 2044525
35259B044525j81846m57451o27795n83206m19255l13493k87333k06796J84K49580
$$ 2044525 1862679 1405228 777433 194227 -225028 -538521 -825854 -1032650 -1032466 -782886
35249g82886M38248N62595O57731P09574O89123O12331N06196L59557J61339m8042
$$ -782886 -344638 217957 875688 1585262 2274385 2886716 3392912 3752469 3913808 3865766
35239C865766k14315l28423l97834l84725k32196M9030L62118N96206O90948O35581
$$ 3865766 3651451 3323028 2925194 2540469 2308273 2357303 2719421 3315627 4006575 4642156
35229D642156M39588J21945k73968o57301q96914q91149o55799l26644n4380R6479
$$ 4642156 5081744 5203689 4929721 4272420 3375506 2484357 1828558 1501914 1447534 1544013
35219A544013J47458J45025J27300J24125J47954J80022J81663J22184k460j66880
$$ 1544013 1691471 1836496 1963796 2087921 2235875 2415897 2597560 2719744 2717284 2550404
35209B550404l35831n00915o76400q20970p95631m90775j1727L56049M21036K54232
$$ 2550404 2214573 1713658 1037258 216288 -579343 -1070118 -1081845 -725796 -304760 -50528
35199e0528L2742j89992m52885o97156p61675n78371k53769P4861L66550O20592
$$ -50528 -17786 -207778 -660663 -1357819 -2119494 -2697865 -2951634 -2876773 -2510223 -1889631
35189a889631P86774Q01973O68052M40987J78991o3078k35514l36070m11036m70160
$$ -1889631 -1102857 -300884 367168 808155 987146 924068 688554 352484 -58552 -528712
35179e28712m43508k80950o2655N6183n02j85906m24666o77903r02890j017967
$$ -528712 -972220 -1253170 -1315825 -1259642 -1260144 -1446050 -1870716 -2548619 -3451509 -4469476
35169d469476r54634p19826l80668j1390L23035N62181O72823O73678O10169N09002
$$ -4469476 -5424110 -6143936 -6524604 -6535994 -6212959 -5650778 -4977955 -4304277 -3694108 -3185106
35159c185106L84542K80494K54236K96507L09346K12252N0766n7512q2647j16923
$$ -3185106 -2800564 -2520070 -2265834 -1969327 -1659981 -1447729 -1396963 -1454475 -1537122 -1654045
35149a654045k16954k80429j61598J13181L35470L40907J72831j9856j78144l42898
$$ -1654045 -1870999 -2151428 -2313026 -2199845 -1864375 -1523468 -1350637 -1370493 -1548637 -1891535
35139a891535n00785n33983l73234j31171q4l1713r2868m9329Q1934K03616K87710
$$ -1891535 -2392320 -2926303 -3299537 -3430708 -3430792 -3462505 -3555373 -3604702 -3522768 -3319152 -3031442
35128c031442L70124M36817M30972L86977M41738O44444Q36564Q16650N87653
$$ -3031442 -2661318 -2224501 -1793529 -1406552 -964814 -320370 516194 1332844 1920497
35119A920497L52253K78213L48245M32937M24971K88246N6778j75734l16584l55830
$$ 1920497 2272750 2550963 2899208 3332145 3757116 4045362 4102140 3926406 3609822 3253992
35109C253992l53847l42903k97681k14395j46435j25843j12909o7218q175M8442
$$ 3253992 2900145 2557242 2259561 2045166 1898731 1772888 1659979 1592761 1584586 1633028
35099A633028J51606L30223M79554M25170J17084k89587n61721n74761l88130
$$ 1633028 1784634 2114857 2594411 3019581 3136665 2847078 2285357 1710596 1322466
35090A322466j72375n6354k0577M8649J89040K88581K19441N389j98636k65903
$$ 1322466 1150091 1093737 1073160 1121809 1310849 1599430 1818871 1824260 1625624 1359721
35080A359721j84311j9118J39108K13753K12027K48116M15929O39775P34755O19178
$$ 1359721 1175410 1156292 1295400 1509153 1721180 1969296 2385225 3025000 3759755 4378933
35070D378933L76826J02709j94448m92670o85378p11015o76945p41343r06080
$$ 4378933 4755759 4858468 4664020 4171350 3485972 2774957 2098012 1356669 450589
35061D50589j023060r84719q18014o02584l92484k31585j59492j63235j76298
$$ 450589 -572471 -1557190 -2375204 -2977788 -3370272 -3601857 -3761349 -3924584 -4100882
35052d100882j56854j25496r9740l2762J41612M12837O64143P43252N77745K46619
$$ -4100882 -4257736 -4383232 -4482972 -4515734 -4374122 -3961285 -3297142 -2553890 -1976145 -1729526
35042a729526o6497k18032k02511r3146Q2182L50675O93006J002825J168935J151183
$$ -1729526 -1796023 -2014055 -2216566 -2309712 -2227530 -1876855 -1183849 -181024 987911 2139094
35032B139094R67211O71497L76984K22492K44589L12169K55645N4685j50860k27381
$$ 2139094 3106305 3777802 4154786 4377278 4621867 4934036 5189681 5244366 5093506 4866125
35022D866125j72680p5257o968J3587j5222j04285k51193m08292m99211m83940
$$ 4866125 4693445 4618188 4611220 4624807 4609585 4505300 4254107 3845815 3346604 2862664
35012B862664l97958l06877k35094j74675j51872k16289l41603m09961l55425
$$ 2862664 2464706 2157829 1922735 1748060 1596188 1379899 1038296 628335 272910
35003B72910k72413l03078m40883n26268m36093k08525K3173J53803J57605R2999
$$ 272910 497 -302581 -743464 -1269732 -1705825 -1914350 -1891177 -1737374 -1579769 -1486770
34993a486770Q3273K27163M88678P16974P96390P27866N52506K78830o5592l87304
$$ -1486770 -1403497 -1176334 -687656 29318 825708 1553574 2106080 2384910 2319318 1932014
34983A932014o07581p39611q11856p64983n20964j29554K54195N35365P27032
$$ 1932014 1324433 584822 -227034 -992017 -1512981 -1642535 -1388340 -852975 -125943
34974a25943Q28692P71291N36638K42640K5987j16693k90055n13905o46865n22483
$$ -125943 702749 1474040 2010678 2253318 2279305 2162612 1872557 1358652 711787 189304
34964A89304j34392L35125O67024P75380P22176N84331L62226N5327k28448l37031
$$ 189304 54912 390037 1057061 1832441 2554617 3138948 3501174 3556501 3328053 2991022
34954B991022k55118j33085r9048j13020n3618J18160L43197N51261O84403O79830
$$ 2991022 2735904 2602819 2503771 2390751 2337133 2455293 2798490 3349751 4034154 4713984
34944D713984N26102L19813J74859P7562p9972l15874n02638n24770m09112k57894
$$ 4713984 5240086 5559899 5734758 5812320 5732348 5416474 4913836 4389066 3979954 3722060
34934C722060j30414m6549l8117j20826k53480l86632n15574o29316o59943n69634
$$ 3722060 3591646 3545097 3506980 3386154 3132674 2746042 2230468 1601152 941209 371575
34924C71575m52608m41428n11426m88563k88802n6341M002j23490k51727j99785
$$ 371575 -81033 -522461 -1033887 -1522450 -1811252 -1867593 -1863591 -1987081 -2238808 -2438593
34914b438593L9556L22884M91451M79860L31947J39334k3198j00078l2152J98780
$$ -2438593 -2399037 -2076153 -1584702 -1104842 -772895 -633561 -656759 -756837 -788989 -590209
34904e90209M86933O33109N18890K30361k6763j12849l7590Q3539J00314r1265
$$ -590209 -103276 529833 1048723 1279084 1252321 1139472 1101882 1185421 1285735 1194470
34894A194470m45660p53008q08907o14296l53461j74901n5878J17457M10978P97409
$$ 1194470 748810 -4198 -813105 -1427401 -1780862 -1955763 -2011641 -1894184 -1483206 -685797
34884f85797J172473J386551J333515J058922P37484N10641L85782L03655K27061
$$ -685797 486676 1873227 3206742 4265664 5003148 5513789 5899571 6203226 6430287
34875F430287J26548l9335k65284m80711o45150p92771r20306r23886p56978n76421
$$ 6430287 6556835 6517500 6252216 5771505 5126355 4333584 3413278 2489392 1732414 1155993
34865A155993n82562p40490q11671o73428m65012l78124m31965n16966n45589
$$ 1155993 573431 -167059 -978730 -1652158 -2117170 -2495294 -2927259 -3444225 -3989814
34856c989814m73002k59110P8601M10352N79641N37445L53091J28341n5701j54311
$$ -3989814 -4462816 -4721926 -4643325 -4232973 -3653332 -3115887 -2762796 -2634455 -2690156 -2844467
34846b844467j86930k22338k82722k92170j76621J5228J58657K07905K41627L52075
$$ -2844467 -3031397 -3253735 -3536457 -3828627 -4005248 -3990020 -3831363 -3623458 -3381831 -3029756
34836c029756N35320O90937O93579M76146R0578l06875n59429o03835m65306k12068
$$ -3029756 -2494436 -1803499 -1109920 -633774 -543196 -850071 -1409500 -2013335 -2478641 -2690709
34826b690709M3216J52862L7854k15777m28578n00474m61049l60674j94552M1671
$$ -2690709 -2647493 -2494631 -2456777 -2672554 -3101132 -3601606 -4062655 -4423329 -4617881 -4576210
34816d576210K92421M87773O14085P04293P80142Q24478P88797O19618L10787
$$ -4576210 -4283789 -3796016 -3181931 -2477638 -1697496 -873018 -84221 535397 846184
34807H46184n7249l65179n57302o61948o98859o17630l63172L6080M83882Q86817
$$ 846184 788935 423756 -133546 -795494 -1494353 -2111983 -2475155 -2439075 -1955193 -1068376
34797a068376J168189J253104J117946Q57006O27975M92942L51660P2984l27841
$$ -1068376 99813 1352917 2470863 3327869 3955844 4448786 4800446 4873430 4545589
34788D545589o83767q42011p97942o62128n41819m80243m65530m38129l07280
$$ 4545589 3861822 3019811 2221869 1559741 1017922 537679 72149 -365980 -673260
34779f73260l7570K58533L78337K25009q9148l67035n07385n21760m42121l09897
$$ -673260 -710830 -452297 -73960 151049 61901 -305134 -812519 -1334279 -1776400 -2086297
34769b086297k28294l02882m93168o09634n15694k81053q3002L908O1367J90989
$$ -2086297 -2314591 -2617473 -3110641 -3720275 -4235969 -4517022 -4600024 -4596116 -4534749 -4343760
34759d343760L82739N28716N34401L97994J91035j6258j88711k91581k73797j31640
$$ -4343760 -3961021 -3432305 -2897904 -2499910 -2308875 -2325133 -2513844 -2805425 -3079222 -3210862
34749c210862L9349J21369J01914O6835O9521Q1159Q0471R6230J10069Q198k73345
$$ -3210862 -3171513 -3050144 -2948230 -2881395 -2811874 -2730715 -2650244 -2554014 -2443945 -2435747 -2709092
34738b709092o01371p47871o37069m10648k43767j75890j44643j04971n1313L7534
$$ -2709092 -3310463 -4058334 -4695403 -5106051 -5349818 -5525708 -5670351 -5775322 -5826635 -5789101
34728e789101K00682M31131O50164P68415P59417O64097N44352M56994M54873
$$ -5789101 -5588419 -5157288 -4507124 -3738709 -2979292 -2315195 -1770843 -1313849 -858976
34719h58976N58041O99221P43297O14661L90847K21968J66356J54911J05445K817
$$ -858976 -300935 398286 1141583 1756244 2147091 2369059 2535415 2690326 2795771 2798588
34709B798588j38258l05851m50261m86186l96086k80630k43275k61053k30953
$$ 2798588 2660330 2354479 1904218 1418032 1021946 741316 498041 236988 6035
34700F035j12511M4503J95730L50544N14552O36703O37000M74202J94918p3319
$$ 6035 -106476 -61973 133757 484301 998853 1635556 2272556 2746758 2941676 2868357
34690B868357k15070k49339l22448n28949p75289q87059q22662o96861o03780
$$ 2868357 2653287 2403948 2081500 1552551 777262 -109797 -932459 -1629320 -2233100
34681b233100n15128l75942k07540n7973Q5210K58028M22223M74305L61714J46929
$$ -2233100 -2748228 -3124170 -3331710 -3389683 -3304473 -3046445 -2624222 -2149917 -1788203 -1641274
34671a641274o4402k34746m03429n84118o86493n72757j86589L97513J031592
$$ -1641274 -1705676 -1940422 -2343851 -2927969 -3614462 -4187219 -4373808 -3976295 -2944703
34662b944703J547599J774131J612752J159166O71394L33257R5451j75379m54064
$$ -2944703 -1397104 377027 1989779 3148945 3820339 4153596 4249047 4073668 3619604
34653C619604n81149n00867l42754k48062k21695j83189o8771J46849M31948O56659
$$ 3619604 3038455 2537588 2194834 1946772 1725077 1541888 1473117 1619966 2051914 2708573
34643B708573O65142M55389K18279J33087J78077J99164J10845l2544j20167q0455
$$ 2708573 3373715 3829104 4047383 4180470 4358547 4557711 4668556 4636012 4515845 4435390
34633D435390O7081K03341J93296L0949j38363j91077j75875k32020m01961n98542
$$ 4435390 4502471 4705812 4899108 4930057 4791694 4600617 4424742 4192722 3790761 3192219
34623C192219p27914p66471p28975o34836n11303l79216k39218j13907p6897j67271
$$ 3192219 2464305 1697834 968859 334023 -177280 -556496 -795714 -909621 -986518 -1153789
34613a153789k80565k28460N7228M27425O55330O43911M71137K60966N6986j65495
$$ -1153789 -1434354 -1662814 -1605586 -1178161 -522831 121080 592217 853183 910169 744674
34603G44674l93169n27203m65640k10314J38591M67330O76987O62354L73006p3288
$$ 744674 351505 -175698 -641338 -851652 -713061 -245731 431256 1093610 1466616 1393328
34593A393328m32941n53504m85651l41481j45236Q8043K27986J37133j21230l16626
$$ 1393328 960387 406883 -78768 -420249 -565485 -477442 -249456 -112323 -233553 -550179
34583e50179k99322j14541J19356L20646M14872L30115R5922j31363k11179j45541
$$ -550179 -849501 -964042 -844686 -524040 -109168 220947 316869 185506 -25673 -171214
34573a71214k9905O5741J25628J51193J50120J41110J37744J38071J28685O9545
$$ -171214 -201119 -135378 -9750 141443 291563 432673 570417 708488 837173 906718
34563I06718j06902m17805p52447r45665r41330q13742o23345l52769k2544K38056
$$ 906718 799816 382011 -370436 -1316101 -2257431 -3071173 -3694518 -4047287 -4069831 -3831775
34553c831775L19545K66345K02795J72108J23212K2198r3435j50022p9388J35460
$$ -3831775 -3512230 -3245885 -3043090 -2870982 -2747770 -2725572 -2819007 -2969029 -3048417 -2912957
34543b912957M01187N46433M87130L33266K66652L38349M44282M58636L17222
$$ -2912957 -2511770 -1965337 -1478207 -1144941 -878289 -539940 -95658 362978 680200
34534F80200K0267l34014n39912m40814j25156J36986J91521J45112J74633K93721
$$ 680200 700467 366453 -173459 -614273 -739429 -602443 -410922 -265810 -91177 202544
34524B02544L83000L70414K78993J37035n0007k32800l08795k17420j1880J76367
$$ 202544 585544 955958 1234951 1371986 1321979 1089179 780384 562964 551084 727451
34514G27451K20574O0423k56225n65722o70212m87405j32560J65894K43730J05540
$$ 727451 948025 1008448 752223 186501 -483711 -971116 -1103676 -937782 -694052 -588512
34504e88512j18767k93572l57799l20266k07983l0276K08265M63711O33465O09766
$$ -588512 -707279 -1000851 -1358650 -1678916 -1886899 -1917175 -1708910 -1245199 -611734 -1968
34494a968L83247R3279o1178M270J76258K58726J76282M2510J6859J19068K16321
$$ -1968 381279 474558 413380 417650 593908 852634 1028916 1071426 1088285 1207353 1423674
34483A423674J86323N1948o5488r3315o4825m1139l1597j3244J5732M2641O8995
$$ 1423674 1609997 1661945 1596457 1503142 1438317 1397178 1365581 1352337 1368069 1410710 1479705
34472A479705Q1653J8045j68550m05798n44495n42962n41327o83813r09151j002491
$$ 1479705 1561358 1579403 1410853 1005055 460560 -82402 -623729 -1307542 -2216693 -3219184
34462c219184q46992n39977k40818J7610L14801O91199J073519J329492J344525
$$ -3219184 -4066176 -4606153 -4846971 -4829361 -4514560 -3823361 -2749842 -1420350 -75825
34453g5825J064933N39806o1341n32358p78085q59268q70377q10463o18272l06301
$$ -75825 989108 1528914 1467573 935215 157130 -702138 -1572515 -2382978 -3001250 -3307551
34443c307551Q735K22524L42313M43856N56027O08772M82017J08373m33340r12895
$$ -3307551 -3298816 -3076292 -2733979 -2290123 -1734096 -1125324 -643307 -534934 -968274 -1881169
34433a881169j083135q65000l95699J08309N01022P22735P56654O45860N11298
$$ -1881169 -2964304 -3829304 -4225003 -4116694 -3615672 -2892937 -2136283 -1490423 -979125
34424i79125M66105N11551N66649N76167N26231L87229J42368j27426k91813l31080
$$ -979125 -513020 -1469 565180 1141347 1667578 2054807 2197175 2069749 1777936 1446856
34414A446856l54540m21816m40514l02433l9894K29337M46889O19119P32460P66770
$$ 1446856 1092316 670500 229986 -72447 -112341 116996 563885 1183004 1915464 2682234
34404B682234P72279Q32896R37796R59011P81379M20869J2541k88756m11056m13432
$$ 2682234 3454513 4287409 5225205 6184216 6965595 7386464 7399005 7110249 6699193 6285761
34394F285761m26586n13403o05936o11977n45826m95697m94541n03058n08885
$$ 6285761 5859175 5345772 4739836 4127859 3582033 3086336 2591795 2088737 1579852
34385A579852n54153o47051p20787p14868o46339n69876n05765m32958l24761
$$ 1579852 1025699 378648 -342139 -1057007 -1703346 -2273222 -2778987 -3211945 -3536706
34376c536706j76658k4493O4500N6454O972P673P4719J44264J87239K62597M20635
$$ -3536706 -3713364 -3737857 -3673357 -3616903 -3609931 -3602258 -3527539 -3383275 -3196036 -2933439 -2512804
34365b512804O01239O72640N50622K58879r7986l99892n83527o78772p54764q19838
$$ -2512804 -1911565 -1238925 -688303 -429424 -527410 -927302 -1510829 -2189601 -2944365 -3764203
34355c764203q08689o81927m94447l36653k42726j83948j15305N682K09474M72208
$$ -3764203 -4572892 -5254819 -5749266 -6085919 -6328645 -6512593 -6627898 -6622216 -6412742 -5940534
34345e940534O93949P61360O41033M04046J73939N6914Q6257J98835K77866K45749
$$ -5940534 -5246585 -4485225 -3844192 -3440146 -3266207 -3209293 -3123036 -2924201 -2646335 -2400586
34335b400586J15418m9234j98508l13800l89938m19173l74215k08393Q3519L91784
$$ -2400586 -2285168 -2334402 -2532910 -2846710 -3236648 -3655821 -4030036 -4238429 -4154910 -3763126
34325c763126N32545M01481O2644l25200o18579p13482n57842k26356P2966J75075
$$ -3763126 -3230581 -2829100 -2766456 -3091656 -3710235 -4423717 -4981559 -5207915 -5134949 -4959874
34315d959874J35053J44386K68664L55326K31143p5344l50556l96664j84751J59754
$$ -4959874 -4824821 -4680435 -4411771 -4056445 -3825302 -3900646 -4251202 -4647866 -4832617 -4672863
34305d672863M84333P19936Q76131R46320Q72441O49820M21510L67028M75346
$$ -4672863 -4188530 -3468594 -2592463 -1646143 -773702 -123882 297628 664656 1140002
34296A140002N10970K62541k15545o53386q23020p06046m47946k17058j04775
$$ 1140002 1650972 1913513 1697968 1044582 221562 -484484 -932430 -1149488 -1254263
34287a254263r8979j20282j01166m4414K868K7369P8516K13661M33731O81554
$$ -1254263 -1353242 -1473524 -1574690 -1619104 -1616236 -1588867 -1510351 -1296690 -862959 -181405
34277a81405Q84085R79033R17627O80475L11222q0290l74487n11505n04910m01712
$$ -181405 702680 1681713 2599340 3279815 3591037 3510747 3136260 2624755 2119845 1718133
34267A718133k52201j12115l0327m551K7775J17281K27918K70507K15602J37349
$$ 1718133 1465932 1353817 1323490 1318939 1346714 1463995 1691913 1962420 2178022 2315371
34257B315371J25194J77087K10917J73644J04908P5626Q1364K8363j58981m27996
$$ 2315371 2440565 2617652 2828569 3002213 3107121 3182747 3264111 3292474 3133493 2705497
34247B705497o15475n84073l43554n1774Q9781l3381l62296o81188p61475n43835
$$ 2705497 2090022 1505949 1162395 1110621 1200402 1167021 804725 123537 -637938 -1181773
34237a181773j84111R7196J99124J61645M7071j30026l46808n11351n12104l22442
$$ -1181773 -1365884 -1268688 -1069564 -907919 -860848 -990874 -1337682 -1849033 -2361137 -2683579
34227b683579l2525K19347L38309L15992K15863J25838J07103J64222K49970K98994
$$ -2683579 -2716104 -2496757 -2158448 -1842456 -1626593 -1500755 -1393652 -1229430 -979460 -680466
34217f80466K69266J67361M6420j6678M0974K14071L89649L98590J70767j55752
$$ -680466 -411200 -243839 -197419 -214097 -173123 40948 430597 829187 999954 844202
34207H44202l42353k98689j77950j86192l41146m71327m17118j69901J56630M08644
$$ 844202 501849 203160 25210 -160982 -502128 -973455 -1390573 -1560474 -1403844 -995200
34197i95200M51863K47049q7978l43811l91365k71971j15199j5479k365o6209
$$ -995200 -543337 -296288 -384266 -728077 -1119442 -1391413 -1506612 -1522091 -1524456 -1590665
34187a590665j57799j88466q2027J59687M39617O00474N03194J40064l05688n66078
$$ -1590665 -1748464 -1936930 -2018957 -1859270 -1419653 -819179 -315985 -175921 -481609 -1047687
34177a047687m98187j79045J96255M52904M79734K48492j33451m54246n68306
$$ -1047687 -1545874 -1724919 -1528664 -1075760 -596026 -347534 -480985 -935231 -1503537
34168a503537n13250m11617l16122k23923j73559k03718k41059j60222L0624J79920
$$ -1503537 -2016787 -2428404 -2744526 -2968449 -3142008 -3345726 -3586785 -3747007 -3716383 -3536463
34158c536463J98681J66249J78372J91366J02632p6299k16461k18303j00216M4137
$$ -3536463 -3337782 -3171533 -2993161 -2801795 -2699163 -2775462 -2991923 -3210226 -3310442 -3266305
34148c266305J33980J65800K22140L89856O39769Q20748Q05722O10132L42055
$$ -3266305 -3132325 -2966525 -2744385 -2354529 -1714760 -894012 -88290 521842 863897
34139H63897R0775r4644j85058k04308k32241k88383k51653Q30L87947O60554
$$ 863897 954672 860028 674970 470662 238421 -49962 -301615 -300785 87162 747716
34129G47716O52653M11337P8873k39364m55136m65042k35854J18310M06412M90281
$$ 747716 1400369 1811706 1890579 1651215 1196079 731037 495183 613493 1019905 1510186
34119A510186L37264J8098l07343m80639m89183m62079m60430l49958J0254M98532
$$ 1510186 1847450 1865548 1558205 1077566 588383 126304 -334126 -684084 -673830 -175298
34109a75298P79184O32857J55782l66508o94928p51820o20946m83947m77933n62560
$$ -175298 603886 1236743 1392525 1026017 331089 -420731 -1041677 -1525624 -2003557 -2566117
34099b566117n75730m39041k31576l3627J94939N00586P89630R16796Q81151Q10883
$$ -2566117 -3141847 -3580888 -3812464 -3846091 -3651152 -3150566 -2360936 -1444140 -562989 247894
34089B47894P58796O39229M06570J84174J26904K12031K60427J51761o3074k73271
$$ 247894 1006690 1645919 2052489 2236663 2363567 2575598 2836025 2987786 2924712 2651441
34079B651441m50063o24989p77934q29946p52469o17399n06981m20060l06438
$$ 2651441 2201378 1576389 798455 -31491 -783960 -1401359 -1908340 -2328400 -2634838
34070b634838j51870K6562K34322M66064O24001N66278K81486m9416k21851k02240
$$ -2634838 -2786708 -2760146 -2525824 -2059760 -1435759 -869481 -587995 -637411 -859262 -1061502
34060a061502j13022o7409p7231r5212p9603j7164O6753J13993Q5540J2735k7840
$$ -1061502 -1174524 -1241933 -1319164 -1414376 -1493979 -1511143 -1444390 -1330397 -1244857 -1232122 -1259962
34049a259962J3252J28979K76391L93361M19760L53573K77593K80150L49275L89539
$$ -1259962 -1246710 -1117731 -841340 -447979 -28219 325354 602947 883097 1232372 1621911
34039A621911L40986K31652J11959k933j05794j65168j54552q4564J5345J18670
$$ 1621911 1962897 2194549 2306508 2303575 2197781 2032613 1878061 1793497 1808842 1927512
34029A927512J89931J87822J08580K620p6348j22881j67543k34881l25531m15107
$$ 1927512 2117443 2305265 2413845 2416465 2340117 2217236 2049693 1814812 1489281 1074174
34019A074174m56832m09954k80371j14119N0094J86665K42677J57546l7827j94833
$$ 1074174 617342 207388 -72983 -187102 -137008 49657 292334 449880 412053 217220
34009B17220j87369o4432q350j38288l90209n87554n92544l87381n4660K85762
$$ 217220 29851 -34581 -42931 -181219 -571428 -1158982 -1751526 -2138907 -2193567 -1907805
33999a907805N30317O18173N41151L49693J37590j5549j00627j56938j90750j55602
$$ -1907805 -1377488 -759315 -218164 131529 269119 253570 152943 -3995 -194745 -350347
33989c50347l3147J13072K10037K68922L46886M30492M30640L14950J86879J85498
$$ -350347 -383494 -270422 -60385 208537 555423 985915 1416555 1731505 1918384 2103882
33979B103882L28856M96804N61163M96048L55470J82820j9194k36846m06460m55590
$$ 2103882 2432738 2929542 3490705 3986753 4342223 4525043 4505849 4269003 3862543 3406953
33969C406953l74245k29360j17091j10420k27988m19705n93176o89128p23217
$$ 3406953 3032708 2803348 2686257 2575837 2347849 1928144 1334968 645840 -77377
33960g7377p18899o22999l62016J0177L06669L98268L48339L01004K93209K59109
$$ -77377 -796276 -1419275 -1781291 -1771114 -1464445 -1066177 -717838 -416834 -123625 135484
33950A35484J83197J42574J81404K27575J81775M9923n3005j8734J51302L48384
$$ 135484 318681 461255 642659 870234 1052009 1101932 1048927 1030193 1181495 1529879
33940A529879M57689M68071M74966N57192O62905O46254M15721K9789l38407n08795
$$ 1529879 1987568 2455639 2930605 3487797 4150702 4796956 5212677 5242466 4904059 4395264
33930D395264m00761r5026K03912L13428K02070l5732l10036n95868q79485j111589
$$ 4395264 3994503 3899477 4103389 4416817 4618887 4583155 4273119 3677251 2797766 1686177
33920A686177j233128j205885j013040o87180l57603k06859l23818o11356q59326
$$ 1686177 453049 -752836 -1765876 -2453056 -2810659 -3017518 -3341336 -3952692 -4812018
33911d812018q94021o68647k77270Q3633K29031J35611k9994p7369K2523J51053
$$ -4812018 -5706039 -6374686 -6651956 -6568323 -6339292 -6203681 -6233675 -6311044 -6288521 -6137468
33901f137468K14179K38651K92182L70525M08122L77170L26424L07233K94776
$$ -6137468 -5923289 -5684638 -5392456 -5021931 -4613809 -4236639 -3910215 -3602982 -3308206
33892c308206K25391J10892O2272J57512L14170L51744J81781j09505l67058n00335
$$ -3308206 -3082815 -2971923 -2909651 -2752139 -2437969 -2086225 -1904444 -2013949 -2381007 -2881342
33882b881342n03100m07410k58786r8574O1091K12499K88035J84059j02088m08232
$$ -2881342 -3384442 -3791852 -4050638 -4149212 -4088121 -3875622 -3587587 -3403528 -3505616 -3913848
33872c913848n42832m57865k41498J3761K59606M40865M96574M30528L14777K06823
$$ -3913848 -4456680 -4914545 -5156043 -5142282 -4882676 -4441811 -3945237 -3514709 -3199932 -2993109
33862b993109J17671O6351R2132J82178K51821K46293K19077K55196L39746L56667
$$ -2993109 -2875438 -2809087 -2716955 -2534777 -2282956 -2036663 -1817586 -1562390 -1222644 -865977
33852h65977K21687j4209k01689k23025r1602O3113J08939J8091j26182k07162
$$ -865977 -644290 -658499 -860188 -1083213 -1174815 -1111702 -1002763 -984672 -1110854 -1318016
33842a318016j48169N4010L11851M63606L72402N5734l00714m87608m30891k15901
$$ -1318016 -1466185 -1412175 -1100324 -636718 -264316 -208582 -509296 -996904 -1427795 -1643696
33832a643696O072J18270R1388j1417q4109o1423L8813J53806K32804K48575J91150
$$ -1643696 -1637624 -1519354 -1427966 -1439383 -1523492 -1584915 -1546102 -1392296 -1159492 -910917 -719767
33821g19767Q5927k733k4928J631J4601k8569j27978k53928l42502l05068j07659
$$ -719767 -633840 -636573 -661501 -659870 -645269 -673838 -801816 -1055744 -1398246 -1703314 -1810973
33810a810973J52369L03800K58598Q1343r9291j99263j93303r5408K5413O5369
$$ -1810973 -1658604 -1354804 -1096206 -1014863 -1114154 -1313417 -1506720 -1602128 -1576715 -1511346
33800a511346p730r5535q3264Q745O6212O4543J08886K56117L94627L84262K56820
$$ -1511346 -1519076 -1614611 -1697875 -1689130 -1622918 -1558375 -1449489 -1193372 -798745 -414483 -157663
33789a57663J74684K06088K41600J53007m9920k62367m13505m88144m63278l03293
$$ -157663 17021 223109 464709 617716 567796 305429 -108076 -596220 -1059498 -1362791
33779a362791k1126L07438N99206P99082Q65742P78680N87747M16985L72318M45174
$$ -1362791 -1383917 -1076479 -477273 321809 1187551 1966231 2553978 2970963 3343281 3788455
33769C788455N28738N25797M22506K64953R9281m6528j46958j85797j87077k11108
$$ 3788455 4317193 4842990 5265496 5530449 5629730 5583202 5436244 5250447 5063370 4852262
33759D852262k97718m25252n42017o20372o53075o17349m97047l47665k81409
$$ 4852262 4554544 4129292 3587275 2966903 2313828 1696479 1199432 851767 570358
33750E70358l49952m77952n53904n58218n51497n54601n01661l20846j7556L32534
$$ 570358 220406 -257546 -811450 -1369668 -1921165 -2475766 -2977427 -3298273 -3315829 -2983295
33740b983295O35272Q17915Q67088Q50290Q58513Q95944Q58854O59786L48388
$$ -2983295 -2348023 -1530108 -663020 187270 1045783 1941727 2800581 3460367 3808755
33731C808755O9887q1598j31616j63644k37058l62680n01086n61712m56714k10339
$$ 3808755 3878642 3797044 3665428 3501784 3264726 2902046 2400960 1839248 1382534 1172195
33721A172195P157J8361j73296l76446m12884k87412j30068j8168P7938J93345
$$ 1172195 1179352 1197713 1024417 647971 235087 -52325 -182393 -200561 -122623 70722
33711G0722L00560L67834M15119M65038M88603M53302L86742L35321K91355K23817
$$ 70722 371282 739116 1154235 1619273 2107876 2561178 2947920 3283241 3574596 3798413
33701C798413J52723J17206Q7209m086j36957k06856j73744j21438j26296j51376
$$ 3798413 3951136 4068342 4155551 4151465 4014508 3807652 3633908 3512470 3386174 3234798
33691C234798j35525j16462j77691l12069m26212m67260m65026m41014l44546
$$ 3234798 3099273 2982811 2805120 2493051 2066839 1599579 1134553 693539 348993
33682C48993j15145K13689M89514N25704K46669k17816o09213p58324p20869o67981
$$ 348993 233848 447537 937051 1462755 1709424 1491608 882395 124071 -596798 -1264779
33672a264779o70309o43561m91264k33115K4440J98806K90576L57886M45128N29085
$$ -1264779 -1935088 -2578649 -3069913 -3303028 -3278588 -3079782 -2789206 -2431320 -1986192 -1457107
33662a457107N48312N00432M75368N48821O70562P15411O24030M25960J42947
$$ -1457107 -908795 -408363 67005 615826 1286388 2001799 2625829 3051789 3194736
33653C194736k30427o26862q82533q80610o76118m31334k62306j83386j54685
$$ 3194736 2964309 2337447 1454914 574304 -101814 -533148 -795454 -978840 -1133525
33644a133525j27512p0036k152Q050p3348j77213j84946m8079J72242L70150M65055
$$ -1133525 -1261037 -1331073 -1333225 -1325175 -1398523 -1575736 -1760682 -1808761 -1636519 -1266369 -801314
33633h01314M25961K83431J30302O4385R6850J36015R0445j9071p7964j3435J13943
$$ -801314 -375353 -91922 38380 102765 199615 335630 426075 407004 329040 315605 429548
33622D29548J76329J23025K7142j3409J2680K9722m9311k64632n78306q56206
$$ 429548 605877 728902 756044 742635 755315 785037 735726 471094 -107212 -963418
33612i63418r25223p24852l95356j51503o8552m9502J0714J17725K43081L86211
$$ -963418 -1888641 -2613493 -3008849 -3160352 -3228904 -3278406 -3267692 -3149967 -2906886 -2520675
33602b520675N04434M60760J43620l73206q57188j109125j097762r20461o80219
$$ -2520675 -2016241 -1555481 -1411861 -1785067 -2642255 -3751380 -4849142 -5769603 -6449822
33593f449822m16504j33203J40285L53559N08122O62615P99654P42523L32357
$$ -6449822 -6866326 -6999529 -6859244 -6505685 -5997563 -5334948 -4535294 -3792771 -3460414
33584c460414l06862q15040r58082q28397o29744m07131j09231K03947L95302
$$ -3460414 -3767276 -4582316 -5540398 -6368795 -6998539 -7405670 -7514901 -7310954 -6915652
33575f915652M47322M62120M75008M12063K42055M0373j19390k20734k27394p0637
$$ -6915652 -6468330 -6006210 -5531202 -5119139 -4877084 -4836711 -4956101 -5176835 -5404229 -5474866
33565e474866K35919N57290P59296Q05926P22720N55783L94195L34427L73094
$$ -5474866 -5238947 -4681657 -3922361 -3116435 -2393715 -1837932 -1443737 -1109310 -736216
33556g36216M10888L98047L91335M29560M50451L91513K88111K03381J33126M3804
$$ -736216 -325328 72719 464054 893614 1344065 1735578 2023689 2227070 2360196 2404000
33546B404000o6416k04475l94538n73609n61081k46199K38233O26932P73804P16769
$$ 2404000 2337584 2133109 1738571 1164962 603881 357682 595915 1222847 1996651 2713420
33536B713420N53772L69615K49537K32247K34843J19447j50726m92432q26370
$$ 2713420 3267192 3636807 3886344 4118591 4353434 4472881 4322155 3829723 3003353
33527C003353j123815j327051j334857j116967p75611m49974k00803m769J91616
$$ 3003353 1879538 552487 -782370 -1899337 -2674948 -3124922 -3325725 -3330494 -3138878
33518c138878M28358O79951Q20974P06604L35015j05219l89660m44225l62625
$$ -3138878 -2710520 -2030569 -1209595 -502991 -167976 -273195 -662855 -1107080 -1469705
33509a469705k69085j92257o7225J49564L73688M30496K29118j24471m25665n55373
$$ -1469705 -1738790 -1931047 -1998272 -1848708 -1475020 -1044524 -815406 -939877 -1365542 -1920915
33499a920915n20781l60849j12923J27814K24988J30181n9481k03603k28415j23509
$$ -1920915 -2441696 -2802545 -2915468 -2787654 -2562666 -2432485 -2491966 -2695569 -2923984 -3047493
33489c047493Q8523L29899M77710M60929L25530J75527Q4222P6527J33448J77631
$$ -3047493 -2958970 -2629071 -2151361 -1690432 -1364902 -1189375 -1105153 -1028626 -895178 -717547
33479g17547J20693k2410j23122r7480j2669L2209O5268J78154L39070L89481
$$ -717547 -596854 -619264 -742386 -839866 -852535 -820326 -755058 -576904 -237834 151647
33469A51647K42614l850j81140k13283j50849j02140j51575k90054m01634l68938
$$ 151647 394261 390411 209271 -4012 -154861 -257001 -408576 -698630 -1100264 -1469202
33459a469202k16548j01524j34038k56738l40082l50105l61685m24411m74422
$$ -1469202 -1685750 -1787274 -1921312 -2178050 -2518132 -2868237 -3229922 -3654333 -4128755
33450d128755l90142j06872L22451P45647R83766R28923O19948K34222j7874k5064
$$ -4128755 -4518897 -4625769 -4303318 -3557671 -2573905 -1644982 -1025034 -790812 -808686 -833750
33440h33750J68077M16732N80763N87013M27550J44723j70479m05649m98544m85308
$$ -833750 -665673 -248941 331822 918835 1346385 1491108 1320629 914980 416436 -68872
33430f8872m56588m65056m90878m90147m50158l91712l38375k94665k44563j66811
$$ -68872 -525460 -990516 -1481394 -1971541 -2421699 -2813411 -3151786 -3446451 -3691014 -3857825
33420c857825o1521L4735O7933L575j55200l73909n96882p57986p99436o87309
$$ -3857825 -3919346 -3884611 -3816678 -3813103 -3968303 -4342212 -4939094 -5697080 -6496516 -7183825
33410g183825m17724l6443L34266N31230M73354K54347P3777O6827K25410M66884
$$ -7183825 -7601549 -7637992 -7303726 -6772496 -6299142 -6044795 -5971018 -5904191 -5678781 -5211897
33400e211897P10272Q65882Q29288N66052J88090j16191k41055k27593j79386
$$ -5211897 -4501625 -3635743 -2806455 -2240403 -2052313 -2168504 -2409559 -2637152 -2816538
33391b816538j57109j62090j79759k07858k53723l20554l90023m13532l37529
$$ -2816538 -2973647 -3135737 -3315496 -3523354 -3777077 -4097631 -4487654 -4901186 -5238715
33382e238715j52670Q8662L14441M89510O26943P51676Q55762Q76135P15161L18851
$$ -5238715 -5391385 -5302723 -4988282 -4498772 -3871829 -3120153 -2264391 -1388256 -673095 -354244
33372c54244k26336o90494q59216p34277n43660n02731n75921n28320k21785J96607
$$ -354244 -580580 -1271074 -2130290 -2864567 -3408227 -3910958 -4486879 -5015199 -5236984 -5040377
33362e040377M36173L52608N4566k38452l70931k98040n9549K35030M48800N18986
$$ -5040377 -4604204 -4251596 -4197030 -4435482 -4806413 -5104453 -5164002 -4928972 -4480172 -3961186
33352c961186N12998N44103O42805P51258Q26683Q85565R34408R20876P97540
$$ -3961186 -3448188 -2904085 -2261280 -1510022 -683339 202226 1136634 2057510 2855050
33343B855050N97963M00312K31224N4440j44208l09006l79060l76933l97085m99961
$$ 2855050 3453013 3853325 4084549 4138989 3994781 3685775 3306715 2929782 2532697 2032736
33333B032736o37215p00605o45028n45480n15105n73117o17308n31923k97606
$$ 2032736 1395521 694916 49888 -495592 -1010697 -1583814 -2201122 -2733045 -3030651
33324c030651J6901L35489O05375P68515P72805O46725N25755N51052P30565R17604
$$ -3030651 -3013750 -2678261 -2072886 -1304371 -531566 115159 640914 1191966 1922531 2840135
33314B840135R34054P15378L49906o231k57823m34642o33592q90746j116084j170307
$$ 2840135 3774189 4489567 4839473 4833242 4575419 4140777 3507185 2616439 1500355 330048
33304C30048j004688p04694l89956r8784J99140M90655O77427O86040N90342N54624
$$ 330048 -674640 -1379334 -1769290 -1868074 -1668934 -1178279 -500852 185188 775530 1330154
33294A330154O35799P05022O21658M39936L50449M16992M75126L45818P0857j50316
$$ 1330154 1965953 2670975 3292633 3732569 4083018 4500010 4975136 5320954 5391811 5241495
33284E241495k12006j86585j66545j36398n0944L8872J9454j47740l80514n64372
$$ 5241495 5029489 4842904 4676359 4539961 4489017 4527889 4547343 4399603 4019089 3454717
33274C454717o44704o29432n40814l93010k13661o7695l1286j18019k40042k80371
$$ 3454717 2810013 2180581 1639767 1246757 1033096 965401 934115 816096 576054 295683
33264B95683k19203j62409k26736m18043o39722p94394q48289q13690p05091n17894
$$ 295683 76480 -85929 -312665 -730708 -1370430 -2164824 -3013113 -3826803 -4531894 -5049788
33254e049788k39505J07985M27662N82275N09391K97290J17060Q1516J88075L72468
$$ -5049788 -5289293 -5181308 -4753646 -4171371 -3661980 -3364690 -3247630 -3166114 -2978039 -2605571
33244b605571N62326O74295O20654L68092j8888m16038p15386q56670q11087n79662
$$ -2605571 -2043245 -1368950 -748296 -380204 -399092 -815130 -1530516 -2387186 -3198273 -3777935
33234c777935k29023R2558K27065J43000p0K4621K81018N86242O99448N80271
$$ -3777935 -4006958 -3914400 -3687335 -3544335 -3544405 -3519784 -3238766 -2652524 -1953076 -1372805
33224a372805M07204L44033L59336L09987J43521m5939j39232j07216m119J00504
$$ -1372805 -965601 -621568 -262232 47755 191276 145337 6105 -101111 -105230 -4726
33214d726J63151J75395J61839J59722J83319K08765J95589J17392k2178j85136
$$ -4726 158425 333820 495659 655381 838700 1047465 1243054 1360446 1338268 1153132
33204A153132l12497l69474l89412m48069n73552p01301p45994p04985o57724
$$ 1153132 840635 471161 81749 -366320 -939872 -1641173 -2387167 -3092152 -3749876
33195c749876o69237p33304q13183q86961r22413q47993o03752k17038K07297
$$ -3749876 -4419113 -5152417 -5965600 -6852561 -7774974 -8622967 -9226719 -9443757 -9236460
33186i236460N67584Q07894R00347Q44086O94072N40679M32198L47975K65268
$$ -9236460 -8668876 -7860982 -6960635 -6116549 -5422477 -4881798 -4449600 -4101625 -3836357
33177c836357K10877K15209K54532K85954L17451L93916N18323O20371N96856
$$ -3836357 -3625480 -3410271 -3155739 -2869785 -2552334 -2158418 -1640095 -1019724 -422868
33168d22868L65106q1860o12623r73877r60035o01483j42069J84720L12604K79060
$$ -422868 -57762 -139622 -752245 -1726122 -2686157 -3287640 -3429709 -3244989 -2932385 -2653325
33158b653325J01487k10677n68429q20413q76180p74587o22808m90756l58458
$$ -2653325 -2551838 -2762515 -3330944 -4151357 -5027537 -5802124 -6424932 -6915688 -7274146
33149g274146j37920K46911P65564J258486J535956J515758J263220R15352N94693
$$ -7274146 -7412066 -7165155 -6399591 -5141105 -3605149 -2089391 -826171 89181 683874
33140F83874L80558L02499L26244L73337L91946M00690M33961M52327L54085J05408
$$ 683874 1064432 1366931 1693175 2066512 2458458 2859148 3293109 3745436 4099521 4204929
33130D204929j66110k58809r8249J72584L26533K59108L9258k15966m49927o34252
$$ 4204929 4038819 3780010 3681761 3854345 4180878 4439986 4479244 4263278 3813351 3179099
33120C179099p00809n86381l45085j55671j77987m06196o67522p53374n59435
$$ 3179099 2478290 1891909 1546824 1391153 1213166 806970 139448 -613926 -1173361
33111a173361j40640L29760O55774P14514N07117J42445k38762n53954q09097
$$ -1173361 -1314001 -984241 -328467 386047 893164 1035609 796847 242893 -566204
33102e66204j032532j184851j168678r43457n95099k59162n100J60707K14928
$$ -566204 -1598736 -2783587 -3952265 -4895722 -5490821 -5749983 -5755083 -5594376 -5379448
33093e379448J27649l9905j38892q9127K3377O2062M999p7502j68485l14793m75005
$$ -5379448 -5251799 -5291704 -5430596 -5519723 -5496346 -5434284 -5429285 -5506787 -5675272 -5990065 -6465070
33082f465070m63634j28035M53494J009854J301267J271839J011735O37464K28413
$$ -6465070 -6928704 -7056739 -6603245 -5593391 -4292124 -3020285 -2008550 -1371086 -1142673
33073a142673j57694m48107n60370m67088k48636l0924J54418L91441P06251R30417
$$ -1142673 -1300367 -1748474 -2308844 -2775932 -3024568 -3055492 -2901074 -2509633 -1803382 -872965
33063h72965Q48845M81731J06286m0900J3415J04445J65157K25433K52206J49347
$$ -872965 -24120 457611 563897 522997 536412 640857 806014 1031447 1283653 1433000
33053A433000p6972k87036l88847m47383n44547o10889m96361j85453J42645K85272
$$ 1433000 1356028 1068992 680145 232762 -311785 -922674 -1419035 -1604488 -1461843 -1176571
33043a176571K06750M8301k3417L4160J27024J47464R5718O5555J23173K36952
$$ -1176571 -969821 -921520 -944937 -910777 -783753 -636289 -540571 -475016 -351843 -114891
33033a14891L26797L35583K37376L2066k22335m05581m13172k31532P7457M20928
$$ -114891 211906 547489 784865 816931 594596 189015 -224157 -455689 -378232 42696
$$ [...]
##END NTUPLES=NMR SPECTRUM
##END=
