##TITLE=31Pdec_1PEM31
 CDCl3, 24 sc
 26.7.2019
##JCAMPDX= 6.0         $$ Bruker NMR JCAMP-DX V2.0
##DATA TYPE= NMR SPECTRUM
##DATA CLASS= NTUPLES
##ORIGIN= UXNMR, Bruker Analytische Messtechnik GmbH
##OWNER= root
$$ XWIN-NMR		Version 3.5
$$ Fri Jul 26 13:58:14 2019 Russian Standard Time (UT+4h)  she@DPX200
##.OBSERVE FREQUENCY= 81.013821
##.OBSERVE NUCLEUS= ^31P
##.ACQUISITION MODE= SIMULTANEOUS
##.ACQUISITION SCHEME= undefined
##.AVERAGES= 24
##.DIGITISER RES= 17
##SPECTROMETER/DATA SYSTEM= spect
##.PULSE SEQUENCE= zgpg30
##.SOLVENT NAME= CDCl3
##.SHIFT REFERENCE= (INTERNAL, CDCl3, 0, 182.463)
##AUDIT TRAIL= $$ (NUMBER, WHEN, WHO, WHERE, WHAT)
$$ ##TITLE= Audit trail, XWIN-NMR		Version 3.5
$$ ##JCAMPDX= 5.01
$$ ##ORIGIN= Bruker BioSpin GmbH
$$ ##OWNER= she
$$ F:/spectra/data/she/nmr/P31/1/pdata/1/auditp.txt
$$ ##AUDIT TRAIL=  $$ (NUMBER, WHEN, WHO, WHERE, WHAT)
(   1,<2019-07-26 13:57:20.17 +0400>,<she>,<DPX200>,
      <created by zg, POWCHK disabled, PULCHK disabled
       configuration hash MD5:
       00 E9 B6 7A A2 85 ED C7 34 08 36 98 17 FE 4E 26
       data hash MD5: 32K
       53 D9 D3 70 35 CE B2 7D 65 3C 22 C5 06 EC A3 55>)
(   2,<2019-07-26 13:57:22.25 +0400>,<she>,<DPX200>,
      <Start of raw data processing
       efp BC_mod = 2 LB = 1 FT_mod = 6 PKNL = 1 PHC0 = -370.9528 PHC1 = 51.39999 SI = 64K 
       data hash MD5: 64K
       08 A2 F7 A4 D9 E6 76 FA DC 25 E6 38 06 D9 8B 57>)
(   3,<2019-07-26 13:57:36.76 +0400>,<she>,<DPX200>,
      <pk PHC0 = -2.779217 PHC1 = 0 
       data hash MD5: 64K
       0C 4B 08 27 9C 8A 39 2A 3D 8F 89 00 03 2E DD DF>)
(   4,<2019-07-26 13:57:39.79 +0400>,<she>,<DPX200>,
      <abs ABSG = 5 
       data hash MD5: 64K
       3C 8E CD 50 3C 28 A7 7A D3 E2 B2 3D 60 91 B6 13>)
$$ ##END=
$$ 
$$ hash MD5
$$ F2 6F 05 83 B2 6C 45 49 17 44 EB 2A EC F4 6D C9
##$RELAX= 
##$RELAX= 
##$RELAX= 
##$RELAX= 
##$RELAX= 
##$RELAX= 
##$RELAX= 
##$RELAX= 
$$ Bruker specific parameters
$$ --------------------------
##$DU= <F:/spectra>
##$EXPNO= 1
##$NAME= <P31>
##$PROCNO= 1
##$TYPE= <nmr>
##$USER= <she>
##$AMP= (0..31)
100 100 100 100 100 100 100 100 100 100 100 100 100 100 100 100 100 100 
100 100 100 100 100 100 100 100 100 100 100 100 100 100 
##$AQSEQ= 0
##$AQ_mod= 1
##$AUNM= <au_zg>
##$AUTOPOS= <>
##$BF1= 81.014009
##$BF2= 200.13
##$BF3= 200.13
##$BF4= 200.13
##$BF5= 200.13
##$BF6= 200.13
##$BF7= 200.13
##$BF8= 200.13
##$BYTORDA= 1
##$CFDGTYP= 0
##$CFRGTYP= 5
##$CHEMSTR= <none>
##$CNST= (0..31)
1 1 145 1 1 1 1 1 1 1 1 1 1 1 1 1 1 1 1 1 1 1 1 1 1 1 1 1 1 1 1 1 
##$CPDPRG= <waltz16>
##$CPDPRG1= <>
##$CPDPRG2= <waltz16>
##$CPDPRG3= <>
##$CPDPRG4= <mlev>
##$CPDPRG5= <mlev>
##$CPDPRG6= <mlev>
##$CPDPRG7= <mlev>
##$CPDPRG8= <mlev>
##$CPDPRGB= <>
##$CPDPRGT= <>
##$D= (0..31)
0 1 0 0 0 0 0 0 0 0 0 0.03 2e-05 3e-06 0 0 0 0 0 0 0 0 0 0 0 0 0 0 0 0 
0 0 
##$DATE= 1564135039
##$DBL= (0..7)
120 120 120 11 120 120 24 19 
##$DBP= (0..7)
150 150 150 150 150 150 150 150 
##$DBP07= 0
##$DBPNAM0= <>
##$DBPNAM1= <>
##$DBPNAM2= <>
$$ [...]
##$SUBNAM3= <"">
##$SUBNAM4= <"">
##$SUBNAM5= <"">
##$SUBNAM6= <"">
##$SUBNAM7= <"">
##$SUBNAM8= <"">
##$SUBNAM9= <"">
##$SW= 369.568048894756
##$SWIBOX= (0..15)
0 1 3 0 0 0 0 0 0 0 0 0 0 0 0 0 
##$SW_h= 29940.119760479
##$TD= 32768
##$TD0= 1
##$TE= 0
##$TE2= 300
##$TE3= 300
##$TEG= 300
##$TL= (0..7)
0 120 53 12 22 120 120 120 
##$TP= (0..7)
150 150 150 150 150 150 150 150 
##$TP07= 0
##$TPNAME0= <>
##$TPNAME1= <>
##$TPNAME2= <>
##$TPNAME3= <>
##$TPNAME4= <>
##$TPNAME5= <>
##$TPNAME6= <>
##$TPNAME7= <>
##$TPOAL= (0..7)
0.5 0.5 0.5 0.5 0.5 0.5 0.5 0.5 
##$TPOFFS= (0..7)
0 0 0 0 0 0 0 0 
##$TUNHIN= 0
##$TUNHOUT= 0
##$TUNXOUT= 0
##$USERA1= <user>
##$USERA2= <user>
##$USERA3= <user>
##$USERA4= <user>
##$USERA5= <user>
##$V9= 5
##$VALIST= <valist>
##$VCLIST= <CCCCCCCCCCCCCCC>
##$VD= 0
##$VDLIST= <DDDDDDDDDDDDDDD>
##$VPLIST= <PPPPPPPPPPPPPPP>
##$VTLIST= <TTTTTTTTTTTTTTT>
##$WBST= 1024
##$WBSW= 4
##$XGAIN= (0..3)
0 0 0 0 
##$XL= 0
##$YL= 0
##$YMAX_a= 99589
##$YMIN_a= -102291
##$ZGOPTNS= <>
##$ZL1= 120
##$ZL2= 120
##$ZL3= 120
##$ZL4= 120
##$ABSF1= 182.463
##$ABSF2= -187.1042
##$ABSG= 5
##$ABSL= 3
##$ALPHA= 0
##$AQORDER= 0
##$ASSFAC= 0
##$ASSFACI= 0
##$ASSFACX= 0
##$ASSWID= 0
##$AUNMP= <proc_1d>
##$AZFE= 0.1
##$AZFW= 0.5
##$BCFW= 0
##$BC_mod= 2
##$BYTORDP= 0
##$COROFFS= 0
##$CY= -3
##$DATMOD= 1
##$DC= 0
##$DFILT= <>
##$DTYPP= 0
##$F1P= 0
##$F2P= 0
##$FCOR= 1
##$FTSIZE= 65536
##$FT_mod= 6
##$GAMMA= 0
##$GB= 0
##$INTBC= 1
##$INTSCL= 5.30512e-09
##$ISEN= 30
##$LB= 1
##$LEV0= 0
##$LPBIN= 0
##$MAXI= 10000
##$MC2= 0
##$MEAN= 0
##$ME_mod= 0
##$MI= 50
##$NCOEF= 0
##$NC_proc= -2
##$NLEV= 6
##$NOISF1= 182.463
##$NOISF2= 159.3651
##$NSP= 0
##$NTH_PI= 0
##$NZP= 0
##$OFFSET= 182.463
##$PC= 4
##$PHC0= -373.732
##$PHC1= 51.39999
##$PH_mod= 1
##$PKNL= yes
##$PPARMOD= 0
##$PSCAL= 0
##$PSIGN= 0
##$REVERSE= no
##$SF= 81.0140089999434
##$SI= 65536
##$SIGF1= 159.3651
##$SIGF2= -187.1042
##$SINO= 113.3802
##$SIOLD= 16384
##$SREGLST= <1H.CDCl3>
##$SSB= 0
##$STSI= 65536
##$STSR= 0
##$SW_p= 29940.119760479
##$SYMM= 0
##$S_DEV= 0
##$TDeff= 32768
##$TDoff= 0
##$TI= <>
##$TILT= no
##$TM1= 0
##$TM2= 0
##$TOPLEV= 0
##$USERP1= <user>
##$USERP2= <user>
##$USERP3= <user>
##$USERP4= <user>
##$USERP5= <user>
##$WDW= 1
##$XDIM= 65536
##$YMAX_p= 471787189
##$YMIN_p= -1414875
$$ End of Bruker specific parameters
$$ ---------------------------------
##NTUPLES= NMR SPECTRUM
##VAR_NAME=  FREQUENCY,     SPECTRUM/REAL,   SPECTRUM/IMAG
##SYMBOL=    X,             R,               I
##VAR_TYPE=  INDEPENDENT,   DEPENDENT,       DEPENDENT
##VAR_FORM=  AFFN,          ASDF,            ASDF
##VAR_DIM=   65536,         65536,           65536
##UNITS=     HZ,            ARBITRARY UNITS, ARBITRARY UNITS
##FACTOR=    0.456856943014862, 1,           1
##FIRST=     14782.0589164792, 0,            0
##LAST=      -15158.0608439998, 0,           0
##MIN=       -15158.0608439998, -1414875,    0
##MAX=       14782.0589164792, 471787189,    0
$$ Real data points
##PAGE= N=1
##DATA TABLE= (X++(R..R)), XYDATA
$$ [...]
$$ plain form
41704 -189353 13512 176033 160759 63069 9746 -17602 -62780 -76707 -37949 -40777 -138911
41693 -138911 -232248 -227493 -183148 -175028 -152102 -62779 7451 -17422 -39124 57352 182802 172439
41681 172439 60387 27397 122249 228876 280239 311113 310867 220427 91698 66051 157602
41670 157602 222297 184668 137299 160566 195692 172558 131711 130971 136883 96778 31270 -27391
41658 -27391 -108729 -227660 -301534 -242749 -100365 -21375 -78048 -195483 -249159 -189036 -64566
41647 -64566 39977 82710 86331 93139 113634 129741 126330 94328 26054 -55716 -85949 -22802
41635 -22802 85949 146908 122633 50737 -17275 -46164 -9419 82483 155345 138031 54829
41624 54829 -7717 -20553 -33232 -76949 -119179 -128666 -120475 -115441 -108840 -98462 -94696 -84246 -29118
$$ packed form
41704a89353K02865J62521j5274r7690n3323k7348m5178j3927L8758k828r8134
41693a38911r3337M755M4345Q120K2926Q9323P0230k4873k1702R6476J25450j0363
41681A72439j12052l2990R4852J06627N1363L0874k46r0440j28729k5647R1551
41670A57602O4695l7629m7369K3267L5126k3134m0847p40N912m0105o5508n8661
41658b7391q1338j18931p3874N8785J42384P8990n6673j17435n3676O0123J24470
41647f4566J04543M2733L621O808K0495J6107l411l2002o8274q1770l0233O3147
41635b2802J08751O0959k4275p1896o8012k8889L6745R1902P2862j7314q3202
41624E4829o2546j2836j2679m3717m2230r487Q191N034O601J0378L766J0450N5128
$$ plain form
41611 -29118 76817 182776 226131 181244 71160 -38998 -78235 -42712 -15457 -65013 -146087
41600 -146087 -159819 -91288 -16109 14565 15773 2670 -28378 -42531 22610 160415 278356
41589 278356 304697 255246 179335 104676 53978 46904 55991 19838 -71024 -154315 -185885 -196716
41577 -196716 -236221 -307403 -378346 -411311 -368730 -245213 -106904 -40857 -50143 -56932 -19038
41566 -19038 25058 38750 33608 10559 -55176 -129284 -111515 17562 119598 56549 -121929
41555 -121929 -238838 -213621 -139521 -137091 -205873 -249546 -203584 -102525 -34009 -51614 -136886
41544 -136886 -229949 -277938 -259732 -196932 -151874 -177593 -246967 -271676 -221235 -170821 -181528
41533 -181528 -192297 -113523 11886 42514 -72637 -226964 -284234 -205555 -53106 65781
$$ packed form
41611b9118J05935J05959M3355m4887j10084j10158l9237L5523K7255m9556q1074
41600a46087j3732O8531P5179L0674J208j3103l1048j4153O5141J37805J17941
41589B78356K6341m9451p5911p4659n0698p074R087l6153r0862q3291l1570j0831
41577a96716l9505p1182p0943l2965M2581J23517J38309O6047r286o789L7894
41566a9038M4096J3692n142k3049o5735p4108J7769J29077J02036o3049j78478
41555a21929j16909K5217P4100K430o8782m3673M5962J01059O8516j7605q5272
41544a36886r3063m7989J8206O2800M5058k5719o9374k4709N0441N0414j0707
41533a81528j0769P8774J25409L0628j15151j54327n7270P8679J52449J18887
$$ plain form
41523 65781 70281 -9217 -38659 54738 163127 138366 7263 -78393 -70691 -49527 -31913 61666
41511 61666 222051 311469 271289 210812 216946 229718 191709 166610 200303 205058 108278 -4918
41499 -4918 -29807 -13799 -50850 -101637 -71354 7083 21638 -36836 -82422 -83544 -71470 -35866
41487 -35866 54386 149875 167222 123143 106910 132524 130148 76248 25044 10885 12813 13040
41475 13040 7236 -31329 -115675 -190610 -195506 -157571 -140095 -132287 -86836 -33237 -43401 -106193
41463 -106193 -147311 -156326 -178891 -198098 -151161 -63989 -36684 -75732 -68683 36600 143222
41452 143222 145623 61752 -24949 -70102 -65583 -10159 63539 93476 62970 17561 -19275 -77290
41440 -77290 -149253 -146284 -9750 178457 265784 195340 57849 -17561 4309 44197 8974
$$ packed form
41523F5781M500p9498k9442R3397J08389k4761j31103q5656P702K1164J7614R3579
41511F1666J60385Q9418m0180o0477O134J2772l8009k5099L3693M755r6780j13196
41499d918k4889J6008l7051n0787L0283P8437J4555n8474m5586j122J2074L5604
41487c5866R0252R5489J7347m4079j6233K5614k376n3900n1204j4159J928K27
41475A3040n804l8565q4346p4935m896L7935J7476P808M5451N3599j0164o2792
41463a06193m1118r015k2565j9207M6937Q7172K7305l9048P049J05283J06622
41452A43222K401q3871q6701m5153M519N5424P3698K9937l0506m5409l6836n8015
41440g7290p1963K969J36534J88207Q7327p0444j37491p5410K1870L9888l5223
$$ plain form
41429 8974 -97438 -181628 -178852 -121459 -66655 -10811 69241 133827 116261 24328 -61794 -84575
41417 -84575 -47486 22436 89934 108631 66300 18202 20620 57837 90459 129804 187733 204385
41405 204385 129022 33148 24615 74925 62339 -23040 -59412 4921 69922 48893 -5566 -1103
41393 -1103 62724 121155 131882 93062 34243 11662 49080 80389 32906 -37149 -340 146934
41381 146934 260848 252382 185204 134398 82249 16782 4919 80281 160891 164146 115384 68862
41369 68862 18928 -27605 5974 144702 266995 246935 130088 56449 58268 48392 -19156
41358 -19156 -84259 -74429 9141 94888 88265 -50656 -232174 -289212 -162608 14215 76319
41347 76319 20622 -30556 -6511 56359 103465 123184 128685 136141 152336 154561 114649 63199
$$ packed form
41429H974j06412q4190K776N7393N4804N5844Q0052O4586j7566r1933q6122k2781
41417h4575L7089O9922O7498J8697m2331m8098K418L7217L2622L9345N7929J6652
41405B04385p5363r5874q533N0310j2586q5379l6372O4333O5001k1029n4459M463
41393a103O3827N8431J0727l8820n8819k2581L7418L1309m7483p0055L6809J47274
41381A46934J13914q466o7178n0806n2149o5467j1863P5362Q0610L255m8762m6522
41369F8862m9934m6533L3579J38728J22293k0060j16847p3639J819r876o7548
41358a9156o5103R830Q3570Q5747o623j38921j81518n7038J26604J76823O2104
41347G6319n5697n1178K4045O2870M7106J9719N501P456J6195K225l9912n1450
$$ plain form
41335 63199 70289 133831 166658 137210 126114 177590 203952 138635 81173 153092 284719 301527
41323 301527 182784 76820 68344 80048 24689 -72171 -135871 -133126 -73792 -2804 416 -102104
41311 -102104 -226789 -250546 -174902 -115436 -124575 -130920 -75323 -444 37013 53540 89423 141686
41299 141686 186070 204038 160885 28417 -138664 -222561 -178189 -82772 -15809 32293 85021
41288 85021 99848 43743 -13934 19706 117042 154163 75462 -41923 -100373 -95734 -91468 -120061
41276 -120061 -143598 -98101 39645 217107 329719 303434 177009 84285 118541 219569
41266 219569 240656 135593 18791 4379 54655 65464 43866 77515 147413 124881 -7435
41255 -7435 -84035 5876 139175 139453 33671 -19597 13323 22912 -36907 -90998 -97099 -103831
$$ packed form
41335F3199P090O3542L2827k9448j1096N1476K6362o5317n7462P1919J31627J6808
41323C01527j18743j05964q476J1704n5359r6860o3700K745N9334P0988L220j02520
41311a02104j24685k3757P5644N9466r139o345N5597P4879L7457J6527L5883N2263
41299A41686M4384J7968m3153j32468j67081q3897M4372R5417O6963M8102N2728
41288H5021J4827n6105n7677L3640R7336L7121p8701j17385n8450M639M266k8593
41276a20061k3537M5497J37746J77462J12612k6285j26425r2724L4256J01028
41266B19569K1087j05063j16802j4412N0276J0809k1598L3649O9898k2532j32316
41255g435p6600Q9911J33299K78j05782n3268L2920R589n9819n4091o101o732
$$ plain form
41243 -103831 -123935 -85048 44417 190145 278762 312619 299885 214341 77049 -16826 -12506
41232 -12506 40671 85019 126130 160585 133317 39271 -24866 3300 45374 6784 -66515 -68162
41220 -68162 -12728 -12283 -97877 -185632 -218395 -228902 -244734 -230694 -163416 -88423 -61101 -81562
41208 -81562 -118033 -149418 -158167 -122977 -48215 27186 66822 56645 -11335 -126215 -220538 -210079
41196 -210079 -105377 -23878 -39298 -74711 -22794 68144 38308 -146902 -317075 -309909 -176603
41185 -176603 -89341 -104798 -129875 -98725 -58759 -54841 -40083 33263 114690 126579 81303 47137
41173 47137 35845 9606 -23078 -10386 43115 65188 23948 -24468 -24065 6333 21078 19149
41161 19149 26251 41655 44200 30103 12101 -3924 -15552 -9885 23384 70695 101919 96918
$$ packed form
41243a03831k0104L8887J29465J45728Q8617L3857j2734q5544j37292r3875M320
41232a2506N3177M4348M1111L4455k7268r4046o4137K8166M2074l8590p3299j647
41220f8162N5434M45q5594q7755l2763j0507j5832J4040O7278P4993K7322k0461
41208h1562l6471l1385q749L5190P4762P5401L9636j0177o7980j14880r4323J0459
41196b10079J04702Q1499j5420l5413N1917R0938k9836j85210j70173P166J33306
41185a76603Q7262j5457k5077L1150L9966L918J4758P3346Q1427J1889m5276l4166
41173D7137j1292k6239l2684J2692N3501K2073m1240m8416M03L0398J4745j929
41161A9149P102J5404K545j4097j8002j6025j1628N667L3269M7311L1224n001
$$ plain form
41149 96918 61106 22459 13307 42366 81973 91940 55472 -12501 -80555 -115435 -100653 -57312
41137 -57312 -28244 -26306 -24194 -11012 -15569 -41504 -33229 33808 76531 3488 -133370 -181475
41125 -181475 -84649 49829 96086 41434 -49120 -123232 -160177 -159316 -144433 -136728 -111130 -34983
41113 -34983 44933 33129 -73845 -160731 -147516 -91400 -85552 -133484 -188579 -247527 -320242 -355022
41101 -355022 -285517 -137352 -16853 4031 -53025 -113052 -107495 -17974 95234 130687 54481
41090 54481 -51089 -87949 -63585 -64609 -132558 -218102 -249181 -204593 -128060 -95110 -146399 -233247
41078 -233247 -264168 -228708 -220622 -294112 -357993 -286679 -95246 79370 149222 145765 132128
41067 132128 129045 133170 135038 105148 23344 -67314 -93847 -49424 1630 21214 32394 41270
$$ packed form
41149I6918l5812l8647r152K9059L9607R967l6468o7973o8054l4880J4782M3341
41137e7312K9068J938K112J3182m557k5935Q275O7037M2723p3043j36858m8105
41125a81475R6826J34478M6257n4652r0554p4112l6945Q61J4883P705K5598P6147
41113c4983P9916j1804j06974q6886J3215N6116N848m7932n5095n8948p2715l4780
41101c55022O9505J48165J20499K0884n7056o0027N557Q9521J13208L5453p6206
41090E4481j05570l6860K4364j024o7949q5544l1079M4588P6533L2950n1289q6848
41078b33247l0921L5460Q086p3490o3881P1314J91433J74616O9852l457j3637
41067A32128l083M125J868k9890q1804r0658k6533M4423N1054J9584J1180Q876
$$ plain form
41055 41270 927 -102334 -186764 -160187 -38191 73889 101162 58971 4400 -27020 -31277
41044 -31277 -19840 -15894 -50326 -135241 -235497 -283168 -238476 -134061 -42753 -1584 14653
41033 14653 46676 105445 176482 231796 223303 109537 -75309 -214780 -221364 -136478 -74928
41022 -74928 -84545 -110287 -91785 -43111 -22366 -59678 -130704 -176455 -141567 -19361 128424
41011 128424 213448 192748 97126 -61 -29490 34828 145042 196443 120154 -27394 -100247
41000 -100247 -10875 172694 294648 267245 144761 48344 40013 86002 128031 147385 139633
40989 139633 71627 -76984 -243170 -317402 -262931 -146578 -44453 19677 30839 -37136 -152897
40978 -152897 -214121 -167995 -89725 -76967 -119388 -143523 -134293 -126325 -116097 -78692 -47528 -80661
$$ packed form
41055D1270m0343j03261q4430K6577J21996J12080K7273m2191n4571l1420m257
41044c1277J1437L946l4432q4915j00256m7671M4692J04415R1308M1169J6237
41033A4653L2023N8769P1037N5314q493j13766j84846j39471o584Q4886O1550
41022g4928r617k5742J8502M8674K0745l7312p1026m5751L4888J22206J47785
41011A28424Q5024k0700r5622r7187k9429O4318J10214N1401p6289j47548p2853
41000a00247Q9372J83569J21954k7403j22484r6417q331M5989M2029J9354p752
40989A39633o8006j48611j66186p4232N4471J16353J02125O4130J1162o7975j15761
40978a52897o1224M6126P8270J2758m2421k4135R230P968J0228L7405L1164l3133
$$ plain form
40966 -80661 -157317 -198477 -187491 -184316 -219904 -262341 -293353 -334129 -383374 -406359 -394150 -360077
40954 -360077 -280246 -126651 40181 115749 102730 108043 165710 185279 122205 69655 100203
40943 100203 130948 52379 -96440 -195485 -219059 -224674 -216211 -145014 -28459 49530 60022
40932 60022 56055 72220 82911 69218 45905 6338 -83439 -210641 -299298 -297551 -234428 -167324
40920 -167324 -114509 -59638 10911 89938 143529 126790 41210 -33622 -17230 63259 97112
40909 97112 28612 -85128 -165153 -195308 -190429 -142016 -41867 76458 158737 171389 107442
40898 107442 -8420 -103712 -102592 -22123 28308 -12357 -72145 -61766 -18707 -44928 -132392
40887 -132392 -161212 -81444 6208 -6371 -90156 -135316 -97038 -24339 20565 14005 -34341 -85908
$$ packed form
40966h0661p6656m1160J0986L175l5588m2437l1012m0776m9245k2985J2209L4073
40954c60077P9831J53595J66832P5568j3019N313N7667J9569o3074n2550L0548
40943A00203L0745p8569j48819r9045k3574n615Q463P1197J16555P7989J0492
40932F0022l967J6165J0691j3693k3313l9567q9777j27202q8657J747O3123O7104
40920a67324N2815N4871P0549P9027N3591j6739q5580p4832J6392Q0489L3853
40909I7112o8500j13740q0025l0155M879M8413J00149J18325Q2279J2652o3947
40898A07442j15862r5292J120Q0469N0431m0665n9788J0379M3059k6221q7464
40887a32392k8820P9768Q7652j2579q3785m5160L8278P2699M4904o560m8346n1567
$$ plain form
40875 -85908 -89438 -40694 -10608 -65205 -171813 -239496 -242630 -238195 -254257 -234031 -127097 16659
40863 16659 94804 72360 17420 25909 127753 253621 289820 195176 67427 46685 137181
40852 137181 187340 89549 -63342 -97050 8220 97257 54081 -55228 -86166 4921 130848
40841 130848 183376 133319 44147 11992 71702 147593 127121 -1240 -123103 -136295 -68515
40830 -68515 -12061 16736 77256 172552 203881 98670 -69791 -151119 -90084 21665 65245
40819 65245 15211 -75206 -157942 -213815 -223154 -176077 -114081 -103401 -144282 -153549 -70236 60876
40807 60876 152680 188851 218929 260560 271349 221353 135164 44675 -49696 -143637 -197869 -183155
40795 -183155 -133757 -115160 -141520 -154874 -95221 21901 108968 92237 -7998 -96664 -110374
$$ packed form
40875h5908l530M8744L0086n4597j06608o7683l134M435j6062K0226J06934J43756
40863A6659P8145k2444n4940Q489J01844J25868L6199r4644j27749k0742R0496
40852A37181N0159r7791j52891l3708J05270Q9037m3176j09309l0938R1087J25927
40841A30848N2528n0057q9172l2155N9710P5891k0472j28361j21863j3192O7780
40830f8515N6454K8797O0520R5296L1329j05211j68461q1328O1035J11749M3580
40819F5245n0034r0417q2736n5873r339M7077O1996J0680m0881r267Q3313J31112
40807F0876R1804L6171L0078M1631J0789m9996q6189r0489r4371r3941n4232J4714
40795a83155M9398J8597k6360j3354N9653J17122Q7067j6731j00235q8666j3710
$$ plain form
40784 -110374 -81815 -75225 -86174 -57475 13940 53603 16301 -41871 -41814 9540 40317 17369
40772 17369 -26751 -57647 -73512 -75146 -54924 -27610 -25256 -44273 -42489 -10480 4923 -14208
40760 -14208 -886 101209 220154 223304 103720 6771 36247 118227 122931 55099 29751
40749 29751 90603 155726 150258 102268 74629 70848 51446 -1585 -72519 -129709 -133962 -71217
40737 -71217 728 -13038 -130596 -256462 -290062 -227670 -126469 -20932 79374 156059 198707
40726 198707 218929 204289 106270 -71185 -221664 -246753 -180545 -131278 -130400 -117592 -51706
40715 -51706 45713 143896 219609 228532 140375 5348 -84340 -101266 -90373 -82915 -77125 -92950
40703 -92950 -157094 -227457 -217042 -109482 19707 102887 127496 87683 -15497 -112520 -104356
$$ packed form
40784a10374K8559O590j0949K8699P1415L9663l7302n8172N7N1354L0777k2948
40772A7369m4120l0896j5865j634K0222K7314K354j9017J784L2009J5403j9131
40760a4208J3322J02095J18945L150j19584r6949K9476Q1980M704o7832k5348
40749B9751O0852O5123n468m7990k7639l781j9402n3031p0934n7190m253O2745
40737g1217P1945j3766j17558j25866l3600O2392J01201J05537J00306P6685M2648
40726A98707K0222j4640r8019j77455j50479k5089O6208M9267Q78J2808O5886
40715e1706R7419R8183P5713Q923q8157j35027q9688j6926J0893P458N790j5825
40703i2950o4144p0363J0415J07560J29189Q3180K4609l9813j03180r7023Q164
$$ plain form
40692 -104356 5370 105933 137930 162499 231722 288220 260699 184088 151378 193749 263906
40681 263906 297483 252612 135366 16858 -26112 -8600 -13951 -62028 -89696 -82773 -111664
40670 -111664 -184687 -190587 -75793 33735 5970 -90747 -92834 4762 47904 -42101 -170379
40659 -170379 -218318 -180227 -122699 -92939 -98607 -117332 -102754 -28106 63547 94953 48264 -15489
40647 -15489 -36968 -26287 -41596 -115871 -206587 -224782 -142367 -61134 -112410 -276219 -379779
40636 -379779 -312584 -159718 -65416 -51310 -51682 -48228 -60947 -62124 -17522 22261 -10851 -66965
40624 -66965 -32080 87872 158421 106401 4010 -66997 -125033 -204323 -246953 -162522 35740
40613 35740 218422 267666 192137 105234 90335 107322 68942 -4728 7846 140104 252351
$$ packed form
40692a04356J09726J00563L1997K4569O9223N6498k7521p6611l2710M2371P0157
40681B63906L3577m4871j17246j18508m2970J7512n351m8077k7668O923k8891
40670a11664p3023n900J14794J09528k7765r6717k087R7596M3142r0005j28278
40659a70379m7939L8091N7528K9760n668j8725J4578P4648R1653L1406m6689o3753
40647a5489k1479J0681j5309p4275r0716j8195Q2415Q1233n1276j63809j03560
40636c79779O7195J52866R4302J4106l72L454j2719j177M4602L9783l3112n6114
40624f6965L4885J19952P0549n2020j02391p1007n8036p9290m2630Q4431J98262
40613C5740J82682M9244p5529q6903j4899J6987l8380p3670J2574J32258J12247
$$ plain form
40602 252351 213036 79561 -7760 -39454 -106021 -196296 -189178 -56570 72171 90893 44672
40591 44672 27746 50876 64274 37166 -30745 -115673 -161125 -129618 -79794 -112384 -221157
40580 -221157 -290558 -269573 -241094 -265193 -262170 -142116 28660 99268 34039 -57656 -79286
40569 -79286 -50535 -43061 -77141 -110326 -98548 -44655 7325 15812 -23237 -79597 -111529 -82337
40557 -82337 15404 128951 168310 97328 -17638 -83326 -78347 -41994 -4076 20524 4982
40546 4982 -53346 -96543 -75019 -27951 -24816 -57344 -70563 -69367 -97373 -133242 -115355 -58531
40534 -58531 -36731 -53199 -37828 26857 89582 137544 196792 225859 149379 12537 -47360
40523 -47360 -12149 -7144 -70226 -70519 63009 200771 212323 157427 146786 146331 76378 1134
$$ packed form
40602B52351l9315j33475q7321l1694o6567r0275P118J32608J28741J8722m6221
40591D4672j6926K3130J3398k7108o7911q4928m5452L1507M9824l2590j08773
40580b21157o9401K0985K8479k4099L023J20054J70776P0608o5229r1695k1630
40569g9286K8751P474l4080l3185J1778N3893N1980Q487l9049n6360l1932K9192
40557h2337R7741J13547L9359p0982j14966o5688M979L6353L7918K4600j5542
40546D982n8328m3197K1524M7068L135l2528j3219J196k8006l5869J7887N6824
40534e8531K1800j6468J5371O4685O2725M7962N9248K9067p6480j36842n9897
40523d7360L5211N005o3082k93J33528J37762J1552n4896j0641m55o9953p5244
$$ plain form
40511 1134 45575 181541 257247 213643 136427 106457 113298 112983 82035 21844 -25550 5199
40499 5199 109816 186079 163107 99705 82087 96582 94191 104183 167536 221080 179645 92001
40487 92001 82212 159174 210811 175301 99925 37965 1492 12509 87543 165346 154035 61277
40475 61277 -12387 -13501 16038 25489 3608 -49495 -111206 -115702 -39509 20504 -31074 -117529
40463 -117529 -83630 50843 97303 -14758 -124826 -82195 47341 107573 65418 -3994 -52310
40452 -52310 -72589 -47036 21084 70457 56986 20402 6508 -18420 -90593 -140169 -68207 88600
40440 88600 177130 124092 27184 20163 110560 193093 186662 113604 53784 56312 107453 163871
40428 163871 191408 174129 118897 67737 72576 125447 144072 73534 -23549 -42644 9876 19790
$$ packed form
40511A134M4441J35966P5706m3604p7216k9970O841l15l0948o0191m7394L0749
40499E199J04617P6263k2972o3402j7618J4495k391R992O3353N3544m1435q7644
40487I2001r789P6962N1637l5510p5376o1960l6473J1017P5034P7803j1311r2758
40475F1277p3664j114K9539R451k1881n3103o1711m496P6193O0013n1578q6455
40463a17529L3899J34473M6460j12061j10068M2631J29536O0232m2155o9412m8316
40452e2310k0279K5553O8120M9373j3471l6584j3894k4928p2173m9576P1962J56807
40440H8600Q8530n3038r6908p021R0397Q2533o431p3058n9820K528N1141N6418
40428A63871K7537j7279n5232n1160M839N2871J8625p0538r7083j9095N2520R914
$$ plain form
40416 19790 -66400 -159587 -158270 -92809 -73958 -136912 -207412 -211856 -159392 -107006 -92499 -122124
40404 -122124 -185167 -244357 -233848 -119200 30404 81104 -12797 -130795 -124093 -12348 42412
40393 42412 -33491 -120981 -82345 53322 158027 181402 157112 90721 -33269 -154612 -174881
40382 -174881 -101364 -42765 -43724 -32142 38420 103447 98226 58756 42953 28037 -34356 -116732
40370 -116732 -152117 -138631 -130911 -142432 -124230 -42753 70773 156316 178270 139958 71006
40359 71006 5748 -39186 -66226 -71930 -34540 58216 173859 242379 208931 87242 -40700
40348 -40700 -93862 -66585 -16280 22017 67188 122561 132645 58626 -46337 -98429 -86848
40337 -86848 -52069 2962 94510 173625 163129 87615 70062 166568 279467 272404 118303
$$ packed form
40416A9790q6190r3187J317O5461J8851o2954p0500m444N2464N2386J4507k9625
40404a22124o3043n9190J0509J14648J49604N0700r3901j17998O702J11745N4760
40393D2412p5903q7490L8636J35667J04705K3375k4290o6391j23990j21343k0269
40382a74881P3517N8599r59J1582P0562O5027n221l9470j5803j4916o2393q2376
40370a16732l5385J3486P720j1521J8202Q1477J13526Q5543K1954l8312o8952
40359G1006o5258m4934k7040n704L7390R2756J15643O8520l3448j21689j27942
40348d0700n3162K7277N0305L8297M5171N5373J0084p4019j04963n2092J1581
40337h6848L4779N5031R1548P9115j0496p5514j7553R6506J12899p063j54101
$$ plain form
40326 118303 -90891 -230879 -227211 -107851 10354 36759 7628 12784 40645 -5323 -133152
40315 -133152 -222947 -195674 -110205 -42978 15992 78331 82213 935 -67522 -35535 22946 -17264
40303 -17264 -127648 -174502 -143631 -160144 -269064 -346199 -287514 -165808 -108583 -104965 -43816
40292 -43816 96258 207342 208208 146329 107242 92748 49276 -25818 -79097 -86501 -69385 -23289
40280 -23289 86151 228365 294184 234890 141096 105444 74065 -58524 -251930 -347258 -285808
40269 -285808 -175721 -123283 -115766 -105545 -96312 -91378 -56392 2081 9129 -57607 -101160 -39321
40257 -39321 65352 100477 75285 99310 217141 353168 413561 373976 269975 159197 94651
40246 94651 89821 104044 86440 28700 -38906 -83024 -84856 -49798 -11781 3445 22988 88644
$$ packed form
40326A18303k09194j39988L668J19360J18205K6405k9131N156K7861m5968j27829
40315a33152q9795K7273Q5469O7227N8970O2339L882q1278o8457L1987N8481m0210
40303a7264j10384m6854L0871j6513j08920p7135N8685J21706N7225L618O1149
40292d3816J40074J11084Q66o1879l9087j4494m3472p5094n3279p404J7116M6096
40280b3289J09440J42214O5819n9294r3794l5652l1379j32589j93406r5328O1450
40269b85808J10087N2438P517J0221R233M934L4986N8473P048o6736m3553O1839
40257c9321J04673L5125k5192K4025J17831J36027O0393l9585j04001j10778o4546
40246I4651m830J4223j7604n7740o7606m4118j832L5058L8017J5226J9543O5656
$$ plain form
40234 88644 172310 194592 139291 72402 26676 -39819 -129659 -153483 -64640 40807 47619 -23100
40222 -23100 -70194 -60159 -23625 34771 113156 146687 86778 20033 83555 263446 393218
40211 393218 366016 240875 112291 -18358 -181056 -321674 -329103 -165833 71648 232098
40201 232098 246678 187269 174748 230716 261531 203988 122878 113009 159538 168287 98943 -6954
40189 -6954 -103185 -165412 -161330 -79557 17049 48645 33400 67527 176829 262707 226710 93534
40177 93534 -24880 -53822 -16979 8585 -18109 -57001 -40814 27539 70178 44200 3818
40166 3818 12150 43461 33392 -16140 -53373 -69222 -101637 -163478 -225452 -251976 -205244 -54437
40154 -54437 153203 276492 222610 73023 -21125 -34096 -52034 -95547 -87162 -1632 76588
$$ packed form
40234H8644Q3666K2282n5301o6889m5726o6495q9840k3824Q8843J05447O812p0719
40222b3100m7094J0035L6534N8396P8385L3531n9909o6745O3522J79891J29772
40211C93218k7202j25141j28584j30649j62698j40618p429J63270K37481J60450
40201B32098J4580n9409j2521N5968L0815n7543q1110r869M6529Q749o9344j05897
40189f954r6231o2227M082Q1773R6606L1596j5245L4127J09302Q5878l5997j33176
40177I3534j18414k8942L6843K5564k6694l8892J6187O8353M2639k5978m0382
40166C818Q332L1311j0069m9532l7233j5849l2415o1841o1974k6524M6732J50807
40154e4437K07640J23289n3882j49587r4148j2971j7938m3513Q385Q5530P8220
$$ plain form
40143 76588 77345 24151 -39043 -101374 -134220 -89718 3555 38524 -19821 -66953 -6228 113151
40131 113151 180977 185258 198370 241873 257047 208542 145030 132378 162971 158407 58702 -102362
40119 -102362 -223487 -242868 -199329 -167810 -159815 -127429 -50277 30434 64285 38614 -24832
40108 -24832 -84061 -94578 -51724 -8347 -13900 -49637 -64081 -52302 -49445 -62774 -64723 -40618
40096 -40618 5907 72596 130567 113615 10253 -69467 -17125 104829 130392 27773 -52346
40085 -52346 1243 104275 107328 -1109 -98199 -89212 -3842 53740 17813 -68686 -95301 -11928
40073 -11928 106108 155733 132507 99011 65342 -9121 -112639 -177899 -184113 -173756 -163029
40062 -163029 -120329 -37306 59261 159399 247785 251845 124129 -37606 -81173 -8823 40600
$$ packed form
40143G6588P57n3194o3194o2331l2846M4502R3273L4969n8345m7132O0725J19379
40131A13151O7826M281J3112M3503J5174m8505o3512j2652L0593m564r9705j61064
40119a02362j21125j9381M3539L1519P995L2386P7152Q0711L3851k5671o3446
40108b4832n9229j0517M2854M3377n553l5737j4444J1779K857j3329j949K4105
40096d0618M6525O6689N7971j6952j03362p9720N2342J21954K5563j02619q0119
40085e2346N3589J03032L053j08437r7090Q987Q5370N7582l5927q6499k6615Q3373
40073a1928J18036M9625k3226l3496l3669p4463j03518o5260o214J0357J0727
40062a63029M2700Q3023R6567J00138Q8386M060j27716j61735m3567P2350M9423
$$ plain form
40051 40600 17947 12414 55271 55138 -15111 -44746 17117 57636 -551 -53739 2318 87269
40039 87269 75156 -1901 -40659 -52420 -99889 -134838 -71950 32144 43720 -34278 -69162
40028 -69162 -6594 66004 60245 -27289 -161448 -290733 -334607 -256198 -139273 -96408 -119066
40017 -119066 -115253 -65126 -27081 -17796 -11855 -40562 -152137 -275660 -270528 -134062 -21519
40006 -21519 -20646 -38727 28436 136795 182432 154517 114759 93511 86094 99469 128920 129560
39994 129560 78357 29626 42331 79484 51586 -47881 -118955 -82696 19085 82231 68836
39983 68836 38511 55155 100336 103668 40456 -38117 -76009 -78817 -88464 -111899 -101060 -5357
39971 -5357 161184 307556 338932 260157 181483 185670 218833 172999 51339 -38268 -51153
$$ packed form
40051D0600k2653n533M2857j33p0249k9635O1863M0519n8187n3188N6057Q4951
40039H7269j2113p7057l8758j1761m7469l4949O2888J04094J1576p7998l4884
40028f9162O2568P2598n759q7534j34159j29285m3874P8409J16925M2865k2658
40017a19066L813N0127L8045R285N941k8707j11575j23523N132J36466J12543
40006b1519Q73j8081O7163J08359M5637k7915l9758k1248p417J3375K9451O40
39994A29560n1203m8731J2705L7153k7898r9467p1074L6259J01781O3146j3395
39983F8836l0325J6644M5181L332o3212p8573l7892k808r647k3435J0839R5703
39971e357J66541J46372L1376p8775p8674M187L3163m5834j21660q9607j2885
$$ plain form
39960 -51153 -59621 -110040 -136149 -76997 11698 42769 20256 -3315 -24303 -54664 -52371 15936
39948 15936 88246 83793 31770 22263 56537 55475 5623 -16527 21738 55838 36569 7761
39936 7761 21397 39873 -14392 -139827 -240840 -235936 -149077 -72624 -50527 -36168 15487 62745
39924 62745 45166 2575 32247 129947 176343 103917 -20767 -108728 -136808 -91906 45739
39913 45739 201885 218817 54582 -138557 -219167 -219611 -211867 -156057 -20730 78681 33559
39902 33559 -67432 -77657 -31455 -55382 -120588 -93014 20238 85090 69632 53771 36123
39891 36123 -52522 -153137 -121740 15494 70708 -10990 -82536 -63019 -51114 -102043 -110521
39880 -110521 -16969 61439 17119 -93409 -178131 -231299 -235631 -117737 86201 186376 87323
$$ packed form
39960e1153q468n0419k6109N9152Q8695L1071k2513k3571k0988l0361K293O8307
39948A5936P2310m453n2023r507L4274j062m9852k2150L8265L4100j9269k8808
39936G761J3636J8476n4265j25435j01013M904Q6859P6453K2097J4359N1655M7258
39924F2745j7579m2591K9672R7700M6396p2426j24684q7961k8080M4902J37645
39913D5739J56146J6932j64235j93139q0610m44P744N5810J35327R9411m5122
39902C3559j00991j0225M6202k3927o5206K7574J13252O4852j5458j5861j7648
39891C6123q8645j00615L1397J37234N5214q1698p1546J9517J1905n0929q478
39880a10521R3552P8408m4320j10528q4722n3168m332J17894K03938J00175r9053
$$ plain form
39869 87323 -68904 -128445 -138902 -201443 -266385 -242381 -180791 -177750 -196871 -158825 -114426 -155230
39857 -155230 -228079 -212038 -122742 -75495 -91142 -95012 -68723 -51232 -24069 55135 134655 131296
39845 131296 84541 99433 157743 143781 51325 301 28370 25246 -76417 -181378 -171518
39834 -171518 -62956 43541 90627 80516 24225 -61824 -138511 -168481 -151048 -121096 -120989
39823 -120989 -163098 -207758 -205726 -177387 -196630 -262706 -262832 -134295 4284 -12475 -170944
39812 -170944 -297817 -285805 -188850 -95692 -24097 32100 48237 10309 -46636 -77999 -72606
39801 -72606 -45812 -26253 -45826 -100052 -128812 -84735 -5626 35057 29609 23838 24796 553
39789 553 -36911 -36625 -7099 -27420 -132627 -252503 -294595 -241456 -146200 -74498 -63228 -93619
$$ packed form
39869H7323j56227n9541j0457o2541o4942K4004O1590L041j9121L8046M4399m0804
39857a55230p2849J6041Q9296M7247j5647l870K6289J7491K7163P9204P9520l359
39845A31296m6755J4892N8310j3962r2456n1024K8069l124j01663j04961R860
39834a71518J08562J06497M7086j0111n6291q6049p6687k9970J7433K9952J07
39823a20989m2109m4660K032K8339j9243o6076j26J28537J38579j6759j58469
39812a70944j26873J2012R6955R3158P1595N6197J6137l7928n6945l1363N393
39801g2606K6794J9559j9573n4226k8760M4077P9109M0683n448n771R58k4243
39789E53l7464K86K9526k0321j05207j19876m2092N3139R5256P1702J1270l0391
$$ plain form
39777 -93619 -95489 -19217 90817 136519 84752 5468 -12895 49695 140686 182316 130607 23915
39765 23915 -38388 -1899 76424 105350 72145 28171 -2135 -29371 -43023 -22795 10951 29592
39753 29592 55684 108804 119462 3897 -179806 -263353 -177129 -29223 49318 43728 10874
39742 10874 -7273 19055 109354 217916 247693 169196 64539 14546 10018 12674 23147 32947
39730 32947 -14016 -138382 -258350 -274416 -182451 -55824 31182 17156 -131477 -342795 -443946
39719 -443946 -339669 -142891 -34994 -37288 -27058 49496 107665 75916 -1782 -55814 -89201
39708 -89201 -131239 -162746 -149895 -110683 -92127 -102128 -103776 -65708 5767 73428 96442 66265
39696 66265 18161 -12788 -37101 -75901 -95588 -41639 58795 105856 65603 19958 31224
$$ packed form
39777i3619j870P6272J10034M5702n1767p9284j8363O2590R0991M1630n1709j06692
39765B3915o2303L6489P8323K8926l3205m3974l0306k7236j3652K0228L3746J8641
39753B9592K6092N3120J0658j15565j83703q3547Q6224J47906P8541n590l2854
39742A0874j8147K6328R0299J08562K9777p8497j04657m9993m528K656J0473R800
39730C2947m6963j24366j19968j6066R1965J26627Q7006j4026j48633k11318j01151
39719d43946J04277J96778J07897k294J0230P6554N8169l1749p7698n4032l3387
39708h9201m2038l1507J2851L9212J8556j0001j648L8068P1475O7661K3014l0177
39696F6265m8104l0949k4313l8800j9687N3949J00434M7061m0253m5645J1266
$$ plain form
39685 31224 39228 -30803 -130890 -166116 -159005 -212096 -320876 -357562 -265820 -150941 -125071
39674 -125071 -163639 -179335 -152799 -116257 -78614 -46878 -65579 -152886 -239412 -246730 -191175 -141237
39662 -141237 -113901 -87293 -71598 -80721 -70127 4275 93038 112341 71934 48814 57831 52746
39650 52746 35299 47624 66833 30200 -34829 -34421 28545 50795 8945 -2546 44213 39142
39638 39142 -79856 -205661 -219130 -152676 -99330 -61301 2965 63423 61401 14684 -8769
39627 -8769 22025 98679 194958 242461 173540 45950 18258 126692 204934 124923 -4198
39616 -4198 -6162 102129 171171 152888 111265 62386 -27800 -120695 -137385 -98867 -100779 -165072
39604 -165072 -233639 -276758 -289752 -229032 -84124 37187 42083 18511 103593 238948 252712
$$ packed form
39685C1224Q004p0031j00087l5226P111n3091j08780l6686R1742J14879K5870
39674a25071l8568j5696K6536L6542L7643L1736j8701q7307q6526p318N5555M9938
39662a41237K7336K6608J5695r123J0594P4402Q8763J9303m0407k3120R017n085
39650E2746j7447J2325J9209l6633o5029M08O2966K2250m1850j1491M6759n071
39638C9142j18998j25805j3469O6454N3346L8029O4266O0458k022m6717k3453
39627h769L0794P6654R6279M7503o8921j27590k7692J08434P8242q0011j29121
39616d198j964J08291O9042j8283m1623m8879r0186r2895j6690L8518j912o4293
39604a65072o8567m3119j2994O0720J44908J21311M896k3572Q5082J35355J3764
$$ plain form
39593 252712 153027 117525 185902 195936 72826 -43255 -41804 -6745 -26961 -31458 47247
39582 47247 105472 27558 -104178 -126275 -43832 -2082 -50634 -87438 -36440 41572 46376 -27805
39570 -27805 -91918 -67490 27695 102504 102777 73246 80157 111076 114494 102728 124046 155889
39558 155889 136272 92600 113344 181856 175517 64015 -29302 -19273 19520 -5371 -65720
39547 -65720 -106084 -163617 -283565 -395915 -388143 -254533 -90017 21109 48026 2032 -54643
39536 -54643 -45136 20795 42644 -26012 -106224 -121413 -104269 -102301 -71754 33120 139092 134000
39524 134000 23545 -85272 -118605 -76444 8957 72858 34308 -90746 -144243 -4238 224459
39513 224459 311168 180886 -6997 -65480 23548 134465 146971 45213 -86421 -145727
$$ packed form
39593B52712r9685l5502O8377J0034j23110j16081J451L5059k0216m497P8705
39582D7247N8225p7914j31736k2097Q2443M1750m8552l6804N0998P8012M804p4181
39570b7805o4113K4428R5185P4809K73k9531O911L0919L418j1766K1318L1843
39558A55889j9617m3672K0744O8512o339j11502r3317J0029L8793k4891o0349
39547f5720m0364n7533j19948j12350P772J33610J64516J11126K6917m5994n6675
39536e4643R507O5931K1849o8656q0212j5189J7144J968L0547J04874J05972n092
39524A34000j10455j08817l3333M2161Q5401O3901l8550j25054n3497J40005K28697
39513B24459Q6709j30282j87883n8483Q9028J10917J2506j01758j31634n9306
$$ plain form
39503 -145727 -107132 -29830 32004 89704 172486 268850 348058 391940 372936 258957 82607
39492 82607 -55940 -106453 -129247 -186104 -239945 -231023 -184791 -158409 -133844 -56349 57919
39481 57919 140543 170956 181198 186322 180423 174316 170802 135155 56926 2463 31884 100955
39469 100955 124042 99312 87627 98911 91324 64242 60560 80724 73573 15096 -63986 -122754
39457 -122754 -133217 -82646 -4183 30453 5326 -1748 54573 84896 -9318 -156791 -188092
39446 -188092 -68146 65716 99707 62280 32299 34895 54931 64938 19435 -92370 -174694
39435 -174694 -105355 84023 207880 151710 6955 -71730 -55357 -13912 22564 75435 125140
39424 125140 109148 20946 -62952 -82239 -69488 -90442 -137813 -135723 -52706 39141 52656 947
$$ packed form
39503a45727L8595P7302O1834N7700Q2782R6364P9208M3882j9004j13979j76350
39492H2607j38547n0513k2794n6857n3841Q922M6232K6382K4565P7495J14268
39481E7919Q2624L0413J0242N124n899o107l514l5647p8229n4463K9421O9071
39469A00955K3087k4730j1685J1284p587k7082l682K0164p151n8477p9082n8768
39457a22754j0463N0571P8463L4636k5127p074N6321L0323r4214j47473l1301
39446a88092J19946J33862L3991l7427k9981K596K0036J0007m5503j11805q2324
39435a74694O9339J89378J23857n6170j44755p8685J6373M1445L6476N2871M9705
39424A25140j5992q8202q3898j9287J2751k0954m7371K090Q3017R1847J3515n1709
$$ plain form
39412 947 -30212 -11856 -3338 -41777 -76345 -56343 -19328 -25186 -47793 -11209 85462 155769
39400 155769 140645 72824 15233 -11154 -16070 673 41937 81565 77031 27015 -4971 42823
39388 42823 141291 193428 167580 153629 239495 390091 526094 665123 864180 1050868 1061349
39377 1061349 866796 625496 471558 382788 303434 252345 231386 163854 28412 -60521
39367 -60521 -16136 79711 111590 106786 149932 209783 193161 111470 58819 66400 94402 123561
39355 123561 145877 115654 20159 -54501 -39027 -3532 -48391 -137753 -172589 -165969 -196240 -235968
39343 -235968 -191148 -84623 -37343 -71433 -84917 -32427 10529 -13098 -60649 -76447 -61029
39332 -61029 -30573 14886 71276 133591 201498 236333 170531 22862 -78172 -68981 -47471
$$ packed form
39412I47l1159J8356Q518l8439l4568K0002L7015n858k2607L6584R6671P0307
39400A55769j5124o7821n7591k6387m916J6743M1264L9628m534n0016l1986M7794
39388D2823R8468N2137k5848j3951Q5866J50596J36003J39029J99057J86688J0481
39377A061349j94553k41300j53938q8770p9354n1089k0959o7532j35442q8933
39367f0521M4385R5847L1879m804M3146N9851j6622q1691n2651P581K8002K9159
39355A23561K2316l0223r5495p4660J5474L5495m4859q9362l4836O620l0271l9728
39343b35968M4820J06525M7280l4090j3484N2490M2956k3627m7551j5798J5418
39332f1029L0456M5459N6390O2315O7907L4835o5802j47669j01034R191K1510
$$ plain form
39321 -47471 -91407 -108118 -13743 72265 12663 -83675 -26339 112546 93664 -91902 -211184
39310 -211184 -177505 -155371 -231262 -267508 -176144 -78453 -74700 -86347 -53725 -71777 -180056
39299 -180056 -211977 -24910 264536 431193 410702 290462 151599 49414 44302 124489
39289 124489 178640 140476 74319 45166 15988 -46708 -85610 -57924 -11447 23894 91222
39278 91222 171792 143187 -22411 -165415 -167036 -128720 -186655 -284160 -287493 -210993 -158832 -140836
39266 -140836 -115859 -130703 -236592 -335868 -295739 -168345 -115888 -147389 -119746 -2748 46488
39255 46488 -73970 -246439 -294777 -208867 -118828 -100002 -91000 -5055 138129 234391 234944 203725
39243 203725 204219 195604 120212 40013 66964 183205 268282 298898 362822 455711 444043 291230
$$ packed form
39321d7471m3936j6711R4375Q6008n9602r6338N7336J38885j8882j85566j19282
39310b11184L3679K2134p5891l6246R1364R7691L753j1647L2622j8052j08279
39299a80056l1921J87067K89446J66657k0491j20240j38863j02185n112Q0187
39289A24489N4151l8164o6157k9153k9178o2696l8902K7686M6477L5341O7328
39278I1222Q0570k8605j65598j43004j621L8316n7935r7505l333P6500N2161J7996
39266a40836K4977j4844j05889r9276M0129J27394N2457l1501K7643J16998M9236
39255D6488j20458j72469m8338Q5910R0039J8826R002Q5945J43184R6262N53l1219
39243B03725M94q615p5392q0199K6951J16241Q5077L0616O3924R2889j1668j52813
$$ plain form
39231 291230 146489 118612 123587 63745 -1762 2572 7297 -63458 -115880 -23971 150133 249881
39219 249881 268569 324137 436396 501321 468930 395023 321685 239757 170366 165338 220574
39208 220574 286504 361790 484416 631301 710717 659824 493927 277348 99942 47095
39198 47095 123925 232869 279522 265286 230293 166827 59817 -41526 -73072 -40723 6558
39187 6558 44934 60431 23941 -49243 -69390 22152 158577 225458 196433 137201 113655 140006
39175 140006 175440 142637 3899 -162989 -235188 -199158 -143240 -98692 -19877 65216 52117
39164 52117 -45430 -76591 -4600 10400 -113300 -211500 -130974 16696 37051 -49731 -83256
39153 -83256 -27532 27048 44930 51777 24657 -61907 -133990 -104202 -6001 75007 127055 153939
$$ packed form
39231B91230j44741k7877M975n9842o5507M334M725p0755n2422R1909J74104R9748
39219B49881J8688N5568J12259O4925l2391p3907p3338q1928o9391n028N5236
39208B20574O5930P5286J22626J46885P9416n0893j65897k16579j77406n2847
39198D7095P6830J08944M6653j4236l4993o3466j07010j01343l1546L2349M7281
39187F558L8376J5497l6490p3184k0147R1542J36425O6881k9025n9232k3546K6351
39175A40006L5434l2803j38738j66888p2199L6030N5918M4548P8815Q5093j3099
39164E2117r7547l1161P1991J5000j23700r8200Q0526J47670K0355q6782l3525
39153h3256N5724N4580J7882O847k7120q6564p2083K9788R8201Q1008N2048K6884
$$ plain form
39141 153939 90916 -83078 -241119 -256362 -170253 -90753 -30855 22059 6676 -85017 -109648
39130 -109648 24171 177191 185270 116219 122964 168764 123123 20115 -16390 -12077 -68630
39119 -68630 -137413 -109926 -52930 -100454 -185622 -145288 -28211 -19769 -106729 -108360 -17317 -11239
39107 -11239 -120637 -180172 -141777 -152272 -263289 -327251 -254905 -142022 -68821 10177 109496
39096 109496 150293 119097 102773 115663 73710 -22734 -66514 -36372 -26151 -54544 -32701
39085 -32701 54788 119643 130939 123707 64358 -80247 -166861 -23819 230151 291049 111611
39074 111611 -49712 -56824 -59257 -148309 -170522 -26535 122403 115379 30731 4831 16683
39063 16683 6051 19184 86918 121820 71359 24307 51487 86782 60280 -233 -74486 -188948
$$ packed form
39141A53939o3023j73994j58041j5243Q6109P9500N9898N2914j5383r1693k4631
39130a09648J33819J53020Q079o9051O745M5800m5641j03008l6505M313n6553
39119f8630o8783K7487N6996m7524q5168M0334J17077Q442q6960j631R1043O078
39107a1239j09398n9535L8395j0495j11017o3962P2346J12883P3201P8998R9319
39096A09496M0797l1196j6324J2890m1953r6444m3780L0142J0221k8393K1843
39085c2701Q7489O4855J1296p232n9349j44605q6614J43042K53970O0898j79438
39074A11611j61323p112k433q9052k2213J43987J48938p024q4648k5900J1852
39063A6683j0632J3133O7734L4902n0461m7052K7180L5295k6502o0513p4253j14462
$$ plain form
39051 -188948 -284377 -231904 -57154 44377 -6601 -71420 -53664 -41233 -92552 -106292 -25421
39040 -25421 38651 12856 -5458 50471 78084 -2203 -98820 -116192 -94049 -72591 -4932 95037
39028 95037 117619 69989 106191 238176 257176 77284 -86837 -46950 86131 130839 110418
39017 110418 110691 77573 -32251 -82337 50855 265883 395353 426897 411582 326077 189125
39006 189125 139195 228167 303546 244801 137137 75649 10705 -65117 -18604 160437 249338
38995 249338 144984 64853 170765 265323 136734 -54273 -50059 65856 47137 -83905
38985 -83905 -129963 -92116 -106604 -136181 -61711 29960 -15091 -90368 20232 242985 306655
38974 306655 181103 91653 128054 160748 132925 125893 128595 34566 -111951 -136897 -28028
$$ packed form
39051a88948r5429N2473J74750J01531n0978o4819J7756J2431n1319j3740Q0871
39040b5421O4072k5795j8314N5929K7613q0287r6617j7372K2143K1458O7659R9969
39028I5037K2582m7630L6202J31985J9000j79892j64121L9887J33081M4708k0421
39017A10418K73l3118j09824n0086J33192K15028J29470L1544j5315q5505j36952
39006A89125m9930Q8972P5379n8745j07664o1488o4944p5822M6513J79041Q8901
38995B49338j04354q0131J05912R4558j28589j91007M214J15915j8719j31042
38985h3905m6058L7847j4488k9577P4470R1671m5051p5277J10600K22753O3670
38974C06655j25552q9450L6401L2694k7823p032K702r4029j46517k4946J08869
$$ plain form
38963 -28028 42965 12050 -2041 58103 96387 57827 18756 36504 64584 44840 -35633 -164818
38951 -164818 -275768 -256896 -110568 -8833 -57608 -127704 -78275 2279 -19479 -52199 56837
38940 56837 217092 223863 94087 8250 7596 14218 58791 205072 329145 267942 123121
38929 123121 123923 247460 277044 186171 147168 186098 150500 23756 -31119 40082 125123
38918 125123 184068 279355 367576 328545 203206 143507 137354 49596 -84846 -95606 6017
38907 6017 37870 -23596 -16097 97999 181504 191715 214576 225857 112085 -61860 -102398
38896 -102398 -13173 24411 -8504 35230 137862 129641 46223 106592 294728 341130 188979
38885 188979 95861 175153 220817 118396 52840 139823 201875 104137 -3054 25628 85294
$$ packed form
38963b8028P0993l0915j4091O0144L8284l8560l9071J7748K8080j9744q0473j29185
38951a64818j10950J8872J46328J01735m8775p0096M9429Q0554k1758l2720J09036
38940E6837J60255O771j29776q5837o54O622M4573J46281J24073o1203j44821
38929A23121Q02J23537K9584r0873l9003L8930l5598j26744n4875P1201Q5041
38918A25123N8945R5287Q8221l9031j25339n9699o153q7758j34442j0760J01623
38907F017L1853o1466P499J14096Q3505J0211K2861J1281j13772j73945m0538
38896a02398Q9225L7584l2915M3734J02632q221q3418O0369J88136M6402j52151
38885A88979r3118P9292M5664j02421o5556Q6983O2052r7738j07191K8682N9666
$$ plain form
38874 85294 58925 34109 95099 147392 124003 125243 192644 191566 77714 25339 123841 204698
38862 204698 147153 96634 183504 275754 227136 140719 158530 195269 114608 -5571 -11813
38851 -11813 65635 96419 66144 32680 -8133 -55645 -30337 89911 186403 178410 150175 184810
38839 184810 219058 178383 107833 59409 799 -63912 -43157 76322 176720 206200 248667
38828 248667 318259 291974 146977 51841 100933 158749 92045 -34704 -112891 -149500 -165165
38817 -165165 -126136 -78893 -148957 -305915 -343074 -190962 -27803 19974 43074 106057 100650
38806 100650 -20377 -117329 -120422 -162714 -302010 -365144 -244764 -107436 -118256 -185096 -166647
38795 -166647 -120192 -148496 -191555 -152035 -60491 24826 106690 137199 34684 -97313 -28552
$$ packed form
38874H5294k6369k4816O0990N2293k3389J240O7401j078j13852n2375R8502Q0857
38862B04698n7545n0519Q6870R2250m8618q6417J7811L6739q0661j20179o242
38851a1813P7448L0784l0275l3464m0813m7512K5308J20248R6492p993k8235L4635
38839A84810L4248m0675p0550m8424n8610o4711K0755J19479J00398K9480M2467
38828B48667O9592k6285j44997r5136M9092N7816o6704j26749p8187l6609j5665
38817a65165L9029M7243p0064j56958l7159J52112J63159M7777K3100O2983n407
38806A00650j21027r6952l093m2292j39296o3134J20380J37328j0820o6840J8449
38795a66647M6455k8304m3059L9520R1544Q5317Q1864L0509j02515j31997O8761
$$ plain form
38784 -28552 217202 332707 202260 84920 165856 264076 192501 79222 86659 112070 25429
38773 25429 -67118 -47385 -12279 -42247 -10855 142417 229536 141904 70872 156463 224245
38762 224245 137027 84139 216289 309674 133315 -138172 -225760 -185135 -193638 -169611 23240
38751 23240 237433 278819 252773 319328 348570 189118 28079 89276 214362 153236 33623
38740 33623 107882 257587 213300 73528 126263 312141 344429 234440 222707 291849 218914
38729 218914 36737 -11572 77755 95612 41929 102216 251507 290668 235098 271985 376459
38718 376459 360868 257956 263686 343527 287924 123844 84639 197000 269484 261796 303154
38707 303154 380296 365480 311722 367922 459651 413349 322026 402959 563370 515531 274605
$$ packed form
38784b8552K45754J15505j30447j17340Q0936R8220p1575j13279P437K5411q6641
38773B5429r2547J9733L5106k9968L1392J53272Q7119q7632p1032Q5591O7782
38762B24245q7218n2888J32150R3385j76359k71487q7588M0625q503K4027J92851
38751B3240K14193M1386k6046O6555K9242j59452j61039O1197J25086o1126j19613
38740C3623P4259J49705m4287j39772N2735J85878L2288j09989j1733O9142p2935
38729B18914j82177m8309Q9327J7857n3683O0287J49291L9161n5570L6887J04474
38718C76459j5591j02912N730P9841n5603j64080l9205J12361P2484p688M1358
38707C03154P7142j4816n3758N6200R1729m6302r1323Q0933J60411m7839k40926
$$ plain form
38696 274605 130673 157367 156278 70676 50108 106500 93832 32437 88318 240016 317956
38685 317956 340462 452313 583632 548896 427351 449877 565679 532141 378136 346592
38675 346592 423827 376536 228604 238573 404107 446099 302208 192362 176783 94439 -35091
38664 -35091 3818 198961 303159 282882 343896 484410 468089 282645 182880 229415 220713
38653 220713 127734 151450 295639 328587 229821 230882 350387 341226 177277 141783 335128
38642 335128 524251 574223 608085 651441 547430 329308 264930 418166 548531 540118 555232
38631 555232 677235 766153 750793 729116 727575 678153 642196 740263 893216 954493 1017774
38620 1017774 1251194 1549099 1717512 1852771 2157786 2584230 3042107 3689010 4637838
$$ packed form
38696B74605j43932K6694j089q5602k0568N6392j2668o1395N5881J51698P7940
38685C17956K2506J11851J31319l4736j21545K2526J15802l3538j54005l1544
38675C46592P7235m7291j47932R969J65534M1992j43891j09846j5579q2344j29530
38664c5091L8909J95143J04198k0277O1014J40514j6321j85444r9765M6535q702
38653B20713r2979K3716J44189L2948r8766J061J19505r161j63949l5494J93345
38642C35128J89123M9972L3862M3356j04011k18122o4378J53236J30365q413J5114
38631E55232J22003Q8918j5360k1677j541m9422l5957R8067J52953O1277O3281
38620A017774K33420K97905J68413J35259L05015M26444M57877O46903R48828
$$ plain form
38611 4637838 5832684 7658747 10886643 15076892 17774385 16726585 12680135 8615514
38603 8615514 6306696 5061479 3841683 2868894 2560767 2419238 1921223 1444810 1440453
38594 1440453 1545766 1305434 999566 1022481 1133778 1005860 862511 943859 975246 761007
38584 761007 661990 904881 1074180 873458 720742 976240 1247785 1122665 961981 1278725
38574 1278725 1877814 2266987 2402744 2421493 2166331 1593756 1138258 1086857 1090940 825098
38564 825098 571545 621276 703464 575787 557446 878408 1126559 960853 743675 833128
38554 833128 900494 620732 377407 559150 799342 666322 478672 655488 879115 725176
38544 725176 530334 776481 1161109 1149041 941401 1030486 1268638 1239796 1106915 1242350
$$ packed form
38611D637838J194846J826063L227896M190249K697493j047800m046450m064621
38603H615514k308818j245217j219796r72789l08127j41529m98015m76413m357
38594A440453J05313k40332l05868K2915J11297j27918j43349Q1348L1387k14239
38584G61007r9017K42891J69299k00722j52716K55498K71545j25120j60684L16744
38574A278725N99089L89173J35757J8749k55162n72575m55498n1401M083k65842
38564H25098k53553M9731Q2188j27677j8341L20962K48151j65706k17178Q9453
38554H33128O7366k79762k43325J81743K40192j33020j87650J76816K23627j53939
38544G25176j94842K46147L84628j2068k07640Q9085K38152k8842j32881J35435
$$ plain form
38534 1242350 1440433 1316841 1073476 1082666 1150347 957615 759538 875135 989769 750942
38524 750942 521180 722367 987012 814364 511000 596370 833089 754556 594134 761549
38514 761549 963177 790385 601022 843772 1109979 870331 532893 703241 1023024 871435
38504 871435 594714 839724 1259985 1137910 745909 810349 1139531 1084208 865447 1117900
38494 1117900 1580632 1577744 1343003 1520738 1819012 1544590 1014767 1017596 1323560 1183601
38484 1183601 842883 1053762 1534407 1465305 1084436 1197861 1542836 1296115 787376 973149
38474 973149 1582674 1568557 1066252 1086698 1566266 1582232 1231005 1392935 1877875 1737758
38464 1737758 1192982 1281067 1819575 1737612 1200547 1311718 1921643 1904189 1407462 1577578
$$ packed form
38534A242350J98083j23592k43365R190O7681j92732j98077J15597J14634k38827
38524G50942k29762K01187K64645j72648l03364Q5370K36719p8533j60422J67415
38514G61549K01628j72792j89363K42750K66207k39648l37438J70348L19783j51589
38504H71435k76721K45010M20261j22075l92001O4440L29182n5323k18761K52453
38494A117900M62732k888k34741J77735K98274k74422n29823K829L05964j39959
38484A183601l40718K10879M80645o9102l80869J13425L44975k46721n08739J85773
38474I73149O09525j4117n02305K0446M79568J5966l51227J61930M84940j40117
38464A737758n44776Q8085N38508q1963n37065J11171O09925j7454m96727J70116
$$ plain form
38454 1577578 2229207 2136781 1488284 1609776 2367176 2376486 1718626 1808965 2598440 2638991
38444 2638991 1949384 1988939 2733367 2714466 2039912 2297389 3346559 3431734 2631049 2801047
38434 2801047 3914858 4059136 3299347 3695116 5155985 5399297 4460370 4851225 6680798
38425 6680798 7324862 6643590 7452339 9926371 11033147 10649200 12292404 16367380 19125961
38416 19125961 20019859 22988899 28438429 31967635 33686491 39728298 51112803 61523830
38408 61523830 70622666 87271508 113593223 141953251 178620395 249934244 360542697
38401 360542697 458024129 471787189 390472193 275269443 190577098 145907215 115374171
38394 115374171 86584267 66936446 57728236 48991022 37350999 29579498 27815439
$$ packed form
38454A577578O51629r2426o48497J21492P57400R310o57860R0339P89475M0551
38444B638991o89607L9555P44428j8901o74554K57477J049170Q5175q00685J69998
38434B801047J113811J44278p59789L95769J460869K43312r38927L90855J829573
38425F680798O44064o81272Q08749K474032J106776l83947J643204M074976K758581
38416A9125961Q93898K969040N449530L529206J718856O041807J1384505J0411027
38408F1523830R098836J6648842K6321715K8360028L6667144P1313849J10608453
38401C60542697R7481432J3763060q1314996j15202750q4692345m4669883l0533044
38394A15374171k8789904j9647821r208210q737214j1640023p771501j764059
$$ plain form
38387 27815439 25818068 20945509 17685395 17718690 16817969 13437076 11407576 12151630 12122500
38378 12122500 9937877 8884644 10317092 11203315 10439347 11405050 15581746 19041746
38370 19041746 18196295 14597429 11397221 8988543 6691351 5253914 5113803 4933862
38362 4933862 3945255 3327720 3714880 3828386 2982283 2431005 2878805 3101875 2361592
38353 2361592 1805842 2171725 2393519 1785220 1396850 1909482 2288065 1809830 1433213
38344 1433213 1888591 2307628 1985720 1700395 2075030 2356346 1988043 1751033 2204498
38335 2204498 2570290 2258520 1984608 2326450 2645454 2439911 2335472 2797754 3295469
38326 3295469 3600923 4390069 5641484 6028125 4947761 3661688 3347264 3474197 3204822
$$ packed form
38387B7815439j997371m872559l260114L3295r00721l380893k029500P44054k9130
38378A2122500k184623j053233J432448Q86223p63968R65703M176696L460000
38370A9041746q45451l598866l200208k408678k297192j437437j40111j79941
38362D933862r88607o17535L87160J13506q46103n51278M47800K23070p40283
38353B361592n55750L65883K21794o08299l88370N12632L78583m78235l76617
38344A433213M55378M19037l21908k85325L74635K81316l68303k37010M53465
38335B204498L65792l11770k73912L41842L19004k05543j04439M62282M97715
38326C295469L05454P89146J251415L86641j080364j286073l14424J26933k69375
$$ plain form
38317 3204822 2939927 3246303 3580542 3356066 3120043 3468822 3885715 3800459 3733904 4262507
38307 4262507 4885913 5041265 5228839 6013910 6900645 7326110 7815514 9003750 10424641
38298 10424641 11440133 12517180 14405167 16834708 19202877 21809243 25208477 28930427
38290 28930427 31931886 33754686 34275134 33021065 29867874 25851065 22205012 19057894
38282 19057894 15992189 13265726 11409239 10150750 8839742 7533441 6663980 6044859
38274 6044859 5202646 4315433 3852937 3631980 3160554 2582325 2368475 2393348 2204019 1895294
38264 1895294 1847516 1903113 1663100 1301863 1237630 1291881 1031242 655630 673383 946404
38254 946404 931504 657640 602559 776145 770949 584292 576053 720472 677749 514198 606074
$$ packed form
38317C204822k64895L06376L34239k24476k36023L48779M16893q5256o6555N28603
38307D262507O23406J55352J87574P85071Q86735M25465M89404J188236J420891
38298A0424641J015492J077047J887987K429541K368169K606366L399234L721950
38290B8930427L001459J822800N20448j254069l153191m016809l646053l147118
38282A9057894l065705k726463j856487j258489j311008j306301q69461o19121
38274F044859q42213q87213m62496k20957m71426n78229k13850K4873j89329l08725
38264A895294m7778N5597k40013l61237o4233N4251k60639l75612J7753K73021
38254I46404j4900k73864n5081J73586n196j86657q239J44419m2723j63551R1876
$$ plain form
38243 606074 909824 1035152 958943 988815 1114084 1062412 907843 966540 1177541 1227046
38233 1227046 1199819 1478443 2070790 2628540 3031483 3368085 3466859 3071910 2396443 1908886
38223 1908886 1657097 1363059 1047030 952356 977409 812114 548731 541989 745422 797789
38213 797789 687505 711962 852973 834375 747429 950473 1348384 1451224 1222093 1211111
38203 1211111 1701848 2336907 2819991 3458136 4664924 6221905 7310783 7199330 5875800
38194 5875800 4124577 2886679 2402515 2145658 1697033 1293132 1241610 1278886 1011326
38185 1011326 612868 498587 600934 577894 483222 587391 744560 609080 326088 331518
38175 331518 577048 625409 436987 390545 565618 664269 628346 688383 801847 682480
$$ packed form
38243F06074L03750J25328p6209K9872J25269n1672j54569N8697K11001M9505
38233A227046k7227K78624N92347N57750M02943L36602R8774l94949o75467m87557
38223A908886k51789k94038l16029r4674K5053j65295k63383o742K03433N2367
38213G97789j10284K4457J41011j8598q6946K03044L97911J02840k29131j0982
38203A211111M90737O35059M83084O38145J206788J556981J088878j11453j323530
38194E875800j751223j237898m84164k56857m48625m03901n1522L7276k67560
38185A011326l98458j14281J02347k3040r4672J04169J57169j35480k82992N430
38175C31518K45530M8361j88422m6442J75073R8651l5923O0037J13464j19367
$$ plain form
38165 682480 400912 326174 452664 416968 202852 173456 354602 358222 113802 13610
38155 13610 194990 315929 203224 109290 152763 105521 -74026 -80687 161116 322081 269098
38144 269098 281905 463631 509456 307949 208499 403523 576901 476589 333619 382101
38134 382101 436576 300176 163747 236335 358480 333762 298949 427444 586061 612890
38124 612890 636379 801567 963329 969341 989948 1249006 1644769 1933347 2091931 2216881
38114 2216881 2242180 2069423 1892285 2122985 2954440 4070017 4787667 4567988 3535005
38105 3535005 2435794 1891919 1781430 1597712 1240581 1031771 1051671 1001202 773470 638630
38095 638630 718888 760539 614919 501480 575785 644582 546760 449836 531612 698884 834367
$$ packed form
38165F82480k81568p4738J26490l5696k14116k9396J81146L620k44420j00192
38155A3610J81380J20939j12705r3934M3473m7242j79547o661K41803J60965n2983
38144B69098J2807J81726M5825k01507r9450J95024J73378j00312j42970M8482
38134C82101N4475j36400j36429P2588J22145k4718l4813J28495J58617K6829
38124F12890K3489J65188J61762O012K0607K59058L95763K88578J58584J24950
38114B216881K5299j72757j77138K30700Q31455J115577P17650k19679j032983
38105C535005j099211n43875j10489j83718l57131k08810J9900n0469k27732j34840
38095F38630Q0258M1651j45620j13439P4305O8797r7822r6924Q1776J67272J35483
$$ plain form
38084 834367 994457 1159639 1123412 842898 583080 512113 469086 319168 200560 217718
38074 217718 233520 182857 249157 496727 665803 581532 441437 440900 435734 257616 68516
38063 68516 104045 307595 482725 582445 621693 544652 395449 375313 528720 626436 541618
38052 541618 458531 525146 609678 599729 612750 693189 648621 433357 344363 561113 831837
38041 831837 905575 932652 1122986 1345129 1405624 1407785 1482348 1475257 1272829 1132806 1302368
38030 1302368 1600535 1788092 2052294 2648488 3302790 3484835 3128400 2613799 2160010
38021 2160010 1697164 1253109 1002097 938170 881291 797476 786327 795586 677456 493671
38011 493671 453720 575033 678499 678393 623106 516789 356057 265961 345959 463196 439662
$$ packed form
38084H34367J60090J65182l6227k80514k59818p0967m3027j49918j18608J7158
38074B17718J5802n0663O6300K47570J69076q4271j40095n37n166j78118j89100
38063F8516L5529K03550J75130R9720L9248p7041j49203k0136J53407R7716q4818
38052E41618q3087O6615Q4532r949J3021Q0439m4568k15264q8994K16750K70724
38041H31837P3738K7077J90334K22143O0495K161P4563p091k02428j40023J69562
38030A302368K98167J87557K64202N96194O54302J82045l56435n14601m53789
38021B160010m62846m44055k51012o3927n6879q3815j1149R259j18130j83785
38011D93671l9951J21313J03466j06n5287j06317j60732r0096P9998J17237k3534
$$ plain form
38000 439662 340837 334444 387905 370913 330931 384250 450750 384060 256807 233325 267891
37989 267891 211695 108365 100360 155987 169782 204728 341789 429486 301605 110365 109614
37978 109614 235461 252974 194725 270419 434541 443041 290021 205562 248367 265573 235262
37967 235262 290151 409206 428312 353845 344459 401627 397438 369561 448716 535794 417378
37956 417378 178242 121754 284813 411425 414378 470874 627203 701612 643116 616556 664896
37945 664896 648789 586330 684138 952581 1154278 1216421 1326476 1536042 1659905 1677658
37935 1677658 1840587 2246361 2697560 3118642 3697959 4458629 5147492 5771602 6770317
37926 6770317 8380225 10366003 12789272 16415505 21518743 26517843 28747685 26898575
$$ packed form
38000D39662r8825o393N3461j6992l9982N3319O6500o6690j27253k3482L4566
37989B67891n6196j03330q005N5627J3795L4946J37061Q7697j27881j91240p51
37978A09614J25847J7513n8249P5694J64122Q500j53020q4459M2805J7206l0311
37967B35262N4889J19055J9106p4467r386N7168m189k7877P9155Q7078j18416
37956D17378k39136n6488J63059J26612K953N6496J56329P4409n8496k6560M8340
37945F64896j6107o2459R7808K68443K01697O2143J10055K09566J23863J7753
37935A677658J62929M05774M51199M21082N79317P60670O88863O24110R98715
37926F770317J609908J985778K423269L626233N103238M999100K229842j849110
$$ plain form
37918 26898575 22226107 17169232 13234615 10461791 8388959 6843965 5810173 5084068
37910 5084068 4394110 3687940 3078449 2590295 2152336 1790516 1611421 1575000 1489814 1297036
37900 1297036 1158229 1164008 1163522 1028219 881686 873743 910602 840502 741009 754381 783427
37889 783427 659473 501317 562504 781264 842005 676842 547623 592447 643214 578854
37879 578854 529187 599260 676845 657133 614822 617344 589630 495446 447749 513215 596009 626717
37867 626717 677268 780327 826028 755544 680017 693402 734089 736819 754973 829161 898042
37856 898042 937932 1025607 1164515 1218359 1126554 1026543 1050863 1150613 1227906 1301405 1429839
37845 1429839 1593565 1747934 1885121 1976976 1980996 1961576 2070876 2349472 2673104 2933225
$$ packed form
37918B6898575m672468n056875l934617k772824k072832j544994j033792p26105
37910E084068o89958p06170o09491m88154m37959l61820j79095l6421q5186j92778
37900A297036j38807N779m86j35303j46533p943L6859p0100r9493J3372K9046
37889G83427j23954j58156O1187K18760O0741j65163j29219M4824N0767o4360
37879E78854m9667P0073P7585j9712m2311K522k7714r4184m7697O5466Q2794L0708
37867F26717N0551J03059M5701p0484p5527J3385M0687K730J8154P4188O8881
37856H98042L9890Q7675J38908N3844r1805j00011K4320R9750P7293P3499J28434
37845A429839J63726J54369J37187R1855M020j9420J09300K78596L23632K60121
$$ plain form
37835 2933225 3123605 3223522 3179711 3058474 3031051 3134028 3212240 3170788 3121128 3207117 3441252
37824 3441252 3777152 4196214 4670878 5186177 5832347 6734586 7888022 9226437 10851200
37815 10851200 13033590 16023973 19966639 24735920 29451196 32360538 31923273 28276197
37807 28276197 23228357 18616021 15016109 12132479 9782078 8028806 6765856 5745206
37799 5745206 4908332 4321044 3901267 3509880 3174716 2955054 2736351 2417711 2132311
37790 2132311 2013332 1919273 1679220 1432333 1400871 1474654 1365572 1073619 862494 838167
37780 838167 870968 891265 954203 1029178 1011849 947130 983383 1099849 1117464 990274 865591
37769 865591 837968 840927 801784 734521 669914 637632 702881 884172 1066581 1127201 1095824
$$ packed form
37835B933225J90380R9917m3811j21237k7423J02977P8212m1452m9660Q5989K34135
37824C441252L35900M19062M74664N15299O46170R02239J153436J338415J624763
37815A0851200K182390K990383L942666M769281M715276K909342m37265l647076
37807B8276197n047840m612336l599912k883630k350401j753272j262950j020650
37799E745206q36874n87288m19777l91387l35164k19662k18703l18640k85400
37790B132311j18979r4059k40053k46887l1462P3783j09082k91953k11125k4327
37780H38167L2801K0297O2938P4975j7329o4719L6253J16466J7615j27190j24683
37769H65591k7623K959l9143o7263o4607l2282O5249J81291J82409O0620l1377
$$ plain form
37758 1095824 1063104 1009243 877028 734527 693952 730370 738404 704035 675708 650341 634902
37747 634902 713251 887103 972039 843181 666228 674729 831277 935163 953089 988155 1014655
37736 1014655 924378 784624 776973 902840 999500 1024467 1076068 1151576 1140850 1064158 1074244
37725 1074244 1204987 1337566 1424352 1529113 1639165 1660095 1615675 1641096 1754567 1833462
37715 1833462 1832096 1827303 1837649 1795865 1713275 1676805 1671889 1598648 1465473 1371641 1304675 1164201
37703 1164201 981612 891938 882833 804334 642936 543837 532520 467622 324196 269082 368947
37692 368947 460699 420404 350152 379999 468938 521118 539483 551655 521790 436129 357435
37681 357435 318353 272995 204278 157630 133967 84146 36087 78772 195139 268617 276137
$$ packed form
37758A095824l2720n3861j32215j42501m0575L6418Q034l4369k8327k5367j5439
37747F34902P8349J73852Q4936j28858j76953Q501J56548J03886J7926L5066K6500
37736A014655r0277j39754p651J25867R6660K4967N1601P5508j0726p6692J0086
37725A074244J30743J32579Q6786J04761J10052K0930m4420K5421J13471P8895
37715A833462j366m793J0346m1784q2590l6470m916p3241j33175r3832o6966j40474
37703A164201j82589q9674r105p8499j61398r9099j1317o4898j43426n5114R9865
37692C68947R1752m0295p0252K9847Q8939N2180J8365J2172k9865q5661p8694
37681C57435l9082m5358o8717m6648k3663m9821m8059M2685J16367P3478P520
$$ plain form
37670 276137 302999 348563 313706 214790 199168 292073 339737 275252 228007 281717 336597
37659 336597 318027 313483 375281 385108 262911 135671 140137 207381 200426 134280 103735 106189
37647 106189 87104 68089 95436 145749 197758 305223 484957 626573 631110 554814 504995
37636 504995 478163 413733 329020 284438 274623 256032 232209 229296 238630 248696 274612 305090
37624 305090 293658 245132 219992 214188 150972 43933 29831 154729 263641 217458 102804
37613 102804 94003 201140 305690 393632 600722 1010577 1493622 1776165 1663724 1224705
37603 1224705 751371 485937 398530 308865 178799 132385 197922 230613 150811 71120 87990
37592 87990 117267 65829 21237 116618 309615 446602 476631 466189 453084 410846 333469
$$ packed form
37670B76137K6862M5564l4857r8916j5622R2905M7664o4485m7245N3710N4880
37659C36597j8570m544O1798R827j22197j27240M466O7244o955o6146l0545K454
37647A06189j9085j9015K7347N0313N2009J07465J79734J41616M537p6296m9819
37636E04995k6832o4430q4713m4582r815j8591k3823k913R334J0066K5916L0478
37624C05090j1432m8526k5140n804o3216j07039j4102J24898J08912m6183j14654
37613A02804q801J07137J04550Q7942K07090M09855M83045K82543j12441m39019
37603A224705m73334k65434q7407q9665j30066m6414O5537L2691p9802p9691J6870
37592H7990K9277n1438m4592R5381J92997J36987L0029j0442j3105m2238p7377
$$ plain form
37581 333469 259225 219353 214918 221399 194941 122633 71310 110107 186355 182283 95978 39421
37569 39421 51074 59853 49212 82609 134299 89356 -33197 -64686 29783 71882 -24582 -101880
37557 -101880 -48651 -1646 -73001 -106797 54177 252458 241688 87039 52293 178044 258775
37546 258775 197115 110152 84910 70583 42024 64282 148467 203260 168638 75817 -34924
37535 -34924 -139425 -177750 -94970 64060 190216 221243 150016 -10013 -177917 -216233 -107436
37524 -107436 -22140 -76390 -136567 -40474 103665 67632 -122644 -215126 -108921 39163 89490
37513 89490 68363 16393 -86128 -188677 -168571 -28278 79468 84021 87014 163132 241981
37502 241981 259767 265759 295289 285891 206557 133800 114525 86159 18283 -4428 58347 95160
$$ packed form
37581C33469p4244l9872m435O481k6458p2308n1323L8797P6248m072q6305n6557
37569C9421J1653Q779j0641L3397N1690m4943j22553l1489R4469M2099r6464p7298
37557a01880N3229M7005p1355l3796J60974J98281j0770j54649l4746J25751Q0731
37546B58775o1660q6963k5242j4327k8559K2258Q4185N4793l4622r2821j10741
37535c4924j04501l8325Q2780J59030J26156L1027p1227j60029j67904l8316J08797
37524a07436Q5296n4250o0177R6093J44139l6033j90276r2482J06205J48084N0327
37513H9490k1127n1970j02521j02549K0106J40293J07746M553K993P6118P8849
37502B41981J7786N992K9530r398p9334p2757j9275k8366o7876k2711O2775L6813
$$ plain form
37490 95160 19738 -60196 3590 159178 219011 122441 -6235 -50783 -33001 -33495 -71828 -97159
37478 -97159 -52220 69238 204191 265237 227264 154206 116647 107947 74745 7594 -41125
37467 -41125 -23102 54032 136146 158156 80311 -72212 -198862 -192724 -52911 91787 113168
37456 113168 31196 -21659 8862 21929 -72280 -186602 -160840 7618 159832 196556 176330
37445 176330 173648 172605 153625 162148 212437 223236 134035 4563 -77190 -105497 -103846 -53507
37433 -53507 36964 78823 22076 -45186 -18935 62462 82662 15672 -62457 -78963 -4421 146065
37421 146065 276223 256748 95786 -32102 -20810 15714 -54823 -153795 -127814 -13422 25567
37410 25567 -37358 -81064 -55405 -27860 -29026 -18667 5133 15161 52620 161476 252762 203428
$$ packed form
37490I5160p5422p9934O3786J55588N9833r6570j28676m4548J7782m94l8333k5331
37478i7159M4939J21458J34953O1046l7973p3058l7559q700l3202o7151m8719
37467d1125J8023P7134Q2114K2010p7845j52523j26650O138J39813J44698K1381
37456A13168q1972n2855L0521J3067r4209j14322K5762J68458J52214L6724k0226
37445A76330k682j043j8980Q523N0289J0799q9201j29472q1753k8307J651N0339
37433e3507R0471M1859n6747o7262K6251Q1397K0200o6990p8129j6506P4542J50486
37421A46065J30158j9475j60962j27888J1292L6524p0537r8972K5981J14392L8989
37410B5567o2925m3706K5659K7545j166J0359K3800J0028L7459J08856R1286m9334
$$ plain form
37398 203428 73730 50311 175472 306826 349861 351773 345938 283632 164174 76320 62921
37387 62921 75820 89922 125693 144732 74887 -41231 -80017 -39836 -41784 -100539 -82837 49214
37375 49214 144383 101755 29750 51813 104914 67576 -27679 -56507 -7923 5996 -78914 -193011
37363 -193011 -217664 -112818 33849 82080 -9054 -124903 -138574 -67284 -7849 25354 76032
37352 76032 106785 40426 -76866 -117444 -77266 -71173 -114425 -93179 13077 68452 4543
37341 4543 -64921 -33024 49188 90735 89744 68646 15751 -36951 -12634 66317 73126 -18661
37329 -18661 -76100 -24216 41655 49777 85159 208476 302845 248882 122788 68450 77549 45053
37317 45053 -41319 -106744 -118517 -91849 -30677 34838 22573 -89692 -195322 -193166 -119693
$$ packed form
37398B03428j29698k3419J25161J31354M3035J912n835o2306j19458q7854j3399
37387F2921J2899J4102L5771J9039o9845j16118l8786M0181j948n8755J7702J32051
37375D9214R5169m2628p2005K2063N3101l7338r5255k8828M8584J3919q4910j14097
37363a93011k4653J04846J46667M8231r1134j15849j3671P1290N9435L3203N0678
37352G6032L0753o6359j17292m0578M0178O093m3252K1246J06256N5375o3909
37341D543o9464L1897Q2212M1547r91k1098n2895n2702K4317P8951O809r1787
37329a8661n7439N1884O5871Q122L5382J23317R4369n3963j26094n4338R099l2496
37317D5053q6372o5425j1773K6668O1172O5515j2265j12265j05630K156P3473
$$ plain form
37306 -119693 -64698 -38975 -14681 -11953 -48463 -76194 -54655 -14421 22656 94664 195428
37295 195428 222823 123389 -5396 -47570 -13321 27444 52022 43810 -38383 -154883 -168074
37284 -168074 -36139 91489 78710 -18144 -87176 -143460 -238362 -309047 -269983 -157259 -49053
37273 -49053 50895 124005 66421 -134735 -288391 -244577 -129361 -137281 -210326 -157323 -930
37262 -930 55237 -34086 -101723 -54393 12859 13252 -15659 -25426 -22928 1345 70150 138978 150600
37249 150600 150650 205484 241130 136817 -47381 -127397 -71931 -25787 -50619 -49963 14687 41634
37237 41634 -12627 -43734 6088 33127 -47272 -148262 -148503 -68752 -7738 8469 15990 19860
37225 19860 -2621 -47245 -89859 -116321 -119117 -103661 -102550 -128975 -123827 -22734 131719 229494
$$ packed form
37306a19693N4995K5723K4294K728l6510k7731K1539M0234L7077P2008J00764
37295A95428K7395r9434j28785m2174L4249M0765K4578q212q2193j16500j3191
37284a68074J31935J27628j2779r6854o9032n6284r4902p0685L9064J12724J08206
37273d9053R9948P3110n7584k01156j53656M3814J15216p920p3045N3003J56393
37262i30N6167q9323o7637M7330O7252L93k8911r767K498K4273O8805O8828J1622
37249A50600N0N4834L5646j04313j84198q0016N5466M6144k4832O56O4650K6947
37237D1634n4261l1107M9822K7039q0399j00990k41P9751O1014J6207P521L870
37225A9860k2481m4624m2614k6462k796J5456J111k6425N148J01093J54453R7775
$$ plain form
37213 229494 238309 215663 183268 103390 -6228 -50719 9687 98829 132395 105233 42374
37202 42374 -53548 -167446 -250770 -269792 -229590 -141898 -20073 97319 172927 210382 218347
37191 218347 170990 72283 11308 58996 149073 164839 107715 69194 73580 73021 67278 95688
37179 95688 133520 128304 111351 135343 142028 56586 -26871 44503 203160 220738 68062 -26254
37167 -26254 56737 141433 57140 -94271 -129152 -69139 -60310 -127695 -182635 -191507 -183108 -148589
37155 -148589 -70050 -2895 -10806 -54664 -48040 9557 45149 29907 6766 22974 92526 195776
37143 195776 270883 247297 132932 23957 -12960 -20025 -71559 -168723 -249713 -260211 -186625
37132 -186625 -66910 16775 13787 -19603 10871 94875 131806 86197 20738 -30971 -95057
$$ packed form
37213B29494Q815k2646l2395p9878j09618m4491O0406Q9142L3566k7162o2859
37202D2374r5922j13898q3324j9022M0202Q7692J21825J17392P5608L7455P965
37191B18347m7357r8707o0975M7688R0077J5766n7124l8521M386n59n743K8410
37179I5688L7832n216j6953K3992O685q5442q3457P1374J58657J7578j52676r4316
37167b6254Q2991Q4696q4293j51411l4881O0013Q829o7385n4940q872Q399L4519
37155a48589P8539O7155p911m3858O624N7597L5592j5242k3141J6208O9552J03250
37143A95776P5107k3586j14365j08975l6917p065n1534r7164q0990j0498P3586
37132a86625J19715Q3685k988l3390L0474Q4004L6931m5609o5459n1709o4086
$$ plain form
37121 -95057 -138791 -70197 86196 154624 34170 -154424 -231268 -165849 -50166 31583 32434
37110 32434 -50329 -120324 -44604 149348 257827 171217 32484 16430 81133 79918 9163
37099 9163 -19671 21062 66190 96867 138360 154777 87029 -24356 -75423 -38444 36509 122269
37087 122269 208484 238354 174813 99997 126781 233892 306114 310977 305326 283871 167035
37076 167035 -43108 -222506 -274709 -221984 -126597 -23552 40463 4385 -119515 -228937
37066 -228937 -248472 -206986 -166731 -135587 -89827 -35304 386 12289 20311 35053 36501 -12551
37054 -12551 -120863 -227966 -237492 -121520 31382 108549 93159 52092 26065 -12025 -88386
37043 -88386 -167900 -185232 -117048 -7428 77641 115875 135358 148369 112917 4664 -100422
$$ packed form
37121i5057m3734O8594J56393O8428j20454j88594p6844O5419J15683Q1749Q51
37110C2434q2763o9995P5720J93952J08479q6610j38733j6054O4703j215p0755
37099I163k8834M0733M5128L0677M1493J6417o7748j11385n1067L6979P4953Q5760
37087A22269Q6215K9870o3541p4816K6784J07111P2222M863n651k1455j16836
37076A67035k10143j79398n2203N2725R5387J03045O4015l6078j23900j09422
37066b28937j9535M1486M0255L1144M5760N4523L5690J1903Q022J4742J448m9052
37054a2551j08312j07103r526J15972J52902P7167j5390m1067k6027l8090p6361
37043h8386p9514j7332O8184J09620Q5069L8234J9483J3011l5452j08253j05086
$$ plain form
37032 -100422 -92088 22074 109647 82057 -3355 -43963 -24428 -1853 -14966 -58230 -107381
37021 -107381 -132424 -115955 -77866 -48502 -20552 19933 33711 -14883 -57070 6365 126264
37010 126264 141242 24348 -59532 -5726 76251 56282 -14997 -24487 6568 -11553 -66599
36999 -66599 -83649 -65770 -62696 -59488 -21196 9941 -15422 -43007 3136 80101 86996 15060
36987 15060 -77609 -180282 -293399 -340053 -255325 -120570 -71370 -107784 -125270 -91567 -56908
36976 -56908 -28831 22765 71555 82894 111691 205938 264718 164175 -15618 -80828 -18707
36965 -18707 2908 -68688 -96317 -14337 50200 -1334 -84500 -100353 -98676 -156908 -225625 -216836
36953 -216836 -151917 -110510 -102350 -84721 -51864 -27943 -16099 -15610 -47058 -111515 -162920 -155259
$$ packed form
37032a00422Q334J14162Q7573k7590q5412m0608J9535K2575j3113m3264m9151
37021a07381k5043J6469L8089K9364K7950M0485J3778m8594m2187O3435J19899
37010A26264J4978j16894q3880N3806Q1977j9969p1279r490L1055j8121n5046
36999f6599j7050J7879L074L208L8292L1137k5363k7585M6143P6965O895p1936
36987A5060r2669j02673j13117m6654Q4728J34755M9200l6414j7486L3703L4659
36976e6908K8077N1596M8790J1339K8797R4247N8780j00543j79793o5210O2121
36965a8707K1615p1596k7629Q1980O4537n1534q3166j5853J677n8232o8717Q789
36953b16836O4919M1407Q160J7629L2857K3921J1844M89l1448o4457n1405P661
$$ plain form
36941 -155259 -83905 26358 123559 127916 9264 -134444 -169447 -107247 -90906 -178860 -254840
36930 -254840 -200203 -53051 69939 128007 159816 189654 198629 162468 78535 -25016 -97053
36919 -97053 -110487 -95229 -86121 -65045 -13704 16135 -24459 -71906 -27501 72777 94551 13113
36907 13113 -50161 -21397 31552 40666 44541 90214 134918 115681 38374 -53593 -125217 -129070
36895 -129070 -23398 147725 269132 284562 243161 202486 169561 147873 145639 126426 55648
36884 55648 451 59674 184508 210926 95263 -34580 -98381 -163258 -260213 -279181 -155810
36873 -155810 -13453 8828 -44946 -42070 41825 132420 180579 177721 123966 61728 58462 92154
36861 92154 59936 -37232 -56900 50135 122046 29042 -112913 -129189 -58692 -55859 -120012
$$ packed form
36941a55259P1354J10263R7201M357j18652j43708l5003O2200J6341q7954p5980
36930b54840N4637J47152J22990N8068L1809K9838Q975l6161q3933j03551p2037
36919i7053j3434J5258R108K1076N1341K9839m0594m7447M4405J00278K1774q1438
36907A3113o3274K8764N2949R114L875M5673M4704j9237p7307r1967p1624l853
36895a29070J05672J71123J21407J5430m1401m0675l2925k1688k234j9213p0778
36884E5648n5197N9223J24834K6418j15663j29843o3801o4877r6955j8968J23371
36873a55810J42357K2281n3774K876Q3895R0595M8159k858n3755o2238l266L3692
36861I2154l2218r7168j9668J07035P1911r3004j41955j6276P0497K833o4153
$$ plain form
36850 -120012 -120806 -32066 53069 105861 177501 245151 216528 98866 11778 7829 7498 -59735
36838 -59735 -155964 -205206 -182608 -116001 -58376 -54786 -84933 -66396 28591 105897 69372 -44320
36826 -44320 -130897 -161037 -166590 -145112 -86691 -45451 -70509 -108229 -86012 -47987 -84075 -164127
36814 -164127 -175772 -100228 -17961 38380 99586 144038 112041 40157 40772 127562 187919 153475
36802 153475 80896 38418 25943 36681 87521 149900 148167 66736 -23009 -70918 -102282 -141192
36790 -141192 -163816 -156512 -144860 -138543 -114556 -72591 -41254 -20083 15543 47797 30546 -22853
36778 -22853 -41553 2176 59728 74810 25402 -83272 -194025 -197588 -54149 111644 147193
36767 147193 77946 48214 77204 36823 -110105 -221176 -187898 -91835 -60996 -87326 -81913
$$ packed form
36850a20012p94Q8740Q5135N2792P1640O7650k8623j17662q7088l949l31o7233
36838e9735r6229m9242K2598O6607N7625L590l0147J8537R4987P7306l6525j13692
36826d4320q6577l0140n553K1478N8421M1240k5058l7720K2217L8025l6088q0052
36814a64127j1645P5544Q2267N6341O1206M4452l1997p1884O15Q6790O0357l4444
36802A53475p2579m2478j2475J0738N0840O2379j733q1431q9745m7909l1364l8910
36790a41192k2624P304J1652O317K3987M1965L1337K1171L5626L2254j7251n3399
36778b2853j8700M3729N7552J5082m9408j08674j10753l563J43439J65793L5549
36767A47193o9247k9732K8990m0381j46928j11071L3278R6063L0839k6330N413
$$ plain form
36756 -81913 -23005 42873 84139 93128 63596 17409 4906 34496 52543 25984 -11244 -18118
36744 -18118 9734 68168 136597 134535 -6407 -200805 -259669 -132077 21034 56167 25537
36733 25537 39355 73219 38907 -39915 -59818 3239 87967 165114 245284 293027 249785 147075
36721 147075 100405 168895 285598 342613 298493 194876 103987 63144 42337 -9574 -78937
36710 -78937 -92056 -28576 30050 12676 -37274 -31861 34696 100685 138692 161790 154134 84565
36698 84565 -12244 -48481 7126 93423 147154 173916 202993 215905 162166 36568 -88748
36687 -88748 -124431 -56072 37108 69068 37549 1471 -12590 -28988 -53708 -56246 -38753 -51414
36675 -51414 -101457 -115825 -50801 20168 -1261 -101370 -185460 -213846 -220907 -210941 -130052 30597
$$ packed form
36756h1913N8908O5878M1266Q989k9532m6187j2503K9590J8047k6559l7228o874
36744a8118K7852N8434O8429k062j40942j94398n8864J27592J53111L5133l0630
36733B5537J3818L3864l4312p8822j9903O3057Q4728P7147Q0170M7743m3242j02710
36721A47075m6670O8490J16703N7015m4120j03617r0889m0843k0807n1911o9363
36710g8937j3119O3480N8626j7374m9950N413O6557O5989L8007K3098p656o9569
36698H4565r6809l6237N5607Q6297N3731K6762K9077J2912n3739j25598j25316
36687h8748l5683O8359R3180L1960l1519l6078j4061j6398k4720k538J7493j2661
36675e1414n0043j4368O5024P0969k1429j00109q4090k8386p061R966Q0889J60649
$$ plain form
36663 30597 173022 182047 47704 -134931 -270150 -336220 -361681 -359372 -309735 -207531 -94445
36652 -94445 -19596 16353 46025 76470 85969 73319 62303 55787 37345 23710 53926 109448
36640 109448 112206 36364 -39467 -36821 18174 44911 17832 -27519 -60343 -71934 -58698 -42278
36628 -42278 -79258 -193093 -313655 -340149 -258121 -150240 -96711 -101400 -109010 -63562 42320
36617 42320 151916 191786 154524 111618 122770 163331 169040 117818 31276 -70974 -173194
36606 -173194 -243168 -253717 -212071 -141405 -57359 13513 30784 -8563 -53951 -74965 -108499
36595 -108499 -185383 -254900 -242424 -147183 -24789 87212 159655 135172 -2418 -144942 -151249
36584 -151249 -27758 75699 66339 13083 19175 78815 120600 131501 162745 234644 297478
$$ packed form
36663C0597J42425R025j34343j82635j35219o6070k5461K309M9637J02204J13086
36652i4445P4849L5949K9672L0445R499j2650j1016o516j8442j3635L0216N5522
36640A09448K758p5842p5831K646N4995K6737k7079m5351l2824j1591J3236J6420
36628d2278l6980j13835j20562k6494Q2028J07881N3529m689p610M5448J05882
36617D2320J09596L9870l7262m2906J1152M0561N709n1222q6542j02250j02220
36606a73194o9974j0549M1646P0666Q4046P0872J7271l9347m5388k1014l3534
36595a08499p6884o9517J2476R5241J22394J12001P2443k4483j37590j42524o307
36584a51249J23491J03457r360n3256O092N9640M1785J0901L1244P1899O2834
$$ plain form
36573 297478 293241 223400 143980 104554 100738 91491 58517 26814 18067 15275 -726 -11318
36561 -11318 4038 20396 8157 1017 58456 162940 219624 173720 76420 16246 27130 76553
36549 76553 100613 39914 -108755 -257169 -291463 -198997 -84866 -38234 -36566 -20159 -1236
36538 -1236 -29158 -83449 -87861 -32732 -7663 -84323 -218929 -305184 -286335 -180174 -29783
36527 -29783 116710 193611 150937 22747 -79855 -76274 4577 76393 100498 103012 106412 96093
36515 96093 65285 52668 105823 217694 316411 321159 213228 59252 -43900 -56902 -19042
36504 -19042 23393 74983 148943 206492 195653 131301 74586 43023 8605 -19776 6228 80399
36492 80399 127664 114211 95022 112825 127185 97181 62291 74256 109861 126260 151759 238153
$$ packed form
36573B97478m237o9841p9420l9426l816r247l2974l1703q747k792j6001j0592
36561a1318J5356J6358j2239p140N7439J04484N6684m5904r7300o0174J0884M9423
36549G6553K4060o0699j48669j48414l4294R2466J14131M6632J668J6407J8923
36538a236k7922n4291m412N5129K5069p6660j34606q6255J8849J06161J50391
36527b9783J46493P6901m2674j28190j02602L581Q0851P1816K4105K514L400j0319
36515I6093l0808j2617N3155J11871R8717M748j07931j53976j03152j3002L7860
36504a9042M2435N1590P3960N7549j0839o4352n6715l1563l4418k8381K6004P4171
36492H0399M7265j3453j9189J7803J4360l0004l4890J1965L5605J6399K5499Q6394
$$ plain form
36480 238153 356292 418401 383244 274183 124021 -26229 -107256 -86160 -30495 -21872 -26269
36469 -26269 49872 184439 239822 162604 68485 71550 124008 106660 14527 -40468 11656 115211
36457 115211 164727 110896 -13136 -125996 -146227 -43438 129365 263221 276082 181778
36447 181778 77227 54231 117182 186416 180034 87095 -32729 -101503 -73536 35207 145422
36436 145422 161741 53792 -107414 -209547 -199130 -121415 -69005 -91663 -145930 -139044 -40854
36425 -40854 61108 55951 -46927 -120413 -75683 39402 119315 121616 74266 15080 -28801
36414 -28801 -38584 -24458 -18409 -17007 22582 93801 107527 7602 -129517 -182101 -136053 -78016
36402 -78016 -60778 -52416 -14361 34770 42421 -25275 -145921 -233726 -203855 -77234 20970 7236
$$ packed form
36480B38153J18139O2109l5157j09061j50162j50250q1027K1096N5665Q623m397
36469b6269P6141J34567N5383p7218r4119L065N2458j7348r2133n4995N2124J03555
36457A15211M9516n3831j24032j12860k0231J02789J72803J33856J2861r4304
36447A81778j04551k2996O2951O9234o382r2939j19824o8774K7967J08743J10215
36436A45422J6319j07949j61206j02133J0417P7715N2410k2658n4267O886R8190
36425d0854J01962n157j02878p3486M4730J15085P9913K301m7350n9186m3881
36414b8801r783J4126O049J402L9589P1219J3726r9925j37119n2584M6048N8037
36402g8016J7238Q362L8055M9131P651o7696j20646q7805K9871J26621R8204j3734
$$ plain form
36390 7236 -65869 -104934 -98568 -80562 -43125 20936 49965 -3635 -64621 -21798 105766 200426
36378 200426 217785 211724 210528 193725 182533 224385 283739 272521 196306 146250 139423 101293
36366 101293 20544 -23602 -16003 -36096 -90930 -75564 33869 104432 54628 -8232 29525
36355 29525 101986 93373 41908 64780 160172 232339 255558 270307 262655 194019 123033 147418
36343 147418 222927 180830 -41356 -295623 -390974 -286395 -87426 74790 124156 61758
36333 61758 -41031 -93495 -58416 26915 94122 93362 20576 -75389 -128186 -121499 -101663 -105120
36321 -105120 -112266 -102108 -101103 -127521 -136277 -86769 -28528 -42864 -122626 -186632 -195846 -172512
36309 -172512 -114248 12368 172439 249257 181783 54662 -5490 16150 30678 -15485 -76883
$$ packed form
36390G236p3105l9065O366J8006L7437O4061K9029n3600o0986M2823J27564R4660
36378B00426J7359o061j196j6803j1192M1852N9354j1218p6215n0056o827l8130
36366A01293q0749m4146P599k0093n4834J5366J09433P0563m9804o2860L7757
36355B9525P2461q613n1465K2872R5392P2167K3219J4749p652o8636p0986K4385
36343A47418P5509m2097k22186k54267r5351J04579J98969J62216M9366o2398
36333F1758j02789n2464L5079Q5331O7207p60p2786r5965n2797O687J9836l457
36321a05120p146J0158J005k6418q756M9508N8241j4336p9762o4006r214K3334
36309a72512N8264J26616J60071P6818o7474j27121o0152K1640J4528m6163o1398
$$ plain form
36298 -76883 -97503 -105798 -167688 -260953 -266108 -119245 74337 145015 58844 -59182 -98356
36287 -98356 -73540 -43032 -9680 37040 55462 9274 -54015 -59609 -10389 34541 55151 65280
36275 65280 35713 -82116 -247079 -328624 -250336 -78177 63804 120086 115965 85095 31975
36264 31975 -43255 -119682 -168699 -179996 -159768 -103559 7624 165337 305835 358419 314717
36253 314717 215149 81271 -81206 -217023 -238659 -137391 -9938 60835 86872 98996
36243 98996 68754 -26352 -121413 -128910 -48576 53969 137677 186243 164736 65514 -30534 -30981
36231 -30981 40418 76004 36322 -14170 -21497 -2235 26197 87204 175973 215116 136348 -21053
36219 -21053 -135698 -122061 -3792 125837 200891 227445 231790 200593 118158 36742 25910
$$ packed form
36298g6883k0620q295o1890r3265n155J46863J93582P0678q6171j18026l9174
36287i8356K4816L0508L3352M6720J8422m6188o3289n594M9220M4930K0610J0129
36275F5280k9567j17829j64963q1545P8288J72159J41981N6282m121l0870n3120
36264C1975p5230p6427m9017j1297K0228N6209J11183J57713J40498N2584m3702
36253C14717r9568j33878j62477j35817k1636J01268J27453P0773K6037J2124
36243I8996l0242r5106r5061p497Q0334J02545Q3708M8566k1507r9222r6048m47
36231c0981P1399L5586l9682n0492p327J9262K8432O1007Q8769L9143p8768j57401
36219b1053j14645J3637J18269J29629P5054K6554M345l1197q2435q1416j0832
$$ plain form
36208 25910 49182 -4807 -135360 -193472 -105447 -12215 -66864 -192526 -195526 -55216 70356
36197 70356 98967 105269 137962 129506 38852 -57782 -83460 -58118 -28895 -9572 -35022 -156838
36185 -156838 -319323 -355050 -192911 20814 100629 44547 -12754 -20 41585 64987 69004
36174 69004 58237 31274 4850 -4197 -8215 -18704 -13291 25415 70489 92689 101750 98056 33713
36161 33713 -108059 -235735 -240045 -147032 -94060 -148038 -228214 -234112 -179576 -151304 -176737 -192141
36149 -192141 -137452 -36973 36864 58401 71903 115938 163331 167926 143549 146896 191236 231359
36137 231359 237891 230446 221596 183564 100924 14975 -14157 39883 166799 324425 431956
36126 431956 417314 303914 199287 165735 159911 137970 145953 233607 337250 345127 256629
$$ packed form
36208B5910K3272n3989j30553n8112Q8025R3232n4649j25662l000J40310J25572
36197G0356K8611O302L2693q456r0654r6634k5678K5342K9223J9323k5450j21816
36185a56838j62485l5727J62139K13725P9815n6082n7301J2734M1605K3402M017
36174F9004j0767k6963k6424r047m018j0489N413L8706M5074K2200R061l694o4343
36161C3713j41772j27676m310R3013N2972n3978q0176n898N4536K8272k5433j5404
36149a92141N4689J00479P3837K1537J3502M4035M7393M595k4377L347M4340M0123
36137B31359O532p445q850l8032q2640q5949k9132N4040J26916J57626J07531
36126D31956j4642j13400j04627l3552n824k1941P983Q7654J03643P877q8498
$$ plain form
36115 256629 185390 203991 262715 272135 198811 63159 -95071 -220109 -255925 -195222 -92848
36104 -92848 -13337 17137 3521 -40941 -93871 -123405 -108837 -55640 12597 66085 77424 41232
36092 41232 -9023 -21636 25816 104437 158294 146897 77316 10715 26532 157035 354905
36081 354905 531757 616120 569390 387010 129218 -74536 -119203 -32374 62485 101299 135990
36070 135990 209007 246620 154041 -23113 -129796 -99858 -37036 -63583 -158952 -205177 -144693
36059 -144693 -28554 64496 93558 57434 -4188 -18631 47125 124773 122140 58334 36415
36048 36415 71066 50603 -81201 -212474 -220608 -155207 -144647 -177270 -122388 37475 144544
36037 144544 84681 -49073 -92921 -35570 -10710 -98959 -225319 -260372 -161165 12437 178298
$$ packed form
36115B56629p1239J8601N8724R420p3324j35652j58230j25038l5816O0703J02374
36104i2848P9511L0474j3616m4462n2930k9534J4568N3197O8237N3488J1339l6192
36092D1232n0255j2613M7452P8621N3857j1397o9581o6601J5817J30503J97870
36081C54905J76852Q4363m6730j82380k57792k03754m4667Q6829R4859L8814L4691
36070A35990P3017L7613r2579j77154j06683K9938O2822k6547r5369m6225O0484
36059a44693J16139R3050K9062l6124o1622j4443O5756P7648k633o3806k1919
36048C6415L4651k0463j31804j31273q134O5401J0560l2623N4882J59863J07069
36037A44544n9863j33754m3848N7351K4860q8249j26360l5053R9207J73602J65861
$$ plain form
36026 178298 285592 302625 210193 45561 -78687 -65984 43870 102114 22567 -127489
36016 -127489 -237781 -291600 -335239 -367917 -345339 -268356 -190705 -144222 -114476 -80866 -31679
36005 -31679 39880 105233 99759 12147 -66591 -55705 204 17563 22444 90103 171736 134503
35993 134503 -18170 -116833 -57348 69630 136857 151125 193260 277718 345360 337868 236236
35982 236236 83327 -14764 10560 78466 49461 -61152 -92003 10673 100814 62324 -19868
35971 -19868 -18416 43243 76272 84034 99856 73833 -29494 -109311 -63715 24171 3804 -91605
35959 -91605 -94164 18637 80286 -3799 -116679 -107063 21909 163822 247640 259556 204287
35948 204287 114947 58800 78112 140224 169853 119990 11880 -77071 -78445 -9467 36685
$$ packed form
36026A78298J07294J7033r2432j64632j24248J2703J09854N8244p9547j50056
36016a27489j10292n3819m3639l2678K2578P6983P7651M6483K9746L3610M9187
36005c1679P1559O5353n474q7612p8738J0886N5909J7359M881O7659Q1633l7233
35993A34503j52673r8663N9485J26978O7227J4268M2135Q4458O7642p492j01632
35982B36236j52909r8091K5324O7906k9005j10613l0851J02676R0141l8490q2192
35971a9868J452O1659L3029P762J5822k6023j03327p9817M5596Q7886k0367r5409
35959i1605k559J12801O1649q4085j12880R616J28972J41913Q3818J1916n5269
35948B04287q9340n6147J9312O2112K9629m9863j08110q8951j374O8978M6152
$$ plain form
35937 36685 1851 -69391 -102749 -87415 -51523 2416 73726 118850 101479 56466 41046 55471
35925 55471 69594 84828 108008 115390 110101 151721 246214 278999 167548 18252 3278 126999
35913 126999 248841 298984 322711 335798 300099 245111 252127 297600 270679 177656 163456
35902 163456 273144 355613 292311 175278 144891 173204 143261 56662 16995 48521 63018
35891 63018 711 -99672 -181110 -238224 -285119 -307195 -272789 -172523 -36221 81753 137552
35880 137552 126126 74487 15375 -21445 -10423 47943 115595 152261 149776 114046 48381 -12624
35868 -12624 -225 101802 208352 231798 185342 122076 34592 -87141 -161385 -112542 -22847
35857 -22847 -31662 -101513 -59042 116309 231279 165946 48146 45548 131164 172462 134144
$$ packed form
35937C6685l4834p1242l3358J5334L5892N3939P1310M5124j7371m5013j5420J4425
35925E5471J4123J5234K3180P382n289M1620R4493L2785j11451j49296j4974J23721
35913A26999J21842N0143K3727J3087l5699n4988P016M5473k6921r3023j4200
35902A63456J09688Q2469o3302j17033l0387K8313k9943q6599l9667L1526J4497
35891F3018o2307j00383q1438n7114m6895k2076L4406J00266J36302J17974N5799
35880A37552j1426n1639n9112l6820J1022N8366O7652L6666k485l5730o5665o1005
35868a2624J2399J02027J06550K3446m6456o3266q7484j21733p4244M8843Q9695
35857b2847q815o9851M2471J75351J14970o5333j17800k598Q5616M1298l8318
$$ plain form
35846 134144 64493 -26538 -140842 -207294 -154214 -34092 32958 17545 -11891 -21068 -53992
35835 -53992 -139712 -226572 -231879 -129694 13389 86637 46476 -20828 2942 108003 170638
35824 170638 139830 110226 165244 249531 270738 238803 211940 177289 93806 7558 11522 102605
35812 102605 170763 134078 17472 -104232 -183828 -213417 -198258 -136486 -28124 82991 102107
35801 102107 -17451 -173032 -199146 -76421 39949 34036 -37891 -84706 -126523 -201294 -234528
35790 -234528 -146662 -26442 -41599 -193701 -302698 -248969 -111614 -31919 -34312 -35755 21736
35779 21736 97693 100120 -8627 -152908 -210769 -149723 -58423 -24657 -36938 -45242 -56110 -99056
35767 -99056 -141798 -118005 -25490 63772 86356 42567 -15605 -25362 31486 95434 91761 36711
$$ packed form
35846A34144o9651r1031j14304o6452N3080J20122O7050j5413k9436r177l2924
35835e3992q5720q6860n307J02185J43083P3248m0161o7304K3770J05061O2635
35824A70638l0808k9604N5018Q4287K1207l1935k6863l4651q3483q6248L964R1083
35812A02605O8158l6685j16606j21704p9596k9589J5159O1772J08362J11115J9116
35801A02107j19558j55581k6114J22725J16370n913p1927m6815m1817p4771l3234
35790b34528Q7866J20220j5157j52102j08997N3729J37355P9695k393j443N7491
35779B1736P5957K427j08747j44281n7861O1046R1300L3766j2281q304j0868m2946
35767i9056m2742K3793R2515Q9262K2584m3789n8172r757N6848O3948l673n5050
$$ plain form
35755 36711 17323 51908 63398 26322 26503 103731 149157 65660 -64838 -101073 -56922 -59443
35743 -59443 -140939 -210996 -210320 -163314 -89156 18702 121573 145936 72261 -59216 -210580
35732 -210580 -336324 -352324 -220796 -44447 26930 -29565 -115356 -154885 -135288 -44682 104803
35721 104803 217549 204876 121291 91392 123443 127220 94675 107979 167730 174070 103959 56141
35709 56141 81546 109524 86699 55710 48427 30590 3556 33468 123340 181141 173398 181918
35697 181918 240346 248236 138080 5862 -33149 -20058 -71587 -200146 -320644 -376553 -364374
35686 -364374 -287475 -175452 -101840 -100151 -105904 -55272 8596 6189 -46978 -63193 -6495 80800
35674 80800 151567 186253 169468 94022 -17545 -130070 -217087 -245490 -180846 -43257 79119
$$ packed form
35755C6711j9388L4585J1490l7076J81P7228M5426q3497j30498l6235M4151k521
35743e9443q1496p0057O76M7006P4158J07858J02871K4363p3675j31477j51364
35732b10580j25744j6000J31528J76349P1377n6495q5791l9529J9597R0606J49485
35721A04803J12746j2673q3585k9899L2051L777l2545J3304N9751O340p0111m7818
35709E6141K5405K7978k2825l0989p283j7837k7034K9912Q9872N7801p743Q520
35697A81918N8428P890j10156j32218l9011J3091n1529j28559j20498n5909J2179
35686c64374P6899J12023P3612J689n753N0632O3868k407n3167j6215N6698Q7295
35674H0800P0767L4686j6785p5446j11567j12525q7017k8403O4644J37589J22376
$$ plain form
35663 79119 109077 48127 -47839 -117468 -109313 -12507 101724 130083 58473 -22148 -40616 -19629
35651 -19629 -6413 -9181 -29851 -74477 -97736 -29134 103513 173327 127267 59799 55684 67876
35639 67876 29669 -18316 -11990 16312 7887 -8602 21180 69315 80832 70153 62011 9206
35627 9206 -117296 -225053 -211997 -125085 -81411 -84956 -56255 3535 25848 20329 56728 118519
35615 118519 125022 92295 115970 184670 170560 40540 -72608 -63494 13353 64790 90026
35604 90026 115613 104908 19748 -99468 -185933 -219291 -197823 -111759 1072 50883 15178
35593 15178 -6753 66909 169424 180747 107003 65088 104370 141032 89826 -12169 -57797
35582 -57797 -10963 52246 45944 -17114 -51058 -18225 27868 39933 55757 122269 191319 180703
$$ packed form
35663G9119K9958o0950r5966o9629Q155R6806J14231K8359p1610q0621j8468K0987
35651a9629J3216k768k0670m4626k3259O8602J32647O9814m6060o7468m115J2192
35639F7876l8207m7985O326K8302q425j6489K9782M8135J1517j0679q142n2805
35627I206j26502j07757J3056Q6912M3674l545K8701N9790K2313n519L6399O1791
35615A18519O503l2727K3675O8700j4110j30020j13148R114P6847N1437K5236
35604I0026K5587j0705q5160j19216q6465l3358K1468Q6064J12831M9811l5705
35593A5178k1931P3662J02515J1323p3744m1915L9282L6662n1206j01995m5628
35582e7797M6834O3209o302o3058l3944L2833M6093J2065J5824O6512O9050j0616
$$ plain form
35570 180703 116247 108909 185245 248299 236309 210073 223627 212154 105067 -22587 -29618
35559 -29618 89616 194090 187518 121948 87084 85106 68946 44485 60558 112991 126334 54743
35547 54743 -38227 -42639 61171 169384 175623 91972 13484 -14144 -33036 -76006 -96348 -34951
35535 -34951 84216 177710 201588 176129 122666 36545 -63174 -114212 -82785 -21662 -6455
35524 -6455 -26943 3447 119994 239251 252397 154098 37798 -20062 -27414 -33103 -60716 -96626
35512 -96626 -110284 -72224 21754 130489 193240 187774 146898 115137 111150 130532 152693 142789
35500 142789 84875 19136 4981 40432 66530 59866 57411 68661 40504 -41547 -91018 -35513
35488 -35513 60688 81541 35092 41927 147548 243324 207735 58207 -80140 -114901 -57466
$$ packed form
35570A80703o4456p338P6336O3054j1990k6236J3554j1473j07087j27654p031
35559b9618J19234J04474o572o5570l4864j978j6160k4461J6073N2433J3343p1591
35547E4743r2970m412J03810J08213O239q3651p8488k7628j8892m2970k0342O1397
35535c4951J19167R3494K3878k5459n3463q6121r9719n1038L1427O1123J5207
35524f455k0488L0390J16547J19257J3146r8299j16300n7860p352n689k7613l5910
35512i6626j3658L8060R3978J08735O2751n466m0876l1761l987J9382K2161r904
35500A42789n7914o5739j4155L5451K6098o664k455J1250k8157q2051m9471N5505
35488c5513R6201K0853m6449O835J05621R5776l5589j49528j38347l4761N7435
$$ plain form
35477 -57466 20159 62641 66966 60074 57160 57012 70642 113365 151570 106292 -45828 -210509
35465 -210509 -267934 -202014 -85072 34643 153651 236177 212238 83043 -42045 -60035
35455 -60035 14714 90399 113751 105005 97956 90179 59592 6038 -40058 -49107 -24135 3292
35443 3292 1676 -42880 -120158 -182959 -161961 -42338 82900 101879 34271 15275 102481 188500
35431 188500 163886 79382 54707 93385 102265 58150 34629 68402 107506 105249 72764 19071
35419 19071 -77293 -207962 -310104 -327268 -252387 -114228 24900 77753 19590 -42000 22492
35408 22492 181084 266707 200667 82037 23397 12815 80 12993 91688 176473 165811
35397 165811 60945 -26963 -5473 115383 252224 315164 261140 125168 -2964 -55117
$$ packed form
35477e7466P7625M2482M325o892k914j48J3630M2723L8205m5278j52120j64681
35465b10509n7425O5920J16942J19715J19008Q2526k3939j29195j25088j7990
35455f0035P4749P5685K3352q746p049p777l0587n3554m6096r049K4972K7427
35443C292j616m4556p7278o2801K0998J19623J25238J8979o7608j8996Q7206Q6019
35431A88500k4614q4504k4675L8678Q880m4115k3521L3773L9104k257l2485n3693
35419A9071r6364j30669j02142j7164P4881J38159J39128N2853n8163o1590O4492
35408B2492J58592Q5623o6040j18630n8640j0582j2735J2913P8695Q4785j0662
35397A65811j04866q7908K1490J20856J36841O2940n4024j35972j28132n2153
$$ plain form
35387 -55117 -30960 32408 101402 145652 143573 115660 113808 150261 175392 153443 117060 109585
35375 109585 114231 89006 43109 24788 45012 62630 49400 30732 43899 76300 71969 6083
35363 6083 -66104 -62813 24028 119450 164606 173856 166962 110200 -13662 -131240 -157834 -116760
35351 -116760 -93284 -99009 -79957 -39414 -41960 -97169 -149374 -188873 -258860 -338214 -339931 -254717
35339 -254717 -173555 -132425 -67028 28390 44141 -58408 -140992 -82149 39541 82674 60255
35328 60255 72010 99877 40482 -94651 -176026 -153297 -111182 -109365 -97888 -35372 17867 -8629
35316 -8629 -79574 -96191 -23849 70790 102876 62238 14558 13900 35693 26934 4980 40081
35304 40081 130529 178000 128777 59893 59611 93418 75604 21355 25233 108955 185114 177404
$$ packed form
35387e5117K4157O3368O8994M4250k079k7913j852L6453K5131k1949l6383p475
35375A09585M646k5225m5897j8321K0224J7618j3230j8668J3167L2401m331o5886
35363F083p2187L291Q6841R5422M5156R250o894n6762j23862j17578k6594M1074
35351a16760K3476n725J9052M0543k546n5209n2205l9499o9987p9354j717Q5214
35339b54717Q1162M1130O5397R5418J5751j02549q2584N8843J21690M3133k2419
35328F0255J1755K7867n9395j35133q1375K2729M2115J817J1477O2516N3239k6496
35316h629p0945j6617P2342R4639L2086m0638m7680o58K1793q759k1954L5101
35304D0081R0448M7471m9223o8884k82L3807j7814n4249L878Q3722P6159p710
$$ plain form
35292 177404 107141 49151 46660 74524 64340 -17242 -104195 -93668 5977 63941 8750 -66352
35280 -66352 -55336 -7767 -32779 -101814 -85455 40306 158942 185099 154086 128715 122711
35269 122711 136500 174891 202859 160344 42842 -92443 -198619 -248695 -192464 -6117 210189
35258 210189 292346 201113 62507 -8488 -33159 -79762 -141646 -168290 -152356 -119288 -71184
35247 -71184 2072 79085 114586 77676 -31554 -176107 -283844 -294954 -227003 -160730 -145595
35236 -145595 -150098 -120428 -58943 -23533 -59601 -141163 -184679 -142298 -79191 -108079 -230204
35225 -230204 -311911 -262921 -157076 -102862 -80471 -20998 26203 -39429 -168509 -197442 -94662
35214 -94662 -8603 -33979 -86543 -71983 -31593 -30491 -28983 24131 71883 44137 -2925 31378
$$ packed form
35292A77404p0263n7990k491K7864j0184q1582q6953J0527R9645N7964n5191p5102
35280f6352J1016M7569k5012o9035J6359J25761J18636K6157l1013k5371o004
35269A22711J3789L8391K7968m2515j17502j35285j06176n0076N6231J86347K16306
35258B10189Q2157r1233j38606p0995k4671m6603o1884k6644J5934L3068M8104
35247g1184P3256P7013L5501l6910j09230j44553j07737j1110O7951O6273J5135
35236a45595m503K9670O1485L5410l6068q1562m3516M2381O3107k8888j22125
35225b30204q1707M8990J05845N4214K2391N9473M7201o5632j29080k8933J02780
35214i4662Q6059k5376n2564J4560M0390J102J508N3114M7752k7746m7062L4303
$$ plain form
35202 31378 118389 132071 35221 -76871 -116546 -88639 -25438 67811 165804 198008 132878
35191 132878 49616 60071 161642 226204 161758 36868 -13537 21803 24178 -61049 -132034
35180 -132034 -95986 -29088 -59781 -156705 -170622 -64868 36455 39529 -13225 -58833 -107704
35169 -107704 -164779 -165666 -68783 61590 130523 116295 54117 -23054 -84525 -104181 -105587 -147095
35157 -147095 -226640 -264903 -218581 -141934 -97231 -75892 -53428 -50964 -88861 -140188 -179081 -218704
$$ packed form
35202C1378Q7011J3682r6850j12092l9675K7907O3201R3249R7993L2204o5130
35191A32878q3262J0455J01571O4562o4446j24890n0405L5340K375q5227p0985
35180a32034L6048O6898l0693r6924j3917J05754J01323L074n2754m5608m8871
35169a07704n7075q87R6883J30373O8933j4228o2178p7171o1471j9656j406m1508
35157a47095p9545l8263M6322P6647M4703K1339K2464K464l7897n1327l8893l9623
$$ [...]
##END NTUPLES=NMR SPECTRUM
##END=
