##TITLE=31Pdec_1PBP507
 CDCl3, 24 sc
 5.7.2019
##JCAMPDX= 6.0         $$ Bruker NMR JCAMP-DX V2.0
##DATA TYPE= NMR SPECTRUM
##DATA CLASS= NTUPLES
##ORIGIN= UXNMR, Bruker Analytische Messtechnik GmbH
##OWNER= root
$$ XWIN-NMR		Version 3.5
$$ Fri Jul  5 16:32:48 2019 Russian Standard Time (UT+4h)  she@DPX200
##.OBSERVE FREQUENCY= 81.013821
##.OBSERVE NUCLEUS= ^31P
##.ACQUISITION MODE= SIMULTANEOUS
##.ACQUISITION SCHEME= undefined
##.AVERAGES= 24
##.DIGITISER RES= 17
##SPECTROMETER/DATA SYSTEM= spect
##.PULSE SEQUENCE= zgpg30
##.SOLVENT NAME= DMSO
##.SHIFT REFERENCE= (INTERNAL, DMSO, 0, 182.463)
##AUDIT TRAIL= $$ (NUMBER, WHEN, WHO, WHERE, WHAT)
$$ ##TITLE= Audit trail, XWIN-NMR		Version 3.5
$$ ##JCAMPDX= 5.01
$$ ##ORIGIN= Bruker BioSpin GmbH
$$ ##OWNER= she
$$ F:/spectra/data/she/nmr/P31/1/pdata/1/auditp.txt
$$ ##AUDIT TRAIL=  $$ (NUMBER, WHEN, WHO, WHERE, WHAT)
(   1,<2019-07-05 16:31:48.79 +0400>,<she>,<DPX200>,
      <created by zg, POWCHK disabled, PULCHK disabled
       configuration hash MD5:
       00 E9 B6 7A A2 85 ED C7 34 08 36 98 17 FE 4E 26
       data hash MD5: 32K
       DA 94 DD 29 BF 33 CB A2 60 08 68 BC EA AC 40 DA>)
(   2,<2019-07-05 16:31:51.10 +0400>,<she>,<DPX200>,
      <Start of raw data processing
       efp BC_mod = 2 LB = 1 FT_mod = 6 PKNL = 1 PHC0 = -2897.813 PHC1 = 85.39893 SI = 64K 
       data hash MD5: 64K
       F8 65 C9 A2 8B B6 59 7F DC AA 39 A4 DF EF 64 69>)
(   3,<2019-07-05 16:32:10.23 +0400>,<she>,<DPX200>,
      <pk PHC0 = 36.38345 PHC1 = -84.4 
       data hash MD5: 64K
       A6 98 5B 6A 46 5D 15 EF 12 63 3C 79 3A A1 ED 23>)
$$ ##END=
$$ 
$$ hash MD5
$$ 46 C2 29 00 9E F3 95 52 67 9D E5 B7 E9 0B 55 E6
##$RELAX= 
##$RELAX= 
##$RELAX= 
##$RELAX= 
##$RELAX= 
##$RELAX= 
##$RELAX= 
##$RELAX= 
$$ Bruker specific parameters
$$ --------------------------
##$DU= <F:/spectra>
##$EXPNO= 1
##$NAME= <P31>
##$PROCNO= 1
##$TYPE= <nmr>
##$USER= <she>
##$AMP= (0..31)
100 100 100 100 100 100 100 100 100 100 100 100 100 100 100 100 100 100 
100 100 100 100 100 100 100 100 100 100 100 100 100 100 
##$AQSEQ= 0
##$AQ_mod= 1
##$AUNM= <au_zg>
##$AUTOPOS= <>
##$BF1= 81.014009
##$BF2= 200.13
##$BF3= 200.13
##$BF4= 200.13
##$BF5= 200.13
##$BF6= 200.13
##$BF7= 200.13
##$BF8= 200.13
##$BYTORDA= 1
##$CFDGTYP= 0
##$CFRGTYP= 5
##$CHEMSTR= <none>
##$CNST= (0..31)
1 1 145 1 1 1 1 1 1 1 1 1 1 1 1 1 1 1 1 1 1 1 1 1 1 1 1 1 1 1 1 1 
##$CPDPRG= <waltz16>
##$CPDPRG1= <>
##$CPDPRG2= <waltz16>
##$CPDPRG3= <>
##$CPDPRG4= <mlev>
##$CPDPRG5= <mlev>
##$CPDPRG6= <mlev>
##$CPDPRG7= <mlev>
##$CPDPRG8= <mlev>
##$CPDPRGB= <>
##$CPDPRGT= <>
##$D= (0..31)
0 1 0 0 0 0 0 0 0 0 0 0.03 2e-05 3e-06 0 0 0 0 0 0 0 0 0 0 0 0 0 0 0 0 
0 0 
##$DATE= 1562329908
##$DBL= (0..7)
120 120 120 11 120 120 24 19 
##$DBP= (0..7)
150 150 150 150 150 150 150 150 
##$DBP07= 0
##$DBPNAM0= <>
##$DBPNAM1= <>
##$DBPNAM2= <>
##$DBPNAM3= <>
##$DBPNAM4= <>
##$DBPNAM5= <>
##$DBPNAM6= <>
##$DBPNAM7= <>
##$DBPOAL= (0..7)
0.5 0.5 0.5 0.5 0.5 0.5 0.5 0.5 
##$DBPOFFS= (0..7)
0 0 0 0 0 0 0 0 
$$ [...]
##$SUBNAM2= <"">
##$SUBNAM3= <"">
##$SUBNAM4= <"">
##$SUBNAM5= <"">
##$SUBNAM6= <"">
##$SUBNAM7= <"">
##$SUBNAM8= <"">
##$SUBNAM9= <"">
##$SW= 369.568048894756
##$SWIBOX= (0..15)
0 1 3 0 0 0 0 0 0 0 0 0 0 0 0 0 
##$SW_h= 29940.119760479
##$TD= 32768
##$TD0= 1
##$TE= 0
##$TE2= 300
##$TE3= 300
##$TEG= 300
##$TL= (0..7)
0 120 53 12 22 120 120 120 
##$TP= (0..7)
150 150 150 150 150 150 150 150 
##$TP07= 0
##$TPNAME0= <>
##$TPNAME1= <>
##$TPNAME2= <>
##$TPNAME3= <>
##$TPNAME4= <>
##$TPNAME5= <>
##$TPNAME6= <>
##$TPNAME7= <>
##$TPOAL= (0..7)
0.5 0.5 0.5 0.5 0.5 0.5 0.5 0.5 
##$TPOFFS= (0..7)
0 0 0 0 0 0 0 0 
##$TUNHIN= 0
##$TUNHOUT= 0
##$TUNXOUT= 0
##$USERA1= <user>
##$USERA2= <user>
##$USERA3= <user>
##$USERA4= <user>
##$USERA5= <user>
##$V9= 5
##$VALIST= <valist>
##$VCLIST= <CCCCCCCCCCCCCCC>
##$VD= 0
##$VDLIST= <DDDDDDDDDDDDDDD>
##$VPLIST= <PPPPPPPPPPPPPPP>
##$VTLIST= <TTTTTTTTTTTTTTT>
##$WBST= 1024
##$WBSW= 4
##$XGAIN= (0..3)
0 0 0 0 
##$XL= 0
##$YL= 0
##$YMAX_a= 61388
##$YMIN_a= -72939
##$ZGOPTNS= <>
##$ZL1= 120
##$ZL2= 120
##$ZL3= 120
##$ZL4= 120
##$ABSF1= 0
##$ABSF2= 0
##$ABSG= 0
##$ABSL= 0
##$ALPHA= 0
##$AQORDER= 0
##$ASSFAC= 0
##$ASSFACI= 0
##$ASSFACX= 0
##$ASSWID= 0
##$AUNMP= <proc_1d>
##$AZFE= 0.1
##$AZFW= 0.5
##$BCFW= 0
##$BC_mod= 2
##$BYTORDP= 0
##$COROFFS= 0
##$CY= -3
##$DATMOD= 1
##$DC= 0
##$DFILT= <>
##$DTYPP= 0
##$F1P= 0
##$F2P= 0
##$FCOR= 1
##$FTSIZE= 65536
##$FT_mod= 6
##$GAMMA= 0
##$GB= 0
##$INTBC= 1
##$INTSCL= 5.30512e-09
##$ISEN= 30
##$LB= 1
##$LEV0= 0
##$LPBIN= 0
##$MAXI= 10000
##$MC2= 0
##$MEAN= 0
##$ME_mod= 0
##$MI= 50
##$NCOEF= 0
##$NC_proc= -3
##$NLEV= 6
##$NOISF1= 182.463
##$NOISF2= 159.3651
##$NSP= 0
##$NTH_PI= 0
##$NZP= 0
##$OFFSET= 182.463
##$PC= 4
##$PHC0= -2861.429
##$PHC1= 0.9989319
##$PH_mod= 1
##$PKNL= yes
##$PPARMOD= 0
##$PSCAL= 0
##$PSIGN= 0
##$REVERSE= no
##$SF= 81.0140089999434
##$SI= 65536
##$SIGF1= 159.3651
##$SIGF2= -187.1042
##$SINO= 113.3802
##$SIOLD= 16384
##$SREGLST= <1H.CDCl3>
##$SSB= 0
##$STSI= 65536
##$STSR= 0
##$SW_p= 29940.119760479
##$SYMM= 0
##$S_DEV= 0
##$TDeff= 32768
##$TDoff= 0
##$TI= <>
##$TILT= no
##$TM1= 0
##$TM2= 0
##$TOPLEV= 0
##$USERP1= <user>
##$USERP2= <user>
##$USERP3= <user>
##$USERP4= <user>
##$USERP5= <user>
##$WDW= 1
##$XDIM= 65536
##$YMAX_p= 453634579
##$YMIN_p= -3689117
$$ End of Bruker specific parameters
$$ ---------------------------------
##NTUPLES= NMR SPECTRUM
##VAR_NAME=  FREQUENCY,     SPECTRUM/REAL,   SPECTRUM/IMAG
##SYMBOL=    X,             R,               I
##VAR_TYPE=  INDEPENDENT,   DEPENDENT,       DEPENDENT
##VAR_FORM=  AFFN,          ASDF,            ASDF
##VAR_DIM=   65536,         65536,           65536
##UNITS=     HZ,            ARBITRARY UNITS, ARBITRARY UNITS
##FACTOR=    0.456856943014862, 1,           1
##FIRST=     14782.0589164792, 0,            0
##LAST=      -15158.0608439998, 0,           0
##MIN=       -15158.0608439998, -3689117,    0
##MAX=       14782.0589164792, 453634579,    0
$$ Real data points
##PAGE= N=1
##DATA TABLE= (X++(R..R)), XYDATA
$$ [...]
43520 -71677 -275960 -296629 -317597 -463950 -635069 -677327 -591399 -497757 -461858 -431696 -342909
43509 -342909 -226776 -174555 -214938 -281546 -309413 -298922 -255280 -148150 411 72832 10592
43498 10592 -55995 27331 190276 222186 91791 -3002 62376 165263 134435 -27065 -195238
43487 -195238 -267552 -179668 76162 355530 424874 240140 45590 68914 226534 276332
43477 276332 171252 87055 136368 220960 187136 17071 -162036 -198723 -46283 181763
43467 181763 299111 228163 73524 -4278 57461 207761 339567 331969 130572 -155677
43457 -155677 -319986 -274661 -121062 29275 172087 285992 257165 63068 -107421 -88957
43447 -88957 10924 -14783 -138071 -159601 -66145 -74679 -281870 -493868 -503759 -368137 -284480
43436 -284480 -316123 -374414 -395524 -391864 -355613 -248983 -117593 -100448 -248014 -393951 -318751
43425 -318751 -41441 161785 82848 -168226 -330461 -331941 -324635 -411360 -499144 -457530 -295601
43414 -295601 -132118 -81924 -193533 -394011 -483740 -317877 -19248 131421 48012 -80120
43404 -80120 -99124 -85198 -145724 -232041 -280536 -351524 -469883 -498430 -347405 -158853 -100410
43393 -100410 -124081 -123105 -165168 -324096 -418580 -218074 153782 315560 128694 -146441 -214837
43382 -214837 -55247 154888 231448 79614 -234875 -494949 -545581 -472542 -440775 -438687 -363713
43371 -363713 -264979 -260462 -281061 -166909 20489 70253 -6074 20142 193727 294209 221589
43360 221589 154799 215662 262888 168345 49157 59315 153011 208113 208445 170896 62355
43349 62355 -88001 -158653 -127405 -128095 -222411 -295036 -266696 -215975 -194974 -135266 -39913 -41139
43337 -41139 -150278 -193492 -128541 -157483 -355792 -473885 -331662 -137637 -141367 -212588 -81903
43326 -81903 198468 367578 371175 330948 238987 40042 -84767 104776 488825 702910
43316 702910 657299 590166 596693 481218 163014 -116390 -146738 -47345 -47977 -167988 -264046
43305 -264046 -251819 -156070 -46056 -3121 -66285 -176944 -263888 -356416 -481374 -507221 -299350
43294 -299350 -1959 90464 -31588 -53376 188988 449531 415856 97905 -264612 -496326
43284 -496326 -547052 -431550 -263362 -212141 -293749 -332600 -238995 -154990 -193024 -222907 -108844
43273 -108844 17393 -37744 -180881 -163896 5184 70167 -60851 -190001 -170710 -116686
43263 -116686 -157189 -203838 -131343 -33186 -90207 -260608 -310056 -151167 30582 46641 -50070
43252 -50070 -94714 -72497 -97032 -169011 -128580 109242 403545 546313 476260 263261 -10799
43241 -10799 -243623 -285777 -92144 137381 142401 -63124 -199429 -97771 89697 130786
43231 130786 24896 -43109 24727 139475 172364 106026 28813 26258 90736 131723 81016
43220 81016 -30257 -128402 -194560 -240008 -218972 -72431 140378 266223 240834 147324 63393
43209 63393 -36948 -176748 -282969 -285228 -229526 -207754 -228023 -229174 -180003 -99055 -13138
43198 -13138 48610 52927 559 -62330 -97429 -101131 -66953 16924 113765 154978 140307 147145
43186 147145 204015 226789 121193 -110342 -383428 -582774 -597860 -413143 -177527 -64911
43176 -64911 -46475 58343 280639 431642 393914 283119 214315 114393 -77662 -225172
43166 -225172 -218107 -211724 -389674 -617137 -606816 -348185 -86799 71694 231013 386123
43156 386123 363151 150101 -6613 39228 123229 58786 -82056 -140842 -141029 -193386 -262560
43145 -262560 -219218 -57055 92729 122802 28069 -120543 -209573 -170343 -89796 -119576 -215595
43134 -215595 -135289 193248 483787 454813 221719 95293 110305 37499 -186548 -348636
43124 -348636 -318391 -246474 -304302 -444889 -541008 -573214 -545130 -381682 -84626 132569 57530
43113 57530 -230121 -445982 -448100 -349251 -303447 -337485 -412320 -502549 -549096 -442969 -153626
43102 -153626 169703 303421 158746 -140122 -375272 -418902 -319842 -226523 -218460 -221860 -119600
43091 -119600 64900 149438 -14111 -366027 -694829 -846972 -844060 -801099 -772860 -706888 -537519
43080 -537519 -298483 -118493 -100066 -218403 -350822 -389799 -314702 -185066 -103827 -161397
43070 -161397 -350007 -534241 -578375 -518002 -521747 -642262 -701480 -516440 -169257 79678
43060 79678 126039 124221 226520 361616 365517 238186 146343 200448 331033 388277 293453
43049 293453 93722 -68470 -46107 175464 418595 461304 273355 49759 -12053 93796
43039 93796 234949 306179 280150 162409 -10257 -154802 -211227 -215326 -229465 -227373 -151252
43028 -151252 -72417 -153240 -399570 -584713 -519435 -295684 -138604 -100361 -61379 13811 23904
43017 23904 -43464 -34947 123008 263014 199426 -1158 -123739 -95671 -8642 85130 195878
43006 195878 228374 20219 -375609 -639142 -549457 -274081 -150439 -272325 -445428 -488047
42996 -488047 -406557 -293272 -218346 -244556 -396328 -557818 -529665 -266907 33514 159247
42986 159247 111743 28050 -35276 -116160 -197787 -192573 -88918 -1187 -32785 -160388 -284338
42975 -284338 -335663 -308980 -241393 -180050 -132106 -53545 54895 69500 -122277 -399065 -461100
42964 -461100 -180832 222334 450683 456540 382713 292005 137941 -54070 -173248 -188521
42954 -188521 -160073 -89379 63021 203237 160778 -23633 -86901 67536 175510 -25338
42944 -25338 -403618 -607419 -516915 -314733 -180566 -134999 -158929 -254150 -355783 -346130 -196757
42933 -196757 5562 165951 211898 73702 -208056 -404742 -329684 -127908 -112389 -300462
42923 -300462 -369481 -142448 148376 221600 129827 87411 112796 83537 12516 8252 29996
42912 29996 -60793 -219242 -227675 -23573 188896 223915 142668 110864 163052 211557 196909
42901 196909 127531 26140 -74020 -109258 -36424 98866 187995 155681 16301 -151753
42891 -151753 -274227 -337082 -383939 -450062 -508383 -504076 -431268 -338446 -260123 -187071 -115595
42880 -115595 -81404 -111978 -172286 -198553 -178777 -159090 -162609 -148829 -89273 -39470 -61492 -95839
42868 -95839 -22362 124195 130889 -109845 -409429 -517857 -460281 -455760 -555254 -588045 -475705
42857 -475705 -358051 -336069 -317467 -232605 -189861 -258163 -284962 -126854 88487 139194 27088
42846 27088 -88892 -159221 -214440 -183447 -18025 78821 -130865 -486231 -543116 -186204 187193
42835 187193 210523 -17444 -207064 -313246 -451662 -577586 -541441 -382043 -298662 -334061
42825 -334061 -298750 -57033 260872 400154 258342 -24245 -213933 -199220 -62737 54806
42815 54806 113307 130042 37606 -250077 -613980 -767123 -610401 -377855 -296068 -273307 -119006
42804 -119006 80975 75850 -135459 -288484 -257927 -201689 -235351 -228465 -65453 105078 70284
42793 70284 -138363 -321832 -398418 -431283 -450065 -436662 -440142 -506242 -514987 -308049 -279
42782 -279 69864 -208730 -532652 -592141 -478134 -478150 -607594 -608216 -367034 -72431 83148 131240
42770 131240 180054 226200 218327 166736 90991 -19459 -110106 -66134 88499 144983 -5247
42759 -5247 -176826 -140609 53536 185510 193539 186681 201677 174808 129103 168057 275161
42748 275161 320250 281880 267458 286329 206568 -5158 -188134 -208665 -118370 -22982 53238
42737 53238 101350 75871 -12068 -79951 -112320 -178582 -268895 -277916 -211028 -224119 -374623 -516093
42725 -516093 -536963 -513481 -511366 -439648 -253966 -111135 -138019 -217174 -197114 -153977 -226843
42714 -226843 -335797 -301958 -140777 -8431 45612 54949 -16666 -161039 -184265 26482 196957
42703 196957 -30042 -529745 -796547 -619252 -288303 -75536 100509 344170 483913 343229
42693 343229 43783 -202625 -390377 -579290 -664541 -551407 -397410 -399943 -461202 -354592
42683 -354592 -143747 -119754 -328248 -467318 -325308 -54436 108831 169399 252190 322341
42673 322341 233864 -17014 -274447 -437317 -527726 -540779 -398760 -126508 72124 45108
42663 45108 -82192 -63623 118711 229064 124116 -43272 -49138 110228 266897 309835
42653 309835 228643 24046 -254885 -441060 -402723 -250722 -214079 -309093 -324981 -168867
42643 -168867 -15586 -23028 -83607 -487 216311 378027 361772 199051 -17667 -193087
42633 -193087 -232054 -101008 110060 249581 225438 49353 -187603 -362369 -416388 -433532
42623 -433532 -535353 -674917 -660490 -438770 -208942 -158840 -230818 -278700 -315999 -432370
42613 -432370 -574288 -614368 -568816 -535867 -468861 -245060 49860 156119 9970 -145838
42603 -145838 -110131 17106 38240 -51581 -118524 -103243 -38698 41765 83735 61 -180979
42592 -180979 -253708 -86195 143337 150361 -58838 -202458 -138757 -46887 -123800 -300240 -390950
42581 -390950 -380511 -390129 -441973 -433980 -331696 -231971 -214705 -253613 -308397 -393951 -499697
42570 -499697 -532983 -426254 -246664 -120797 -84888 -81703 -75500 -83446 -98199 -68953 11706
42559 11706 70273 47014 -13223 -9440 99340 261494 394973 441643 371337 183470 -70255
42548 -70255 -287355 -374122 -320472 -210602 -145513 -149175 -158602 -107899 -4460 87477 112400
42537 112400 44756 -127982 -381267 -601571 -625446 -395563 -65031 115520 40579 -151141
42527 -151141 -243474 -175599 -64388 -21805 -34265 -44774 -62449 -112946 -145135 -95858 -11438
42516 -11438 23708 63257 237859 485499 534459 266916 -69238 -180263 -124048 -173021 -372415
42505 -372415 -502980 -472871 -463148 -599179 -724537 -653442 -463471 -358467 -369698 -378188 -346021
42494 -346021 -335006 -336953 -264983 -114723 10495 46402 21460 -33341 -100863 -102137 45643
42483 45643 254383 293610 76820 -192880 -259671 -106391 96615 247037 365930 439150
42473 439150 380142 188349 2711 -73669 -89708 -105952 -54359 131062 330556 359744 242494
42462 242494 175347 208058 166189 -32124 -186950 -96791 125597 207370 83968 -85476
42452 -85476 -198537 -285843 -340091 -302353 -236673 -293533 -446568 -482669 -338279 -229780 -316912
42441 -316912 -432106 -331258 -73136 65474 -16875 -140805 -122192 13825 123325 134782
42431 134782 110707 168694 344037 509544 481168 240519 -21880 -139945 -153988 -177206
42421 -177206 -192529 -124686 -37911 -84224 -265033 -399417 -356239 -202737 -95723 -119926 -258631
42410 -258631 -439571 -573709 -600437 -520527 -373171 -209956 -110936 -147512 -262137 -270391 -88161
42399 -88161 120519 156045 73732 87473 220872 266107 122599 -24591 40679 279562 474909
42388 474909 490576 355087 170441 37724 17600 79124 125544 128135 179402 349300 545435
42377 545435 596094 437731 152366 -143205 -368418 -471125 -445837 -367975 -332444 -333148 -262267
42366 -262267 -60887 176792 291955 227286 66012 -74409 -142229 -155348 -160017 -196278 -258908
42355 -258908 -283114 -224261 -160147 -221502 -374248 -387184 -132889 170894 190093 -95593 -379568
42344 -379568 -444681 -383651 -347437 -285685 -74363 241188 479180 520559 381044 169169
42334 169169 41013 85029 184740 129258 -78547 -204667 -156671 -135584 -264078 -331028 -158715
42323 -158715 20398 -100441 -365642 -361119 -68681 107037 -35981 -261710 -354936 -411083
42313 -411083 -517865 -506004 -237300 125331 352713 440705 466431 355599 29526 -346951
42303 -346951 -491776 -330928 -53207 113511 92024 -11430 -6469 169180 323892 228235
42293 228235 -47906 -206867 -145240 -61074 -88808 -110630 -40409 2127 -32741 29406 244010
42282 244010 336141 118521 -128856 -42320 247063 295435 -1330 -311403 -382219 -302361
42272 -302361 -240354 -236386 -297624 -433311 -544960 -508221 -389777 -360627 -391121 -290227 -72041
42261 -72041 5203 -151525 -297242 -218524 -34922 37100 19698 72548 199216 266125 238416
42250 238416 205112 197657 149407 45989 -20161 9463 60316 35449 -28488 -6332 113824
42239 113824 174901 68892 -69386 -26665 157175 206602 6029 -218350 -233240 -137411
42229 -137411 -179761 -366312 -474530 -399265 -261045 -176069 -114429 -13479 120718 249742
42219 249742 322112 262836 66835 -116800 -127787 -3478 84971 68712 6507 -78186 -202136
42208 -202136 -290831 -241760 -119472 -91673 -161562 -166381 -64286 -7893 -81176 -171081 -174942
42197 -174942 -143919 -135940 -106952 -43274 -34452 -112388 -170726 -147994 -148553 -271441 -440539 -508309
42185 -508309 -427732 -245881 -37005 94034 68575 -31658 -7502 212715 485843 650222
42175 650222 659954 487851 102811 -353206 -566430 -391493 -56154 114908 62159 -46761
42165 -46761 -86717 -60040 -10762 7980 -54200 -177474 -291235 -397212 -536863 -609109 -440228
42154 -440228 -122810 -26593 -300084 -601792 -553467 -246037 -26333 26959 85555 161393
42144 161393 83965 -140905 -288863 -273599 -266521 -398732 -573764 -638298 -546202 -314498 -8078
42133 -8078 199033 147418 -71930 -186199 -86242 80406 192878 308288 448309 463952
42123 463952 270450 53517 62220 286537 492121 516987 400556 252084 117249 -8905
42113 -8905 -116742 -172533 -162609 -128125 -131539 -178476 -210790 -201729 -197899 -216092 -175758 -26508
42101 -26508 125508 144446 76375 94543 244407 377044 349263 180029 -5230 -98996 -87517
42090 -87517 -78046 -205659 -422413 -465584 -182737 200106 336205 216147 121067 156291 137512
42079 137512 -17649 -108721 3377 155581 172613 154622 250617 348807 260858 74665 34974
42068 34974 139081 133121 -84734 -306853 -324371 -200359 -139037 -208931 -301457 -307909 -251285
42057 -251285 -232980 -276526 -266716 -97100 139669 215502 59406 -123397 -100487 114030 319679
42046 319679 367763 240658 -3719 -236017 -293239 -165416 -75116 -205249 -406017 -366477
42036 -366477 -53057 232696 254789 96891 -44331 -126963 -214419 -306189 -353325 -355675 -329526
42025 -329526 -243260 -88935 28648 -26349 -260226 -525946 -646782 -548874 -324742 -183394
42015 -183394 -254866 -408017 -364666 -58310 238119 251602 68012 -5497 137107 312817
42005 312817 365768 354594 367309 346000 216886 52829 -34335 -60256 -80942 -28944 181000
41994 181000 424174 444213 184088 -134072 -310358 -382743 -461898 -520615 -495225 -471822 -575794
41983 -575794 -725568 -699674 -475279 -323759 -479268 -825748 -1026120 -912645 -645181 -484237
41973 -484237 -494593 -526725 -457028 -360337 -389582 -534076 -611408 -522340 -393090 -379580 -433106
41962 -433106 -396267 -264937 -179228 -164351 -73822 146486 306017 203811 -87992 -304057
41952 -304057 -293600 -131170 47751 195961 314193 355836 254140 47194 -80189 43395
41942 43395 345669 519333 354968 16543 -147940 -52704 39462 -88927 -322489 -429705
41932 -429705 -397897 -377308 -401195 -363022 -229185 -87437 13870 112217 202112 206643 107405
41921 107405 -22238 -137312 -248198 -304168 -198780 43893 220259 176809 -4742 -132259
41911 -132259 -122735 -13910 148485 322159 430076 422432 338086 219764 35525 -204371
41901 -204371 -332269 -201261 45215 80718 -183892 -469663 -505692 -367499 -302792 -358614
41891 -358614 -373944 -272257 -154526 -106350 -102347 -134209 -251989 -405062 -408715 -187851 70691
41880 70691 142730 50241 -18467 4300 17110 -52552 -160823 -249593 -292827 -242597 -76670
41869 -76670 83131 49160 -190804 -436359 -519761 -463511 -354892 -212318 -52325 47504
41859 47504 55115 51962 110682 208164 327469 502821 665794 617510 315091 33524 33730
41848 33730 188564 180156 -19635 -149611 -104807 -64768 -126885 -124363 49334 196452 98009
41837 98009 -143017 -256159 -175338 -47521 36378 96101 90839 -76700 -348122 -478041 -296128
41826 -296128 91517 411077 468376 278603 30726 -59671 63617 238940 270924 160565
41816 160565 64940 45151 -3807 -132308 -200277 -79900 112218 144914 -5310 -124621
41806 -124621 -70226 42028 24484 -128465 -274023 -322939 -283828 -157741 59529 263938
41796 263938 284789 108558 -54068 -21360 122158 153455 17763 -124900 -141174 -75163
41786 -75163 -33544 -38776 -49870 -41836 -11079 27219 8502 -124933 -286409 -278116 -64257 91829
41774 91829 -78776 -472217 -709909 -618147 -416757 -364602 -412203 -362933 -236922 -239332 -395870
41763 -395870 -463377 -287297 -59372 -65409 -290897 -463283 -444939 -387183 -456439 -582702 -587513
41752 -587513 -444830 -278441 -160776 -54433 61139 135804 143714 124196 89439 -13590
41742 -13590 -192678 -340914 -351446 -251220 -151507 -105307 -82185 -47705 12492 122830 278513
41731 278513 378628 300364 73700 -104436 -87463 52568 135599 95382 9643 -49377 -86153
41720 -86153 -103397 -62609 32494 98443 82736 49109 77645 130665 112778 38848 31531 132601
41708 132601 210243 102788 -198852 -545093 -756515 -740202 -541401 -312971 -179064 -106506
41698 -106506 20148 183436 214973 58557 -85106 -15545 164445 185700 5387 -143951
41688 -143951 -112041 -29200 -66062 -171980 -188023 -107661 -78375 -191912 -382645 -506448 -450435
41677 -450435 -215323 39093 92563 -104304 -350539 -428238 -345153 -244124 -160691 -32680
41667 -32680 100921 108548 -15024 -121567 -140132 -154508 -190078 -126357 53131 117011 -107171
41656 -107171 -420068 -492771 -350516 -332103 -554174 -713064 -543625 -221853 -100038 -215857
41646 -215857 -322914 -315014 -330267 -428686 -448871 -288753 -103083 -64885 -97992 -29363 116628
41635 116628 183528 164356 191591 270922 258643 134367 68778 139937 195336 119378 37174
41624 37174 75414 96308 -89014 -356707 -404376 -218387 -115517 -266047 -447848 -405269
41614 -405269 -229162 -192381 -354430 -527096 -549652 -422822 -226440 -66324 -58780 -206717
41604 -206717 -320552 -220978 4507 117337 78019 70585 156850 149980 -58907 -266964 -234702
41593 -234702 -43546 33283 -69655 -159537 -110735 -32236 -69649 -200729 -299351 -300485 -238282
41582 -238282 -182042 -168824 -155658 -46926 164675 315238 238947 9180 -125801 -65438
41572 -65438 34753 27058 -18158 26695 111710 93819 -13948 -39187 107411 304275 356927
41561 356927 200645 -40950 -166258 -88116 57972 49316 -152681 -353538 -398031 -369428
41551 -369428 -409197 -461142 -371211 -167133 -30851 -11942 21561 126443 190826 161454 157814
41540 157814 241984 253879 46105 -234681 -290637 -53192 238444 333355 218004 55760
41530 55760 -26416 -54484 -143534 -323082 -439015 -308084 6610 200889 103831 -77125
41520 -77125 -42293 165762 233753 54887 -120728 -82389 29721 -30350 -222231 -283713 -120666
41509 -120666 69398 76368 -69632 -169940 -88054 128173 289661 213434 -110577 -486030
41499 -486030 -695587 -712210 -660693 -599512 -462274 -224483 13813 170993 284939 393997
41489 393997 438921 383866 313732 281748 181948 -54744 -252158 -212910 -82525 -200401 -576179
41478 -576179 -820939 -692770 -414055 -280099 -230832 -64659 139516 134117 -78317 -254555
41468 -254555 -293643 -315924 -368073 -341431 -224403 -161679 -183485 -128752 54594 170335 79060
41457 79060 -64634 -52983 66886 118390 100951 164487 348657 529963 596311 534983 385795
41446 385795 233007 196860 299353 373815 239607 -57607 -301679 -372178 -322577 -216863
41436 -216863 -48658 150308 266219 238558 147057 95954 77367 17966 -80039 -122010 -55282
41425 -55282 28856 -21569 -226664 -418527 -433312 -322933 -280976 -364915 -417032 -306492 -129105
41414 -129105 -74812 -177082 -288870 -258746 -64093 174970 264279 100435 -175686 -290942
41404 -290942 -172216 -41866 -94206 -234744 -283357 -272260 -331266 -407947 -360902 -249523 -245352
41393 -245352 -288281 -138438 198948 406424 307700 115004 87095 180704 211720 160267 121769
41382 121769 110130 102130 151928 272079 308366 130996 -129838 -239850 -200338 -231184 -429584
41371 -429584 -636432 -672968 -562900 -471935 -520371 -679927 -792733 -711735 -493739 -398123
41361 -398123 -582236 -855716 -890271 -635201 -335154 -140080 66196 365530 564669 445487
41351 445487 119978 -85185 -52756 20657 -45437 -175620 -210463 -167018 -186191 -289935 -342387
41340 -342387 -258706 -127654 -71297 -71112 -21076 90242 152922 95235 -24942 -130445 -242470
41329 -242470 -398944 -502740 -383555 -47041 250136 273202 95923 -15602 7841 -65734
41319 -65734 -401251 -773462 -799782 -450889 -122988 -153464 -440647 -645785 -622010 -483860
41309 -483860 -346222 -192991 -3673 151302 189938 99242 -86340 -303608 -452188 -465655
41299 -465655 -406202 -390257 -406931 -331759 -159017 -79963 -228012 -446205 -447098 -175534 107444
41288 107444 121224 -132994 -403606 -476316 -378114 -289375 -300064 -320942 -246404 -119677 -63658
41277 -63658 -106027 -170421 -203663 -199330 -119349 73784 303471 434833 462002 495788 539124
41266 539124 451952 212442 28978 61050 184316 198089 136220 170155 295077 353339 350284
41255 350284 498095 873118 1224353 1251252 961726 632030 470742 434274 359724 183622
41245 183622 -10178 -119182 -143418 -157068 -189436 -190914 -128317 -55416 -46537 -96642 -129130
41234 -129130 -77812 63167 228139 292425 160480 -110164 -338532 -431979 -488414 -601499
41224 -601499 -658920 -490538 -173383 4060 -79936 -210418 -142993 49866 88790 -114492
41214 -114492 -333116 -325822 -131452 24964 46911 63509 210275 429048 550418 499172
41204 499172 335457 149770 19351 24109 171598 315366 293182 165164 157343 317888
41194 317888 401385 204509 -129823 -292928 -194510 -12907 67259 14699 -102031 -178061
41184 -178061 -111385 83988 225966 154075 -52544 -175556 -144398 -72698 -29372 42952 148752
41173 148752 156909 -9484 -218002 -264560 -107383 109647 228737 215767 140608 60318 -45629
41162 -45629 -190340 -259991 -102726 212012 369920 186902 -103566 -126228 138319 345771
41152 345771 263020 32535 -74473 24954 220829 363293 353288 212064 106644 177007
41142 177007 318910 302661 129679 58524 204839 345725 264497 88671 87633 273453
41132 273453 416996 385272 261831 154890 54453 -99697 -313023 -516956 -605898 -519128
41122 -519128 -328162 -195484 -204609 -284243 -322495 -273426 -136518 43178 121269 -39035 -334994
41111 -334994 -469281 -327132 -130967 -92601 -113784 -24856 71221 -36510 -281085 -391907
41101 -391907 -303723 -208370 -204744 -170066 -24071 115992 120629 9729 -126695 -214846 -181117
41090 -181117 -19384 110675 41426 -129539 -140049 28053 89376 -112511 -369596 -446992
41080 -446992 -414714 -444941 -480394 -352076 -99314 75603 101584 66214 4147 -116717 -222123
41069 -222123 -176022 -23777 22036 -93834 -145805 60842 393187 544042 408019 168790
41059 168790 29764 -18100 -113090 -286556 -411464 -398309 -343864 -388792 -478660 -420307 -197194
41048 -197194 -49029 -125361 -217578 -30192 369027 601035 467491 164910 -38798 -122549
41038 -122549 -195806 -248726 -190745 -38499 97954 170295 206105 206689 147906 56053 -20814
41027 -20814 -91462 -176900 -225350 -180542 -100500 -85464 -112025 -75038 17271 42748 -29043 -92864
41015 -92864 -106935 -165179 -293682 -336572 -161508 144749 399301 523004 504692 313349
41005 313349 17874 -133996 15961 261660 269941 57356 -44202 79126 130185 -125933
40995 -125933 -463764 -502611 -239015 -9312 5061 -32442 58294 185672 144036 -64913
40985 -64913 -203750 -73717 256534 508565 457353 133384 -225599 -403940 -369436 -229826
40975 -229826 -100037 -43214 -77784 -168065 -223410 -167933 -21784 112081 137799 30486 -160796
40964 -160796 -340672 -418141 -369582 -254608 -158744 -129829 -164926 -219591 -219868 -114159 59786
40953 59786 199522 253586 270108 308662 358622 378479 359552 307099 209864 73883 -62041
40942 -62041 -180411 -288402 -330210 -201211 61773 209025 47449 -269182 -388508 -204394
40932 -204394 2491 -80639 -427585 -731491 -748433 -504278 -214226 -74596 -117419 -219110
40922 -219110 -245806 -189654 -138402 -130558 -116389 -79725 -106409 -256507 -422517 -415794 -197961
40911 -197961 52534 134592 29479 -126915 -224935 -259971 -245009 -138999 83354 337157
40901 337157 468956 393134 164865 -57961 -107549 74466 344370 437688 241381 -43257
40891 -43257 -113664 77413 295141 338089 232790 94837 -38672 -165934 -247973 -271491
40881 -271491 -280728 -276570 -198028 -70821 -35285 -135845 -228237 -204818 -154124 -159720 -112605 87393
40869 87393 299255 340182 289925 335928 415813 313570 62952 -62063 30763 142261 132848
40858 132848 81041 23578 -145213 -386497 -435617 -200151 22501 -43456 -240413 -238209 -38115
40847 -38115 72965 -29422 -196502 -307364 -403250 -489765 -442404 -199477 107187 301390
40837 301390 340710 288101 201367 119360 91404 144857 240221 303018 304705 296248 348903 458197
40825 458197 533590 517378 481724 533265 632964 610343 378727 41800 -244746 -417651 -473332
40814 -473332 -406702 -254577 -102672 24585 185161 356717 371475 132434 -193748 -330176
40804 -330176 -183560 112707 372255 458904 302326 -33538 -335671 -430926 -361894 -266440
40794 -266440 -154228 38816 233690 255415 103287 -23081 -10979 33190 4934 -24728
40784 -24728 28395 72252 -32202 -234626 -345748 -296204 -205176 -179662 -168001 -71577 76492
40773 76492 131546 21546 -160586 -270955 -270322 -224979 -194583 -193189 -250676 -417103 -662031
40762 -662031 -837948 -812682 -617093 -420683 -374785 -489687 -626039 -597580 -342649 -15792
40752 -15792 153870 110924 -2084 -78865 -171594 -313822 -369827 -200354 108741 322299
40742 322299 307940 107873 -161379 -357976 -353501 -181235 -77513 -208211 -416796 -427468
40732 -427468 -235588 -75718 -45728 -28819 3509 -92398 -325112 -454257 -338700 -171062
40722 -171062 -178375 -273492 -215728 14091 211795 235702 103766 -120573 -350382 -440080 -320499
40711 -320499 -142144 -111456 -208140 -235292 -127126 -17970 -2942 -24524 -30225 -54778 -86515
40700 -86515 -30584 111985 193002 141728 78895 84826 17682 -261041 -606613 -750877 -671715
40689 -671715 -580381 -566568 -489404 -251894 39552 267396 451847 596598 581029 372638
40679 372638 185803 214728 317952 213892 -65120 -188987 -22524 171844 130798 -46409
40669 -46409 -101783 -6722 64904 38081 -17487 -93815 -267675 -498804 -606057 -512134 -355746
40658 -355746 -277795 -230980 -109974 37576 72572 -11796 -67357 3803 131721 193524 154652
40647 154652 47834 -110816 -302061 -436130 -402568 -209093 -5053 74453 51330 56597
40637 56597 171680 356203 506049 534986 414324 184952 -60206 -229618 -271193 -166950
40627 -166950 51356 255572 276331 89854 -109418 -123344 9524 97165 63729 -9995
40617 -9995 -78645 -182170 -297441 -328011 -280973 -273287 -314419 -280187 -171807 -176946 -351415
40606 -351415 -462948 -326681 -98510 -25801 -82531 -96617 -88382 -190706 -325672 -274636 -51909
40595 -51909 80711 -3719 -159818 -256822 -352848 -502209 -606496 -567063 -426059 -266434
40585 -266434 -109450 17196 43771 -36220 -136269 -200900 -248261 -259420 -155530 71092
40575 71092 316724 484043 532563 423565 168010 -72078 -112363 -3344 22117 -108316
40565 -108316 -209648 -136011 26990 138612 174290 135299 -12407 -198438 -233751 -63696
40555 -63696 123839 156812 87011 35977 8968 -20310 -19699 -19668 -135522 -329932 -359383 -132085
40543 -132085 83927 20028 -210548 -321658 -274368 -225748 -202921 -120212 -24156 -28734 -68336
40532 -68336 1273 102549 31347 -162829 -193877 27468 254828 269235 132803 -6720
40522 -6720 -135312 -279131 -379439 -393342 -386579 -413380 -406858 -283003 -76991 89831 119611
40511 119611 -5639 -196154 -277511 -145208 87377 190290 70055 -171483 -405656 -574145
40501 -574145 -634166 -561385 -424102 -320610 -237515 -105395 23604 29941 -46227 -39379 52421
40490 52421 36970 -144773 -283329 -202632 745 144769 200362 203297 117886 -31999 -61137
40479 -61137 136968 371730 393113 248985 179044 229729 230132 126030 72458 150359 228541
40468 228541 199142 151190 184121 206316 75635 -154541 -282903 -212018 -29458 138444
40458 138444 241585 280065 268842 252099 272519 292902 211378 -5526 -253960 -401224 -426144
40447 -426144 -403313 -378312 -322992 -211084 -76489 25981 79180 99607 100749 81197 34336
40436 34336 -38925 -110578 -121428 -31631 113492 202443 164529 37045 -89750 -172677 -238903
40425 -238903 -315798 -354098 -246158 41285 357182 468435 319911 111421 34729 28387
40415 28387 -65871 -189406 -131953 101158 240662 144933 -78 -5041 20188 -115444 -337201
40404 -337201 -416312 -325403 -239243 -229679 -192224 -75332 22414 17416 -56609 -146164 -248026
40393 -248026 -351647 -414877 -414822 -348316 -206515 -33489 44765 -33114 -139616 -109749 35259
40382 35259 151719 193515 201072 135161 -70396 -315241 -400348 -288753 -110242 68871 256177
40371 256177 334562 138987 -215349 -364831 -170347 91514 144980 79150 114197 221537
40361 221537 219162 106800 51124 92294 91911 -16647 -101373 -13091 201909 334495 241919
40350 241919 18092 -95235 14842 200740 259749 194101 147504 153051 117170 18018 -75429
40339 -75429 -167038 -300901 -365534 -181090 176007 397071 367593 305299 368326 409954 285076
40328 285076 125733 91514 78822 -73382 -280315 -371096 -390524 -478722 -583748 -561490 -457206
40317 -457206 -425513 -452208 -405455 -288182 -193178 -84108 115977 282084 217902 1386
40307 1386 -83136 39846 165622 175936 193943 300469 357459 240581 53197 -21736 49816
40296 49816 166983 226747 179382 52023 -47613 -48981 -35977 -120241 -228783 -206496 -120942
40285 -120942 -219874 -524533 -721637 -600842 -376485 -371151 -545263 -589643 -400288 -197100
40275 -197100 -164240 -215830 -210046 -199857 -303198 -439602 -414812 -258954 -255056 -530318 -807384
40264 -807384 -752717 -452105 -292626 -415831 -568114 -530470 -403190 -338365 -264541 -87363
40254 -87363 49849 -37331 -251132 -327949 -189074 32358 216160 296659 188924 -85624
40244 -85624 -287368 -222530 -46625 -51781 -229968 -332403 -296171 -281377 -304497 -190385 64555
40233 64555 219724 169601 88881 98479 87321 -10703 -59106 6404 21816 -107834 -207972
40222 -207972 -124278 22753 80070 132340 291613 416244 311133 63733 -90370 -130609
40212 -130609 -210576 -325431 -299268 -105104 42612 -29752 -243223 -388537 -350075 -175795
40202 -175795 -5943 45015 -18587 -98275 -130228 -139871 -155882 -159089 -151619 -174243 -206166 -157633
40190 -157633 -19807 95139 128239 163834 272694 392178 438569 408913 306257 122865
40180 122865 -29918 26468 244862 324025 123694 -108568 -111028 18568 64414 86590 253944
40169 253944 447453 403998 183807 124062 325006 519475 495587 341414 202785 86973
40159 86973 4177 43219 183716 249501 166532 76922 97542 163910 221001 356864 594833
40148 594833 738238 608772 315796 120110 124621 242542 368918 423134 306237 832
40138 832 -311280 -388583 -203680 20989 57074 -120102 -352122 -457661 -377920 -210681 -91908
40127 -91908 -34354 56345 184877 195987 -8630 -269842 -321484 -114327 130633 194995 85499
40116 85499 -37322 -64838 -28060 -26866 -113606 -238969 -308248 -296488 -281509 -336677 -428946
40105 -428946 -476923 -479746 -508756 -570196 -557954 -381091 -91141 153860 228002 128887 -29188
40094 -29188 -96761 -9817 145204 229050 228748 267089 392029 459459 341145 173258 214750
40083 214750 457437 581386 385632 80572 -5195 131216 226829 170922 102997 90240
40073 90240 -13733 -268699 -435398 -272536 78232 231804 51054 -208052 -273399 -195393
40063 -195393 -205934 -359464 -466135 -362611 -119038 70189 115057 72060 13390 -37850
40053 -37850 -55325 -17112 7260 -89590 -249193 -244575 1844 244211 234843 91958 101844
40042 101844 238144 191805 -109916 -348061 -289481 -124030 -140087 -301959 -375307 -296813
40032 -296813 -182044 -88725 -4395 9082 -127691 -352573 -525778 -598943 -578384 -414514
40022 -414514 -108447 154165 180262 32010 -74977 -82962 -103672 -167098 -180251 -123908 -76685
40011 -76685 -35109 87898 265275 350569 301771 230144 193215 118185 -23321 -133239 -137277
40000 -137277 -76086 -5880 56330 65631 -21193 -118964 -67805 152198 397041 558935 635920
39989 635920 609813 456719 299095 320924 469262 461402 177806 -164224 -332531 -361864
39979 -361864 -385028 -396276 -358836 -371319 -524148 -709724 -759394 -677016 -579133 -500517 -418823
39968 -418823 -379879 -427367 -474437 -404337 -246620 -114577 -29660 49024 84301 9706 -122640
39957 -122640 -199829 -231046 -322330 -473087 -540588 -433779 -235724 -97321 -73371 -88052 -38919
39946 -38919 57542 36069 -224523 -576311 -709373 -541819 -340862 -340611 -410526 -294882 -44334
39935 -44334 51770 -86490 -217428 -147246 14790 47913 -112167 -386868 -685089 -908548
39925 -908548 -938778 -746394 -465691 -268514 -190653 -145368 -73685 -3595 39796 111720 281937
39914 281937 505727 628226 565998 436826 417818 496731 495965 361488 259328 297928 328162
39903 328162 185331 -8024 -9399 148463 194939 60150 1412 185770 377494 234851
39893 234851 -207870 -560696 -549345 -296883 -107682 -102876 -158726 -149187 -128109 -212122 -347876
39882 -347876 -326474 -70967 204858 235289 33616 -152915 -189443 -192832 -299147 -451727
39872 -451727 -506467 -430697 -290255 -119982 77127 250700 339970 373393 427133 484501 439462
39861 439462 265127 83760 12583 9188 -54724 -205496 -336494 -355721 -285435 -202178 -154366
39850 -154366 -173398 -288505 -456744 -526964 -370357 -47973 225618 300786 221716 129539
39840 129539 95738 77253 -1245 -146433 -269818 -273318 -173352 -95102 -108688 -141439 -123824
39829 -123824 -131404 -247328 -359417 -292524 -121535 -119994 -349665 -533950 -446471 -211104 -65184
39818 -65184 -23118 20570 15856 -155802 -398474 -464879 -300391 -113156 -76997 -139512 -161043
39807 -161043 -95264 14241 100115 91551 -44114 -252303 -440653 -562293 -590626 -474737
39797 -474737 -232130 -29252 -19220 -118615 -93651 132261 397333 533709 542473 517883 523970
39786 523970 571151 608370 533047 321456 140003 187630 418443 563479 453448 188544
39776 188544 -35058 -132630 -133891 -105681 -106982 -120550 -34770 185191 345650 228020 -66541
39765 -66541 -197055 -40959 156248 157006 21389 -89700 -171169 -269003 -302417 -177612 39967
39754 39967 215784 302590 300315 203004 98339 147748 326185 366278 135877 -117924 -113822
39743 -113822 61627 154540 169300 268575 375594 262583 6341 -36632 225523 454449
39733 454449 384879 180498 112011 147448 93521 -41687 -79572 22148 105345 34048 -159160
39722 -159160 -338742 -387931 -286562 -131213 -53357 -89560 -180137 -290971 -428381 -517706
39712 -517706 -418550 -135958 115971 158146 44670 -70126 -137239 -174558 -150051 -49748
39702 -49748 35216 39950 57057 176637 278610 176403 -79960 -244857 -209794 -105102 -61661
39691 -61661 -61282 -61271 -89199 -147711 -170178 -133940 -90884 -43240 63389 171178 103870 -176695
39679 -176695 -460126 -547650 -489209 -441248 -424194 -373236 -315273 -314698 -313031 -199478 -5709
39668 -5709 123976 129271 61785 -46451 -192144 -306352 -309751 -253918 -258090 -313390 -304604 -220273
39656 -220273 -168579 -171542 -127560 -20622 15428 -86906 -211245 -237983 -191659 -122745 -881
39645 -881 159069 210527 62583 -149785 -227465 -161035 -86852 -56120 9228 163698 366372
39634 366372 550902 674580 708087 645172 511072 328967 121524 -38405 -70650 -19163
39624 -19163 -24711 -104793 -97052 79715 251161 220051 56383 -18047 47735 107623 61824
39613 61824 -51395 -177197 -285067 -297742 -144036 98549 247579 226613 130941 73208
39603 73208 54762 2040 -128545 -275899 -290063 -101853 101515 25364 -326229 -582466
39593 -582466 -488229 -244472 -147407 -105946 147256 512493 602160 331255 24216 -109294
39583 -109294 -210123 -374322 -406658 -169235 127142 208472 89399 -59023 -180659 -269123
39573 -269123 -231140 -48214 75016 -46290 -290425 -385375 -259199 -48132 156014 364793
39563 364793 544155 591978 476629 290864 166757 182551 301603 367167 244794 7486
39553 7486 -131227 -100903 -44055 -60870 -74365 -35971 -61454 -225116 -397423 -439624 -400236
39542 -400236 -372854 -329928 -254560 -251079 -339047 -329660 -130951 10808 -152883 -448381 -500384
39531 -500384 -278357 -105831 -171960 -341347 -443753 -462936 -409813 -271874 -142007 -172138
39521 -172138 -344361 -481768 -517726 -553728 -618353 -583696 -387068 -150291 -9793 14236
39511 14236 -61694 -216753 -327318 -227550 40997 203556 80666 -188281 -347573 -330806
39501 -330806 -255408 -208400 -163541 -76480 32528 98950 83266 14182 -43283 -63184 -61966
39490 -61966 -21470 102163 254246 288786 185587 126100 223745 317920 217761 27293 -1541
39479 -1541 144361 248995 211856 122803 20651 -143812 -294982 -272314 -137984 -165318 -426376
39468 -426376 -648901 -605152 -409643 -290711 -277755 -273307 -253461 -228076 -147452 -7114 77725
39457 77725 45803 21628 132005 292183 313177 143911 -108068 -318861 -408596 -341367 -170089
39446 -170089 -22878 28862 28151 24628 12493 10446 64673 115620 19312 -213250 -359312 -281128
39434 -281128 -131743 -134929 -292468 -444003 -490436 -417802 -228406 -9006 49479 -120399
39424 -120399 -306582 -267036 -55550 84055 74132 45203 64701 50276 -29850 -75850 -37776
39413 -37776 -14811 -89823 -186983 -187791 -107012 -56373 -71957 -68111 24959 136643 119516 -66332
39401 -66332 -284868 -376309 -336485 -284615 -288989 -313910 -319644 -302782 -230952 -56368 174841
39390 174841 334875 368607 331196 253466 108113 -49002 -66034 84506 211691 147209
39380 147209 -30473 -129329 -104376 -62034 -79827 -145137 -226638 -302023 -340325 -323788 -259673
39369 -259673 -146303 7218 117108 89678 -21101 -44374 83044 258554 409131 567944
39359 567944 703115 680816 500883 361725 365615 373545 297962 294452 454201 550723 376940
39348 376940 134399 152014 357106 389736 171868 -5271 41471 162917 171040 54393
39338 54393 -152221 -423865 -600847 -473225 -116557 113811 45680 -93596 -59685 53684
39328 53684 34495 -78178 -92883 -17712 -61725 -307122 -580981 -683245 -601570 -454806 -328936
39317 -328936 -240527 -205269 -249286 -337381 -363877 -280514 -188925 -207310 -271734 -217731 -74270
39306 -74270 -82628 -332122 -575488 -567101 -408442 -347941 -393004 -382424 -323821 -345666 -372177
39295 -372177 -188269 150862 304342 121411 -158892 -289779 -322590 -393226 -462326 -453227
39285 -453227 -441438 -506799 -552807 -461869 -307010 -236710 -253647 -264730 -253580 -251746 -227308
39274 -227308 -153004 -112088 -191487 -323995 -364901 -283775 -177638 -139006 -191968 -299286 -364333
39263 -364333 -306018 -195036 -206320 -358664 -436805 -285339 -42765 64195 34980 29785 93123
39252 93123 139344 145713 159778 152970 60139 -54548 -57704 32981 68311 7708 -47409 -77384
39240 -77384 -200826 -444943 -636585 -614862 -420521 -199323 -47584 -24974 -171775 -405609
39230 -405609 -533244 -494186 -477578 -649274 -866839 -854829 -604490 -386023 -358935 -377951
39220 -377951 -250406 -7261 191038 280834 294912 236107 101631 -21551 -36035 6972
39210 6972 -39136 -202372 -353799 -394363 -357987 -302859 -223004 -114860 -20188 52898 145918
39199 145918 228634 176462 -49760 -306947 -442848 -462353 -424455 -296224 -52149 183631
39189 183631 267138 236943 211091 149006 -67295 -342827 -411960 -222493 -48960 -113881 -281665
39178 -281665 -274557 -60252 136150 131901 -48160 -270954 -430871 -480344 -414914 -259356 -44893
39167 -44893 191631 373193 394168 223376 -16166 -126702 -28574 131598 98558 -227508
39157 -227508 -654014 -884103 -850875 -773521 -834816 -918079 -783696 -426765 -95917 28845
39147 28845 23473 56000 156015 201412 71121 -213375 -460186 -444953 -138489 238375 453265
39136 453265 495733 491001 477134 410882 313520 226453 74224 -219524 -502577 -511456 -245610
39125 -245610 -8598 -20745 -186422 -308454 -335484 -303637 -209866 -65176 45371 53973 -16739
39114 -16739 -108165 -164143 -126885 -22021 -9593 -177438 -339374 -274627 -113059 -162105 -358738
39103 -358738 -290326 147465 528191 513358 297283 184092 110766 -65038 -148603 83598
39093 83598 404000 424741 205922 106121 132894 -53704 -490124 -757266 -599890 -285414
39083 -285414 -160538 -175884 -70991 198818 441344 502616 400104 258905 209379 282308
39073 282308 368765 359650 306901 321045 343418 210830 -42708 -159562 -5887 226320 257888
39062 257888 39877 -242670 -382992 -311572 -126326 5513 42878 139026 406663 676472
39052 676472 675064 420366 218979 243296 337442 310956 201551 133725 115839 119418 189763
39041 189763 318781 352656 201453 25326 25883 140852 150390 37236 17211 193906 395691
39030 395691 444279 414003 476408 593412 556405 319472 105786 105961 220360 239802 175772
39019 175772 210494 348088 346611 69569 -286064 -437207 -350753 -201138 -109501 -72926 -69510
39008 -69510 -88322 -104082 -123544 -184030 -224584 -91102 204729 387146 261414 15744 -47711
38997 -47711 42399 25803 -134624 -217101 -140121 -72589 -102128 -98477 4383 69430 22373
38986 22373 9405 143183 300157 324927 258363 208737 155182 44327 -42842 14026 190301
38975 190301 351991 409912 352657 213214 87641 96627 239891 361021 321209 135603
38965 135603 -93409 -270917 -308688 -171359 18539 60204 -72444 -187990 -146776 -27624
38955 -27624 38217 38069 1617 -80454 -165353 -149986 -55896 -50613 -173122 -228080 -95856 45738
38943 45738 -11150 -191430 -290392 -274522 -208142 -39460 273715 541385 529964 307350 131749
38932 131749 55298 -76772 -271034 -348601 -284681 -273118 -379322 -420935 -301844 -185666
38922 -185666 -189611 -170639 -11933 116921 37318 -90129 6811 254856 333751 195320 141331
38911 141331 317759 455034 289893 -2706 -57431 135807 216270 -29009 -372344 -445980
38901 -445980 -174841 187276 354898 254491 29421 -122012 -130240 -102622 -170119 -312812
38891 -312812 -411409 -441669 -486820 -549121 -507643 -319346 -106362 39513 176817 322652
38881 322652 312162 30562 -340161 -508532 -424441 -256232 -112097 -7514 -33011 -278997
38871 -278997 -592923 -670121 -439013 -145648 -9177 115 -13225 -47693 -111483 -131282 -66155
38860 -66155 16666 59234 86521 110506 93278 52031 61057 108206 99877 47664 81762 225819
38848 225819 330288 294255 187954 93980 -287 -89889 -114981 -104008 -163747 -256489 -197551
38837 -197551 35020 209242 173070 62684 47390 87274 99404 148297 285117 386659
38827 386659 347266 266163 264965 285806 246961 220847 266658 263642 111748 -77372 -188854
38816 -188854 -304162 -468226 -483522 -226876 35820 578 -170307 -82548 256173 451456
38806 451456 340565 181659 182467 228719 189998 150909 175345 120531 -119749 -383276 -433808
38795 -433808 -261300 -51920 40178 -13287 -156188 -285801 -306850 -213172 -85997 -3691
38785 -3691 4441 -52407 -111043 -76681 44907 96529 -32575 -221857 -273024 -186180 -114862
38774 -114862 -94148 -11258 158213 279058 259448 174416 146984 220949 369006 522955 592862
38763 592862 547432 456538 377656 269100 117851 46635 133867 224385 117907 -125728 -280788
38752 -280788 -293435 -291853 -299726 -197565 22795 208061 281717 318582 354050 332897 282436
38741 282436 322339 450269 511592 427414 267116 68782 -199590 -457334 -517083 -356334
38731 -356334 -187705 -174981 -255487 -313765 -345561 -367456 -340557 -271563 -230662 -199873 -74259
38720 -74259 117268 181258 44713 -107484 -91911 35602 119459 141557 194758 322961 488211
38709 488211 614945 609889 438640 222237 137860 189349 208924 110303 -20066 -112670 -206626
38698 -206626 -296191 -283811 -172204 -114071 -167289 -181370 -45857 120416 164729 130839 141815
38687 141815 177218 125748 -21242 -163198 -222167 -186308 -78636 47064 135941 196444 264122
38676 264122 297130 224172 102524 75439 145297 160029 73423 36242 151638 317418 409502
38665 409502 456465 516154 524265 396058 181121 20538 25752 231587 547296 737579 624965
38654 624965 350456 238795 351924 405709 225914 36535 121958 407712 590959 552263
38644 552263 432150 380546 406615 438447 412696 334188 298423 386489 516593 515421 358009
38633 358009 192491 107581 52500 11810 42233 82258 -32628 -269975 -355520 -155469 114255
38622 114255 193483 88080 -46489 -117145 -66916 133511 335097 288092 5719 -203583
38612 -203583 -201772 -215613 -388582 -482581 -296627 -66643 -108990 -316197 -362231 -206005 -37408
38601 -37408 98579 260342 337676 182668 -91898 -264455 -334231 -391025 -320244 -5357
38591 -5357 320889 339094 155501 129471 270344 267140 89941 67807 305548 491303 413371
38580 413371 247231 169987 87797 -50807 -38316 236281 511848 511450 344315 280328 312659
38569 312659 235091 36599 -65933 44601 249721 387509 405088 305924 100055 -138019
38559 -138019 -266135 -210832 -72504 -26411 -112403 -184350 -116391 -3189 -46239 -251800 -383030
38548 -383030 -258985 31607 285959 424894 483862 497251 503998 550967 581902 453734 182387
38537 182387 21367 142438 381797 473660 392528 276210 161191 24213 -41641 51333
38527 51333 175851 148248 24399 505 91200 149421 141279 152192 172504 122423 43898
38516 43898 34271 50347 15228 31345 210558 380660 286168 27838 -48069 115325 222626
38505 222626 123113 4337 15811 53654 43168 116004 346480 575142 651597 628930 582875
38494 582875 462452 268121 172244 290579 478885 501746 301602 10173 -203846 -241047
38484 -241047 -133908 -35530 -41997 -43205 112148 349232 450847 367003 226582 81009 -114520
38473 -114520 -291743 -322322 -280495 -360733 -516611 -491849 -250737 -51102 -18987 13673 147344
38462 147344 236815 219441 284286 520861 702518 640907 492600 485087 573517 600124 576258
38451 576258 563603 469903 219733 -24548 -60334 55258 123806 110545 112819 123819 56096
38440 56096 -53042 -62480 64246 220863 305621 291526 193499 79271 73837 245167 501678
38429 501678 673235 674544 554363 427499 385322 425355 457739 426001 393839 445442 560589
38418 560589 693176 890101 1173652 1383883 1343700 1133411 986005 956188 935828 951014
38408 951014 1141783 1437865 1573742 1497973 1477105 1696519 2023752 2271224 2437905 2568761
38398 2568761 2602056 2481008 2235726 1884087 1446946 1093295 1022579 1153862 1193883 1064092
38388 1064092 973761 1012326 996983 831928 694659 723066 817072 894404 1041814 1252908
38378 1252908 1312667 1124808 889598 791477 768782 735105 742825 776314 685216 488004 430640
38367 430640 571007 641022 526159 530147 903201 1435515 1815669 2096555 2478544 2873395
38357 2873395 3016320 2835393 2430891 1860820 1206867 692085 488244 525595 648197 784605
38347 784605 844755 694078 383048 152745 77060 -17398 -160494 -129900 110422 268270
38337 268270 224840 247192 450221 512700 256015 38174 167424 362123 255510 35520
38327 35520 73577 273620 330322 320513 471493 612878 454138 197219 273625 624649 824493
38316 824493 793601 801498 846013 638254 214371 6615 231957 664931 1063015 1386532
38306 1386532 1552417 1394542 969728 579209 416798 436673 534973 600358 470353 138257
38296 138257 -86632 69189 436921 654967 679291 700365 709837 556742 328775 268680
38286 268680 371704 428779 397993 393331 399528 334135 285391 368339 480294 501346 541619
38275 541619 672604 679383 456028 337762 588681 889009 863147 774329 1047750 1407451
38265 1407451 1253212 707382 473515 717544 887474 674217 393457 317828 329491 359914
38255 359914 530398 734902 688842 484355 495160 671488 575290 183512 -32822 67732
38245 67732 112503 -2761 102397 505197 723811 554546 454842 722093 954524 764004
38235 764004 438117 416548 594288 618085 486894 426794 479245 568403 707412 870524
38225 870524 928594 892094 912004 930299 719038 362653 238063 398076 484592 390601 442090
38214 442090 736340 899750 753616 621636 684555 638803 347616 229607 574730 1015075
38204 1015075 1121171 1028175 1027221 1025465 889760 867733 1155116 1440176 1381097 1179772 1192997
38193 1192997 1312316 1229657 1026540 1010206 1202257 1422349 1640292 1846368 1840140 1569991
38183 1569991 1434289 1813013 2499166 2982904 3096823 3009137 2799649 2455703 2132355 2026526
38173 2026526 2081939 2113912 2113788 2176159 2264116 2296478 2346645 2540310 2857276 3182050 3438905
38162 3438905 3600549 3716126 3962802 4489604 5230817 6071374 7088464 8398667 10006426
38153 10006426 12114893 15186512 19299556 24213366 30841415 41310280 55320011 66977363
38145 66977363 68479550 58325831 43612547 32519024 26542230 22127170 17542527 14415413
38137 14415413 13394075 12573599 11093991 10760114 12478952 14172456 14439016 15468192
38129 15468192 19328572 24000494 27565245 34642126 52095907 76575804 92359624 86634765
38121 86634765 64094822 41471849 29319765 24567553 20249026 15502793 13112019 12722273
38113 12722273 11643576 9851040 9507867 10576534 10844105 9831086 9152546 9122404 8291599
38104 8291599 6553639 5608772 5848466 5635119 4338378 3396682 3562077 3659281 3024086
38095 3024086 2724139 3283163 3511144 2766136 2196431 2538342 2792428 2307154 2073254
38086 2073254 2653430 2910068 2173098 1631537 2128106 2591167 2158317 1830628 2431666
38077 2431666 2948437 2566970 2318981 2950301 3229841 2274984 1475410 2054328 2776652
38068 2776652 2272724 1596713 2115041 2841588 2396525 1720327 2202112 2920777 2471517
38059 2471517 1774272 2250337 2940665 2365856 1540424 2076752 2974332 2500494 1615508
38050 1615508 2159233 3225641 2870712 1903584 2306394 3344675 3059564 2209878 2774098
38041 2774098 3927001 3622972 2781239 3581486 5019939 4726916 3753836 4675026 6401183
38032 6401183 6145884 5093792 6404422 8981451 9426167 8855361 11012755 14839677 16351566
38023 16351566 16776415 20585178 26410067 29245535 31046617 38566118 50832790 60944455
38015 60944455 70708349 89044117 114772420 140291079 177516181 254418463 366772060
38008 366772060 453634579 450325985 360439346 250718475 176888137 139201269 111788743
38001 111788743 85777792 68143619 58564507 48811182 37798406 31372166 30006782
37994 30006782 28125350 23932152 20886008 20270011 19506754 17606007 16701546 17994931
37986 17994931 20057171 21414054 22850942 27581463 39041794 55587149 67472656 64398592
37978 64398592 47974433 31437976 24372749 23229904 20271029 15358525 13055239 13276503
37970 13276503 12247306 9991741 9889036 12018987 12961965 11628123 10104501 9131289
37962 9131289 7464173 5479063 5042352 5855333 5818355 4876764 4839488 5635268 5416611
37953 5416611 4228201 3971919 4745862 4702661 3635376 3319711 4073674 4236749 3408907
37944 3408907 3093244 3682414 3777467 3028924 2840371 3649350 4144048 3793904 3671603 4170882
37934 4170882 4308595 3891195 4049278 4994003 5473339 5090787 5013234 5744521 6303315 6276918
37924 6276918 6633814 7763531 8663631 8846795 9235803 10417306 11732600 12806792 14305671
37915 14305671 16490677 18651196 20644360 23430746 27442661 31911198 36278501 40593617
37907 40593617 43956371 44416679 41355683 36481282 31649162 27117857 22665479 18834640
37899 18834640 16050917 13797204 11624186 9895359 8790326 7718638 6430606 5550081
37891 5550081 5322385 5016068 4254456 3736177 3902245 4071060 3661616 3134768 2954145
37882 2954145 2738658 2230398 1990077 2306075 2480422 2039038 1619418 1801090 2062545
37873 2062545 1795380 1396896 1423730 1545686 1292234 1040311 1312079 1788857 1916487 1854580
37863 1854580 1996682 2161966 2053792 1938314 2125610 2334491 2245195 2108993 2187832 2204442
37853 2204442 1952792 1799587 1975976 2067469 1828685 1759813 2190861 2555541 2341119 2026083
37843 2026083 2236751 2654031 2660714 2476288 2699076 3196237 3378627 3204923 3044183 2871132
37833 2871132 2440202 1988208 1955692 2205877 2247779 2062287 2035657 2230771 2375904 2502430
37823 2502430 3034264 4224541 5815935 7153073 7464265 6387403 4502681 2969682
37815 2969682 2337403 2104540 1685850 1232305 1111016 1186427 1171186 1199805 1475075 1738147
37805 1738147 1636451 1291750 1034525 900339 791942 768974 794038 602268 199517 40356
37795 40356 328327 624492 549471 354575 369467 433545 349549 342743 549211 598193 260493
37784 260493 -20823 170082 506467 502495 312949 330233 457660 415153 322043 358239 297892
37773 297892 174 -109346 296969 773264 777093 561228 657787 909495 810235 455989
37763 455989 348785 513719 565177 436506 356586 316569 194839 165827 375711 503670
37753 503670 262526 3424 168538 493136 458431 199122 205156 421725 431118 281158
37743 281158 346637 570821 611877 562695 775192 1135443 1244317 1151478 1189909 1265109 1053126
37732 1053126 734439 766106 1053914 1095228 830051 632723 585423 474152 374469 536335
37722 536335 830634 986872 1163376 1574880 1872702 1750021 1837085 2941880 4563358
37713 4563358 5272057 4578080 3371629 2462286 1772162 1144041 850552 934890 956189 758959
37703 758959 711400 897637 879256 549976 409182 647316 757763 448793 184985 378421
37693 378421 719744 773365 641490 593307 564665 437658 344915 346507 256260 68370 72543
37682 72543 297168 370119 190992 171182 503402 768069 621139 331461 253665 274870
37672 274870 186692 141496 321400 549910 616204 628207 708694 701002 496878 307971 310757
37661 310757 356573 298984 260079 322775 322479 190900 139464 260649 316471 154009 -39563
37650 -39563 -101832 -117308 -86221 176335 587432 722690 467701 269248 436558 673491
37640 673491 655323 593270 795182 1070061 1038499 735563 475388 360001 304607 331661
37630 331661 485088 627626 614957 512985 437577 386001 391850 572280 837055 851544 502875
37619 502875 119666 24025 142124 241439 262072 236227 172156 170927 351711 545916 428200
37608 428200 69055 -57043 239994 609186 753091 802018 888353 850187 638207 546090
37598 546090 717800 847334 677896 399486 259364 181697 60985 24373 115613 123763
37588 123763 -9095 -37910 86725 61812 -159370 -149956 264489 620973 550787 343078
37578 343078 348136 386285 256182 280711 753929 1316421 1499351 1483231 1697591 2034561
37568 2034561 2090878 1876220 1661199 1401084 925423 464862 392905 624675 794016 827042
37558 827042 855259 804483 574380 386277 460086 597194 557800 548303 823188 1130496 1115215
37547 1115215 958407 1032243 1246633 1360770 1594627 2209647 2776872 2655237 2008382 1568275
37537 1568275 1532236 1472414 1228858 1085014 1089736 991655 865993 1052175 1430072 1508146
37527 1508146 1296539 1331438 1712998 1882319 1551827 1131632 971059 850687 543738 277047
37517 277047 272781 334416 241799 142305 236666 438866 617481 841464 1147285 1362422 1358860
37506 1358860 1212823 988731 664094 358983 297504 439253 493571 389647 366607 505049
37496 505049 567261 436930 329692 399766 491824 459236 404493 425626 415300 287620 162367
37485 162367 181735 344836 594651 855254 963662 818427 603550 594926 758486 839438
37475 839438 824620 974892 1393726 1895566 2304650 2563973 2580605 2313914 1980074 1806709
37465 1806709 1648026 1240407 748160 577450 701923 693846 418076 161465 54367 -78131
37455 -78131 -232471 -165872 82446 170087 63916 103920 331932 368851 141173 91345 394833
37444 394833 585037 310249 -91835 -172982 -36420 594 -24422 69530 176266 115858
37434 115858 12272 77124 235224 287263 247923 252795 313745 375856 425701 398899 216286
37423 216286 22684 103163 454118 746809 800682 741345 630864 379944 122571 178787
37413 178787 481066 547229 234236 3592 182136 473824 512906 412815 422330 482935
37403 482935 474382 489032 543741 433600 169151 113045 378486 568270 434391 285155
37393 285155 373219 422403 200489 28656 216095 481473 475722 410865 588681 748516
37383 748516 530587 218879 340263 786003 983934 761087 447835 276895 211847 239425
37373 239425 359951 415210 310041 219887 258455 240009 105962 173670 538091 696388
37363 696388 306065 -144818 -52915 343652 426277 235365 275828 568952 693562 591414
37353 591414 582570 710562 759989 787419 979759 1148838 1016845 815692 946700 1258857
37343 1258857 1330484 1210441 1182426 1106037 765065 528634 802870 1172124 1031438 711563
37333 711563 922714 1453633 1618614 1633639 2183661 2956940 3175946 3284854 4266355 5565702
37323 5565702 6122990 7561849 13141464 22115508 28121675 25850286 17515322 9984275
37315 9984275 6781529 5889963 4649537 3259559 2794787 2745640 2139344 1322399 1111055
37306 1111055 1286313 1174467 888539 903226 1030680 798912 383526 297745 496983 544633
37296 544633 398455 354164 413702 331195 151602 151197 323086 399832 332903 324408 413283
37285 413283 415064 277920 170416 190876 257053 303511 361230 429118 461101 480504 535648
37274 535648 562086 459842 282986 180871 173030 153754 100639 100388 173845 253682 337368
37263 337368 473682 579606 480418 197072 -8534 16919 103819 34897 -127988 -177439
37253 -177439 -96645 -39160 -40263 10728 115305 119895 -23565 -161477 -182200 -159788 -152685
37242 -152685 -59665 169190 352502 305647 121399 16725 4036 -55935 -148256 -110595 66789
37231 66789 199270 202291 201007 279638 328513 243456 111737 81838 166326 276546 355139
37220 355139 376774 296040 96445 -140953 -286825 -278561 -170681 -81602 -77239 -97614 -47267
37209 -47267 35922 15090 -101257 -120028 17135 70940 -136953 -381636 -331834 -60605 66691
37198 66691 -59557 -206249 -228426 -217433 -199942 -71224 97034 55979 -198432 -358781
37188 -358781 -290415 -211856 -229898 -98439 302810 621879 506215 134275 -79692 -82156
37178 -82156 -111673 -205552 -157719 109350 451797 735488 901011 866430 615293 321536
37168 321536 165707 103381 17577 -26406 72048 173983 71962 -144142 -199439 -67588
37158 -67588 15339 -39327 -55163 76190 215507 207123 81880 -35972 -60577 45071 235674
37147 235674 360365 326660 251892 271209 261315 8839 -376423 -521373 -314524 -78549
37137 -78549 -102753 -261392 -267743 -109177 -20743 -126474 -287053 -281847 -44223 270711 421229
37126 421229 325178 169874 195461 381813 477419 349886 154567 99565 184922 261359 234814
37115 234814 118700 -24105 -91873 28518 333474 637057 727573 581021 356749 199522
37105 199522 115093 41147 -30958 -47957 22430 148993 279889 387242 451704 449637 402246
37094 402246 399613 508010 677382 817647 942532 1137442 1397463 1620772 1776433 1952945
37084 1952945 2212259 2521353 2860316 3263861 3719937 4176286 4691997 5421260 6405268
37075 6405268 7578401 9025511 10932966 13093287 14717237 15044990 14053471 12356204
37067 12356204 10536294 8808664 7202247 5754341 4511090 3536327 2908441 2563783
37059 2563783 2235689 1749106 1289093 1149889 1292493 1402731 1333192 1208980 1109153 938495
37049 938495 674926 491938 529385 710384 862622 894735 816111 698034 624328 580837
37039 580837 437310 158542 -52625 10219 271807 518611 715237 928606 1047914 905806
37029 905806 628187 511455 547777 433682 102861 -116366 11806 322392 571317 750585
37019 750585 907186 935654 766498 543576 422579 376513 346574 378740 466065 477728 397009
37008 397009 393404 496066 466735 214158 57605 282792 661981 756258 533670 328525
36998 328525 288595 239589 83795 -22327 37082 140282 133669 43673 -12716 4319 47832
36987 47832 48375 -39368 -172257 -214074 -94437 57061 57130 -76954 -156203 -87336 39338 134296
36975 134296 217821 295246 269834 80614 -151817 -214789 -22434 300244 537328 562538
36965 562538 422173 272258 243614 356930 534936 660874 641601 472405 252488 93413
36955 93413 8066 -67030 -154844 -212048 -209210 -153497 -38258 132263 269274 266035 155427
36944 155427 86078 118354 160671 130904 55733 -12735 -43024 28572 231096 412532 356790
36933 356790 101661 -73906 -57461 -52115 -190545 -268164 -78404 210707 285506 131865
36923 131865 -24076 -92164 -143930 -154994 -33204 131035 141543 27145 14646 144344
36913 144344 190765 32815 -157426 -196089 -126114 -53787 40626 173059 210055 40848 -205433
36902 -205433 -283411 -123363 121468 270020 247526 72800 -169293 -352904 -401655 -362184
36892 -362184 -333609 -337155 -311792 -222038 -102777 -395 60676 43999 -80037 -230366 -212258
36881 -212258 68785 418961 523541 332650 130568 137871 211527 114893 -54880 12177
36871 12177 325844 515162 341118 13600 -151223 -152620 -183105 -268241 -266610 -127774 60152
36860 60152 215969 288896 213715 11697 -140018 -110553 -12594 -29853 -135646 -173387 -131187
36849 -131187 -120212 -148558 -147015 -163975 -285105 -395511 -292719 -32581 118368 103644 157762
36838 157762 391131 581570 516901 304785 177517 178109 201390 188915 127823 -12001 -198557
36827 -198557 -312054 -316780 -331987 -416272 -427775 -245873 2658 112505 90941 97182 162922
36816 162922 163469 46456 -73775 -68504 60062 190955 183049 -773 -209510 -214186 16118
36805 16118 228682 186798 -17686 -85385 104439 372031 486504 404093 245901 145062
36795 145062 138674 141603 29249 -191586 -326694 -202585 89420 265084 169305 -68563
36785 -68563 -212322 -159589 14460 162973 177791 62395 -65313 -88650 -27262 -1011 -50156
36774 -50156 -75954 -1708 93541 87998 10719 8055 114090 170824 45890 -148553 -169609
36763 -169609 38795 265606 307607 201858 92100 -18786 -210182 -397279 -376700 -166894
36753 -166894 -78713 -304435 -605994 -608858 -300097 -8983 63160 46574 100494 144138 22845
36742 22845 -212868 -359353 -321816 -189758 -86470 -56481 -85663 -134735 -153169 -135110 -155369
36731 -155369 -278781 -444318 -518204 -457796 -337268 -209096 -44422 157935 310036 350728
36721 350728 341676 367062 402493 374268 294180 225168 146454 -17540 -229286 -330328 -250425
36710 -250425 -121235 -111954 -225896 -331989 -337835 -251914 -118762 16815 97432 91095 49525
36699 49525 59173 118371 129976 49100 -26835 14026 112583 80483 -144707 -378109 -405808
36688 -405808 -264336 -175938 -223558 -254129 -151112 -23170 4220 26405 192978 409450
36678 409450 442401 280938 151531 174008 246145 289773 341217 336025 101836 -302961 -535060
36667 -535060 -440475 -306038 -393079 -490365 -266064 147492 329618 217827 144978 249278
36657 249278 285842 113601 -34988 43963 176768 103456 -106382 -171271 4948 253949
36647 253949 369404 263615 -9044 -252968 -247177 12357 264075 282024 141644 82379
36637 82379 198074 379771 483761 435157 234394 -13127 -121298 4437 239326 365708
36627 365708 299770 134317 7763 -3995 82353 172332 185034 164506 222247 339843 355612
36616 355612 217073 104170 185318 381048 514291 570967 626203 616776 428430 173543
36606 173543 123307 315213 452772 299828 -723 -136914 -31695 117917 141097 75044
36596 75044 38465 41561 -15871 -195843 -421549 -539278 -476123 -317113 -202361 -162512 -106593
36585 -106593 20343 140846 165093 154608 261784 500638 688604 681736 580510 590219 722756
36574 722756 779237 640110 430984 341292 399653 513247 620123 690025 664083 530486
36564 530486 404715 400666 461831 450823 367593 332838 376525 397235 336749 255807 224093
36553 224093 255773 348095 457235 461957 308734 166475 242705 454530 512319 357696 258601
36542 258601 381354 529193 460575 243068 96608 64565 54849 70625 172922 297955
36532 297955 323150 267247 240164 228618 107650 -139753 -361112 -408110 -280413 -106895
36522 -106895 -51199 -190114 -409271 -476364 -299059 -48652 50597 -21112 -117884 -136783 -81873
36511 -81873 6824 82750 108906 118949 178699 227093 96529 -203708 -386664 -237198 70451
36500 70451 198818 86861 -45196 -51728 3043 30514 25307 -11077 -73992 -81798 41269
36489 41269 212175 270546 205419 154079 186405 239414 259342 260635 241023 175403 102095 94726
36477 94726 142093 153246 71991 -87411 -267013 -350489 -217698 74825 278307 251402 149068
36466 149068 154595 184975 88968 -21841 53239 206113 148606 -97915 -208689 -81080 7936
36455 7936 -133681 -321812 -320055 -179452 -80207 -52024 -25811 2375 9698 18463 21109 -41571
36443 -41571 -154009 -217829 -222744 -259544 -311532 -225920 31979 287593 405996 447743 493291
36432 493291 505539 464510 450591 488635 485033 415192 393477 465177 515464 473097 407345 340720
36420 340720 191098 -1968 -38785 129547 297667 339579 372892 443059 359678 64525
36410 64525 -154360 -103775 -51965 -309604 -689721 -780324 -572931 -396647 -345794 -221055
36400 -221055 -8541 23995 -220835 -487562 -546470 -459901 -359631 -220492 1900 199978
36390 199978 224580 65989 -146515 -254240 -182824 -37999 -36745 -223008 -343802 -182828
36380 -182828 87580 128895 -68383 -203647 -149324 -90404 -145579 -178973 -101466 -65570 -192663
36369 -192663 -336342 -298776 -111096 62445 150473 155792 51865 -143185 -297384 -314809
36359 -314809 -266850 -253948 -238242 -149373 -63897 -116932 -279026 -370606 -294661 -138345 -27524
36348 -27524 31911 130395 311794 489938 522232 369655 153584 23754 6857 32212 52107
36337 52107 55728 18725 -48843 -49385 72700 186384 124963 -35449 -45593 144507 292068
36326 292068 211871 20043 -81017 -75992 -50054 10743 152017 295463 337387 333549 411007
36315 411007 543948 590132 522388 444709 375895 206639 -65995 -227415 -94270 217968
36305 217968 412845 365889 227884 160289 106751 -67246 -292679 -329039 -104058 136200
36295 136200 121768 -99754 -247349 -167441 35045 192406 241260 187593 59818 -58282
36285 -58282 -71722 -1577 34560 3499 2503 82512 151379 119580 24699 -70297 -192329 -369402
36273 -369402 -513446 -505391 -349807 -157188 -13276 64335 88648 96114 140994 237834 339484
36262 339484 402219 417477 354745 161165 -127003 -351738 -377150 -211839 37934 246543
36252 246543 280193 76984 -206936 -275776 -34837 266427 348150 225752 81859 -41072
36242 -41072 -214925 -395085 -451533 -388980 -320099 -249573 -106495 29245 -12065 -174832 -185558
36231 -185558 39773 235778 160884 -80123 -238452 -256584 -214953 -101346 136581 390674
36221 390674 465167 330413 133031 -27774 -170497 -286733 -297156 -190591 -79802 -72242
36211 -72242 -167316 -293194 -360084 -284913 -71124 135055 182407 112931 96269 158550 134026
36200 134026 -65137 -291960 -369017 -312717 -240240 -168675 -41267 126822 259078 317406
36190 317406 286872 137530 -78243 -172320 -16110 264499 434316 432291 360412 272957 184799
36179 184799 223570 498671 813671 804830 442717 109153 50190 49792 -146376 -365319 -280887
36168 -280887 34944 206899 131437 86515 236963 373717 275437 60492 -10142 93247
36158 93247 184502 145842 15587 -156600 -371892 -589801 -704831 -668845 -564670 -502152
36148 -502152 -479820 -408084 -254580 -94623 3704 65483 113871 64945 -156781 -434391 -553284
36137 -553284 -495870 -469641 -586272 -693827 -628185 -454160 -315959 -213463 -102806 -66208
36127 -66208 -164745 -244277 -130310 73437 133898 61862 58508 139819 129513 26775 43254
36116 43254 205471 255905 90964 -7827 211270 561655 665378 451306 177404 57199
36106 57199 74470 120536 139657 135214 129512 121419 68887 -29355 -51000 121857 388101 508566
36094 508566 429243 332333 321721 287082 167936 104332 182385 264986 249084 262391 398243
36083 398243 479390 337385 128382 85778 130530 46416 -97549 -62183 103129 98067 -134851
36072 -134851 -317857 -291063 -216857 -233871 -226971 -96199 20932 -5227 -42348 91201 305978
36061 305978 360768 227479 127609 212601 377084 434691 363382 288455 262947 175145 -60829
36050 -60829 -292183 -257254 43448 274830 183396 -55483 -83518 148805 359057 360082 270861
36039 270861 273290 375618 491205 573136 576561 433594 174552 -27312 -30176 119324 258600
36028 258600 269518 129910 -106002 -323903 -416123 -380193 -300050 -215334 -85107 99011
36018 99011 246008 245509 58497 -273132 -631237 -839530 -780344 -525523 -280274 -177773
36008 -177773 -182108 -175739 -65189 173958 457765 616056 555153 384242 288238 312092 371264
35997 371264 406104 385650 241869 -6207 -137140 14579 226081 113494 -287509 -500801
35987 -500801 -271975 75320 127059 -69707 -192703 -147542 -83643 -55303 18272 107394 63225
35976 63225 -132501 -316591 -367752 -323569 -259620 -186295 -83405 63193 260491 466472
35966 466472 579563 551594 466467 420209 383249 283190 154781 78385 24384 -94739 -245677
35955 -245677 -292127 -186599 -19343 118949 201803 202451 104033 -4018 25717 198546 331397
35944 331397 278227 125707 79337 191409 292636 212979 3074 -135029 -121921 -102166
35934 -102166 -214201 -358251 -325128 -102316 116314 214479 256230 279448 207515 58770
35924 58770 26962 196556 356598 285228 75352 -24120 31500 99569 125049 157694 160718
35913 160718 51934 -92647 -116189 -48072 -50055 -97788 11302 285204 453006 364339 217357
35902 217357 225120 276315 148847 -92416 -168393 -2709 168922 135478 -22708 -87165 -10484
35891 -10484 45866 -34188 -138193 -76708 120775 193759 -8279 -296313 -383537 -267027 -182722
35880 -182722 -220303 -213997 -57996 102586 118133 78913 137831 229680 180559 24504 -16703
35869 -16703 123389 235730 129829 -101405 -215308 -125752 36729 127692 140177 144891 165618
35858 165618 163027 106165 12978 -77530 -148032 -211973 -280989 -312868 -206554 92559 458509
35847 458509 631990 481654 170374 -36292 -86148 -137649 -273339 -398365 -450960 -510488
35837 -510488 -601553 -581114 -369212 -133804 -66613 -103588 -68088 13935 -30257 -212800 -363936
35826 -363936 -391511 -349993 -271563 -140773 -23515 -3750 478 132171 314016 322818 155613
35815 155613 48790 97514 149688 140735 208868 359868 352865 104681 -102511 -39876 133403
35804 133403 202557 265055 452241 562283 362612 46130 -45387 809 -166083 -508080
35794 -508080 -619545 -407758 -239638 -303263 -318093 -88481 103780 -32948 -293499 -295258
35784 -295258 -56023 111491 113485 117085 167490 117808 -57051 -175200 -132765 -44532 -30184
35773 -30184 -45723 -11764 34808 16453 -46236 -63014 -6843 43334 -2087 -122201 -183672
35762 -183672 -92824 70056 140384 81712 -7164 -106512 -322370 -634642 -783317 -577572
35752 -577572 -189506 54785 79433 43523 9409 -105413 -262432 -271972 -93523 78829
35742 78829 128687 188378 362357 489038 376461 132976 38659 147039 219308 59416
35732 59416 -241989 -436062 -389056 -188962 -32931 -33465 -122400 -152534 -79792 13286 63841
35721 63841 88542 75876 -34310 -183795 -161379 118790 420168 446643 231079 67705
35711 67705 95550 162270 116255 20340 -5387 15910 -10366 -87642 -149225 -176415 -200806 -220959
35699 -220959 -184236 -44875 178214 383641 445950 344103 205676 148301 115519 -15314
35689 -15314 -196759 -252930 -172421 -166386 -351617 -548207 -524001 -310579 -124541 -61995 -29023
35678 -29023 62811 168600 181691 61558 -95281 -89663 189597 562027 668658 389048
35668 389048 19396 -105417 -45137 -113326 -383908 -578100 -452608 -95662 215973 300844
35658 300844 165143 -54201 -184687 -156087 -70172 -47551 -36128 81245 217541 138666
35648 138666 -168041 -411726 -393581 -275682 -296127 -401831 -385639 -263263 -251002 -401048
35638 -401048 -507306 -414819 -218952 -79004 -3813 65377 93249 24548 -48514 42514 295504
35627 295504 494835 471234 315028 252980 366550 521536 553722 425469 190822 -86400
35617 -86400 -325626 -430820 -387224 -305778 -287576 -288287 -209924 -86399 -56271 -155984 -261908
35606 -261908 -262816 -183925 -103276 -43885 -885 7674 -21708 -48800 -45030 -25971 -1422 35148
35594 35148 37259 -78317 -280740 -378328 -222351 85816 282384 223078 15511 -120605
35584 -120605 -83957 8107 -62902 -367148 -701680 -791560 -621572 -451256 -455378 -491505 -336559
35573 -336559 -34326 157805 108196 -69775 -214216 -268877 -237946 -147140 -88600 -164994 -330242
35562 -330242 -403401 -304997 -168501 -137871 -160521 -94275 51941 115719 -49 -215368 -385475
35551 -385475 -438403 -386786 -277782 -159866 -51772 69207 202884 255510 114289 -181405
35541 -181405 -429208 -483801 -416996 -383572 -400918 -377550 -307900 -278270 -279919 -198361 -49004
35530 -49004 -37714 -254838 -467689 -413045 -188695 -112399 -234588 -269106 -58620 165109
35520 165109 135348 -52239 -113632 -13158 23340 -108981 -239854 -201877 -76424 -58293
35510 -58293 -185417 -314997 -320680 -219554 -109253 -49319 -34643 -57115 -146969 -323672 -517013
35499 -517013 -583737 -436281 -144436 112333 194889 112736 4572 7628 118522 196089 146909
35488 146909 82161 192449 454596 592303 413661 86183 -55152 79478 261804 277514
35478 277514 173672 116559 134801 126433 65825 69139 226041 449960 553851 446168 210430
35467 210430 6663 -70001 -47958 -41650 -147478 -324436 -385909 -189480 149852 335912
35457 335912 234276 34619 -22331 26017 -37184 -246841 -398265 -368293 -300445 -382476 -577885
35446 -577885 -689632 -609164 -405303 -215446 -127903 -149750 -239086 -361081 -494021 -561867
35436 -561867 -439945 -127887 151164 177700 24514 -57130 -7318 13159 -36526 9561 186535
35425 186535 259760 83925 -147020 -205169 -159881 -174678 -179034 -24822 178734 190076 11753
35414 11753 -139198 -178017 -196034 -201352 -102838 41694 28560 -195266 -451896 -578711 -561481
35403 -561481 -419115 -174746 35975 47910 -97872 -197255 -190397 -215318 -317371 -334795 -154279
35392 -154279 120109 340286 476619 530167 468457 343810 306679 400755 491715 483119 449946
35381 449946 471206 483759 399502 230429 11515 -260379 -526557 -650920 -598806 -500899
35371 -500899 -457583 -415750 -314644 -200703 -110284 3718 129666 141130 -5437 -170228
35361 -170228 -241379 -286641 -364072 -349179 -125754 178859 336374 316898 283916 345015 442306
35350 442306 454710 317972 85157 -88102 -99254 -55755 -137407 -286480 -247357 18505
35340 18505 213323 141019 8609 76496 234331 200344 -18402 -159208 -102799 26960
35330 26960 94900 48400 -146707 -423406 -538960 -340090 -50454 -30280 -282099 -465491
35320 -465491 -391486 -218437 -126372 -80006 -5739 35478 -18769 -90591 -66676 59855 211727
35309 211727 297800 249405 100190 17208 110689 233588 148154 -110670 -240376 -73911
35299 -73911 218601 391284 400060 332295 222102 52835 -152886 -331154 -409208 -329464 -133864
35288 -133864 -9019 -106357 -315965 -382511 -266557 -210384 -390018 -674304 -811362 -709692
35278 -709692 -456457 -195858 -71812 -156076 -333727 -368061 -172739 67211 116999 -53362
35268 -53362 -296145 -471042 -530886 -498483 -426533 -345215 -241398 -138563 -146242 -312682 -477518
35257 -477518 -438137 -234786 -75045 5146 156007 364674 382122 114789 -170514 -199769
35247 -199769 -38625 85890 113552 105590 44141 -102499 -235534 -248713 -197731 -174831 -131379
35236 -131379 -8229 80853 6860 -135805 -166074 -101204 -77192 -67940 56494 237128 268132
35225 268132 141741 91140 234773 403480 400892 248833 87394 -18267 -92671 -190854
35215 -190854 -373987 -632038 -813426 -767249 -563799 -408625 -324148 -124830 233789 510078
35205 510078 504324 332267 211003 147062 36613 -63755 -9923 150857 212803 123210 57503
35194 57503 151779 331930 453719 463113 368135 195338 37630 8539 70547 40241 -140494
35183 -140494 -270600 -154781 116040 309479 376988 433176 475152 373496 159064 65245
35173 65245 190104 333347 306012 212954 248924 366785 364273 201708 8744 -164117 -363335
35162 -363335 -518487 -456941 -183438 61677 104637 33632 14568 69154 132905 194854 261758
35151 261758 282884 220909 127213 60892 1464 -83019 -152296 -154363 -107171 -51246 22588 138609
35139 138609 278954 400255 454335 384858 195973 32435 58919 223824 295252 197747
35129 197747 146911 337484 650229 816930 756294 585695 397223 199814 28307 -58783
35119 -58783 -76843 -91944 -124915 -168697 -242438 -326595 -317238 -166731 -490 40695 12073
35108 12073 73241 233239 335631 269573 64786 -189593 -391298 -429101 -279037 -74041
35098 -74041 35351 44590 13605 -81775 -251256 -333076 -159753 150567 293981 180630 25141
35087 25141 11140 72201 67458 -4990 -54127 -26530 71912 186401 223471 150907 76524 112213
35075 112213 200556 223977 222570 301676 380557 289999 94656 22719 62866 -35916 -298129
35064 -298129 -418301 -263722 -118717 -210860 -332160 -218420 -9422 13732 -87942 -72260
35054 -72260 20579 -22468 -131501 -44241 187527 223123 4193 -124740 18406 161914
35044 161914 39575 -201565 -291693 -253468 -249207 -234146 -77166 107011 65615 -196455 -404249
35033 -404249 -395224 -272007 -150466 6406 222433 376162 362550 255031 181404 136482
35023 136482 50193 -28298 26279 189650 250384 65861 -227137 -347427 -193077 46513
35013 46513 117452 -19561 -182824 -206269 -106567 -1444 59804 114993 180290 221788 245890
35002 245890 319889 445179 487322 329567 64256 -76025 8029 168014 203383 94283
34992 94283 -20408 -41411 -5494 839 -46240 -98742 -102856 -53380 11120 63787 128405 232449
34980 232449 320686 272452 48792 -211521 -300533 -146687 118017 291055 275676 134753
34970 134753 -1328 -69977 -117805 -205306 -302428 -328748 -280371 -238680 -242480 -238425 -192067 -158492
34958 -158492 -184404 -219736 -199877 -150958 -137023 -156578 -164635 -151439 -140600 -160496 -252655 -417901
34946 -417901 -518569 -385543 -111503 -54725 -382346 -776861 -829333 -589716 -436306 -483110
34936 -483110 -463491 -213424 76466 189611 166917 128448 74992 24703 107853 338320 494573
34925 494573 426232 298022 319200 400769 328844 149065 102909 242807 372864 362531 285268
34914 285268 221070 128171 -28668 -181349 -261907 -294621 -326906 -343962 -294747 -159667 15493
34903 15493 121409 53395 -169041 -388700 -471834 -434097 -354448 -246412 -100798 28521
34893 28521 95605 148468 223628 229478 82046 -103599 -128077 17416 164155 239181 336429
34882 336429 490961 571200 474712 289238 167747 144143 154840 163641 184951 230288 288044
34871 288044 326309 296472 180110 37931 -53575 -121437 -265714 -477530 -575221 -395651
34861 -395651 -11685 304895 336200 106070 -179375 -350675 -410076 -448841 -485978 -463966
34851 -463966 -384727 -336614 -356715 -380885 -381976 -425447 -500704 -446635 -194402 45298 38933
34840 38933 -113462 -112584 86872 211300 81814 -154324 -288362 -324149 -355915 -352810 -240219
34829 -240219 -89671 -55927 -163483 -281330 -291915 -195871 -67797 18888 36286 23671 48552
34818 48552 114209 143050 87221 3732 -38825 -83902 -231925 -464656 -606782 -508556 -228016
34807 -228016 25389 121796 122600 142424 184042 192699 206743 311230 454996 478948 361565
34796 361565 266014 271859 240730 67444 -113847 -145245 -113604 -195633 -353935 -416579 -369986
34785 -369986 -327774 -273041 -98336 123685 183799 65974 -26687 -9961 -19338 -111375 -136392
34774 -136392 -29451 14276 -172675 -439805 -496619 -282186 -13426 81685 -13515 -116665
34764 -116665 -46158 164573 292465 228069 148835 244738 393648 344978 135625 27343
34754 27343 76120 100478 81080 220926 531945 721938 620021 390113 196858 -4032
34744 -4032 -201892 -222487 -79115 -80036 -347358 -554281 -402031 -56907 154607 192232 170990
34733 170990 88927 -8205 117824 539680 912133 899215 612825 339357 127002 -41218
34723 -41218 -11090 218607 279259 -23196 -282383 -84684 314719 440093 377358 509623
34713 509623 792218 948176 1091446 1457902 1812744 1880400 2048053 2806609 3856477 4738994
34703 4738994 5908252 7955373 10354890 12831648 17573135 27191894 39445333 46718145
34695 46718145 43234812 31542098 19652034 12676372 9550301 7224278 4919462 3439587
34687 3439587 2787889 2241072 1667472 1374227 1211338 812297 313362 84958 94135 112542
34677 112542 195711 438955 609249 496548 300685 249528 191148 -22495 -140125 39090
34667 39090 199092 190 -296273 -241399 45857 113281 -47981 -55717 162929 305141
34657 305141 275250 285347 363675 271006 -26502 -245763 -232691 -134167 -60806 43506 130928
34646 130928 40111 -140579 -82730 261571 500587 350965 38999 -56910 90362 235909
34636 235909 249681 203100 195516 267236 395036 468379 376994 186586 81849 83483 18686
34625 18686 -148100 -188058 46624 363400 494800 441780 357870 255764 57436 -177841
34615 -177841 -303945 -301431 -254488 -187656 -105072 -105788 -253853 -403249 -373963 -249408 -253545
34604 -253545 -356538 -282907 37940 300026 227121 -56189 -216236 -126958 60677 160842
34594 160842 113358 -30803 -152699 -142188 -42794 -64488 -326111 -627905 -631588 -273597 139316
34583 139316 289460 188138 87469 142373 263306 275438 129006 -68963 -175416 -126661
34573 -126661 44283 262570 458286 564569 512763 286780 -5642 -170538 -95653 121563
34563 121563 253284 157252 -106981 -367842 -505200 -514858 -454216 -361533 -224365 -17437
34553 -17437 224952 395593 418097 357874 361155 460529 515998 402862 188860 38824 -11816
34542 -11816 -83087 -258753 -468409 -581004 -540631 -391153 -235989 -190175 -294531 -443544
34532 -443544 -465338 -311798 -112838 -11932 -17330 -61727 -132790 -257310 -390369 -416102 -283402
34521 -283402 -91983 -2020 -56529 -123807 -59013 85170 98205 -87413 -242729 -121941
34511 -121941 177577 321965 187866 -15539 -107426 -170964 -302341 -354606 -155084 159847
34501 159847 272768 99103 -131016 -186147 -56647 122881 214345 139569 -57193 -207737
34491 -207737 -194344 -103022 -91867 -162828 -207366 -213907 -247709 -276905 -232573 -209167 -357440
34480 -357440 -572580 -559854 -269378 2680 47069 11003 85809 176394 100715 -66057 -93623
34469 -93623 59076 218552 258644 209573 142756 88600 40395 -53943 -246013 -460998 -518973
34458 -518973 -364779 -149276 10985 186343 412021 510397 347226 100973 21340 46572
34448 46572 -55155 -257279 -306979 -152367 -14789 -10841 -9481 67878 95229 -614 -86311
34437 -86311 -62883 -43995 -143970 -268070 -269077 -171304 -95690 -74746 -61048 -18342 87896
34426 87896 278215 457345 456103 263912 83248 59926 107026 99499 75378 102680 108012
34415 108012 15747 -72106 -23513 101876 165629 185572 256768 325457 265902 124129 52566
34404 52566 38282 -56275 -190971 -158827 55521 205405 180647 212079 487464 774660 689858
34393 689858 234313 -204045 -359508 -343372 -344355 -320356 -142766 111910 224000 135692 5283
34382 5283 -53100 -106450 -216907 -284195 -201736 -52707 9015 -1626 44295 144562 181363
34371 181363 174200 282638 500121 584123 416761 219054 228395 351829 369751 329745 440698
34360 440698 646112 633494 312719 -7440 -43222 91231 97584 -85532 -263544 -293603
34350 -293603 -221138 -131063 -27112 94427 151935 41630 -216720 -447392 -474752 -318034
34340 -318034 -183371 -221897 -342002 -332021 -131029 122729 294807 378096 392448 300608 109084
34329 109084 -44756 -23284 121750 177534 -5307 -355780 -647236 -702039 -545140 -356644
34319 -356644 -255204 -163465 46160 308614 396541 216538 -54279 -191817 -170053 -98801
34309 -98801 -33870 21824 14950 -100222 -238091 -271777 -235287 -276897 -397566 -411672 -239298
34298 -239298 -75319 -132610 -323131 -362627 -159689 59590 41726 -205660 -473558 -604605
34288 -604605 -600921 -531556 -430637 -295381 -125298 60134 220529 308681 307571 248874 169862
34277 169862 62269 -99694 -285801 -409968 -412309 -302145 -119026 88478 227621 186256
34267 186256 -36428 -268586 -319476 -186586 -39023 5437 8759 89263 236201 310366 211941
34256 211941 -2515 -180207 -224036 -170831 -128815 -156524 -214843 -229628 -178180 -105249 -71893
34245 -71893 -102826 -170778 -214788 -177171 -35691 187260 423867 558881 475723 174682 -160918
34234 -160918 -297182 -179713 24907 139015 152129 153167 176190 199069 235677 325154 445276
34223 445276 518568 502590 419021 309333 213146 164262 153966 128329 68627 20127 -16764
34212 -16764 -137616 -372438 -562085 -554871 -466189 -536421 -735578 -746166 -423754 -64412 -52526
34201 -52526 -374529 -661605 -651127 -435230 -260882 -236188 -289586 -327739 -344949 -377331 -405359
34190 -405359 -360986 -239488 -134987 -108309 -86195 8561 85400 -1246 -183987 -217079 -27536
34179 -27536 154662 119468 -34162 -75242 21175 81271 -2933 -177239 -337405 -389271 -254612
34168 -254612 17759 187534 52415 -263902 -430216 -322867 -134822 -40574 24523 140052
34158 140052 165794 -58620 -391203 -504103 -315617 -97145 -90719 -195674 -156625 57586
34148 57586 230862 218097 116777 82335 109642 85826 -31402 -193463 -359442 -500707
34138 -500707 -542513 -428807 -246034 -161691 -215920 -281668 -258155 -185238 -117213 -9054 177686
34127 177686 346430 353309 181842 -46170 -193995 -190888 -57076 79450 56175 -147266
34117 -147266 -355371 -399902 -323099 -290496 -356125 -423293 -408076 -330044 -240253 -148050 -38029
34106 -38029 84436 165230 114628 -91325 -305763 -317596 -126855 11350 -75953 -229109
34096 -229109 -199811 -29440 28623 -103334 -257225 -322263 -368803 -425293 -370786 -156648 53918
34085 53918 97591 20773 -43407 -78999 -131655 -156013 -80965 24396 6098 -150268 -270197
34074 -270197 -203327 -15730 78968 -42147 -283113 -453261 -483870 -456923 -426651 -333358 -162572
34063 -162572 -60855 -144397 -278451 -236935 -41896 63129 -24631 -153126 -200690 -244138
34053 -244138 -350484 -413496 -333186 -187397 -84508 1435 103771 122979 -15370 -189811
34043 -189811 -252984 -264039 -354237 -448357 -342506 -26260 279328 406046 381887 280706
34033 280706 105375 -127697 -318537 -363012 -240383 -13566 198174 278452 230945 198371
34023 198371 268667 320328 193228 -37790 -132579 -20982 106864 75158 -71674 -189687
34013 -189687 -220823 -186906 -113369 -40496 -31709 -98550 -164542 -147119 -43712 69056 84101
34002 84101 -55041 -251293 -282152 -43351 273173 378334 231807 36660 -73723 -136465
33992 -136465 -151033 -26791 185430 259184 128419 35650 163250 314595 197409 -119256
33982 -119256 -297707 -204458 -24437 74772 130756 199184 213048 124555 15151 -43364 -107886
33971 -107886 -232556 -313133 -187510 135685 433750 465249 191786 -178852 -371849 -297129
33961 -297129 -111362 -3889 18370 52049 76284 -24459 -217864 -288589 -122200 120284
33951 120284 214998 146837 50975 -19224 -120673 -270339 -408625 -496072 -532239 -497440 -389802
33940 -389802 -302639 -339664 -456865 -517893 -507281 -535379 -607572 -573835 -392951 -262337 -329631
33929 -329631 -423146 -280720 41709 234587 186362 109355 155568 163569 -52754 -353060 -426637
33918 -426637 -209493 57576 151390 68966 -72194 -153690 -65766 213880 492267 482477 151612
33907 151612 -186026 -232738 -47912 97093 87676 16221 -61914 -205463 -405410 -522211
33897 -522211 -486630 -422565 -466649 -564318 -556071 -401233 -205110 -63962 6722 10148 -47725
33886 -47725 -97968 -40882 114647 225817 190479 85906 60994 128451 147500 13457 -202042
33875 -202042 -326155 -270941 -125752 -65132 -154009 -250560 -158352 97825 231747 25226
33865 25226 -361963 -555947 -430603 -230999 -187020 -198985 -54505 193020 284835 137354
33855 137354 -66812 -178508 -251226 -340909 -344357 -182038 2071 1657 -158892 -252003 -138704
33844 -138704 102113 317611 419711 378632 213123 22914 -79672 -116092 -222124 -429589
33834 -429589 -566671 -461695 -174661 77443 185562 224752 271450 271457 152703 -18463 -100520
33823 -100520 -73260 -63284 -147241 -231167 -203937 -133178 -176994 -320950 -357391 -173323 84180
33812 84180 224908 271505 358099 473970 498948 444534 436868 447024 278471 -84859 -341692
33801 -341692 -254670 -6244 32026 -215797 -488077 -565490 -468161 -292074 -83865 77521
33791 77521 84035 -34122 -114918 -115750 -178097 -340571 -389844 -174755 96844 111028 -99586
33780 -99586 -211432 -81181 106058 189470 262913 429465 543419 390844 10097 -353540
33770 -353540 -553920 -636442 -651673 -553015 -328405 -107518 -41487 -112956 -137380 30914 318788
33759 318788 492342 412311 200344 94056 152048 198221 86496 -89812 -138935 -40156
33749 -40156 44553 -7877 -161847 -312674 -386995 -346288 -194993 -19342 60851 18597 -55417
33738 -55417 -74948 -46315 -12086 33344 136335 326448 577634 787295 802659 543060 118106
33727 118106 -239372 -386512 -369482 -305647 -244477 -174065 -89134 -213 80057 130543 151170
33716 151170 211331 388312 621365 711936 535172 199416 -55891 -81364 80116 240328
33706 240328 197677 -78658 -365870 -404861 -233853 -144510 -238908 -247966 40634 382181 377150
33695 377150 43861 -237933 -306851 -376842 -556173 -584594 -258893 153333 207556 -147733
33685 -147733 -546996 -677566 -542514 -289404 -13663 212834 288952 166765 -73000 -283815
33675 -283815 -370013 -340554 -287727 -312879 -439920 -603742 -731617 -799648 -798268 -713017 -581280
33664 -581280 -492304 -466121 -403138 -231812 -36653 55217 50360 40431 34682 -22452 -97269 -80585
33652 -80585 36727 138817 163330 180184 247655 301229 249561 100907 -62389 -170946 -188027
33641 -188027 -113140 -16567 -9285 -124332 -272242 -353257 -362194 -339379 -276269 -141738 21760
33630 21760 102206 43231 -64327 -58067 102639 243576 147477 -165525 -427245 -457418 -402002
33619 -402002 -502956 -713278 -736519 -439303 -26179 238892 306762 273850 211951 164378
33609 164378 163297 145137 -13978 -272005 -383016 -225795 -22291 -47692 -246618 -350598
33599 -350598 -285051 -214182 -221121 -203078 -109840 -45172 -55634 -28302 90287 148151 2763
33588 2763 -242063 -365615 -323456 -270371 -325135 -437615 -491088 -440525 -328585 -231805 -219492
33577 -219492 -317355 -466154 -532012 -411159 -153635 50904 66420 -21434 -1888 189118
33567 189118 383146 397656 238152 22586 -179786 -327846 -333394 -161077 52638 130440
33557 130440 70697 2446 -21277 -29716 5977 119351 183732 25023 -287874 -485818 -461035
33546 -461035 -356676 -258508 -73379 181979 256666 17928 -302359 -425783 -393623 -386946
33536 -386946 -373791 -223920 -37140 -31267 -161407 -168970 -6037 99567 53095 66279 296683
33525 296683 561409 591308 405437 243622 224323 251186 222404 168273 149168 126944 13118
33514 13118 -186585 -347660 -377769 -347122 -393605 -506003 -504822 -281878 36343 233277 226738
33503 226738 78905 -115089 -246743 -208095 -27643 86676 -9704 -182369 -203250 -73050
33493 -73050 35916 90016 202490 354110 381808 291558 307888 499071 600956 388739
33483 388739 38236 -85781 109399 375747 447428 280610 19944 -143311 -110477 26018
33473 26018 52627 -123325 -348668 -407638 -266719 -63920 72932 105332 43861 -67424
33463 -67424 -157775 -198893 -236579 -299823 -335620 -295775 -217700 -141204 -19786 185294 384803
33452 384803 449377 378231 271775 170617 41610 -89655 -119580 -8237 150505 232866
33442 232866 192177 42130 -189071 -437934 -593963 -584553 -471001 -399634 -425693 -433950 -305176
33431 -305176 -134221 -154151 -398467 -585823 -474141 -211838 -133805 -271512 -321870 -121223
33421 -121223 122992 182777 146627 221023 373229 394487 224376 8466 -121516 -155726
33411 -155726 -124896 -61637 -30717 -76097 -147042 -169764 -163524 -194006 -245513 -230715 -102188
33400 -102188 110246 327920 440823 380053 232107 171328 207023 146611 -76168 -214431
33390 -214431 -42578 267420 348926 133270 -113152 -195029 -170565 -137984 -102925 -100064 -211589
33379 -211589 -392195 -469093 -383198 -254191 -152386 -332 218886 348362 271443 84805
33369 84805 -66078 -190006 -350219 -468072 -388923 -109927 183528 313494 268196 161120
33359 161120 85097 36898 -16375 -33280 69646 267838 406834 393033 314072 286551 289590
33348 289590 263044 253849 307185 321665 208435 101011 178664 353787 392104 293974 265368
33337 265368 322648 249157 -1888 -176596 -99845 91243 212814 269969 293742 205542 16535
33326 16535 -67049 75714 284857 368909 358525 349395 296266 152305 26174 -76 -40868
33315 -40868 -197439 -343331 -322520 -203197 -125685 -54084 98990 248664 274307 249035 296864
33304 296864 343510 251652 91432 26946 31008 -40793 -181708 -278390 -328832 -380549 -367703
33293 -367703 -264736 -261884 -479424 -644211 -427490 -12571 103732 -146008 -312409 -145804
33283 -145804 59679 -3506 -201278 -270653 -240578 -259555 -272020 -161816 -22090 -112 -21322
33272 -21322 66620 197084 202322 142553 231394 446770 488941 199886 -181314 -308238 -154805
33261 -154805 -12298 -87926 -237810 -172647 132708 371470 294540 46001 -21722 196545
33251 196545 454982 509797 412449 387105 529340 710684 733504 529469 222346 2087
33241 2087 -70076 -89796 -130706 -140542 -80864 -42493 -97333 -150284 -91152 16575 69348 117884
33229 117884 213364 196053 -76466 -390578 -402962 -158730 -23898 -105299 -128755 43676
33219 43676 176175 81405 -77019 -89252 -5724 43365 68081 98620 104902 160712 394959
33208 394959 683459 777393 873368 1543023 2781673 3631647 3251712 2008108 974017
33199 974017 622851 586897 497485 400322 357456 243588 60217 -695 76840 70782 -97555
33188 -97555 -256477 -298736 -268122 -127082 182630 435672 309046 -65285 -178474 112536
33178 112536 368272 251352 -24771 -152123 -188693 -263889 -225165 49566 302050 248328
33168 248328 43756 15157 133296 140257 34519 15387 48541 -87224 -340297 -377515 -98238
33157 -98238 186401 204503 77442 67839 168930 128935 -182842 -562747 -656254 -351634 46091
33146 46091 136881 -74465 -184976 20394 234478 88362 -276460 -420078 -256220 -116615
33136 -116615 -196760 -322744 -331733 -322707 -387408 -403099 -287474 -210316 -330104 -507306 -502675
33125 -502675 -321523 -151964 -80810 -83170 -190847 -433405 -666291 -693295 -547986 -434446
33115 -434446 -386121 -225245 81346 277710 179529 -19136 -15564 146280 147399 -104079 -311488
33104 -311488 -218288 30197 133212 82992 113288 258181 260273 2144 -232871 -130019
33094 -130019 194487 347989 199692 2337 -19502 68700 142090 253177 459008 593136
33084 593136 445686 94387 -160562 -169359 -45100 97823 307210 620882 905697 999675
33074 999675 919197 806322 730653 651455 537426 419686 334913 292611 289383 293139 235872
33063 235872 95470 -35141 -43440 49835 123898 139773 181522 295771 404256 427553 390398
33052 390398 330308 201998 -18254 -205169 -193539 9164 231182 342286 344473 275951
33042 275951 158993 58594 53369 94353 17954 -220764 -437654 -447141 -313177 -246371 -308578
33031 -308578 -365023 -316289 -232698 -224382 -293915 -373839 -424386 -433838 -389541 -310575 -256637 -246385
33019 -246385 -215546 -115215 -1756 39649 10485 -45184 -145020 -307751 -423961 -352019 -163588
33008 -163588 -115484 -294824 -462047 -388769 -203748 -194867 -362549 -432670 -302749 -192847
32998 -192847 -266438 -360893 -267239 -74591 -4119 -30427 61477 278912 350714 117394 -216620
32987 -216620 -342403 -230479 -120748 -180748 -295678 -229245 58524 322772 307329 66514
32977 66514 -98733 -39784 62686 7558 -122056 -150165 -152950 -333991 -623055 -719262 -555809
32966 -555809 -402298 -416959 -415146 -241141 -65981 -78908 -141212 -43394 94520 22244 -174768
32955 -174768 -183842 11578 100830 -30898 -123792 -5057 111112 -16056 -265385 -373785
32945 -373785 -346614 -369658 -431935 -335021 -59219 151240 137869 59248 155027 402836 542285
32934 542285 397638 76469 -154945 -137875 45368 168101 74148 -185361 -409296 -435355
32924 -435355 -278033 -90543 -8022 -47947 -160066 -322235 -528885 -703318 -712897 -516876
32914 -516876 -239766 -42074 36211 49608 26440 -35876 -97704 -112945 -127135 -222716 -352401
32903 -352401 -346862 -136809 131687 267039 238639 148214 68378 -3864 -76033 -131091 -161214
32892 -161214 -169969 -144210 -69911 22542 60926 -10955 -176826 -338353 -379928 -286615 -187782
32881 -187782 -221620 -357465 -431463 -368924 -271755 -249490 -274952 -276832 -263970 -250447 -154556
32870 -154556 80317 322730 377526 260308 184924 258499 352060 332708 269008 296647 396377
32859 396377 445748 426682 432372 480479 459700 301613 103148 12247 50574 116032 130738
32848 130738 120055 142809 194081 206323 135233 26741 -9938 93422 279546 398387 345076
32837 345076 164251 1410 -43801 6185 65743 73371 6964 -132525 -302533 -412870 -395880
32826 -395880 -278777 -146116 -44104 29099 55991 -1898 -127003 -236261 -272942 -249077
32816 -249077 -179927 -56865 73690 91800 -56617 -261927 -379394 -411707 -470144 -587514
32806 -587514 -678870 -681303 -622222 -531194 -389068 -205955 -58992 6187 42053 105593 157962
32795 157962 131011 52193 18757 57385 86617 38492 -37378 -32153 76352 175545 138418
32784 138418 -20407 -150835 -148744 -82510 -82731 -148262 -160969 -86379 -35039 -78509 -123840 -65366
32772 -65366 28205 2516 -152284 -284445 -281277 -179950 -83245 -66962 -166332 -340398 -441195
32761 -441195 -344828 -147560 -102500 -296954 -512281 -494455 -259818 -22143 92437 116545
32751 116545 86916 -15886 -169166 -286922 -330261 -340369 -340688 -306628 -257584 -268429 -337250
32740 -337250 -342388 -207406 -31485 30749 -37629 -134512 -209627 -309617 -454294 -567751 -572876
32729 -572876 -494265 -419817 -390239 -370205 -318141 -239835 -155016 -45013 114525 265774 278987
32718 278987 106506 -109638 -162381 -11533 177571 231699 129746 -43995 -200975 -249145
32708 -249145 -96493 237997 568029 702760 648534 561008 521660 472759 376078 308536 337385
32697 337385 388145 327686 148791 -2660 12085 181821 369364 443784 372589 210615
32687 210615 39757 -72171 -95841 -68649 -78913 -164833 -237164 -178947 -36056 -13317 -224343
32676 -224343 -527060 -689520 -654034 -539854 -438580 -332973 -205834 -107284 -88299 -149587
32666 -149587 -271208 -422976 -544812 -589426 -578633 -546483 -457444 -281078 -110039 -60735
32656 -60735 -72437 20405 199283 247563 95386 -31807 52366 195428 136178 -92382 -216230
32645 -216230 -117572 43534 103704 91958 103427 134178 117025 26226 -108687 -229057 -266909
32634 -266909 -210655 -160750 -237804 -420812 -558799 -559082 -478975 -409431 -358742 -294564 -226986
32623 -226986 -194844 -209753 -245927 -254690 -185074 -40537 79644 54238 -129244 -358889 -506015
32612 -506015 -500108 -331215 -72094 114554 104617 -31203 -98192 -23447 73647 77262 14651
32601 14651 -51030 -139811 -279418 -408160 -448875 -413897 -362255 -318436 -293864 -307121 -319648
32590 -319648 -248436 -116434 -75875 -184317 -284098 -238851 -162252 -228406 -360082 -337271 -161707
32579 -161707 -56620 -97466 -102435 41565 183171 155839 24980 -57419 -79838 -91530 -35446
32568 -35446 147827 335967 337868 155480 -30319 -111702 -134224 -134283 -64646 74426 164185
32557 164185 104285 -51296 -153691 -116714 11952 106846 87140 10591 23457 174582 319972
32546 319972 285168 88130 -93124 -154716 -161909 -210046 -299913 -375298 -393257 -332902 -215227
32535 -215227 -127488 -143335 -216047 -249035 -261571 -345196 -448143 -383907 -117856 133657 194336
$$ [...]
##END NTUPLES=NMR SPECTRUM
##END=
