##TITLE=31Pdec_1MTBDP2212
 CDCl3, 24 sc
 23.12.2022
##JCAMPDX= 6.0         $$ Bruker NMR JCAMP-DX V2.0
##DATA TYPE= NMR SPECTRUM
##DATA CLASS= NTUPLES
##ORIGIN= UXNMR, Bruker Analytische Messtechnik GmbH
##OWNER= root
$$ XWIN-NMR		Version 3.5
$$ Fri Dec 23 14:19:27 2022 Russian Standard Time (UT+4h)  she@DPX200
##.OBSERVE FREQUENCY= 81.013821
##.OBSERVE NUCLEUS= ^31P
##.ACQUISITION MODE= SIMULTANEOUS
##.ACQUISITION SCHEME= undefined
##.AVERAGES= 24
##.DIGITISER RES= 16
##SPECTROMETER/DATA SYSTEM= spect
##.PULSE SEQUENCE= zgpg30
##.SOLVENT NAME= DMSO
##.SHIFT REFERENCE= (INTERNAL, DMSO, 0, 248.564)
##AUDIT TRAIL= $$ (NUMBER, WHEN, WHO, WHERE, WHAT)
$$ ##TITLE= Audit trail, XWIN-NMR		Version 3.5
$$ ##JCAMPDX= 5.01
$$ ##ORIGIN= Bruker BioSpin GmbH
$$ ##OWNER= she
$$ F:/spectra/data/she/nmr/P31/1/pdata/1/auditp.txt
$$ ##AUDIT TRAIL=  $$ (NUMBER, WHEN, WHO, WHERE, WHAT)
(   1,<2022-12-23 14:18:35.32 +0400>,<she>,<DPX200>,
      <created by zg, POWCHK disabled, PULCHK disabled
       configuration hash MD5:
       00 E9 B6 7A A2 85 ED C7 34 08 36 98 17 FE 4E 26
       data hash MD5: 32K
       A3 DE 5F 3E 34 89 20 A9 7D FE 70 51 C2 FE B5 84>)
(   2,<2022-12-23 14:18:39.76 +0400>,<she>,<DPX200>,
      <Start of raw data processing
       efp BC_mod = 2 LB = 1 FT_mod = 6 PKNL = 1 PHC0 = -10851.75 PHC1 = 661.0566 SI = 64K 
       data hash MD5: 64K
       94 34 11 02 28 98 29 8A 6D B9 7C CF 5F 15 78 DE>)
(   3,<2022-12-23 14:18:51.09 +0400>,<she>,<DPX200>,
      <pk PHC0 = -4.112005 PHC1 = 0 
       data hash MD5: 64K
       AD 30 9B 4E 91 53 FD 4E 7A 03 BD 9A 57 D4 C1 74>)
(   4,<2022-12-23 14:18:54.25 +0400>,<she>,<DPX200>,
      <abs ABSG = 5 
       data hash MD5: 64K
       22 C8 42 2F A1 4D 43 8B 7F 40 3F 01 8D 51 E7 AB>)
$$ ##END=
$$ 
$$ hash MD5
$$ C5 72 36 82 C8 12 B3 FD D6 27 EF 6B 7A 04 8D CA
##$RELAX= 
##$RELAX= 
##$RELAX= 
##$RELAX= 
##$RELAX= 
##$RELAX= 
##$RELAX= 
##$RELAX= 
##$RELAX= 
$$ Bruker specific parameters
$$ --------------------------
##$DU= <F:/spectra>
##$EXPNO= 1
##$NAME= <P31>
##$PROCNO= 1
##$TYPE= <nmr>
##$USER= <she>
##$AMP= (0..31)
100 100 100 100 100 100 100 100 100 100 100 100 100 100 100 100 100 100 
100 100 100 100 100 100 100 100 100 100 100 100 100 100 
##$AQSEQ= 0
##$AQ_mod= 1
##$AUNM= <au_zg>
##$AUTOPOS= <>
##$BF1= 81.014009
##$BF2= 200.13
##$BF3= 200.13
##$BF4= 200.13
##$BF5= 200.13
##$BF6= 200.13
##$BF7= 200.13
##$BF8= 200.13
##$BYTORDA= 1
##$CFDGTYP= 0
##$CFRGTYP= 5
##$CHEMSTR= <none>
##$CNST= (0..31)
1 1 145 1 1 1 1 1 1 1 1 1 1 1 1 1 1 1 1 1 1 1 1 1 1 1 1 1 1 1 1 1 
##$CPDPRG= <waltz16>
##$CPDPRG1= <>
##$CPDPRG2= <waltz16>
##$CPDPRG3= <>
##$CPDPRG4= <mlev>
##$CPDPRG5= <mlev>
##$CPDPRG6= <mlev>
##$CPDPRG7= <mlev>
##$CPDPRG8= <mlev>
##$CPDPRGB= <>
##$CPDPRGT= <>
##$D= (0..31)
0 1 0 0 0 0 0 0 0 0 0 0.03 2e-05 3e-06 0 0 0 0 0 0 0 0 0 0 0 0 0 0 0 0 
0 0 
##$DATE= 1671790714
##$DBL= (0..7)
120 120 120 11 120 120 24 19 
##$DBP= (0..7)
150 150 150 150 150 150 150 150 
##$DBP07= 0
##$DBPNAM0= <>
##$DBPNAM1= <>
$$ [...]
##$SUBNAM3= <"">
##$SUBNAM4= <"">
##$SUBNAM5= <"">
##$SUBNAM6= <"">
##$SUBNAM7= <"">
##$SUBNAM8= <"">
##$SUBNAM9= <"">
##$SW= 501.771253377433
##$SWIBOX= (0..15)
0 1 3 0 0 0 0 0 0 0 0 0 0 0 0 0 
##$SW_h= 40650.406504065
##$TD= 32768
##$TD0= 1
##$TE= 0
##$TE2= 300
##$TE3= 300
##$TEG= 300
##$TL= (0..7)
0 120 53 12 22 120 120 120 
##$TP= (0..7)
150 150 150 150 150 150 150 150 
##$TP07= 0
##$TPNAME0= <>
##$TPNAME1= <>
##$TPNAME2= <>
##$TPNAME3= <>
##$TPNAME4= <>
##$TPNAME5= <>
##$TPNAME6= <>
##$TPNAME7= <>
##$TPOAL= (0..7)
0.5 0.5 0.5 0.5 0.5 0.5 0.5 0.5 
##$TPOFFS= (0..7)
0 0 0 0 0 0 0 0 
##$TUNHIN= 0
##$TUNHOUT= 0
##$TUNXOUT= 0
##$USERA1= <user>
##$USERA2= <user>
##$USERA3= <user>
##$USERA4= <user>
##$USERA5= <user>
##$V9= 5
##$VALIST= <valist>
##$VCLIST= <CCCCCCCCCCCCCCC>
##$VD= 0
##$VDLIST= <DDDDDDDDDDDDDDD>
##$VPLIST= <PPPPPPPPPPPPPPP>
##$VTLIST= <TTTTTTTTTTTTTTT>
##$WBST= 1024
##$WBSW= 4
##$XGAIN= (0..3)
0 0 0 0 
##$XL= 0
##$YL= 0
##$YMAX_a= 7612
##$YMIN_a= -8137
##$ZGOPTNS= <>
##$ZL1= 120
##$ZL2= 120
##$ZL3= 120
##$ZL4= 120
##$ABSF1= 248.5645
##$ABSF2= -253.2056
##$ABSG= 5
##$ABSL= 3
##$ALPHA= 0
##$AQORDER= 0
##$ASSFAC= 0
##$ASSFACI= 0
##$ASSFACX= 0
##$ASSWID= 0
##$AUNMP= <proc_1d>
##$AZFE= 0.1
##$AZFW= 0.5
##$BCFW= 0
##$BC_mod= 2
##$BYTORDP= 0
##$COROFFS= 0
##$CY= -3
##$DATMOD= 1
##$DC= 0
##$DFILT= <>
##$DTYPP= 0
##$F1P= 0
##$F2P= 0
##$FCOR= 1
##$FTSIZE= 65536
##$FT_mod= 6
##$GAMMA= 0
##$GB= 0
##$INTBC= 1
##$INTSCL= 6.047779e-11
##$ISEN= 30
##$LB= 1
##$LEV0= 0
##$LPBIN= 0
##$MAXI= 10000
##$MC2= 0
##$MEAN= 0
##$ME_mod= 0
##$MI= 50
##$NCOEF= 0
##$NC_proc= -7
##$NLEV= 6
##$NOISF1= 182.463
##$NOISF2= 159.3651
##$NSP= 0
##$NTH_PI= 0
##$NZP= 0
##$OFFSET= 248.5645
##$PC= 4
##$PHC0= -10855.86
##$PHC1= 661.0566
##$PH_mod= 1
##$PKNL= yes
##$PPARMOD= 0
##$PSCAL= 0
##$PSIGN= 0
##$REVERSE= no
##$SF= 81.0140089999694
##$SI= 65536
##$SIGF1= 159.3651
##$SIGF2= -187.1042
##$SINO= 113.3802
##$SIOLD= 16384
##$SREGLST= <1H.CDCl3>
##$SSB= 0
##$STSI= 65536
##$STSR= 0
##$SW_p= 40650.406504065
##$SYMM= 0
##$S_DEV= 0
##$TDeff= 32768
##$TDoff= 0
##$TI= <>
##$TILT= no
##$TM1= 0
##$TM2= 0
##$TOPLEV= 0
##$USERP1= <user>
##$USERP2= <user>
##$USERP3= <user>
##$USERP4= <user>
##$USERP5= <user>
##$WDW= 1
##$XDIM= 65536
##$YMAX_p= 433719027
##$YMIN_p= -41763777
$$ End of Bruker specific parameters
$$ ---------------------------------
##NTUPLES= NMR SPECTRUM
##VAR_NAME=  FREQUENCY,     SPECTRUM/REAL,   SPECTRUM/IMAG
##SYMBOL=    X,             R,               I
##VAR_TYPE=  INDEPENDENT,   DEPENDENT,       DEPENDENT
##VAR_FORM=  AFFN,          ASDF,            ASDF
##VAR_DIM=   65536,         65536,           65536
##UNITS=     HZ,            ARBITRARY UNITS, ARBITRARY UNITS
##FACTOR=    0.620285442955139, 1,           1
##FIRST=     20137.2065510682, 0,            0
##LAST=      -20513.1999529968, 0,           0
##MIN=       -20513.1999529968, -41763777,   0
##MAX=       20137.2065510682, 433719027,    0
$$ Real data points
##PAGE= N=1
##DATA TABLE= (X++(R..R)), XYDATA
$$ [...]
40286h50582k733969j80156J988441K175167J049287l32101j022812j47125J544886
40277A491036J572043o50578j893702L88953L431061K641746j460743l946346
40269A573470k705486n92149P1174N74294J915284K073305k33709k370342j401382
40260a095541J413848K661841J571947j2485j053115j832042j931928n64565J256952
40251D14912J315757p29762k641222k346724j61133J923231K219886O07743j407230
40242h04542j933893n15405J499068K587687K395144J298068j91929j133274o23716
40233B577208P05592J033003n8481r23816o69134o19743j614437k046935o64562
40224b281305P42548R8421j242843o57999J157870J277617m79915j360501l77652
$$ y = [-850582, -3584551, -3764707, -1776266, 398901, 1448188, 1116087, 93275, -53850, 1491036, 3063079, 2412501, 518799, 907752, 4338813, 6980559, 5519816, 1573470, -1132016, -1724165, -1652991, -1078697, 836587, 2909892, 2676183, 305841, -1095541, 318307, 2980148, 4552095, 4539610, 3486495, 1654453, -277475, -842040, 414912, 1730669, 1000907, -1640315, -3987039, -4148172, -2224941, -5055, 602688, -804542, -2738435, -3253840, -1754772, 832915, 3228059, 4526127, 4334198, 3200924, 2577208, 3282800, 4315803, 4257322, 3333506, 2664372, 2044629, 430192, -1616743, -2281305, -1538757, -1440336, -2683179, -3341178, -2183308, -905691, -1385606, -2746107, -3123759]
40215c123759N08975L38564N42485J436168J049345r10146j496471P00360K405949
40206A451470M07116l040961l266999j37991K012215R88841o38971k34500J031199
40197a428581P81096n48220o73209P65882J736511R24562n76261j118710o49993
40188g86923j87996q1989J06668L93797K21496l97884o34208j08547M89854N44502
40178d41230L71209L07393n1571p55934o68356Q59796K258587J468745r28745
40169B419894k201325j166317M28366O14457m23446j313247j310622m41266Q00701
40160b592805J272477J54284j294463p03854J790653K902812O45484k495779k913547
40151c234738q14879P60485P39716P71331J470098J161976q00765k223662j140301
$$ y = [-3123759, -2614784, -2276220, -1733735, -297567, 751778, -158368, -1654839, -954479, 1451470, 1858586, -1182375, -4449374, -4587365, -2575150, -1586309, -2225280, -2459780, -1428581, -647485, -1195705, -1868914, -1103032, 633479, 1558041, 981780, -136930, -786923, -974919, -1056908, -950240, -556443, -334947, -732831, -1367039, -1475586, -985732, -441230, -70021, 237372, 185801, -570133, -1238489, -378693, 1879894, 3348639, 2419894, 218569, -947748, -519382, 95075, -328371, -1641618, -2952240, -3393506, -2592805, -1320328, -1166044, -2460507, -3164361, -1373708, 1529104, 2174588, -321191, -3234738, -4049617, -3289132, -2549416, -1778085, -307987, 853989, 53224, -2170438, -3310739]
40142c310739J178590J980367O02451j206437j699039o02431J097183J751401
40134b08654K64728k130262k327569Q36627M150304L563180l10621k822641j631692
40125f16600M94123L85737r25469o74717Q29133J109849N923l37447L51687O59
40115F22878j566949j632650P44433K515930J296193q26377q72675L43538M23498
40106A047819p0289P51996J676876J43661k525503k571286l11916L2594k234532
40097d060580k634542O70313K968974N27527k803305j496984K653068L348421
40089h27108k45413k531053m46551K337169J749906p63414j261993Q25090K623920
40080A460553J973839m96963k596555k542448m40336J509347J259180k73978j60782
$$ y = [-3310739, -2132149, -151782, 450669, -755768, -2454807, -3057238, -1960055, -208654, 56074, -2074188, -4401757, -3565130, 585174, 4148354, 3837733, 1015092, -616600, -122477, 263260, -662209, -1336926, -507793, 602056, 607979, 270532, 622219, 622878, -944071, -2576721, -1832288, 683642, 1979835, 1153458, 280783, 624321, 1047819, 977530, 1729526, 3406402, 3550063, 1024560, -1546726, -1858642, -1826048, -4060580, -6695122, -6024809, -3055835, -2528308, -5331613, -6828597, -4175529, -827108, -1072521, -3603574, -4050125, -1712956, 36950, -726464, -1988457, -1163367, 1460553, 3434392, 2937429, 340874, -2201574, -2641910, -1132563, 126617, -147361, -308143]
40071c08143K212210L715498J712411j983646l378908j541134O42707P48399l27621
40062A491773m91117K81738K94252r74981k026619j658472o94160m34146m54392
40053d666124M74362J799970J577732k91784j372682k50809J230321R12457k78629
40044h65186j32530R53041O68503j136025k006204q03188O32835O32331J75228
40035a881195Q36545K025542J936334K43186j572487k030155q14390J292068K788182
40026B823630K327023J06930j905706j868259n7186J496387J275579j58895r48383
40017C091120j92842Q78130N20416r18577j247851K49723J337928n72k334396
40008A383079k728117r03278R35149J765700K421438K714175J054418k255996
$$ y = [-308143, 1904067, 5619565, 7331976, 5348330, 1969422, 428288, 1070995, 1819394, 1491773, 1000656, 1282394, 1576646, 601665, -1424954, -3083426, -3777586, -4211732, -4666124, -4191762, -2391792, -814060, -1105844, -2478526, -2729335, -1499014, -586557, -865186, -997716, -44675, 623828, -512197, -2518401, -3321589, -2688754, -2056423, -1881195, -1044650, 980892, 2917226, 3160412, 1587925, -442230, -1256620, 35448, 2823630, 5150653, 5257583, 3351877, 1483618, 1426432, 2922819, 4198398, 4039503, 3091120, 2898278, 3776408, 4296824, 3378247, 2130396, 2380119, 3718047, 3717475, 1383079, -1345038, -2248316, -1313167, 452533, 2873971, 5588146, 6642564, 4386568]
40000D386568m216355k994089l23406J313027J741641J872299J541392L97084
39992C718161p65739j276738j651547j916200p87692J710668K943158J297803
39984C271874q60863o64527O58551O4142j824001j611408R21781K106103K76663
39975B338315j667874j122608L66002K82739p57447p53498O3702K45925J79886
39966h24858J109613K091538J062696j333909k100797n08480N56655r17551k732025
39957c597118j617027J914497M168295L104636M94393q26157k12388P67511N19746
39948D716388r06473j898415r89537J151652J976520J42312k345525k505521l82006
39939a040605J268089J142450Q10981J427685J675941M07791j036420j134981
$$ y = [4386568, 170213, -2823876, -3147282, -1834255, -92614, 1779685, 3321077, 3718161, 2952422, 1675684, 24137, -1892063, -2679755, -969087, 1974071, 3271874, 2411011, 1746484, 2405035, 2469177, 645176, -966232, -44451, 2061652, 2338315, 670441, -452167, -86165, 196574, -560873, -1314371, -1250669, -1004744, -824858, 284755, 2376293, 3438989, 2105080, 4283, -504197, 52458, -865093, -3597118, -5214145, -3299648, 868647, 3973283, 4467676, 3641519, 3429131, 4196642, 4716388, 3809915, 1911500, 921963, 2073615, 4050135, 4192447, 1846922, -658599, -1040605, 227484, 1369934, 2180915, 3608600, 5284541, 5692332, 4655912, 3520931]
39931C520931q40362j615175k473421j616324K36666R35435L81530Q5136L7491
39922a348093q86929j921588j133412R20536J601879M77565j29494P33992J421624
39913b63920J176923J204398J372938j99453k857877k885851N17473K770719M21205
39904A256555l435053l787317q08466J527009J575346Q08049K23250j60773M53526
39895b347874K287080L056454R17705j846089j720280N65472J369523Q9780m85142
39886A886629M95938O81649q65281j862183q30452M70818J22291j099553j358454
39877b358598k67381J241542J982779J054794j140514k525435j692227n4597L53362
39868c406275J85124J174027K369806J546885l68836l80444J301045J476988l00447
$$ y = [3520931, 2680569, 1065394, -1408027, -3024351, -2787685, -1852250, -1470720, -1385584, -1348093, -2235022, -4156610, -5290022, -4369486, -2767607, -2290042, -2419536, -1685544, -263920, 913003, 2117401, 3490339, 3290886, 433009, -2452842, -1935369, 835350, 1256555, -2178498, -5965815, -6774281, -5247272, -3671926, -2863877, -2640627, -2801400, -2347874, -60794, 2995660, 3913365, 2067276, 346996, 912468, 2281991, 2371771, 1886629, 2382567, 3064216, 2198935, 336752, -493700, -22882, 99409, -1000144, -2358598, -2625979, -1384437, 598342, 1653136, 512622, -2012813, -3705040, -3759637, -3406275, -3221151, -2047124, 322682, 1869567, 1500731, 1120287, 2421332, 3898320, 3597873]
39859C597873r63909K64030L50782j624961k188628K65853J845212n55302l584005
39850b593055k525289J197133K529746O62610o19264N20049J770839J124341l76563
39841A690547j046871p98068j85326N72106R56438K78426j004646j440579n03243
39832a481216N96401L61621j218978k444752j491092J279306K936520J219109
39824b43081k053423k796715j21633K448713J992796k19603j488745j384188q15877
39815d681756J28015J171879Q87446q30375j391013P34771K861582J731062j355154
39806g43543k402200n66196J319662J423749P35532L20715j42746p42276p50067
39797a547370p7551N71203J030997J525233J598102Q91963K82788M27975J97856
$$ y = [3597873, 2633964, 2897994, 3248776, 1623815, -564813, -298960, 1546252, 990950, -2593055, -5118344, -3921211, -1391465, -728855, -1348119, -828070, 942769, 2067110, 1690547, 643676, -154392, -339718, 232388, 1188826, 1467252, 462606, -977973, -1481216, -884815, -523194, -1742172, -4186924, -5678016, -4398710, -1462190, -243081, -2296504, -5093219, -5214852, -2766139, -773343, -992946, -2481691, -3865879, -4681756, -4553741, -3381862, -2494416, -3324791, -4715804, -3981033, -1119451, 611611, -743543, -3145743, -3711939, -2392277, -968528, -232996, 87719, -55027, -797303, -1547370, -1624921, -1053718, -22721, 1502512, 3100614, 3992577, 4275365, 4703340, 4901196]
39788D901196j340893k611947j760123J7039L26392l63312P6003J125737M97929
39779H68021j113936n76453K014676K700599n8647k648815j788145Q62596J901496
39770B161392R83998o4103m87408n04813O9178Q96567N33155j266079k396388
39761g4501j444653k2621J1498k57386J041965K785963K258288l98642k085149
39752A814762j153432N61624O74931o84928j635170j188668j57494K78746K43077
39743a246552R42265K626305L487735J711365j685460l635948k812111r23119
39735a535520J96257Q04599J608715J922417J059316k5076k84845n18592j844587
39726A382684l238320k679057k58732J772117J904564P36954m23400q81539n23867
$$ y = [4901196, 3560303, 948356, -811767, -794728, -468336, -831648, -755645, 370092, 868021, -245915, -822368, 1192308, 3892907, 3834260, 1185445, -602700, 259896, 2161392, 3145390, 3081287, 2593879, 2089066, 2158244, 3054811, 3587966, 2321887, -74501, -1519154, -1541775, -1530277, -1787663, -745698, 2040265, 4298553, 3899911, 1814762, 661330, 1222954, 1897885, 1212957, -422213, -1610881, -1768375, -1489629, -1246552, -304287, 2322018, 5809753, 7521118, 5835658, 2199710, -612401, -1535520, -1339263, -534664, 1074051, 2996468, 4055784, 4030708, 3745863, 3227271, 1382684, -1855636, -4534693, -4793425, -3021308, -1116744, -379790, -803190, -1684729, -2208596]
39717b208596K83943P64048O12486N28015R71260J051684q2127j386156j109672
39708e75115M59671J208750K32630j042539j165802n58865l92568p29913o69139
39699c232890K78747J592616K230741J522903r7654j327557j370213p48764j76058
39690a328129O82555K150376K915783J361050j503935k553664o85210J497289
39682B536115J294993n45109j527974j164717q57249r23632k67551J035448J279411
39673H59735n7876j115055l91704R85462J155762L35679K2664L11421m1688j199687
39663H64713j779190r76322M13234J405961J825488J531787K12199j366557j407251
39654G24062N09892K263223J749054k71702j316900o05944K05931l65325j686943
$$ y = [-2208596, -1924653, -1160605, -548119, -20104, 951156, 2002840, 1920713, 534557, -575115, -115444, 1093306, 1325936, 283397, -882405, -1441270, -1833838, -2563751, -3232890, -2954143, -1361527, 869214, 2392117, 2294463, 966906, -403307, -1152071, -1328129, -645574, 1504802, 4420585, 5781635, 4277700, 1724036, 1038826, 2536115, 3831108, 3285999, 1758025, 593308, -263941, -1187573, -1455124, -419676, 859735, 801859, -313196, -704900, 280562, 1436324, 1772003, 1794667, 2106088, 2064400, 864713, -914477, -1890799, -1477565, -71604, 1753884, 3285671, 3497870, 2131313, 724062, 1233954, 3497177, 5246231, 4974529, 3657629, 3051685, 3257616, 2892291, 1205348]
39645A205348k074262r36108O44476J175942L90100m27543J2729J197935J268067
39636B456684n13530k629566l106333j567951R51438L101067L490385J376923
39628C559117j734205k667770m31833J829057Q09580k177484l008547o61221J707451
39619b775855J687209N51497L79112R55299J027024N71593J92818j79746m99137
39610A909814J02359J717590K593575J293342r68536j768246o70433M96338K14291
39601D920094j178326k339560k233719p14740J255463K057257R33576r33312j569069
39592A97664m78482Q34188P62603m57741j061351O5282J872751K243615N85423
39583D563952j348568j642232n06599L98905L23963r869Q4583L36167J09628q65540
$$ y = [1205348, -868914, -1805022, -1160546, 15396, 405496, -22047, -9318, 1188617, 2456684, 1943154, -686412, -3792745, -5360696, -4409258, -1308191, 2182194, 3559117, 1824912, -842858, -1274691, 554366, 1363946, -813538, -3822085, -4483306, -2775855, -1088646, -537149, -158037, 797262, 1824286, 2395879, 2588697, 2408951, 1909814, 2012173, 3729763, 6323338, 7616680, 6648144, 4879898, 4209465, 4705803, 4920094, 3741768, 1402208, -831511, -1546251, -290788, 1766469, 2700045, 1766733, 197664, -280818, 553370, 1315973, 858232, -203119, -137837, 1734914, 3978529, 4563952, 3215384, 1573152, 1066553, 1465458, 1789421, 1779552, 1864135, 2200302, 2309930, 1444390]
39573A444390k164603k475989n40676K709480M092419J957907j022683j130079
39565B870166J163662K084893K91069j669541j944539j754750j996314j100416
39557b055770J570516L296902J746204j185357k146685j100064l87762n60237
39549h22253l10361L83262K76742k95620L63703K037171K276318J27221k050048
39540A986135j653590P29881K198901J152968r83053j677313l92669Q82624M95349
39531B739233m36116J65551J734595J600978o91658k334792j573261l65655r50507
39522a11632k193974j700228L49191J918460K145394J374718k56752j983347j905138
39513b363308J96248J455691J38757r65168J049235L594748K093176k295419l857716
$$ y = [1444390, -720213, -3196202, -3736878, -1027398, 3065021, 5022928, 4000245, 2870166, 4033828, 6118721, 6409790, 4740249, 2795710, 1040960, -955354, -2055770, -485254, 2811648, 4557852, 3372495, 1225810, 125746, -262016, -822253, -1132614, -749352, -472610, -768230, -404527, 1632644, 3908962, 4036183, 1986135, 332545, 1062426, 3261327, 4414295, 3431242, 1753929, 1361260, 2243884, 2739233, 2303117, 2468668, 4203263, 5804241, 5112583, 2777791, 1204530, 838875, -111632, -2305606, -4005834, -3656643, -1738183, 407211, 1781929, 1525177, -458170, -2363308, -2167060, -711369, -572612, -1537780, -488545, 3106203, 5199379, 2903960, -953756]
39504i53756j050530J480879N17913j390643j138986Q2090j12626j073223r88162
39495d627044j89275J90895O02835J630445K131661J111863k53760m32393K62119
39486D27346Q60250J256890J114220m70414k590845k432113M41500K428055R81368
39477B016257j400437j270782M02055O83235R8959J102869K696513J616154j572248
39468D372575k595993k21604J827208R52636o93752o20807n0510q59701j774471
39459C35581q97948M15764k02599j668738j009199J355274J805657o39680k356255
39450b862143m80952K702862L122919P30149r33435k26680N46978q55850l090270
39441a346422l274862j048797J298159K068836J731072J378732J268524J196082
$$ y = [-953756, -2004286, -523407, -5494, -1396137, -2535123, -2453033, -2565659, -3638882, -4627044, -4816319, -4625424, -4022589, -2392144, -260483, 851380, 597620, 165227, 427346, 1287596, 2544486, 3658706, 3188292, 597447, -1834666, -1393166, 1034889, 2016257, 615820, -654962, -252907, 430328, 529287, 1632156, 4328669, 5944823, 4372575, 1776582, 1554978, 3382186, 4334822, 3641070, 3020263, 2969753, 2110052, 335581, -562367, -146603, -349202, -2017940, -3027139, -1671865, 133792, -505888, -2862143, -3343095, -640233, 2482686, 3212835, 2279400, 2052720, 2599698, 1743848, -1346422, -4621284, -5670081, -4371922, -2303086, -572014, 806718, 2075242, 3271324]
39433C271324R93160K24553j411586k910762k484153n1144J976606J538006l50254
39424G95750j063066k686Q07351j90355j881283k100509n83474P80576N57711
39415b879985l72442k39497R24655J323515L14388l13339Q52189K159934J086326
39406B855744j646999k744853j172746M54401J22331o84087J05110J748818K347613
39397A385332J966275J674731J001477r43918k865493k670466r12077j0659k75956
39388a650754L27091K177484K788662O67145k109008k678447j021805O36339Q01593
39379f1700j54514r64199o75531M67412J026342R1652j100513o81756Q37751J065893
39369a49163n36686j793696j395788p34261q47390k70153J925363L400788J803743
$$ y = [3271324, 4264484, 4489037, 3077451, 166689, -2317464, -2368608, -392002, 1146004, 795750, -267316, -270002, 537349, 346994, -1534289, -3634798, -4218272, -3437696, -2879985, -3252427, -3491924, -2567269, -1243754, -929366, -1242705, -390516, 1769418, 2855744, 1208745, -1536108, -2708854, -2254453, -2132122, -2816209, -2711099, -962281, 1385332, 3351607, 5026338, 6027815, 5083897, 2218404, -452062, -1364139, -1374798, -1650754, -1323663, 853821, 3642483, 4309628, 2200620, -477827, -1499632, -863293, -61700, -216214, -1180413, -1855944, -1388532, -362190, -270538, -1371051, -2052807, -1215056, -149163, -685849, -2479545, -3875333, -4609594, -5456984, -5727137, -3801774, -400986, 1402757]
39360A402757r96800j286914Q43353J749641l8112j827228j193434O77588J413837
39351G44688P95544O4185k88478m05219p2524O43240P98141n4401q34782n89502
39341H00892k36169j127194k567085k529250o73498J069032J261535Q39637J404475
39332a757625K626013K529838K11003k710071l780337k411312k85014Q30718R11542
39323c835245R79595J342796J414943R34581L23745j65659o94098j090198q36675
39314a626215q9077K14942l29876r88219r70810l21486N88968J489882J778241
39305b53650Q47070n71150p04495P20583J583732K81072j696661j760852R3903
39296a460448J506031J170579Q3951n67449q33572r16253l25316J073454K246731
$$ y = [1402757, 405957, -880957, -37604, 1712037, 1673925, -153303, -1346737, -669149, 744688, 1540232, 1604417, 1315939, 910720, 838196, 1481436, 2279577, 2225176, 1390394, 800892, 564723, -562471, -3129556, -5658806, -6332304, -5263272, -4001737, -3162100, -1757625, 868388, 3398226, 3609229, 899158, -2881179, -5292491, -5577505, -4746787, -3835245, -2855650, -1512854, -97911, 836670, 1160415, 994756, 300658, -789540, -1626215, -1715292, -1500350, -1830226, -2818445, -3789255, -4110741, -3521773, -2031891, -253650, 593420, 22270, -682225, 38358, 1622090, 1903162, 206501, -1554351, -1460448, 45583, 1216162, 1300113, 732664, -100908, -1017161, -1342477, -269023, 1977708]
39287A977708K033181M76897j274681k057066j623521q06124n14662l93974O71014
39278a511228K252394K098680m80771k538628j147650J931512K262177q31727
39270B034759l130066j521727J906666L228339J656381n80259j475354o68811
39262A449928R32718J580355Q1336k191559k377267k42012R61151p27596k726526
39253c259472j747114J194984K508849J336174k2508k29419k83127q04761p98343
39244b104737L06946J488512J632855P74101l82597r98662m20313Q02646Q45584
39235A944335r59386k511452j649014M99957J226902M09506R6840N27528l4235
39226d49019j442303j289420Q09665K047914R02306m72256r3010O94811J75226
$$ y = [1977708, 4010889, 4487786, 3213105, 1156039, -467482, -1273606, -1788268, -2182242, -1511228, 741166, 2839846, 2359075, -179553, -1327203, 604309, 2866486, 2034759, -1095307, -2617034, -710368, 2517971, 4174352, 3594093, 2118739, 1449928, 2382646, 3963001, 4044337, 1852778, -524489, -766501, 194650, -532946, -3259472, -5006586, -3811602, -1302753, 33421, 10913, -218506, -501633, -1306394, -2104737, -1797791, -309279, 1323576, 2097677, 1715080, 716418, 296105, 1098751, 1944335, 984949, -1526503, -3175517, -2675560, -1448658, -1039152, -942312, -414784, -449019, -1891322, -3180742, -2371077, -323163, 579143, 106887, 13877, 708688, 883914]
39217H83914m27871N95114J911324J191406q91704j823812j269790q24689n89278
39208a245386O88558K356692K160866J88942p24540N14114J389708p7925k052586
39199C198443j930879n10022l83946j559488j708973l03456N73785r2556o18458
39190c335550K39354J080028N67375J40688J491583K890745J269272k504769l906792
39181b068066j062777K345837K176616o43026k011949m71997J486932J348194
39173A099764m97023j892283j472110K30505J490973J263056N23583Q95212J828521
39164C470198J049115j406227k192655L26083K661781J001977k586107k915525
39156e91360L64012K293810L43372k137667j741300l3968j67180j662318j686920
$$ y = [883914, 456043, 1051157, 2962481, 4153887, 3262183, 1438371, 168581, -656108, -1245386, -556828, 1799864, 3960730, 4149672, 3425132, 3939246, 5328954, 5251029, 3198443, 1267564, 757542, 373596, -1185892, -2894865, -3198321, -2624536, -2717092, -3335550, -3096196, -2016168, -1448793, -1308105, 183478, 3074223, 4343495, 1838726, -2068066, -3130843, -785006, 1391610, 748584, -1263365, -1735362, -248430, 1099764, 602741, -1289542, -2761652, -2531147, -1040174, 222882, 746465, 1641677, 3470198, 4519313, 3113086, 920431, 1246514, 3908295, 4910272, 2324165, -591360, -227348, 2066462, 2409834, 272167, -1469133, -1503101, -1670281, -3332599, -5019519]
39147e019519M06680K614918L202329J958816m19730k409538k161976L79364K754922
39138A306266K779760J068487m37233j134466j451909j189555k3665J152326J088546
39129C158557j10506j340449j895147j555915l04642J001938Q61240p92012j977869
39120b954805j335446O4037Q68203J569022K651922K573871J88527k313141j933910
39111f21720N42761J632932L80032p47893k69945L15545k35887p02959J41442
39102D34308J253371J197738N16680N25799J071409J070646K98220p42089j830842
39093C795240k608010k057640L7238J804095J193458j071716k214293j158698
39085b280326K51955L23984j19987K69780O91289l56795j862563j184285J781550
$$ y = [-5019519, -4612839, -1997921, 1204408, 3163224, 2743494, 333956, -1828020, -1448656, 1306266, 4086026, 5154513, 4717280, 3582814, 2130905, 941350, 917685, 2070011, 3158557, 3048051, 1707602, -187545, -1743460, -2048102, -1046164, -184924, -976936, -2954805, -4290251, -4226214, -3358011, -1788989, 862933, 3436804, 3625331, 1312190, -621720, -78959, 1553973, 1934005, 1186112, 916167, 1231712, 995825, 292866, 434308, 1687679, 2885417, 3402097, 3927896, 4999305, 6069951, 6368171, 5626082, 3795240, 1187230, -870410, -833172, 970923, 2164381, 1092665, -1121628, -2280326, -2028371, -1704387, -1824374, -1554594, -863305, -1220100, -3082663, -4266948, -2485398]
39076b485398L930741L245061J284640J02416p72918k183984k590539n38341J806300
39067A797978J189941j566841k703712j401685m53037q58985k14189K298045L650310
39058A737825J906223l65452l31828O95760J62786j188456j069553J89338O09670
39049B346313Q1193k32866n19522j278938j167423Q49892K542404J164390j817742
39040A967701k439476j16476J910664J836393J214671J217159O07671j396063
39032D802244l183139l112298j696781k58012Q72957J835837K354606K205391
39024C820805J586190O40773n57182j566912j905812j504979l36484J417094K317754
39015C911247P34038j986503k076873R57083K363352r55202m788168l486529J128711
$$ y = [-2485398, 1445343, 4690404, 5975044, 6077460, 5304542, 3120558, 530019, -8322, 1797978, 2987919, 1421078, -1282634, -2684319, -3137356, -3996341, -4210530, -1912485, 1737825, 3644048, 3278596, 2946768, 3642528, 3805314, 2616858, 1547305, 1736643, 2346313, 2427506, 2194640, 1675118, 396180, -771243, 78649, 2621053, 3785443, 1967701, -471775, -588251, 1322413, 3158806, 4373477, 5590636, 6198307, 4802244, 1619105, -1493193, -3189974, -3447986, -2575029, -739192, 1615414, 3820805, 5406995, 6047768, 5490586, 3923674, 2017862, 512883, 176399, 1593493, 3911247, 4645285, 2658782, 581909, 1538992, 3902344, 2947142, -1841026, -5327555, -4198844]
39006d198844K580479k3227j231197J254437L180263J407550j324321j887977
38998b42837j466603j648471q74013J575442K577021L06767j558098O09883L883284
38989C162375K910888j664186m127347k008520J285427K031158L75713j439118
38981E26390j919975q72968O55529Q78024n71655j566421m19307J209285P65389
38972a315709q99532p16415J615329L070271J919617j21908j044515j084175j052739
38963C70224n94971L62910M02592j235337k576802j117253K315086L921047J659268
38954C506764j878046k474539N67313L741941L753453J045264j686785k894868
38946C680497k706244j383662O52621J889039J028187q31482j312981o8679R78286
$$ y = [-4198844, -1618365, -1641592, -2872789, -1618352, 1561911, 2969461, 1645140, -242837, -1709440, -3357911, -4231924, -2656482, -79461, 227306, -1330792, -720909, 3162375, 6073263, 4409077, 281730, -1726790, -441363, 1589795, 1965508, 526390, -1393585, -2266553, -1611024, -733000, -1304655, -2871076, -3290383, -2081098, -1315709, -2215241, -2931656, -1316327, 1753944, 3673561, 3551653, 2507138, 1422963, 370224, -224747, 138163, 540755, -694582, -3271384, -4388637, -2073551, 1847496, 3506764, 1628718, -845821, -278508, 3463433, 7216886, 8262150, 6575365, 3680497, 974253, -409409, 243212, 2132251, 3160438, 2328956, 1015975, 947296, 1925582]
38937A925582O66105k54549j023065j602687j393975K45304J929479J435300o37874
38928A289620j376219k18883L04664o70743p87639Q15078J411881l00383j238725
38919g71349P73922K577408O35899k720198k727494L52551K110910J009660k70213
38910I71096o119M49236n4421o88027o04018l759P70366J108807n2772k093854
38900b03465k021128J207380L674288J589922k502593l203075m45497J119046
38892g85122Q9260l41146P94465M06645k127292k666876P32886L810800K512501
38883B426121q72770j751131M4110J420768J269575P51054K31730o42664j136307
38874A740486n20267J80075j60185p01953l28109J54193l75892j139271r96969
$$ y = [1925582, 2591687, 2337138, 1314073, -288614, -1682589, -1437285, 492194, 1927494, 1289620, -86599, -305482, -818, -671561, -1459200, -644122, 767759, 467376, -771349, 2573, 2579981, 3215880, 495682, -2231812, -1879261, 231649, 1241309, 971096, 964977, 1414213, 1359792, 671765, 67747, 63988, 834354, 1943161, 1890389, -203465, -2224593, -1017213, 2657075, 4246997, 1744404, -1458671, -1904168, -785122, -695862, -1037008, -242543, 164102, -1963190, -4630066, -3897180, -86380, 2426121, 1553351, -197780, -153670, 1267098, 2536673, 3287727, 3519457, 2876793, 1740486, 1220219, 1400294, 1240109, 538156, 210047, 364240, -11652, -1150923, -2147892]
38865b147892n43042m92694J53741J868277K477760L18057k144500j341962J798118
38856e4137K989181R37758j183170j009663j92070j010148k582992k408815r7556
38847d611612K234070K650276J271414l06681p29988N7000J211476K069210K325251
38838F170416J420390r88817l585950l915253j381923J466682J887847J76483
38830A249875j275099j140062j2832R75430R66132l69447j999758j870022M88141
38821b987642K686177K389104M02398r11927j063922j069541p94628N87500K086884
38812A324403J742414p9959r40214n6643Q00367M83871k3339J12673J77399l97790
38802C143182r79818j090354j018283p03119R5654M67602n07025j373958L3871
$$ y = [-2147892, -2690934, -3183628, -3029887, -1161610, 1316150, 1634207, -510293, -1852255, -54137, 2935044, 3872802, 2689632, 1679969, 1487899, 477751, -2105241, -4514056, -4611612, -2377542, 272734, 1544148, 1237467, 507479, 564479, 1775955, 3845165, 6170416, 7590806, 6601989, 3016039, -899214, -2281137, -814455, 1073392, 1249875, -25224, -1165286, -1178118, -202688, 763444, 393997, -1605761, -3475783, -2987642, -301465, 2087639, 2490037, 1578110, 514188, -555353, -1349981, -762481, 1324403, 3066817, 2986858, 2046644, 1990001, 2790368, 3274239, 3250900, 3363573, 3540972, 3143182, 2163364, 1073010, 54727, -648392, -552738, -85136, -592161, -1966119, -1932248]
38793a932248K494403K530600J60762o97341J142332J842394o57447k448182j78242
38784B257031K656760J217470k318269k166994J397865K636198m6683k038285
38776C595093q59504J48859j397625k589433r05925J009409K41161j107371n1078
38767a916414J410834k94453l467302l159213J004569M156937L350722Q51117
38759A936797m13481o52458j059847j111476L2537J453888J542668R0656j629549
38750A89735k124343q03327J248809J869869L81783j027359j50239J724332J495046
38741B804306r18841k294941j002696P64633P14203k85550l44548K11503j56233
38732e08164j286819j458338L7778J882930K206145M92333j697213j923575M30415
$$ y = [-1932248, 562155, 3092755, 3253517, 2556176, 3698508, 5540902, 4883455, 2435273, 2257031, 4913791, 6131261, 3812992, 1645998, 3043863, 5680061, 5633378, 3595093, 2735589, 2884448, 1486823, -1102610, -2008535, -999126, -757965, -1865336, -1916414, -505580, -800033, -4267335, -7426548, -6421979, -2265042, 1085680, 1936797, 1523316, 870858, -188989, -1300465, -1267928, 185960, 1728628, 1819284, 189735, -1934608, -2737935, -1489126, 380743, 762526, -264833, -415072, 1309260, 2804306, 1885465, -409476, -1412172, -647539, 66664, -218886, -563434, -351931, -508164, -1794983, -3253321, -3215543, -1332613, 873532, 1365865, -331348, -2254923, -1824508]
38723a824508K922181K805943O79419n31691n1360j03956j769444k885864j558759
38714b318039P11711J359536L05717p80969j178592j124017n17802M76252P44012
38705b322191r9574n56397N17842J833161J636294M23142k67903m22744p62463
38696b0833o92965N26907J624826Q77615r51258j742314j363723j272604j409855
38687d424204l87251J433277J950858O59930o25100p60847n94920q43390r11667
38678d503314m09881J52198O62170J532733K245933J729262M32727m9238K93505
38669B086095k09470j802150k436086q52662J511670K581473J832793j73810k518417
38660A9436l581492k066373Q58374K415529J863022J121655J193426O61027j122237
$$ y = [-1824508, 1097673, 3903616, 4583035, 4051344, 3999984, 3896028, 2126584, -759280, -2318039, -1606328, -246792, 58925, -722044, -1900636, -3024653, -3542455, -3066203, -2322191, -2421765, -2978162, -2460320, -627159, 1009135, 1432277, 1164374, 741630, -20833, -713798, -186891, 1437935, 2315550, 1364292, -378022, -1741745, -3014349, -4424204, -4811455, -3378178, -1427320, -767390, -1392490, -2153337, -2748257, -3591647, -4503314, -4913195, -4760997, -4098827, -2566094, -320161, 1409101, 1841828, 1792590, 2086095, 1876625, 74475, -2361611, -3214273, -1702603, 878870, 2711663, 2537853, 19436, -3562056, -5628429, -4770055, -2354526, -491504, 630151, 1823577, 2484604, 1362367]
38651A362367k204909j194656K97077M83586L52757J322788K032730M78098k044532
38642H85306k336514r0235J658137R33089q31703j353287m40958M41979L46746
38633g87440k30454k08759N72695Q96595k04348j586402j198534O65821J362701
38624g18125k1312r81259L54436J934634J123772p74434p02610R09381J059851
38615B184334l06765r3247K177213K812738j38301l314901k943443k24942J175869
38606A328555N80178j34949n61059j547174k030278j89983K359724J757215j850651
38597b88422l388287j91939L498407K578016j311171k387298O58239L295376K270817
38588D733738l93577j620990j523892j377867o33742J268430K432589Q80075k030991
$$ y = [1362367, -842542, -2037198, -1740121, -1256535, -903778, 419010, 2451740, 2929838, 885306, -1451208, -1541443, 116694, 1049783, 218080, -1135207, -1576165, -1134186, -787440, -1017894, -1226653, -653958, 242637, 38289, -1548113, -2746647, -2080826, -718125, -739437, -1720696, -1366260, 568374, 1692146, 917712, 215102, 1124483, 2184334, 1877569, 1784322, 3961535, 6774273, 6635972, 3321071, 377628, 152686, 1328555, 1908733, 1773784, 1212725, -334449, -2364727, -2554710, -194986, 1562229, -288422, -3676709, -3868648, -370241, 2207775, 896604, -1490694, -832455, 2462921, 4733738, 4340161, 2719171, 1195279, -182588, -816330, 452100, 2884689, 3764764, 1733773]
38579A733773l307692k389468r68910K00301J505329K248076J312074j40332K93747
38570D86898K258487K649927L15012k074217j976481l25967N30150J73849k52024
38561A785634k23455m9509J04809K17448J69613J47728L96570L43277p15946j926401
38551B49768j635640j06410O33720J13084J08904J180015J324576l66731j526372
38542b5086k19111J645238J375626o9913N4909J422435J182704j160364k825186
38533A381252j939069K02114J595819J838892J300342R8613j236150j725038j321728
38524A95047r80667q62388M1767J871783K977097K004056j67335j536278j271406
38515B271676q0642J002919J298453M39299j287335k593794k124187j42700J344754
$$ y = [1733773, -1573919, -3963387, -4932297, -4731996, -3226667, -978591, 333483, 193151, 486898, 2745385, 5395312, 5710324, 3636107, 1659626, 1333659, 1863809, 2037658, 1785634, 1562179, 1512670, 1617479, 1834927, 2004540, 2152268, 2548838, 2892115, 2176169, 249768, -1385872, -1492282, -858562, -745478, -636574, 543441, 1868017, 1501286, -25086, -244197, 1401041, 2776667, 2706754, 2761663, 4184098, 5366802, 4206438, 1381252, -557817, -355703, 1240116, 3079008, 4379350, 4477963, 3241813, 1516775, 195047, -785620, -1648008, -1606241, 265542, 3242639, 5246695, 5079360, 3543082, 2271676, 2191034, 3193953, 4492406, 4931705, 3644370, 1050576, -1073611, -1216311, 128443]
38506A28443Q45171o10123p20960Q21865J759194O46601p79018k50951J300175
38497C140397J128450q22593j742389n11373O32007j0425r82650o36063m1718
38488A53643p05216j566619q57372P13015J263948R36085J141317J682113J323872
38479D084786M77581N99064J369841J076679m45785j669116j931273j800432j213986
38470E47359K24390J370255P38145n09753J76608K247939K225134p18469k841134
38461C460474j354576J257880J132215j147515j907837k24488J144143M96492
38453B856788m84490q1787N65202k03401j286966m88852J351540R04022k420045
38444G12011m663981k622962J322546K553429R55375N67235K715763L753240J051799
$$ y = [128443, 973614, 363491, -357469, 464396, 2223590, 2870191, 2091173, 1840222, 3140397, 4268847, 3446254, 1703865, 1192492, 1824499, 1814074, 831424, 195361, 153643, -551573, -2118192, -2975564, -2262549, -998601, -62516, 1078801, 2760914, 4084786, 4562367, 5161431, 6531272, 7607951, 7162166, 5493050, 3561777, 1761345, 547359, 771749, 2142004, 2880149, 2370396, 2547004, 4794943, 7020077, 6301608, 3460474, 2105898, 3363778, 4495993, 3348478, 1440641, 1216153, 2360296, 2856788, 2372298, 2290511, 2855713, 2652312, 1365346, 876494, 2228034, 3132056, 712011, -3951970, -6574932, -5252386, -2698957, -1743582, -1176347, 1539416, 5292656, 6344455]
38435F344455k572619l067414r12723M90154K24478K28468J277510J824502P19478
38426D556289j291362k761543k665028q88094J077724J105144n24771q57949J192928
38417a056662K494159N25761k080073j553421P90877R73926p02026m81594J838835
38408G49782K454045L87379q54080L54707J034530q70136k970376k675303q46232
38399c235684Q86691K515353L389088J693276j615818k562913k43313J214554
38391B041234n28878k004129k30603J804789N27052j730576j018926J073304N87975
38382E21242j293146m53247K226610J965281j439185k875000k43871K538471K228150
38373C175305N67370N1378O8663n26217r03184n29767o58494j607846j621266
$$ y = [6344455, 3771836, 704422, -208301, 281853, 506331, 734799, 2012309, 3836811, 4556289, 3264927, 503384, -2161644, -3049738, -1972014, -866870, -1391641, -2249590, -1056662, 1437497, 1963258, -116815, -1670236, -879359, 94567, -607459, -1089053, 749782, 3203827, 3591206, 2737126, 3091833, 4126363, 3256227, 285851, -2389452, -3235684, -2348993, 166360, 3555448, 5248724, 3632906, 1069993, 826680, 2041234, 1512356, -491773, -722376, 1082413, 1609465, -121111, -1140037, -66733, 521242, -771904, -1225151, 1001459, 2966740, 1527555, -1347445, -1591316, 947155, 3175305, 3742675, 3794053, 3862716, 3336499, 2433315, 1903548, 1245054, -362792, -1984058]
38364a984058j81686O26445j50404m22703J025980J834238j13346k814926k995047
38355e175507p85107J210290J805021J494258M02292j167240j362277J026614
38347b551656L727848L306263R4472j998631q51266J281079J299454p53939k449051
38338A104573k283578r25098K21869O25690P77896J167724J417679Q11462l35661
38329B582556o91927J88294R20586K36592r54905q48955M44929J056191K29835
38320C163196p09799o25144r8566O4610L17659J150222J588848M88009j307045
38311D031990j693322j18952J684079J921857N71337j200487k328062k171498
38303F96942o25596J401387K356615J571421o0452j306595j775931j491024l65088
$$ y = [-1984058, -2165744, -1539299, -1689703, -2112406, -1086426, 747812, 634466, -2180460, -5175507, -5960614, -4750324, -2945303, -1451045, -1048753, -2215993, -3578270, -2551656, 1176192, 4482455, 4576927, 2578296, 1727030, 3008109, 4307563, 3553624, 1104573, -1179005, -2104103, -1882234, -1256544, -478648, 689076, 2106755, 2918217, 2582556, 1890629, 2078923, 2999509, 3236101, 2281196, 1432241, 1877170, 2933361, 3163196, 2453397, 1828253, 1729687, 1794297, 2111956, 3262178, 4851026, 5339035, 4031990, 2338668, 2219716, 3903795, 5825652, 6396989, 5196502, 2868440, 696942, 71346, 1472733, 3829348, 5400769, 5340317, 4033722, 2257791, 766767, 401679]
38294D01679J047938J340773M9756j180397p41270L39878j27981j780451j814386
38285b464461P48929L245433K969890O65017j142485j682226j836620j651162
38277a147685l53060J466232K033217J125818N90767J342443J695427N6881k165225
38268D644815k297926l62854R18466K19688n95367J31747Q03523q32597l365192
38259g35697l108534K51071K693691J651912l75269j06811J441416J320245o2248
38250B969776p5967Q52781k20593k824718k590740J692015N011153K968403j830487
38241E951623l719135j716596N47038R45491P02709O77971j18290j633064j721958
38232h4211N70248K952121K727565L36901j434830j144364k55226q06801k322419
$$ y = [401679, 1449617, 2790390, 2840146, 1659749, 918479, 1258357, 1130376, -650075, -2464461, -1715532, 1529901, 4499791, 5164808, 4022323, 2340097, 503477, -1147685, -1500745, -34513, 1998704, 3124522, 3715289, 5057732, 6753159, 6810040, 4644815, 2346889, 1984035, 2902501, 3122189, 2526822, 2658569, 3462092, 2629495, -735697, -3844231, -3593160, -899469, 752443, 377174, 270363, 1711779, 3032024, 2969776, 2893809, 3746590, 3525997, 701279, -1889461, -197446, 4813707, 7782110, 5951623, 2232488, 515892, 1062930, 2008421, 2711130, 3389101, 3270811, 1637747, -84211, 486037, 3438158, 6165723, 6502624, 5067794, 3923430, 3668204, 2861403, 538984]
38223E38984k139399P27520L326906K261134j165748k209105L97109K266898K5369
38214D029668l295544k905818L67664J797288L68875k94867J474644K790926J405034
38205E737870p49988j225108q53862j464423k383882j780979K26535K000969K649340
38196B156472K163933O06928j299651k085816j483832j067988j546023j161185
38188c717162J289501L551897K657402m45153j878843k67656J563005Q74492j316199
38179B311284k086446o24255J094670J106741k70366j162432n51497N74232O53383
38170A045314k97066p49463O1204R37267M23831j053744j700737o70233J002875
38161a000752J760016J187532K21451O352O49464J145389O76125k97196p77103
$$ y = [538984, -1600415, -872895, 2454011, 4715145, 3549397, 1340292, 1737401, 4004299, 4029668, 734124, -2171694, -1804030, -6742, 362133, 67266, 1541910, 4332836, 5737870, 4987882, 3762774, 2908912, 1444489, -939393, -2720372, -2493837, -492868, 2156472, 4320405, 4927333, 3627682, 1541866, 58034, -1009954, -2555977, -3717162, -2427661, 1124236, 3781638, 3336485, 1457642, 1189986, 2752991, 3627483, 2311284, 224838, -399417, 695253, 1801994, 1531628, 369196, -182301, 391931, 1045314, 748248, -1215, 59989, 997256, 1421087, 367343, -1333394, -2003627, -1000752, 759264, 1946796, 2168247, 2174599, 2824063, 3969452, 4645577, 4348381, 3571278]
38152C571278p30030q32811q66668J45391J804013K011618j13122k378479k118277
38143D92913K79664K113892K003953R52987R1719n85043r76095l96800Q10376
38134D787566R28312o10348j784013p17553J227837J224992o44822j316469N20050
38125C615552K198653J119521j164269j381452L04313P14187j074036k271531
38117B060938j061341M58477r1403j426427r38714Q59945J299829j1554p94122
38108C55628J07243J337815J627011J270994O66012l45948j230815j024847k39331
38099B523762l03776p96180K00325K406488K952830Q50716j132297q52490j29262
38090E720116j197666k425990r49579K092254K729934J03009k259186j550008
$$ y = [3571278, 2841248, 2008437, 1141769, 1287160, 3091173, 5102791, 4989669, 2611190, 492913, 772577, 2886469, 4890422, 5843409, 5935128, 5350085, 4373990, 3977190, 4787566, 5715878, 5105530, 3321517, 2603964, 3831801, 5056793, 4411971, 3095502, 3615552, 5814205, 6933726, 5769457, 4388005, 4692318, 5406505, 4332469, 2060938, 999597, 1458074, 1366671, -59756, -998470, -138525, 1161304, 1149750, 355628, 462871, 1800686, 3427697, 4698691, 5364703, 5018755, 3787940, 2763093, 2523762, 2219986, 1423806, 1624131, 4030619, 6983449, 7834165, 6701868, 5849378, 5720116, 4522450, 2096460, 1146881, 3239135, 5969069, 6072078, 3812892, 2262884]
38082B262884P59051J501909n6930j908319j990913k46114J553343J641742J15129
38073C631782j251158j219452l79179K01902M69448O79878M88162m2249J80756
38064B759890J376806J736740P3161j721479j263153M42573O06984o80033q20341
38055B511148M90110O80717q22262j136805R65796K251871J04152k672688j842368
38046E29671J427319K018571j308182l793672j528231K972938M349662J539441
38038F207517j442858j339116M05719M66830j442678k483295j057314R73726J310043
38029A598574O04961R67962K202249K082927K58679q81306r8016N29340r30525
38020F334845k758686k060931N60830J699310J51750j572222j180165M73217J403722
$$ y = [2262884, 3021935, 4523844, 4466914, 2558595, 567682, 321568, 1874911, 3516653, 3631782, 2380624, 1161172, 781993, 983895, 1453343, 2133221, 2621383, 2579134, 2759890, 4136696, 5873436, 5946597, 4225118, 2961965, 3404538, 4011522, 3331489, 2511148, 3001258, 3681975, 2859713, 1722908, 2688704, 4940575, 5044727, 2372039, 529671, 1956990, 3975561, 2667379, -1126293, -2654524, 318414, 4668076, 6207517, 4764659, 3425543, 3831262, 4298092, 2855414, 372119, -685195, 288531, 1598574, 2203535, 3171497, 5373746, 7456673, 7715352, 6834046, 6736030, 7265370, 6334845, 3576159, 1515228, 2076058, 3775368, 3927118, 2354896, 1174731, 1647948, 3051670]
38011C051670J348413J127469P39831j42730p78420k77398N58888N7525j741184
38002C944064k907800k260371p23710M34797J333875K500818L236515K325795
37994G883983L7069j829618k067002j358134j064556j314659r59167N91804K097899
37985B017619J729095l87526j776630n96344J686248K070515K28923j077899k87673
37976C606328O18719l85495j727716p49380J557023J691035p95629k368361q39367
37967F07157J547229J798948K89306o80891l71059L29272P54806O04413l87947
37958D491234j400593p63060J192570J543061r00962k892426j247433J883059
37950A905450J904402j256560l175558j631588Q32684J565807J138158Q60872
$$ y = [3051670, 4400083, 5527552, 6267383, 6124653, 5346233, 5068835, 5627723, 5685248, 3944064, 1036264, -1224107, -1947817, -1513020, -179145, 2321673, 5558188, 7883983, 7921052, 6091434, 4024432, 2666298, 1601742, 287083, -672084, -80280, 2017619, 3746714, 3359188, 1582558, 986214, 2672462, 4742977, 4971900, 3894001, 3606328, 4225047, 3839552, 2111836, 1362456, 2919479, 4610514, 3814885, 1446524, 607157, 2154386, 3953334, 4242640, 3561749, 3190690, 3519962, 4274768, 4879181, 4491234, 3090641, 2327581, 3520151, 5063212, 4162250, 1269824, 22391, 1905450, 3809852, 2553292, -622266, -2253854, -1421170, 144637, 1282795, 2143667]
37942B143667M65821j43535J51488J238069J040530r13825j888027q1218K127368
37933D140338J694842m39930j182376j54401M57207k3705r8997O77572Q01978
37924E872528l73061j334034p00164R33076K158784K382360J689239L17858j083076
37915I863510j609876j139037n81813o75648j036845q00838J31251Q65318N76199
37906E592221l30538n09914N08518J343300N76990q78957q32095Q01834J707581
37897G978940Q12792j08128K86540M36005j219382k953126k203829R2425Q21285
37888C943522l43132o45930R88888K191008J074770q23136j058350K19939R24690
37879F472269J4200j569390k333047j666072j37429J187346J802786J918881J450987
$$ y = [2143667, 2609488, 2465953, 2617441, 3855510, 4896040, 3982215, 2094188, 2012970, 4140338, 5835180, 5395250, 4212874, 4058473, 4515680, 4491975, 4392978, 5070550, 5872528, 5499467, 4165433, 3465269, 4398345, 6557129, 8939489, 10628728, 10946586, 9863510, 8253634, 7114597, 6532784, 5857136, 4820291, 4019453, 4150704, 5016022, 5592221, 5261683, 4751769, 5260287, 6603587, 7180577, 6301620, 5469525, 6271359, 7978940, 8791732, 8683604, 8970144, 9406149, 8186767, 5233641, 3029812, 3122237, 3943522, 3600390, 2954460, 3943348, 6134356, 7209126, 6385990, 5327640, 5547579, 6472269, 6486469, 4917079, 2584032, 917960, 780531, 1967877, 3770663, 5689544, 7140531]
37870G140531o9472j840385j653450Q92139K638748Q88006k137045k161165O27374
37861D325281J965001M05840p59217L66112R26730j390523l803930k709984N62649
37852a12041K172543J698575J568173K064428J196829r34173j670233j06205J413633
37843G291529R11472o55076j287999m97906P29404J178464M13331m75089K44899
37834G853029K112060J978743j520597m689526l240428J160058K961641R08665
37826G523645o96543M25453J025255j257778k975776m27862L537574L290968r94992
37817I449944l629880j706563J627720K723868J994764J397167Q30330n73490
37809A2113860j788609j076082J158197K658224K059171K0488j905942k386313
$$ y = [7140531, 7071059, 5230674, 3577224, 4469363, 7108111, 7996117, 5859072, 3697907, 4325281, 6290282, 6696122, 5936905, 6303017, 7229747, 5839224, 2035294, -674690, -112041, 2060502, 3759077, 5327250, 7391678, 8588507, 7654334, 5984101, 5877896, 7291529, 8203001, 7547925, 6259926, 5762020, 6491424, 7669888, 8083219, 7608130, 7853029, 9965089, 11943832, 10423235, 5733709, 2493281, 3653339, 6614980, 7523645, 6827102, 7252555, 8277810, 7020032, 4044256, 3616394, 7153968, 10444936, 9449944, 5820064, 4113501, 5741221, 8465089, 10459853, 11857020, 12687350, 12113860, 10325251, 9249169, 10407366, 13065590, 15124761, 15145249, 13239307, 10852994]
37801A0852994q39821J768948K963471J104695k120983l058278n88401K097822
37793A2180447J504337j396967k344896L73460L448716K926116o45034l169706
37785A2876473k186374Q29168L018128L071614J396840q73020k317153j951096
37777A3864580k91325J102869J479864J355567J073628L43089m90344m26824K67533
37768A8278637o1499j631314k158433j43942K485395K956060J476513L20820K27031
37759B1749268J59982q8716K96503J005551P83481k00734n40075k21356n75476
37750B2368428j372358p30901J407278K569582J665856P93767J511856K073502
37742C0287010O36378j230858j102244J66490J01504r01740l01065J949963L075622
$$ y = [10852994, 10013173, 11782121, 14745592, 15850287, 13729304, 10671026, 10082625, 12180447, 13684784, 12287817, 9942921, 10316381, 13765097, 16691213, 16046179, 12876473, 10690099, 11519267, 14537395, 17609009, 19005849, 18132829, 15815676, 13864580, 13573255, 14676124, 16155988, 17511555, 18585183, 18928272, 18437928, 18011104, 18278637, 18217138, 16585824, 14427391, 14283449, 16768844, 19724904, 21201417, 21522237, 21749268, 21909250, 21820534, 22117037, 23122588, 23906069, 23705335, 23165260, 22943904, 22368428, 20996070, 20265169, 21672447, 24242029, 25907885, 26701652, 28213508, 30287010, 30923388, 29692530, 28590286, 28756776, 28858280, 27956540, 27655475, 29605438, 32681060]
37733C2681060J972654O76451O70974Q93283N04675O27489J725013K016554N70846
37724D2338999m51818Q62645K658538K053243j55141q70708J27134J44162j263644
37715D5443410r97698K378276N471567M439603L30700k522075k109104j90245
37707E2244434J181140J954261K631922K703506J617720J95080m0011J323132
37699F3811184L043729L565760K688435J708668J774452K437642K462457J822693
37691H3315020J758714K672003L340226K904195K294549K654191L593102M283135
37683A06815135N043284O225312O694251N447458L849391L954217N239176N554186
37675A48822410M927175N508230P645112R153876R147658R408021J0764375J1299953
$$ y = [32681060, 34653714, 35330165, 36001139, 36894422, 37399097, 38026586, 39751599, 41768153, 42338999, 41887181, 42749826, 45408364, 47461607, 47306466, 46435758, 46562892, 46707054, 45443410, 44445712, 46823988, 52295555, 56735158, 57065858, 54543783, 52434679, 52244434, 53425574, 55379835, 58011757, 60715263, 62332983, 62528063, 62488052, 63811184, 66854913, 70420673, 73109108, 74817776, 76592228, 79029870, 81492327, 83315020, 85073734, 87745737, 91085963, 93990158, 96284707, 98938898, 102532000, 106815135, 111858419, 118083731, 124777982, 130225440, 134074831, 138029048, 143268224, 148822410, 153749585, 159257815, 166902927, 176056803, 185204461, 194612482, 205376857, 216676810]
37667B16676810R972887R035026J0468054J2620450J3121258J2813047J3657203
37660B98364735J4727430J3893330J2069157J1927202J3209767J3259553J1828955
37653C89280129J1221536J1462324R690409N428730K234298K148303K253298o14351
37645D33104676m866779p018337p120484p860844r790914j1019889j1003021j1327657
37637C63096751j2685791j3883004j4249900j4601599j5191166j4921282j3521633
37630B64042376j2592656j3193280j3855451j2561704r810736q033691q211775
37623A85783083q724978q001474o863547p015932q069352p938499o287396n466067
37615A27415838o850773q172054o669769l563319k400469l508203l710384k092232
$$ y = [216676810, 226649697, 235684723, 246152777, 258773227, 271894485, 284707532, 298364735, 313092165, 326985495, 339054652, 350981854, 364191621, 377451174, 389280129, 400501665, 411963989, 421654398, 427083128, 429317426, 431465729, 433719027, 433104676, 428237897, 421219560, 414099076, 406238232, 396447318, 385427429, 374424408, 363096751, 350410960, 336527956, 322278056, 307676457, 292485291, 277564009, 264042376, 251449720, 238256440, 224400989, 211839285, 202028549, 193994858, 185783083, 177058105, 169056631, 162193084, 155177152, 147107800, 139169301, 132881905, 127415838, 120565065, 112393011, 105723242, 102159923, 99759454, 96251251, 92540867, 90448635]
37607I0448635j997698n219714p899585n758416q96567Q78911j739586m425856
37599F3390124m073604k377566j689076j393624l66653K72412n77781j412335
37591E1771897n39855O62097k35690k589139l502995k278184j149534j424438
37583D0714159j638639m86701P10837N5649j892185k907064k215682j148464q28575
37574C0363335p44436m6765R10527J161741N99316q4171o32770j406703k263323
37565B7856751k279132j081887L29921P80222L24161k59627p35779j176322j051963
37556B2706345L4888R57813Q2259k079367k952117j377747O10847O91366n04174
37547A8170113p71362L1454n5268j608141k507806r63685J686953K511102O17526
$$ y = [90448635, 88450937, 83231223, 75331638, 69573222, 68676655, 69555566, 67815980, 63390124, 59316520, 56938954, 55249878, 53856254, 53489601, 53762013, 53184232, 51771897, 51232042, 51894139, 51658449, 49069310, 45566315, 43288131, 42138597, 40714159, 39075520, 38588819, 39299656, 39355305, 37463120, 34556056, 32340374, 31191910, 30363335, 29618899, 29572134, 30482661, 31644402, 32243718, 32159547, 31526777, 30120074, 27856751, 25577619, 24495732, 24825653, 25605875, 25930036, 25670409, 24934630, 23758308, 22706345, 22741233, 23699046, 23781305, 21701938, 18749821, 17372074, 17982921, 18674287, 18170113, 17398751, 17430205, 17374937, 15766796, 13258990, 12295305, 13982258, 16493360, 17110886]
37538A7110886j939402k764668j673465l45963o3288m71584n94005l40932l18029
37529H599550m35981J96713J643152K425890J307556q80474k196490j951604j058598
37520G649714l44339K15208N83311L21621m41605p97384l40892K46375M43632
37511G535641P80843J692053K266578J253545r45445k316743j515124M78749J412317
37502A0642414L76817j052816p47674J044889J702666k37665k656409k433946
37494F638276J99561J926594R69979p87978j022583q1303N16899P74305J437116
37485A0570866J872116R18665q71117j869322j763755j436377r59887K05288J313298
37476G979775R16508n42444r87317L009M09504q82161k087472j224696Q84311
$$ y = [17110886, 15171484, 12406816, 10733351, 10387388, 10324100, 9852516, 9258511, 8917579, 8599550, 8163569, 8360282, 10003434, 12429324, 13736880, 12856406, 10659916, 8708312, 7649714, 7305375, 7520583, 8103894, 8425515, 7983910, 7186526, 6845634, 7092009, 7535641, 8316484, 10008537, 12275115, 13528660, 12583215, 10266472, 8751348, 9230097, 10642414, 11019231, 9966415, 9218741, 10263630, 11966296, 11728631, 9072222, 6638276, 6837837, 8764431, 9734410, 8946432, 7923849, 7842546, 8359445, 9133750, 10570866, 12442982, 13361647, 12490530, 10621208, 8857453, 7421076, 6461189, 6666477, 7979775, 8896283, 8353839, 7366522, 7369531, 7779035, 6896874, 4809402, 3584706, 4469017]
37467D469017J938730J332160L71803K9544K6567p2065j28820N4945K82703K48520
37457H553104k4979j14087M13678J360182J848884J352238N12078K73893M45387
37448A4620378r794j321405k418804k112505j81540K397907L738058K424876l72909
37439A6764262j381167O07601K476530J106103j500183r78073K295812L383160
37431B2774045N22944k125752j210166R71098J163245N17567J459977K597297
37423B6670255J298470r28580m18613K497500L855372K160458M5026k21251P98962
37414C5757599K071795L567618M672167L953883J441010q99290j504180n04342
37406D8556260J156588K230611J387871j121162k768925j808730m0432j58440
$$ y = [4469017, 6407747, 7739907, 8111710, 8141254, 8167821, 8095756, 7966936, 8021881, 8304584, 8553104, 8528125, 8414038, 8827716, 10187898, 12036782, 13389020, 13901098, 14174991, 14620378, 14610584, 13289179, 10870375, 8757870, 8576330, 10974237, 14712295, 17137171, 16764262, 15383095, 15990696, 18467226, 19573329, 18073146, 17095073, 19390885, 22774045, 23296989, 21171237, 19961071, 20932169, 22095414, 22612981, 24072958, 26670255, 27968725, 27040145, 26621532, 29119032, 32974404, 35134862, 35179888, 34958637, 35757599, 37829394, 41397012, 46069179, 50023062, 51464072, 50564782, 49060602, 48556260, 49712848, 51943459, 53331330, 52210168, 49441243, 47632513, 47592081, 47433641]
37398D7433641j579531j802842p36993l26512q36944j107729j628716l441532
37390C5972842m761135l083000j44174L7059k107867k230396L53056J436873n37419
37381B4935839j794448k89814M94001j927498m161118k668478K43896O56796n93644
37372A4895532m33027P45435N80114n67628q76182q97012j910105k394127l35678
37363H807322K534980K837747N97716j380381j853334j512782n57456P71849Q47814
37354A1093475q93895j992531o84391P14848k31092j435160k9910J894546O23605
37345I059495k213704j979092R57198J765809p22505k617935j912536q55118o75651
37336H05961L03110K116545K170315K56838n36006O08243Q12929q04905j243962
$$ y = [47433641, 45854110, 44051268, 43314275, 42987763, 42150819, 41043090, 39414374, 35972842, 31211707, 28128707, 27984533, 28021592, 25913725, 23683329, 24036385, 25473258, 24935839, 23141391, 22851577, 23345578, 21418080, 17256962, 14588484, 14832380, 15489176, 14895532, 14462505, 15207940, 15788054, 15220426, 14344244, 13447232, 11537127, 9143000, 8807322, 11342302, 14180049, 14777765, 13397384, 11544050, 10031268, 9473812, 10245661, 11093475, 10199580, 8207049, 7522658, 8237506, 8006414, 6571254, 6541344, 8435890, 9059495, 6845791, 4866699, 5823897, 7589706, 6867201, 4249266, 2336730, 1481612, 805961, 1109071, 3225616, 5395931, 5652769, 5116763, 5725006, 6537935, 5733030, 4489068]
37327D489068O40644J681686M4892j635598j343913r97107j831856j448670J172219
37318G71365K557736N68529j254326L76377K507897J017684k065465k084461K25117
37309B620453L72001j978841k852864j014114O22554P44900J444382L367021L809620
37300G135112J277806j763551k466205j174174M7237K49782k52985q60282r48665
37291A244075m54049l46098j152734j471224J04431K126288J901693k55405j253667
37282D43310P672J082396P8381j509271j546778m73392R6926J86923Q20278J740830
37272I27275J783203R53674L76178L47286J0018q53785j104314j6966J190484
37263C613053P42411j073520j970523p63208Q42297O58334p85755j204536j94668
$$ y = [4489068, 5129712, 6811398, 6856290, 5220692, 3876779, 2879672, 1047816, -400854, 771365, 3329101, 3897630, 2643304, 3019681, 5527578, 6545262, 4479797, 2395336, 2620453, 2992454, 1013613, -1839251, -2853365, -2230811, -1485911, -41529, 3325492, 7135112, 8412918, 6649367, 4183162, 3008988, 3056225, 3306007, 3053022, 2192740, 1244075, 790026, 443928, -708806, -2180030, -2075599, 50689, 1952382, 1696977, 443310, 450982, 1533378, 1611759, 102488, -1444290, -1917682, -1820756, -1633833, -813555, 927275, 2710478, 3664152, 4040330, 4387616, 4397634, 3543849, 2439535, 2422569, 3613053, 4355464, 3281944, 1311421, 548213, 1390510, 2048844, 1263089, 58553, -136115]
37254a36115L44849l98720q34197L2121P10764l3243p02958M92685K392618K560519
37244D428323J037331j59732m76615j053744j888589j523870J86608J390142Q75331
37235B815185m68165j272386j140994k27305J019761J543325P43166j81497K09447
37226C040537R04377k53696k464018k241579J139125L565123J600833k372073
37218B918629l412634q89857J189392L48266j137289j88627K357940K991376M91047
37209D668243k423952k736958r03692K61463k30001l61025J357912L074026K115735
37200D821751p89752k304893j309609k28689q17806j366245J13907K161263J982923
37191B262850j8382q56582K54257Q10573o68387k079097j088180J066629J370617
$$ y = [-136115, 208734, -189986, -1024183, -992062, -281298, -314541, -1017499, -524814, 1867804, 4428323, 5465654, 5305922, 4829307, 3775563, 1886974, 363104, 549712, 1939854, 2815185, 2347020, 1074634, -66360, -293665, 726096, 2269421, 3012587, 2831090, 3040537, 3944914, 3691218, 1227200, -1014379, 124746, 3689869, 5290702, 2918629, -494005, -1383862, -194470, 153796, -983493, -1172120, 1185820, 4177196, 4668243, 2244291, -492667, -1396359, -1134896, -1364897, -1725922, -368010, 2706016, 4821751, 4031999, 1727106, 417497, 188808, -628998, -1995243, -1881336, 279927, 2262850, 2244468, 1387886, 1642143, 2452716, 1784329, -294768, -1382948, -316319, 1054298]
37182A054298m95755j850076r69812P80182J300824N54412o843K56518O35895
37173A259643M29488j75637n91590n72513l50871l28411o33164q61413m69039
37164b293507M43533J104376J064074P50978O63248N60520P5947l71979j48566
37155A848624M15361M14933j04074p1195Q89995J624015R00397r10250k250081
37146B757725k160351j135553l13747k35887n09123n00758j09314K99249M99877
37137a407882N05162J48305p08200j402638q41259Q55275J989728J361242j04857
37128C94876p18345k44107L07379L94769K47229M4573m0653L62067Q74299K32026
37118A854113j514208k058060j61820J582502L08198j995909r20442L041157M302343
$$ y = [1054298, 558543, -1291533, -2261345, -1481163, -180339, 374073, 367230, 623748, 1259643, 1689131, 1513494, 921904, 349391, -1480, -329891, -963055, -1824468, -2293507, -1849974, -745598, 318476, 1069454, 1732702, 2293222, 2369169, 1997190, 1848624, 2263985, 2678918, 2574844, 2503649, 3393644, 5017659, 5918056, 5007806, 2757725, 597374, -538179, -851926, -1087813, -1596936, -2097694, -2207008, -1907759, -1407882, -902720, -754415, -1462615, -2865253, -3706512, -2851237, -861509, 499733, 394876, -323469, -567576, -260197, 134572, 381801, 426374, 385721, 747788, 1622087, 1854113, 339905, -1718155, -1879975, -297473, 10725, -1985184, -2905626, 135531, 4437874]
37109D437874N23076l494802k841096N65375J716125J31196p17141J68430K79807
37100G68844j229843j833156j89109J206837n0627k223205j841075J096034K949847
37091a345453J488919j137219j586721M5991Q36502j99106o11502J192813K776377
37082A460601J264712j684624j931788Q14173K504825R79099j078778p67081P95714
37073B356853R43349m41841j608470j803510j378653n42724L06921M35866J82073
37064a550136P79015J833897J365631n18452r75495Q54603J818737j10550k041427
37055A455823q11057J589936J252936j300633k332737r09584N24173O26885L09088
37046D04830P3539l09813k02089O65638N13291j631072k992695q81746K159597
$$ y = [4437874, 4960950, 1466148, -1374948, -809573, 906552, 1037748, 320607, 489037, 768844, -460999, -2294155, -2483264, -1276427, -1327054, -3550259, -5391334, -4295300, -1345453, 143466, -993753, -2580474, -2534483, -1697981, -1897087, -2508589, -1315776, 1460601, 2725313, 1040689, -891099, -76926, 2427899, 3406998, 2328220, 1561139, 2356853, 3300202, 2858361, 1249891, -553619, -1932272, -2474996, -2168075, -1732209, -1550136, -771121, 1062776, 2428407, 1909955, 934460, 1789063, 3607800, 3497250, 1455823, 644766, 2234702, 3487638, 2187005, -145732, -1055316, -531143, 95742, 404830, 478369, 168556, -33533, 632105, 1145396, -485676, -3478371, -4360117, -2200520]
37037b200520J674714j473979k359295J46173K218618J818575R98486Q10957m86899
37028A146830k744506k790290O876J947757J031143J10297J471137K777168J515473
37019D471885n73782r35803n12805j039170j211819N67135K261342J112089j412956
37010B726116j630091N73194J785512M37156j295761j180895J46301O49270l43532
37001A867270j532913j254841M55645J598622P12958q35176o59815R12006J247185
36992B510941l88026j787821j535690q52786p38661k48299R79712J353312J89472
36983e17846o96697m4814P15944J71038o94684o10446j30148L2311K90692L38664
36973a145986j060822k869896j840831K113457M383039K262881p20563n12203
$$ y = [-2200520, -525806, -1999785, -4359080, -4212907, -1994289, -175714, 822772, 1633729, 1146830, -1597676, -4387966, -4381090, -2433333, -1402190, -1291893, 179244, 2956412, 4471885, 3898103, 2962300, 2449495, 1410325, 198506, 765641, 3026983, 4139072, 2726116, 1096025, 1669219, 3454731, 3891887, 2596126, 1415231, 1561532, 2210802, 1867270, 334357, -920484, -464839, 1133783, 1846741, 1011565, 351750, 1263756, 2510941, 2122915, 335094, -1200596, -2053382, -2792043, -3040342, -2060630, -707318, -517846, -1214543, -1259357, -543413, -372375, -1067059, -1677505, -1807653, -1775342, -1484650, -1145986, -2206808, -5076704, -6917535, -4804078, -421039, 1841842, 1121279, 609076]
36965F09076J219018Q17457p53252k15740J560144J020146j469067k010940J48049
36956I24891J439141q3285k038497j890538k23024J188484J729026J487412O51432
36947C185042j12905l36092o60067j566829k006553j046232K77988O85857P40487
36938h39304J125213P94062o39325r83196R33594K229288L40416k091553j294076
36929d24881J020192N77302j762269j527513J108280J443869j211278k084114
36921b860412O64450K771529J355548n83492o9128J004830L35383m19849N35322
36912B734181J219372l70495k232167j809317k33710L56538N73713J414759J330691
36903B983565o80043k095879q36136P09362l19827k069197j321827N26753n869
$$ y = [609076, 1828094, 2645551, 1892299, 1676559, 3236703, 4256849, 2787782, 776842, 924891, 2364032, 2280747, 242250, -1648288, -1871312, -682828, 1046198, 2533610, 3185042, 3072137, 2736045, 2075978, 509149, -1497404, -2543636, -2265648, -1579791, -839304, 285909, 1079971, 440646, -542550, 391044, 2620332, 2960748, 869195, -424881, 595311, 1172613, -589656, -2117169, -1008889, 434980, -776298, -2860412, -2195962, 575567, 1931115, 1347623, 1278495, 2283325, 2618708, 2198859, 2734181, 3953553, 3583058, 1350891, -458426, -692136, -335598, 238115, 1652874, 2983565, 2303522, 207643, -628493, 80869, -238958, -2308155, -3629982, -3103229, -3109098]
36894c109098j873107j011648K389366L754843J462536r04455o62904L14231j84898
36885A74866q24050M60175K517134K512090N545k517251k683711p15973R66462
36876a04713M68994j138444r80532J396086K661553L00270l225524l690511j131466
36867e444287Q39844R50328J293287K297284J329459k080955l900471j264352
36859e979863K797928L583869J181980q17527j168131j482078j852620l40180
36851d076622K708506L769268J151831k115259k477465o42335K38964m70056o12223
36842b525391P14761J713281R54676l95930m97266N77123J360551J079067R3790
36833C074662j017347j782144j757273j037904m07139k26517K08695J323603K009637
$$ y = [-3109098, -4982205, -5993853, -3604487, 150356, 1612892, 708437, 45533, 359764, 174866, -649184, -189009, 2328125, 4840215, 4845760, 2328509, -355202, -1071175, -104713, 364281, -774163, -1754695, -358609, 2302944, 2603214, -622310, -4312821, -5444287, -4604443, -3654115, -2360828, -63544, 1265915, -815040, -4715511, -5979863, -3181935, 401934, 1583914, 766387, -401744, -1883822, -3736442, -4076622, -1368116, 2401152, 3552983, 1437724, -1039741, -1682076, -1443112, -1913168, -2525391, -1810630, -97349, 857327, 461397, -35869, 541254, 1901805, 2980872, 3074662, 2057315, 275171, -1482102, -2520006, -2927145, -3153662, -2944967, -1621364, 388273]
36824C88273R94949r88656j853665q86195M95887P86610j6677r89865j289342
36815c358681m35777J243017K281995J429050m10151q96699O22050K067290J440517
36806C982611n29173j563664q07699M73425P63455l6981p82001m91061M71371
36797A480283P64021j55285j146233j019961m29720q03003j792928j609742n455
36788d718023J065884M71468k74993N57118K084857J986762j51914k038920j263889
36779b281650J852507M101632K445520k247375n328196l574087N47948J985466
36771b498235o4128j465999L74544K872979K691125O05005n74123n01002p62604
36762F77562j486750j475000p62961l45825J3831J238015K654669K585134R79247
$$ y = [388273, 1383222, 394566, -1459099, -2345294, -1849407, -1062797, -1079474, -2069339, -3358681, -3794458, -2551441, -269446, 1159604, 749453, -147246, 474804, 2542094, 3982611, 3453438, 1889774, 1082075, 1555500, 2318955, 2281974, 1499973, 1008912, 1480283, 2244304, 2089019, 942786, -77175, -506895, -1309898, -3102826, -4712568, -4718023, -3652139, -3180671, -3455664, -2898546, -813689, 1173073, 1021159, -1017761, -2281650, -429143, 3672489, 6118009, 3870634, -1457562, -5031649, -4483701, -2498235, -2562363, -4028362, -3653818, -780839, 1910286, 2515291, 1941168, 1440166, 677562, -809188, -2284188, -3047149, -3392974, -3379143, -2141128, 513541, 3098675, 4077922]
36753D077922n45900j074043j020682p71598m38029n37349j197793j214748L16837
36744b405383K017621J783164j85656j812264k045461j379030j46350J482421
36736b690938K332966J401740j59020m88482M9102j81910q39845k72582R34598
36727H5629M70519j451128j878239O7259J596740P62764o31766l41833R19696
36718d00359J367704J058164Q74608N77880j87600o36637l14544j77458o69761
36709A491997n66644O28597J126015l57961k145688k139518j074098p89907q39485
36700d666692L44761J980417J701952n06935j926325r13192J108388J939806J199423
36691B61603J05241j76157M17297Q55004K05053r10078r28633J37417L58836r19015
$$ y = [4077922, 3532022, 2457979, 1437297, 665699, 227670, -309679, -1507472, -2722220, -2405383, -387762, 1395402, 1209746, -602518, -2647979, -4027009, -4173359, -2690938, -357972, 1043768, 884748, 396266, 445368, 263458, -576387, -848969, 85629, 556148, -894980, -2773219, -2705960, -1109220, -346456, -978222, -1320055, -400359, 967345, 2025509, 2900117, 3477997, 3290397, 2653760, 2339216, 2161758, 1491997, 925353, 1553950, 2679965, 2322004, 176316, -1963202, -3037300, -3827207, -4666692, -4321931, -2341514, -639562, -1146497, -3072822, -3986014, -2877626, -937820, 261603, 366844, 190687, 607984, 1462988, 1668041, 757963, -170670, -33253, 325583, -593432]
36681e93432j465579L86716K492448J767488r16666j868345j51841J274524L98241
36672A323554r76671m79831J116386J284948m96066k146728j797416j2792J052241
36663a132375L36305q05982n06540P66944P35488j032606k024172n47152J509242
36654b700848J694788Q50660J188774K047757J006794j495892k348972o79411
36646d36350R11098O54946q5730J18249L75671l73737j226755r14947K12169R85214
36636B19828P73856m86737k009271j880777P05102L077488J906668j501743k367194
36627a562780M47377K634378J252550j059705j173159m91394j358438k153069
36619c464240l19983K457186K727508R85542L55420R85472L69952j579609k347363
$$ y = [-593432, -2059011, -1672295, 820153, 2587641, 1670975, -197370, -349211, 925313, 1323554, 346883, -132948, 983438, 2268386, 1772320, -374408, -2171824, -2184616, -1132375, -796070, -1602052, -2108592, -1341648, -606160, -1638766, -3662938, -4210090, -2700848, -1006060, -155400, 1033374, 3081131, 4087925, 2592033, 243061, -436350, 474748, 1129694, 1043964, 1162213, 1537884, 1164147, -62608, -977555, -765386, 219828, 993684, 506947, -1502324, -3383101, -2677999, 399489, 2306157, 804414, -1562780, -1115403, 1518975, 2771525, 1711820, 538661, 47267, -1311171, -3464240, -3784223, -1327037, 1400471, 2386013, 2741433, 3726905, 4096857, 2517248, 169885]
36610A69885j415490p56839p18845L73442K148859J910068o65687k376861j320539
36601b652007N22899Q95969L09188m4157m96070j260318j114318L93932J499717
36592a945165P74432o06920p67118K11166R75256R32693L23828n76050j295344
36583a973222j233823n49572R8949Q94510K399589L647666K784251Q9598j856350
36574D301596j772156j190638j453913j571887m56983Q53626R04425J09177k24471
36565e01224J68620P73228J198617R26079l48725j431411n97214J370206J421293
36556B979469j252376l354542j887175J638615L375662J953372o83652j979435
36548G89938r05990J384561K193061J23260k355834j649781J311189J726450j658638
$$ y = [169885, -1245605, -2002444, -2721289, -2347847, -198988, 1711080, 1045393, -1331468, -2652007, -2129108, -1233139, -923951, -968108, -1464178, -2724496, -3838814, -3444882, -1945165, -1170733, -1777653, -2544771, -2333605, -1358349, -425656, -101828, -677878, -1973222, -3207045, -3756617, -3657668, -2763158, -363569, 3284097, 6068348, 6157946, 4301596, 2529440, 1338802, -115111, -1686998, -2143981, -1290355, -385930, -276753, -501224, -332604, 440624, 1639241, 2565320, 2216595, 785184, 187970, 1558176, 2979469, 1727093, -1627449, -3514624, -1876009, 1499653, 3453025, 2769373, 789938, -116052, 1268509, 3461570, 3584830, 1228996, -420785, 890404, 2616854, 958216]
36539I58216m092417k090973J243398J670034M54629J004087K322177J259381
36531B728532j130748j254143M95217O41684p84321m57535J557205J311002j963945
36522A142948l910231j850102J388632K455915J856864J147934p1342j732953
36514D27665j557940J238170L427219J993363j375141k810428j439307N48759
36506D52360J479742J370420N77440n85875j445689j582204j291041p55693K03633
36497a576907J134000J159536N50314L49013K24436j055919k705887k295113J55942
36488d060585J513402K84990j058572l20540R19250M23594p91996m95030R16629
36479b668858J456926Q55488K26127j97772o69812o14310J98214O13996J22438
$$ y = [958216, -3134201, -5225174, -3981776, -2311742, -1857113, -853026, 1469151, 2728532, 1597784, 343641, 838858, 1480542, 696221, 238686, 1795891, 3106893, 1142948, -2767283, -4617385, -3228753, -772838, 1084026, 2231960, 2160618, 427665, -1130275, 107895, 3535114, 5528477, 4153336, 1342908, -96399, 452360, 1932102, 3302522, 3879962, 3294087, 1848398, 266194, -1024847, -1780540, -1576907, -442907, 716629, 1266943, 1615956, 1840392, 784473, -1921414, -4216527, -4060585, -2547183, -2262193, -3320765, -3641305, -2722055, -2298461, -3090457, -3585487, -2668858, -1211932, -356444, -130317, -328089, -997901, -1612211, -1413997, -800001, -677563]
36470f77563Q3755J000759R41335q82244j691499M31777K385785N23715k901894
36461g86074k766268Q01874K781027J346030j02310L47254R0202k368330l889494
36452d546089j763006J721635K939406J915511N60872j017967k971183l149310
36444f310131j36814L000047K223898j245822k417753J14531K542140K051969
36436a77935N35599N59761J191630K98690j482297j872711o44006L91642L61019
36427h38608N0120o108j14608j54089M31816J196776R73347l7614j51457J129370
36417B478945J899176M26029k207124l343083j976150M17032J852452J632084
36409A179361M42727m48751k38229N62866N76027o84443k033992k161588j236874
$$ y = [-677563, -593808, 406951, 1348286, 466042, -1225457, -793680, 1592105, 2115820, -786074, -3552342, -2750468, 30559, 1376589, 1274279, 1621533, 1711735, -656595, -4546089, -6309095, -4587460, -1648054, 267457, 828329, -189638, -3160821, -6310131, -6446945, -3446898, -1223000, -2468822, -4886575, -4772044, -2229904, -177935, 357664, 917425, 2109055, 2407745, 925448, -947263, -1591269, -1199627, -838608, -788488, -794596, -909204, -1063293, -631477, 565299, 1538646, 1501032, 1349575, 2478945, 4378121, 4804150, 2597026, -746057, -2722207, -2305175, -452723, 1179361, 1622088, 1173337, 935108, 1497974, 2074001, 1389558, -644434, -2806022, -4042896]
36400d042896k11451O62429J525332J853292J105024L3460o9395O89718R21378
36391B466891L797j158282j498940r13774L0533O75944O23452J63223N0989L31224
36381G75057J45223o45028q97216k64903j62618j069926q76328J600094L424674
36372B029029J394049k359414k891888O3732J884177N22318r12882k58102J95912
36363c33069j308645k233356l28349J919531J264380r41206j312288J00506Q44320
36354b328176N61764N55110M98684n59018j281026K7731J726512R71273j351407
36345a178553j786510J76642J741063J664859J445802J548692N09653j545694
36337B575954k257011r06942L90849L89501L82793J072222R73465n55136j600396
$$ y = [-4042896, -4254347, -3591918, -2066586, -213294, 891730, 925190, 855795, 1545513, 2466891, 2470688, 1312406, -186534, -1100308, -1069775, -393831, 229621, 392844, 443833, 775057, 920280, 275252, -621964, -886867, -1049485, -2119411, -2995739, -1395645, 2029029, 3423078, 1063664, -1828224, -1764492, 119685, 642003, -270879, -528981, -333069, -1641714, -3875070, -4203419, -2283888, -1019508, -1960714, -3273002, -3172496, -2328176, -1766412, -1211302, -712618, -1271636, -2552662, -2524931, -798419, 172854, -1178553, -2965063, -2788421, -1047358, 617501, 2063303, 3611995, 4121648, 2575954, 318943, -587999, -197150, 192351, 575144, 1647366, 2620831, 2065695, 465299]
36328D65299p43969O37423P94127J04680m29993j030510j806610j620871r7248
36319c727672J025359L96060o64677k51940J118163J508316N19700n80222r41577
36310a598490p16174j15026P05991J203732R68104L13127l22531q62309r28418
36301a351994J56912J846668K158988L08343j573027r96256J318760K243261M39930
36292D551585j907249j972421K55525K105527J400651j048024k339804q60118
36284A85672J726402K470917P28134j395809k094980j790254j497968r69141K66256
36275b370771J261672P74720n77029r64587q160P48193K09247p98782r29338q4179
36265b739014R10284J551173J765597J377599M07363m31481m86960k19176m19428
$$ y = [465299, -278670, 358753, 1152880, 1257560, 827567, -202943, -2009553, -3630424, -3727672, -2702313, -2306253, -2970930, -3222870, -2104707, -596391, -76691, -656913, -1598490, -2314664, -2429690, -1723699, -519967, 448137, 761264, 438733, -423576, -1351994, -1195082, 651586, 2810574, 3118917, 1545890, 549634, 1868394, 4111655, 4551585, 2644336, 671915, 927440, 3032967, 4433618, 3385594, 1045790, 185672, 1912074, 4382991, 5111125, 3715316, 1620336, -169918, -1667886, -2637027, -2370771, -1109099, -334379, -911408, -1875995, -1884155, -1135962, -926715, -1725497, -2654835, -2739014, -1828730, -277557, 1488040, 2865639, 3273002, 2841521, 2354561, 2135385, 1715957]
36256A715957n19375P57346K686277K481711o70410l385736k278454R25276J663162
36247C375754o19998j825326n503J518157j3148j912541o02837K096356J858861
36238C869775r02603j809764J47005J297042j99625j603368q85900p1197q48914
36229a007549j062369J073385K713442N15156l287967l498304L95408L588276
36221e70522K966203O44947l77295m20130j124440k053725j732168m50280K86536
36212b830874K40543L60115P25838M61580m53899r98271q15227n54126l46372
36203d210693L96440J303918J023190l48066p43030O89619J822797Q06831p68051
36194b7045m74859P67303L61879j130606p32778J491605J952453n62467k595487
$$ y = [1715957, 1196582, 1953928, 4640205, 7121916, 6451506, 3065770, 787316, 1712592, 3375754, 2755756, 930430, 924927, 2443084, 2429936, 517395, -85442, 2010914, 3869775, 2967172, 1157408, 1304413, 2601455, 2401830, 798462, -87438, -158635, -1007549, -2069918, -996533, 1716909, 2232065, -1055902, -4554206, -4158798, -570522, 2395681, 3040628, 2663333, 2243203, 1118763, -934962, -2667130, -3117410, -2830874, -2590331, -2230216, -1504378, -1042798, -1496697, -2494968, -3310195, -3864321, -4210693, -3814253, -2510335, -1487145, -1835211, -2578241, -1888622, -65825, 741006, -27045, -501904, 265399, 627278, -503328, -1236106, 255499, 2207952, 1645485, -950002]
36185i50002j410900J039322J856072J491101J512056J161729n36484j761352
36177B401542n35858J538043J601925o6183j237799j603380k097729k076900p18286
36168b794625M26313o9136l08567J594494L085632R46839k371310j964578J222152
36159b32786J777705q97289j740840Q26408K228886K33289j050989J013589K405419
36150D563392m25609l870075k893255R12451K481496J145795m0550k94656j097319
36141D81670j904063q90630R66166R88381n73976q86183Q42526K432423K197118
36132C653432N57042j372668k425306j428388J093005K354677P79198j332012
36124A878980j071836P05015J144569J1915o47681k72844K4724O2851K42633l86634
$$ y = [-950002, -2360902, -1321580, 534492, 2025593, 3537649, 4699378, 4162894, 2401542, 1865684, 3403727, 5005652, 4939469, 3701670, 2098290, 561, -2076339, -2794625, -2368312, -2437448, -2746015, -1151521, 1934111, 2880950, 509640, -1454938, -232786, 1544919, 647630, -1093210, -266802, 1962084, 2195373, 1144384, 2157973, 4563392, 4137783, 267708, -2625547, -1713096, 768400, 1914195, 1873645, 1578989, 481670, -1422393, -2313023, -1346857, -358476, -932452, -1818635, -976109, 1456314, 3653432, 4210474, 2837806, 412500, -1015888, 77117, 2431794, 3210992, 1878980, 807144, 1512159, 2656728, 2668643, 2020962, 1748118, 1772842, 1835693, 2078326, 1691692]
36114A691692k450275l661252j534323K018004K644444j14646k275164j391790
36106e073310O18557J298518Q61758M80929K31222k2050R3473L43075n6211p34861
36096a958900m52232N99830Q27863j00815p08413k02981M93404O23827O04379
36087b74038P67682Q20739P54689O71537j19428j938946l025718j354632J896372
36078a801743L221203J426596r55492j305587K21681J858070K157787M87008k359175
36069B950348l878642k329941N24789J438007K30544m35693K97699M46604p33647
36060a489932j184549K49347J777849J804595J191141Q97023K41335q93487j042623
36051A550699q7690j83598j764530j873838Q89349K970031Q95349k893459l300325
$$ y = [1691692, -758583, -4419835, -5954158, -3936154, -1291710, -1406356, -3681520, -5073310, -4454753, -3156235, -2294477, -1813548, -1582326, -1604376, -1510903, -1167828, -1224039, -1958900, -2411132, -1811302, -983439, -1084254, -1792667, -1995648, -1502244, -878417, -274038, 493644, 1314383, 2069072, 2740609, 2621181, 682235, -2343483, -3698115, -1801743, 1419460, 2846056, 1890564, 584977, 806658, 2664728, 4822515, 5309523, 2950348, -928294, -3258235, -2733446, -1295439, -1064895, -1500588, -1202889, -756285, -1489932, -2674481, -2425134, -647285, 1157310, 2348451, 3245474, 3486809, 2593322, 1550699, 1463009, 1279411, -485119, -2358957, -1469608, 1500423, 2395772, -497687, -3798012]
36042c798012N5829K860518K496985M25145j342231k251593j705735P04249K994661
36033D39816K280300p80539k295059p94873P73627O1856j139576n30605O88003
36024a297050M11516k78527P48777K111748O42491k816963l621541j61387L315176
36015i45760K601312p46762k131691k83295J934265J958274R5304j859309k294429
36006a672091m45526K476918L289045L98672l003635k305423J844795L735592
35998D318347N81452l369196l098967J6838R06038j387847k844931r59097J915402
35989c921961K557834J111959j85969l85918k21547k96235l70114j13492K79210
35980a546233K57240l75037q31951J0480J804479K436125P04049j504792j425044
$$ y = [-3798012, -3742183, -881665, 1615320, 2040465, 698234, -1553359, -3259094, -2554845, 439816, 2720116, 1939577, -355482, -1150355, -376728, -314872, -1454448, -1985053, -1297050, -885534, -1164061, -415284, 1696464, 2338955, -478008, -4099549, -4260936, -945760, 1655552, 908790, -1222901, -1506196, 428069, 2386343, 2481647, 622338, -1672091, -2117617, 359301, 3648346, 4047018, 1043383, -1262040, 582755, 4318347, 4899799, 1530603, -1568364, -1551526, -645488, -2033335, -4878266, -5837363, -3921961, -1364127, -252168, -438137, -824055, -1045602, -1341837, -1711951, -1825443, -1546233, -1288993, -1664030, -2495981, -2485501, -681022, 1755103, 2459152, 954360, -470684]
35971d70684O40780J658391K51938j451879j165695L65124R36877K21900k70689
35962G16063J12037L37968l52492j138989r35892j05093P4541o71487j168274
35953c131618m53505Q75792J469484Q62661k36899q57344m25960Q94770J896564
35944H93945J181709p50388j398663K97954J754088L10951k155033j558128J861583
35935D38018L385633R36029j840067j425526N32563P53072m35808o67248J89218
35926A865884O65179O36127N67517k76088j937183k201886p6259J475496j30389
35917E88398k364184j445194J151042J012814j770871k814499n48574K027414
35909d163654K691279K216844J107765j021160k476252q28883K237684K419387
$$ y = [-470684, 170096, 1828487, 2080425, 628546, -537149, -172025, 764852, 986752, 716063, 828100, 1166068, 813576, -325413, -1261305, -1366398, -1291857, -1963344, -3131618, -3585123, -2709331, -1239847, -377186, -614085, -1471429, -1897389, -1002619, 893945, 2075654, 1325266, -73397, 224557, 1978645, 2289596, 134563, -1423565, 438018, 3823651, 4759680, 2919613, 1494087, 2026650, 2779722, 2343914, 1676666, 1865884, 2531063, 3167190, 3734707, 3458619, 1521436, -680450, -756709, 718787, 588398, -1775786, -3220980, -2069938, -1057124, -2827995, -5642494, -6191068, -4163654, -1472375, 744469, 1852234, 831074, -1645178, -2474061, -236377, 2183010]
35901B183010k39511j214973P25467J519456o74057k142019o60517J77199k275319
35892b601264m082304j028351L729394M108140L39800j996042n44710J587937
35884d87400J565010J23256r83273j200830n44779N34924P12148n69814j560027
35875b410785m97746J408280J691973M31125k81653N6503R6756l69903m6070R99409
35865A077889P24948j708495m046342l464788j14442K875003K906637Q98965N7614
35856g93011J485540K410672K70961k851428k757879N24024K609689J352692m20982
35847A830278q4300Q97263M20871n89612o85079p41789j381981p82607J669686
35838E52730K772716L84642k166078r97095J740665J333461j552145k149300L12382
$$ y = [2183010, 1943499, 728526, 1453993, 2973449, 2299392, 157373, -503144, -325945, -2601264, -6683568, -7711919, -3982525, 125615, 465415, -1530627, -2075337, -487400, 1077610, 1200866, 217593, -983237, -1528016, -993092, -280944, -850758, -2410785, -2908531, -1500251, 191722, 622847, 341194, 397697, 494453, 124550, 78480, 1077889, 1802837, 94342, -3952000, -7416788, -7531230, -4656227, -1749590, -850625, -793011, 692529, 3103201, 3374162, 522734, -2235145, -1711121, 898568, 2251260, 1830278, 1745978, 2643241, 3064112, 2474500, 1789421, 1047632, -334349, -1116956, 552730, 3325446, 3710088, 1544010, 546915, 2287580, 3621041, 2068896, -80404, 231978]
35829B31978J753158M06822r43976o67390p41658j975625j815878P80328K617453
35820c54788J181865j235169j298467L14162P21732l53411p14234M76498J645115
35811C83303J227077o32778k534321k912567j225026J181191K170385J364725
35803i78011M86462N71122L95377j150864k616903j771145R08587K493893J435062
35794b26420m87850o98689P96585J650542M08947j699144k573207j851368p79333
35785e459937j10919N16953J244360J473190J017329N45058M85109N73678O76843
35776I61664Q15311L61549j138763k345785j481947N01976P87683p48416j060718
35767c347446Q23559J794010J5158j532575j27299J573419j58585l330658k856253
$$ y = [231978, 1985136, 2391958, 1447982, 780592, 38934, -1936691, -3752569, -2972241, -354788, 827077, -408092, -1706559, -1392397, -670665, -1024076, -1738310, -1261812, 383303, 1610380, 977602, -1556719, -4469286, -5694312, -4513121, -2342736, -978011, -491549, 79573, 474950, -675914, -3292817, -5063962, -4155375, -1661482, -226420, -714270, -1412959, -616374, 1034168, 1443115, -256029, -2829236, -4680604, -5459937, -5570856, -5053903, -3809543, -2336353, -1319024, -773966, -288857, 284821, 961664, 1776975, 2138524, 999761, -1346024, -2827971, -2325995, -1538312, -2286728, -3347446, -2523887, -729877, -714719, -2247294, -2374593, -801174, -959759, -4290417, -7146670]
35758g146670J397486M325692L068669J10640j430678j407090p67793K59046J079295
35749e11403P18757l49619p39403n74905q90223j082410J1761J118696K14577
35740b084172j318452m27745J937458J733264j163764k183215K75845J882993
35732a347788l16435k734250j108070K618320L636304J469349n85662j066403
35724E65365j078976q26578M53232J726174J052355q53419j147086Q09283K366128
35715C066478J409458r11572k082674j346137p2655K29343l90654o61087m9191
35706h08691K42460q52406k056825j270346R14259J689793M38006k05104J163550
35697g45304K182207P52241j121490m15222J941560K445903L00591j862309k143964
$$ y = [-7146670, -5749184, -1423492, 1645177, 1755817, 325139, -1081951, -1849744, -1590698, -511403, 207354, -142265, -881668, -1456573, -2346796, -3429206, -3417445, -2298749, -2084172, -3402624, -3830369, -1892911, -159647, -1323411, -3506626, -3230781, -1347788, -1664223, -4398473, -5506543, -2888223, 748081, 2217430, 1631768, 565365, -513611, -1340189, -886957, 839217, 1891572, 1038153, -108933, 700350, 3066478, 4475936, 3564364, 1481690, 135553, 62898, 292241, -98413, -759500, -808691, -566231, -1418637, -3475462, -4745808, -3831549, -2141756, -1703750, -1908854, -745304, 1436903, 2189144, 1067654, 652432, 2593992, 5039895, 5340486, 3478177, 1334213]
35688A334213j368451p80377k68392N06920J051874Q17319n7429j053701j504272
35679a322296p35038R93541J997989Q71154j415324k297550o63404J808701K617205
35670A854978J167840p45563j053304J76638R09468M1748q66334l5525J342053
35661B791999O75961j648996k483551r56762L9107j196021k100520j45194K721871
35652b302106L076432J271504K24203N18472L55391n57685p12497k9320R749o11916
35642A242227m61126K99043R5595o94657k8570J664888J351869j401995k822511
35633g55237o05224K117340J369068j667865k675422o69774J173694P27395m34004
35624a420029k07667Q34419P23927r12642k370943j816313P88832L288722L007899
$$ y = [1334213, -34238, -814615, -1083007, -576087, 475787, 1293106, 1235677, 181976, -1322296, -2057334, -1063793, 934196, 1805350, 390026, -1907524, -2570928, -762227, 1854978, 3022818, 2277255, 1223951, 1400589, 2310057, 2351805, 1485471, 1449946, 2791999, 3467960, 1818964, -664587, -1621349, -1582242, -2778263, -4878783, -5023977, -2302106, 774326, 2045830, 2270033, 2788505, 3143896, 2586211, 1873714, 1844394, 1854143, 1242227, 781101, 1080144, 1175739, 481082, 452512, 2117400, 3469269, 2067274, -755237, -1360461, 756879, 2125947, 458082, -2217340, -2887114, -1713420, -986025, -1420029, -1627696, -793277, -69350, -981992, -3352935, -5169248, -4380416, -1091694, 1916205]
35615A916205k88362l323512k584428J243058L826243K713890K70175k77166M21512
35606C917615l05546j981316j440321J452579K600173j38184l175333k487067
35598a557400K74597Q10729q13969r62998P22167O88202j723639k342363P77077
35589d127597L351868J443131k044613j911151J255914K622823R66289l73112
35581A183552J41269K31597j175704j806170n36959K05169j149144k087905p5512
35572e069807K944224L339398J215199k26906L09165R95742L60026p86084j192302
35563A888655q16549j60762M37107N03475k14785q94827m60182O36016Q94771
35554A812919J75363q7825M84480K84248j502022k899068j648068J354560K975779
$$ y = [1916205, 1627843, -1695669, -4280097, -3037039, 789204, 3503094, 3773269, 3496103, 3917615, 3612069, 1630753, 190432, 1643011, 4243184, 4105000, 929667, -1557400, -1282803, -472074, -1286043, -2249041, -1526874, -838672, -2562311, -4904674, -4127597, -775729, 667402, -1377211, -3288362, -2032448, 590375, 1556664, 1183552, 1324821, 1556418, 380714, -1425456, -1962415, -1757246, -2906390, -4994295, -5069807, -2125583, 1213815, 2429014, 2202108, 2511273, 3507015, 3867041, 3080957, 1888655, 1072106, 911344, 1348451, 1851926, 1637141, 742314, 282132, 918148, 1812919, 1988282, 1900457, 2384937, 2669185, 1167163, -1731905, -3379973, -2025413, 950366]
35545I50366J724688r24520k765188k780562j037174J525779L033859K173579
35537A900827J56885m84915N52324J011417o1740o16830P14803J749772J38322
35528E060865k303670j963388Q59224K200651L53030j938972j954107n72736m7534
35519c06637o95610j356028j270905k46365J396892K189724Q14122j242467q81475
35510a598749J727108K558567k00140k864384j811838Q82945J185277k16744K26101
35501a11857K086041J514071j659413k983552o01264J765115J086129l70104L47854
35492A073020J609546L55910k291092k719309n39351J288808J252405O51976M19999
35483A101912j23429j002493r20547L92332J368651Q64997n16347j790921k527280
$$ y = [950366, 2675054, 1750534, -1014654, -3795216, -4832390, -3306611, -272752, 1900827, 2057712, 1572797, 2125121, 3136538, 3074798, 2457968, 3172771, 4922543, 5060865, 2757195, 793807, 1653031, 3853682, 4206712, 2267740, 313633, -259103, -306637, -1002247, -2358275, -3629180, -3875545, -2478653, -288929, 525193, -717274, -1598749, 128359, 2686926, 2486786, -377598, -2189436, -1306491, -121214, -337958, -111857, 1974184, 3488255, 1828842, -1154710, -1755974, 9141, 1095270, 725166, 1073020, 2682566, 3038476, 747384, -1971925, -2511276, -1222468, 29937, 681913, 1101912, 978483, -24010, -944557, -552225, 816426, 1681423, 1165076, -625845, -3153125]
35474c153125k137363k12816J959479K278127Q84474J95421J038456J205649o88877
35465A369425k434821j601810M30116P78118j20928M77805K456791K569784j60289
35456C764191k467205j739076K55120O38276j95286j51625N49008P1913j293370
35447e68054j251179P03252K333380J952931M11761q16757j484386j657725q36317
35438a213094P81994J581403M93651j217656j470855j31768R26506K93273j443736
35429a400282k604772k082636j7034K511714M083063L609550J098514j926277
35421C271840l212063j818783N63106J243618k01729j397492n68381Q66143M91406
35412g62335j403471k320068j254107K69929R27333J193632J638154J569113M18328
$$ y = [-3153125, -5290488, -5503304, -3543825, -1265698, -381224, -185803, 852653, 2058302, 1369425, -1065396, -2667206, -2237090, -1458972, -1579900, -1102095, 1354696, 3924480, 3764191, 1296986, -442090, -186970, 451306, 256020, 104395, 653403, 725316, -568054, -1819233, -1115981, 1217399, 3170330, 3582091, 2765334, 1280948, -376777, -1213094, -431100, 1150303, 1643954, 426298, -1044557, -1176325, -249819, 43454, -1400282, -4005054, -6087690, -6104724, -3593010, 490053, 4099603, 5198117, 3271840, 59777, -1759006, -1195900, 47718, -154011, -1551503, -2119884, -1253741, -762335, -2165806, -4485874, -5739981, -5470052, -4542719, -3349087, -1710933, -141820, 276508]
35403B76508r49748j379389q75876j37763M17248N54848J78141o7196P24091K033037
35393G73901J977403j27769k447050k814287j241592O77122J866981K225865J825654
35384B716228Q31163k11258q45619j143871j228345r24202k65520L15697N96299
35375a59428O52142L13736m71229q54725r7376P39072K6730j405472r73916J289057
35365i41409J969516n84787l204146k403940M25459J407018O0566p02274L38625
35356c635372J217599N63156k74201K01793J280147J403658K89608j221469k226514
35347b401595k020524m13069J586669K320020J321888k1035j02303J068821J989555
35338C328427J384458l68974j596132j261909k48047m3880n63551n67759m7708
$$ y = [276508, -673240, -2052629, -2928505, -3066268, -2649020, -2094172, -1916031, -1983227, -1259136, 773901, 2751304, 2623535, 176485, -2637802, -3879394, -3202272, -1335291, 890574, 2716228, 3547391, 3336133, 2490514, 1346643, 118298, -805904, -1071424, -755727, -159428, 492714, 806450, 335221, -519504, -616880, 122192, 148922, -1256550, -2230466, -941409, 1028107, 443320, -2760826, -5164766, -4739307, -3332289, -3271723, -3973997, -3635372, -2417773, -1854617, -2128818, -1927025, -646878, 756780, 1046388, -175081, -2401595, -4422119, -4835188, -3248519, -928499, 393389, 372354, 270051, 1338872, 3328427, 4712885, 4343911, 2747779, 1485870, 1237823, 1193943, 630392, 62633, 14925]
35329A4925k60734j123205r21475N09827R19231n43846j376902J41445J557075
35320a083659J44361k093068j335415J651270K563674M45226j206786n59897Q2845
35311a391449p66281r28490R92334K287883M93120k009660j473561J195867J897780
35302B97543k31445j862661r83781M04858J97765m25194M20950J659674R58225
35293D35934r87717r77914J613049L203392J030981k417194k587989O79760K949913
35284B942215J418850j726703l083572k300929r16554N60812K069732K376297
35276A340148O79515j364276j680404q08008m92202m16384P89418K198899J614838
35267A861544l46889p19402R24432J550586l65768k267343j611969K57490N42512
$$ y = [14925, -245809, -1369014, -2290489, -1780662, -861431, -1405277, -2782179, -2640734, -1083659, -939298, -3032366, -4367781, -2716511, -152837, 292389, -914397, -1474294, -1391449, -2157730, -3086220, -2093886, 193997, 687117, -1322543, -2796104, -1600237, 297543, 66098, -1796563, -2780344, -2375486, -2177721, -2602915, -2181965, -522291, 435934, -551783, -1529697, 83352, 3286744, 4317725, 1900531, -687458, -7698, 2942215, 4361065, 2634362, -449210, -2750139, -3666693, -3105881, -1036149, 1340148, 2019663, 655387, -1025017, -1833025, -2325227, -2741611, -1952193, 246706, 1861544, 1514655, 795253, 1719685, 3270271, 2904503, 637160, -974809, -717319, -174807]
35258a74807p63269j422948m92256Q79354J567015J605822J371173Q70603l0816
35249C409871j190598j965866j540802o1882Q80366K8533j517995j575042j11874
35240c645289O94484k7086m95143N33695J395870J94061j719344j355335J329516
35231c094571K892842J044784k039230k517262p3439J732406O59020q70386M40064
35222a825772L180436K848518j022523l409523j137109K237807K007955n56274
35214B323515j034156N78606M59153j907487k809782q36567J005964Q55367O66504
35205f98883J581659J447399o22827j709064j38018J036012q11022k920355j571277
35196d406376J553413K137779K55025l26013J282336K095950O96795q07206q74269
$$ y = [-174807, -938076, -2361024, -2853280, -1973926, -406911, 1198911, 2570084, 3440687, 3409871, 2219273, 253407, -1287395, -1349277, -468911, -440378, -1958373, -3533415, -3645289, -2950805, -2977891, -3473034, -2939339, -1543469, -1349408, -3068752, -4424087, -3094571, -201729, 843055, -1196175, -3713437, -3786876, -2054470, -1395450, -2265836, -1825772, 1354664, 4203182, 3180659, -228864, -1365973, 871834, 2879789, 2323515, 1289359, 1867965, 2327118, 419631, -2390151, -3226718, -2220754, -1365387, -698883, 882776, 2330175, 1707348, -1716, -139734, 896278, 85256, -2835099, -4406376, -2852963, -715184, -460159, -786172, 496164, 2592114, 3288909, 2481703, 1607434]
35187A607434p41217j462110j914943j098133R4352O76961J065969J588553J399491
35178A216357J85646o77077j39698N88451k61283k119388k579239p73015J250751
35169c308495J225077k42747n51037J117721K444676J172056j632940k963603
35161b739292j741662L98051J702485J774397P35294r03719j522642R5069K279667
35152G7648K053104l80213j632435m01695O27869l50811j135281K36559J493392
35143E88137j16131k743400k690017m15397N32490m40171m51985J464471K722634
35134a549369J699452K49252L94809J348431J262311j33319j771719k488314j398260
35125b386726J272077L357041K624300j57712j945016j462399l19854K37578J015728
$$ y = [1607434, 866217, -595893, -2510836, -3608969, -3514617, -2837656, -1771687, -183134, 1216357, 1402003, 724926, 585228, 1173679, 912396, -1206992, -3786231, -4559246, -3308495, -2083418, -2326165, -2877202, -1759481, 685195, 1857251, 224311, -2739292, -4480954, -4082903, -2380418, -606021, 129273, -774446, -2297088, -2202019, 77648, 2130752, 1750539, 118104, -283591, 344278, -6533, -1141814, -905255, 588137, 472006, -2271394, -4961411, -5376808, -4844318, -5284489, -5736474, -4272003, -1549369, 150083, 399335, 794144, 2142575, 3404886, 3271567, 1499848, -988466, -2386726, -1114649, 2242392, 4866692, 4708980, 2763964, 1301565, 981711, 1219289, 2235017]
35116B235017K334149K486451M77486j771514j935188n31938J93365n49672j806240
35107A131916k741321k972722j861690N84710K565293K193081K84530l96621J067526
35098a45298K473818J689401m34625j489075p64622L29969N64635J24083m06076
35089A942210q82524j066431m88509M83208N28242p73499j921122j430547M0822
35080c568150Q25894P49263Q43475J093554M76291p67510r49861N02153K034436
35071A239545K092820P92756q98276k079304j799179Q4268J616866N21847k217537
35062f46194l040298q98304J126071O11895p53549m82237Q24447J413560J567295
35053b77314J890389Q93596k148468m046342j617450K659474L528453Q55123l15014
$$ y = [2235017, 4569166, 7055617, 7533103, 5761589, 3826401, 3294463, 3487828, 2938156, 1131916, -1609405, -4582127, -6443817, -5859107, -3293814, -1100733, -816203, -1212824, -145298, 2328520, 4017921, 3583296, 2094221, 1329599, 1659568, 2224203, 2348286, 1942210, 1059686, -6745, -495254, -12046, 516196, -257303, -2178425, -3608972, -3568150, -2742256, -1992993, -1149518, -55964, 420327, -347183, -1297044, -794891, 1239545, 3332365, 4125121, 3226845, 1147541, -651638, -567370, 1049496, 1571343, -646194, -3686492, -4584796, -3458725, -2846830, -3600379, -4082616, -3258169, -1844609, -277314, 1613075, 2506671, 358203, -3688139, -5305589, -2646115, 882338, 1737461, 1422447]
35044A422447J992464L453311M09574m195636m965568j445898J893724J765776
35036C30194o63416k253830j502135O16671K141996J954170N41765p38176j024665
35027e97426m96968J28268K87813l396j62053J96827N05347L3057o19211j71365
35017h99107J008119J088504j08237m30317R96354J936422O29443j201346j261700
35008A758135l49879l54497o90960J08304J100371O48269k32373J71694O56312
34999B815376o07552j897453o55034J162289j81927l131421k599187J346874L112802
34990f35233P72311j098916K61335J345070o13395k396614p85534J588687J189457
34981c72832j65274Q22384K557202J527516j219125k000550p35379r6093k72408
$$ y = [1422447, 3414911, 6868222, 7277796, 3082160, -1883408, -3329306, -1435582, 330194, -333222, -2587052, -4089187, -3472516, -1330520, 623650, 1165415, 427239, -597426, -1094394, -966126, -678313, -681709, -843762, -646935, -141588, -108531, -727742, -899107, 109012, 1197516, 1089279, 658962, 1655316, 3591738, 4221181, 3019835, 1758135, 1408256, 1053759, 362799, 471103, 1571474, 2219743, 1987370, 2159064, 2815376, 2207824, 310371, -344663, 817626, 635699, -2495722, -5094909, -3748035, -635233, 137078, -961838, -700503, 644567, 31172, -2365442, -3150976, -1562289, -372832, -538106, 284278, 2841480, 4368996, 3149871, 1149321, 413942, 317849, 45441]
$$ [...]
##END NTUPLES=NMR SPECTRUM
##END=
