##TITLE=31Pdec_1BnP3005
 CDCl3, 124 sc
 31.5.2022
##JCAMPDX= 6.0         $$ Bruker NMR JCAMP-DX V2.0
##DATA TYPE= NMR SPECTRUM
##DATA CLASS= NTUPLES
##ORIGIN= UXNMR, Bruker Analytische Messtechnik GmbH
##OWNER= root
$$ XWIN-NMR		Version 3.5
$$ Tue May 31 14:21:35 2022 Russian Standard Time (UT+4h)  she@DPX200
##.OBSERVE FREQUENCY= 81.013821
##.OBSERVE NUCLEUS= ^31P
##.ACQUISITION MODE= SIMULTANEOUS
##.ACQUISITION SCHEME= undefined
##.AVERAGES= 124
##.DIGITISER RES= 16
##SPECTROMETER/DATA SYSTEM= spect
##.PULSE SEQUENCE= zgpg30
##.SOLVENT NAME= CD3CN
##.SHIFT REFERENCE= (INTERNAL, CD3CN, 0, 248.564)
##AUDIT TRAIL= $$ (NUMBER, WHEN, WHO, WHERE, WHAT)
$$ ##TITLE= Audit trail, XWIN-NMR		Version 3.5
$$ ##JCAMPDX= 5.01
$$ ##ORIGIN= Bruker BioSpin GmbH
$$ ##OWNER= she
$$ F:/spectra/data/she/nmr/P31/1/pdata/1/auditp.txt
$$ ##AUDIT TRAIL=  $$ (NUMBER, WHEN, WHO, WHERE, WHAT)
(   1,<2022-05-31 14:20:25.10 +0400>,<she>,<DPX200>,
      <continue with go, POWCHK disabled, PULCHK disabled
       configuration hash MD5:
       00 E9 B6 7A A2 85 ED C7 34 08 36 98 17 FE 4E 26
       data hash MD5: 32K
       DE 6A C1 FE 59 3F F6 76 42 E9 F6 B2 0D 82 20 EF>)
(   2,<2022-05-31 14:20:27.39 +0400>,<she>,<DPX200>,
      <Start of raw data processing
       efp BC_mod = 2 LB = 1 FT_mod = 6 PKNL = 1 PHC0 = -10074.89 PHC1 = 464.4538 SI = 64K 
       data hash MD5: 64K
       75 05 82 3C BF 5E E5 67 B3 31 29 95 50 38 14 D8>)
(   3,<2022-05-31 14:21:04.50 +0400>,<she>,<DPX200>,
      <pk PHC0 = -151.8985 PHC1 = -14.40001 
       data hash MD5: 64K
       77 55 CD C5 50 10 84 A3 D2 E2 8C 5A AF 3B 0F D5>)
(   4,<2022-05-31 14:21:07.95 +0400>,<she>,<DPX200>,
      <abs ABSG = 5 
       data hash MD5: 64K
       78 4F 13 86 9F B0 39 5A E1 27 C4 36 26 A2 1B 76>)
$$ ##END=
$$ 
$$ hash MD5
$$ 88 17 1F 71 3B 0B 04 11 71 49 63 E4 42 61 FD 04
##$RELAX= 
##$RELAX= 
##$RELAX= 
##$RELAX= 
##$RELAX= 
##$RELAX= 
##$RELAX= 
##$RELAX= 
$$ Bruker specific parameters
$$ --------------------------
##$DU= <F:/spectra>
##$EXPNO= 1
##$NAME= <P31>
##$PROCNO= 1
##$TYPE= <nmr>
##$USER= <she>
##$AMP= (0..31)
100 100 100 100 100 100 100 100 100 100 100 100 100 100 100 100 100 100 
100 100 100 100 100 100 100 100 100 100 100 100 100 100 
##$AQSEQ= 0
##$AQ_mod= 1
##$AUNM= <au_zg>
##$AUTOPOS= <>
##$BF1= 81.014009
##$BF2= 200.13
##$BF3= 200.13
##$BF4= 200.13
##$BF5= 200.13
##$BF6= 200.13
##$BF7= 200.13
##$BF8= 200.13
##$BYTORDA= 1
##$CFDGTYP= 0
##$CFRGTYP= 5
##$CHEMSTR= <none>
##$CNST= (0..31)
1 1 145 1 1 1 1 1 1 1 1 1 1 1 1 1 1 1 1 1 1 1 1 1 1 1 1 1 1 1 1 1 
##$CPDPRG= <waltz16>
##$CPDPRG1= <>
##$CPDPRG2= <waltz16>
##$CPDPRG3= <>
##$CPDPRG4= <mlev>
##$CPDPRG5= <mlev>
##$CPDPRG6= <mlev>
##$CPDPRG7= <mlev>
##$CPDPRG8= <mlev>
##$CPDPRGB= <>
##$CPDPRGT= <>
##$D= (0..31)
0 1 0 0 0 0 0 0 0 0 0 0.03 2e-05 3e-06 0 0 0 0 0 0 0 0 0 0 0 0 0 0 0 0 
0 0 
##$DATE= 1653992218
##$DBL= (0..7)
120 120 120 11 120 120 24 19 
##$DBP= (0..7)
150 150 150 150 150 150 150 150 
##$DBP07= 0
##$DBPNAM0= <>
##$DBPNAM1= <>
$$ [...]
##$SUBNAM3= <"">
##$SUBNAM4= <"">
##$SUBNAM5= <"">
##$SUBNAM6= <"">
##$SUBNAM7= <"">
##$SUBNAM8= <"">
##$SUBNAM9= <"">
##$SW= 501.771253377433
##$SWIBOX= (0..15)
0 1 3 0 0 0 0 0 0 0 0 0 0 0 0 0 
##$SW_h= 40650.406504065
##$TD= 32768
##$TD0= 1
##$TE= 0
##$TE2= 300
##$TE3= 300
##$TEG= 300
##$TL= (0..7)
0 120 53 12 22 120 120 120 
##$TP= (0..7)
150 150 150 150 150 150 150 150 
##$TP07= 0
##$TPNAME0= <>
##$TPNAME1= <>
##$TPNAME2= <>
##$TPNAME3= <>
##$TPNAME4= <>
##$TPNAME5= <>
##$TPNAME6= <>
##$TPNAME7= <>
##$TPOAL= (0..7)
0.5 0.5 0.5 0.5 0.5 0.5 0.5 0.5 
##$TPOFFS= (0..7)
0 0 0 0 0 0 0 0 
##$TUNHIN= 0
##$TUNHOUT= 0
##$TUNXOUT= 0
##$USERA1= <user>
##$USERA2= <user>
##$USERA3= <user>
##$USERA4= <user>
##$USERA5= <user>
##$V9= 5
##$VALIST= <valist>
##$VCLIST= <CCCCCCCCCCCCCCC>
##$VD= 0
##$VDLIST= <DDDDDDDDDDDDDDD>
##$VPLIST= <PPPPPPPPPPPPPPP>
##$VTLIST= <TTTTTTTTTTTTTTT>
##$WBST= 1024
##$WBSW= 4
##$XGAIN= (0..3)
0 0 0 0 
##$XL= 0
##$YL= 0
##$YMAX_a= 2394
##$YMIN_a= -12123
##$ZGOPTNS= <>
##$ZL1= 120
##$ZL2= 120
##$ZL3= 120
##$ZL4= 120
##$ABSF1= 248.5645
##$ABSF2= -253.2056
##$ABSG= 5
##$ABSL= 3
##$ALPHA= 0
##$AQORDER= 0
##$ASSFAC= 0
##$ASSFACI= 0
##$ASSFACX= 0
##$ASSWID= 0
##$AUNMP= <proc_1d>
##$AZFE= 0.1
##$AZFW= 0.5
##$BCFW= 0
##$BC_mod= 2
##$BYTORDP= 0
##$COROFFS= 0
##$CY= -3
##$DATMOD= 1
##$DC= 0
##$DFILT= <>
##$DTYPP= 0
##$F1P= 0
##$F2P= 0
##$FCOR= 1
##$FTSIZE= 65536
##$FT_mod= 6
##$GAMMA= 0
##$GB= 0
##$INTBC= 1
##$INTSCL= 5.30512e-09
##$ISEN= 30
##$LB= 1
##$LEV0= 0
##$LPBIN= 0
##$MAXI= 10000
##$MC2= 0
##$MEAN= 0
##$ME_mod= 0
##$MI= 50
##$NCOEF= 0
##$NC_proc= -7
##$NLEV= 6
##$NOISF1= 182.463
##$NOISF2= 159.3651
##$NSP= 0
##$NTH_PI= 0
##$NZP= 0
##$OFFSET= 248.5645
##$PC= 4
##$PHC0= -10226.79
##$PHC1= 450.0538
##$PH_mod= 1
##$PKNL= yes
##$PPARMOD= 0
##$PSCAL= 0
##$PSIGN= 0
##$REVERSE= no
##$SF= 81.014009
##$SI= 65536
##$SIGF1= 159.3651
##$SIGF2= -187.1042
##$SINO= 113.3802
##$SIOLD= 16384
##$SREGLST= <1H.CDCl3>
##$SSB= 0
##$STSI= 65536
##$STSR= 0
##$SW_p= 40650.406504065
##$SYMM= 0
##$S_DEV= 0
##$TDeff= 32768
##$TDoff= 0
##$TI= <>
##$TILT= no
##$TM1= 0
##$TM2= 0
##$TOPLEV= 0
##$USERP1= <user>
##$USERP2= <user>
##$USERP3= <user>
##$USERP4= <user>
##$USERP5= <user>
##$WDW= 1
##$XDIM= 65536
##$YMAX_p= 310022006
##$YMIN_p= -25732053
$$ End of Bruker specific parameters
$$ ---------------------------------
##NTUPLES= NMR SPECTRUM
##VAR_NAME=  FREQUENCY,     SPECTRUM/REAL,   SPECTRUM/IMAG
##SYMBOL=    X,             R,               I
##VAR_TYPE=  INDEPENDENT,   DEPENDENT,       DEPENDENT
##VAR_FORM=  AFFN,          ASDF,            ASDF
##VAR_DIM=   65536,         65536,           65536
##UNITS=     HZ,            ARBITRARY UNITS, ARBITRARY UNITS
##FACTOR=    0.620285442955139, 1,           1
##FIRST=     20137.2065510759, 0,            0
##LAST=      -20513.1999529892, 0,           0
##MIN=       -20513.1999529892, -25732053,   0
##MAX=       20137.2065510759, 310022006,    0
$$ Real data points
##PAGE= N=1
##DATA TABLE= (X++(R..R)), XYDATA
$$ [...]
13032A668042M090193o57197m984005m166316J475355O217256N078419L19156
13024I040903j399497J317480K767748k57766l296750k623724k267143n944019
13016b662768p780849o65297R524550R598333r11901p359333j323539O916478
13008E335674M513795m619139p086671q98444L156037k98109l686264J8335O185726
12999B620940O444517P57283m621223o385603n164328j090021M817824P359272
12991D738661K520584m823303n784694j76033L077093l66025l991700j420195
12983f225612L569138L722285l90938k513692p00366J570338K239173K230234
12975C500560J342936j400628l911779l114300l22445Q17257P00527J972094K666390
$$ y = [1668042, 5758235, 5101038, 117033, -4049283, -2573928, 3643328, 8721747, 9040903, 7641406, 8958886, 11726634, 11468868, 8172118, 5548394, 3281251, -2662768, -10443617, -11108914, -1584364, 8013969, 7102068, -257265, -1580804, 5335674, 9849469, 5230330, -1856341, -2754785, 401252, 103143, -3583121, -3564786, 2620940, 9065457, 9822740, 5201517, -1184086, -6348414, -7438435, -2620611, 4738661, 7259245, 2435942, -3348752, -3524785, -447692, -813717, -4805417, -6225612, -2656474, 1065811, 674873, -1838819, -2539185, -968847, 1270326, 3500560, 4843496, 3442868, -468911, -3583211, -3905656, -3088399, -2387872, -415778, 2250612]
12966B250612j074548n763017l360510N023657Q203615J613102n016701k879924
12958a003714K457896J552326l063672k624443J813614J578076l754754n182961
12950h227632O16108O271363N863043K142595j070982m291361o670845m020801
12942i388512K751303N512190Q14112l550379k93980N831180N722965k62895m332976
12933B803008l350991q81674M97803J401422J517257L1777q21729J260548L348317
12924E805738J176799k891296k678031J609013L343524K02133k472858q82116
12916C212906J571906R13105r96380n76632J383613J776163J99151j577327k903379
12907C003126m125437m876261m616014l472584j397568J709688M419249M678929
$$ y = [2250612, 1176064, -4586953, -7947463, -2923806, 5279809, 6892911, 1876210, -1003714, 1454182, 3006508, -57164, -2681607, -867993, 710083, -3044671, -8227632, -7611524, -1340161, 4522882, 6665477, 5594495, 1303134, -5367711, -9388512, -6637209, -1125019, -310907, -3861286, -4155266, 1675914, 7398879, 7135984, 2803008, -547983, -1429657, -931854, 469568, 1986825, 2018602, 1196873, 2457421, 5805738, 6982537, 4091241, 1413210, 3022223, 6365747, 6567880, 4095022, 3212906, 4784812, 5697917, 4701537, 4124905, 5508518, 7284681, 7483832, 5906505, 3003126, -1122311, -5998572, -10614586, -14087170, -15484738, -13775050, -9355801, -4676872]
12899d676872K820083J038211k18002j955496k804769j60774M018982L995878
12891B057241r98855m252424j208062L481462L099149j231165l288124j372655
12883c713433O88553N08206m90065j056100j454772q21364K311913O289823O973062
12874I235823K997561k521109o023904o560571m641553j046728K488460L877664
12866b194357K834993Q01914j172456k524549j875932J251228L577209Q11849
12858A509899n641645q580064l942212L382283N966710L499871J574788K182749
12850d7621J257582k958079n011207k68856O166259N303717k194009n907114p18337
12841d377665N553826M004196k403764m578269j339224P50890p13877j333471
$$ y = [-4676872, -1856789, -818578, -1036580, -2992076, -5796845, -5957619, -1938637, 2057241, 1058386, -3194038, -4402100, -920638, 2178511, 947346, -2340778, -3713433, -3024880, -2516674, -3006739, -4062839, -5517611, -6338975, -4027062, 2262761, 9235823, 12233384, 9712275, 3688371, -2872200, -7513753, -8560481, -6072021, -2194357, 640636, 1442550, 270094, -2254455, -4130387, -2879159, 698050, 1509899, -4131746, -12711810, -16654022, -13271739, -7305029, -3805158, -2230370, -47621, 1209961, -1748118, -6759325, -7028181, -861922, 4441795, 2247786, -3659328, -4377665, 1176161, 5180357, 2776593, -1801676, -3140900, -2390010, -3103887, -4437358]
12833d437358Q45142K106424O83174l31597M6744j439191m545109l694774J913187
12824h853358M399075p18042n805397j929836P311980J0996371O008444j066484
12816A0342753m568308m682785l311401j745838j487432k099391q8868N240800
12808b400470Q091280M155472j505678j756501J124296q4053m407073m070244
12800h52971J868500N530739K859367j112307j648553o21933r20764j793926k214429
12791A093723k681713k203626M38257K127380q27852m653428k429072L554273
12783e582058M072540j204008k031773M768162Q482124J798006o534804n272571
12775a504382K350304N322348J682533j577749q40953J244656K219612J533869
$$ y = [-4437358, -3592216, -1485792, -802618, -1134215, -1087471, -2526662, -7071771, -10766545, -8853358, -4454283, -5172325, -10977722, -12907558, -5595578, 5400793, 11409237, 10342753, 5774445, 1091660, -2219741, -3965579, -5453011, -7552402, -7641270, -2400470, 5690810, 9846282, 8340604, 6584103, 7708399, 7624346, 3217273, -852971, 1015529, 6546268, 9405635, 8293328, 6644775, 6022842, 5102078, 3308152, 1093723, -1587990, -3791616, -3353359, -1225979, -2053831, -6707259, -9136331, -5582058, -1509518, -2713526, -4745299, 22863, 8504987, 10302993, 3768189, -1504382, 845922, 6168270, 7850803, 6273054, 5432101, 6676757, 8896369, 10430238]
12767A0430238j523970n558530o128185k275157O81561J4574Q67364O189608Q837965
12758A1535468K652536n400366m999221J053767K150071k329258l670807k53453
12750G38737M79137l018696k894583L603253Q068114M194306k651033m501785
12742D017450j665055O98625O37613o51298k041521k028407O71224L764417L129024
12733F532072o36570k538468j114263j16740j161188j414898l21034j400517m750029
12724f921635m956049N7169M784848M474502J427655o67514k268009l872681k906472
12715a0848186P84640K579530Q39648N15298L933912N054114n47434o639507n282544
12706i610529O55857K715981L73781k8255K749761L515808O11746j500917l46381
$$ y = [10430238, 8906268, 3347738, -2780447, -5055604, -4374043, -4359469, -3492105, 2697503, 11535468, 14188004, 8787638, 3788417, 4842184, 6992255, 4662997, 992190, 738737, 1217874, -1800822, -4695405, -1092152, 6975962, 11170268, 8519235, 4017450, 2352395, 3051020, 3688633, 3037335, 995814, -1032593, -361369, 3403048, 6532072, 5895502, 3357034, 2242771, 2126031, 964843, -450055, -771089, -2171606, -6921635, -11877684, -11820515, -7035667, -2561165, -1133510, -1801024, -4069033, -7941714, -10848186, -10063546, -7484016, -6644368, -6129070, -2195158, 2858956, 2311522, -4327985, -9610529, -8954672, -6238691, -5864910, -5893165, -3143404, 372404, 984150, -516767, -863148]
12697h63148J153242O02338n21514o80462n42725n99788n71551j202313k842503
12688f068424l101171r0566L323079L184095P63930n237M39856j004494l022285
12679e581217j685489J522233J316617j765401j635926K561300M607220K071390
12671A410727O9152J114024N16186l480842m393660R62902M398982j252064q818207
12662i472800o612900L251281Q136637M217932L87974K296436M374666J463035
12654H042261j861946K48328M645653M588709N68431j543947n45898j089107n142735
12645G909749q188095n648358N65032M288130K445189j695938k756913K13154
12637b868050K857510J676415j099307j352992L1570j291357m999047n277135
$$ y = [-863148, 290094, 892432, 370918, -309544, -852269, -1452057, -2023608, -3225921, -6068424, -9169595, -9260161, -5937082, -2752987, -1989057, -1994294, -1554438, -2558932, -5581217, -7266706, -5744473, -4427856, -6193257, -7829183, -5267883, -660663, 1410727, 1479879, 2593903, 3110089, -370753, -4764413, -3801511, 597471, -654593, -9472800, -16085700, -12834419, -4697782, -479850, -91876, 2204560, 6579226, 8042261, 6180315, 6428643, 11074296, 15663005, 16231436, 14687489, 14141591, 13052484, 7909749, -278346, -5926704, -5361672, -1073542, 1371647, -324291, -3081204, -2868050, -10540, 1665875, 566568, -786424, -754854, -2046211, -7045258, -12322393]
12629a2322393K6127N183080N115329K795555L038277L751445L57299m488292
12621C456427m021218J064523K969024o94543l487731j475426P30120o73691j530852
12612c663367J964903M898268J441484m219636l755612J694475L272511j303404
12604C29622m669366k117848J835741K140898Q39835J558143K426609P3400l283088
12595h66054k596881J874453M341273J502525k857336k593233L031973P726185
12587I562905N006248l530336q866519n207011K452089M928826R81615k464821
12579B862996j347222Q61759N02899j006767j798395l016243m172102j427591
12571h540666M830659P004009J070645n291311l096607L936892M927619j313467
$$ y = [-12322393, -12296266, -7113186, -1997857, 797698, 3835975, 7587420, 7944719, 3456427, -564791, 499732, 3468756, 2774213, -713518, -2188944, -1458824, -2132515, -3663367, -1698464, 3199804, 4641288, 421652, -3333960, -1639485, 1633026, 329622, -4339744, -6457592, -4621851, -2480953, -1641118, -82975, 2343634, 2417034, -866054, -3462935, -1588482, 2752791, 4255316, 1397980, -1195253, 1836720, 9562905, 14569153, 11038817, 2172298, -3034713, -582624, 4346202, 5327817, 2862996, 1515774, 2377533, 2880432, 1873665, 75270, -2940973, -7113075, -8540666, -3710007, 3294002, 4364647, -926664, -4023271, -86379, 4841240, 3527773]
12563C527773n123837j559800K835525J253996l786932n907482l516774Q67959
12555a1409572M840775O233421L591265m81557r31709K180206K840366j244158
12547E619037m108565j080536L115711J998519j930292j671279K502237M171313
12539H616145J945340P27653J735866J11501n308783p971608l480424L081591
12531e42719M808159K726908K030947K515229k95421o104930q724407m704049
12523h290283K050350N780897N187241K650524K56838j438613k556363l293762
12515C46829l221552j150424K606746M447093J119710m629059n960461r56609
12507g397727M206662L686030j52787j155467J294670K508942P03771o08672R64201
$$ y = [3527773, -1596064, -3155864, -320339, 933657, -2853275, -8760757, -12277531, -11409572, -6568797, -335376, 3255889, 2774332, 1842623, 4022829, 6863195, 5619037, 1510472, 429936, 3545647, 5544166, 3613874, 1942595, 4444832, 8616145, 10561485, 11289138, 13025004, 13136505, 7827722, -143886, -3624310, -542719, 4265440, 6992348, 9023295, 11538524, 11243103, 5138173, -3586234, -8290283, -6239933, -459036, 4728205, 7378729, 7635567, 6196954, 3640591, 346829, -2874723, -4025147, -1418401, 3028692, 4148402, -480657, -6441118, -7397727, -3191065, 494965, 342178, -813289, 481381, 2990323, 3694094, 3085422, 4049623]
12498D049623K787418J677911j281386k818965k012684n33760J03855k53993r04744
12489H13275p70141P21268K530477K821649J237991q21671k142797k318740q48024
12480A223287K005493L710828J873936j734312l015576j708469j465908k967080
12472b077801k311230J451610L067598m53208l632050q11393L874539K527379
12464A635444l352971m698801N87538M264877J117963l004399j220608L347962
12456a322995L200104j399144l341332j3647L348416K326097n09214n86090J547599
12447C249794J692973j251238l685145k653979R4545J027793M4121J94551K506648
12438A220063L978481J997688j538223k743541j025519O42272J23503j606049
$$ y = [4049623, 6837041, 8514952, 7233566, 4414601, 2401917, 1868157, 1972012, 1718019, 813275, 43134, 764402, 3294879, 6116528, 7354519, 6532848, 4390051, 2071311, 1223287, 3228780, 6939608, 8813544, 7079232, 4063656, 2355187, 889279, -2077801, -4389031, -2937421, 130177, -323031, -3955081, -4766474, -891935, 1635444, -1717527, -6416328, -5828790, -1563913, -445950, -3450349, -4670957, -1322995, 1877109, 477965, -2863367, -2877014, 471402, 2797499, 2288285, 1702195, 3249794, 4942767, 3691529, 6384, -2647595, -2553050, -1525257, -1481136, -1286585, 1220063, 5198544, 7196232, 5658009, 2914468, 1888949, 2531221, 2654724, 1048675]
12430A048675k497538j597926R53538M101335N690467L934202k50648l628658
12422G753447l887734j690876M89689O64720j318584l672138m115006k255300
12414h031782q3971N29211j36264q07879q93142o6302J828769L263955K040579
12405b356826n08823J82994M663541O672324K157767l016451j061835M965978
12397A1698669M873377k918784q564365n540269O15061K247346M98462N49693
12389C459190K026667J122950j364823j110261K052748L427504N07961l633989
12381F487947m721693k220489P89891J217938q75229k444768j299346R34031J483812
12372f47906R12781J520804K145444m67028m800813m919522M99904N200023M218557
$$ y = [1048675, -1448863, -3046789, -2093251, 2008084, 7698551, 11632753, 11382105, 7753447, 3865713, 2174837, 2664526, 3329246, 2010662, -1661476, -5776482, -8031782, -8115753, -7586542, -7722806, -8530685, -9423827, -9490129, -7661360, -4397405, -2356826, -2865649, -2682655, 1980886, 8653210, 10810977, 7794526, 6732691, 11698669, 16572046, 13653262, 5088897, -451372, 163689, 2411035, 2909497, 3459190, 5485857, 6608807, 5243984, 4133723, 6186471, 9613975, 10121936, 6487947, 1766254, -454235, 335656, 1553594, 678365, -1766403, -3065749, -2131718, -647906, 264875, 1785679, 3931123, 3464095, -1336718, -6256240, -5756336, -556313, 3662244]
12363C662244L33907j719762k099247k694454k101061J212870M609095M936472
12355F140064L102641R54815k286633o160101o318101j133735L574751K377865
12347B51566j524057k224711p34181j295948k337862L08767M371650M427997J848090
12338C091311J990469L298237m60400p621350r133717k815405L202911L450465
12330d997479J670206J546115O86427k063209k463013R89648L036882J023766
12322e70657K97914M315791P096095K779024l902365m812923r79442L95088k156063
12313B462462l715126k103950m0063P99213J273723R58914j318202l546947k482731
12304g712707P52020J974438O13510J73551J880902K685060N78679k140764k388198
$$ y = [3662244, 3996151, 2276389, 177142, -2517312, -4618373, -3405503, 1203592, 6140064, 9242705, 10197520, 7910887, 1750786, -4567315, -5701050, -2126299, 251566, -1272491, -3497202, -4231383, -5527331, -7865193, -7556426, -3184776, 1243221, 3091311, 5081780, 8380017, 7919617, 298267, -8835450, -11650855, -8447944, -4997479, -3327273, -1781158, -1094731, -3157940, -5620953, -4631305, -1594423, -570657, -272743, 4043048, 11139143, 13918167, 10015802, 5202879, 4223437, 4618525, 2462462, -1252664, -3356614, -3396677, -2597464, -1323741, -364827, -1683029, -5229976, -7712707, -6960687, -4986249, -4372739, -4199188, -2318286, 366774, 945453, -1195311, -3583509]
12295c583509j61118K293959K992145J182423k179876m301457k627151K160074
12287d224510O184274N925531J518501l239479m250099j368982J008080q08802
12279G44514m532824m600615J3957M379839M723247K784931J423376K75536j450656
12270C761305j972664l62334M42908j916894m564995l357132P10303L194638K520732
12261a544133O44903j010727k362174k644473j284370J76065J74461j31348Q15776
12252g166020J667314M91964j403748j515140k47920N89042J429693L165430L769764
12243G80379J186081k147274k382267l67963K14554o64181j77904J231622N13658
12234a813295j618357j183399J796212K668568o8224k265739j154382P09262Q09159
$$ y = [-3583509, -3744627, -1450668, 1541477, 2723900, 544024, -3757433, -6384584, -4224510, 1959764, 7885295, 9403796, 6164317, 1914218, 545236, 1553316, 744514, -3788310, -8388925, -8374968, -3995129, 728118, 3513049, 4936425, 5211961, 3761305, 1788641, 1426307, 1869215, -47679, -4612674, -7969806, -7259503, -4064865, -1544133, -899230, -1909957, -4272131, -6916604, -8200974, -8024909, -7850448, -7981796, -7166020, -5498706, -5006742, -6410490, -7925630, -8173550, -7584508, -6154815, -2989385, 780379, 1966460, -180814, -2563081, -2931044, -2716490, -3380671, -3558575, -2326953, -1813295, -3431652, -4615051, -2818839, -150271, -218495, -2484234, -3638616, -2929354, -2120195]
12225b120195P44502K043929K577147O02904j368270m16275J854997J712705j169911
12216D461533l481164k597643O87371L043654J646982k464918m492795j494000
12208d690980L020668L488601L41412j139945L15613M47628j981349k009565K801691
12199E93774O828190M565398q10785k928635k077940k798541m519643k328736
12191c476918L581668O669327L603187j077348k285036j370407k444856n261710
12183b062093n757085k289231J982394L112044Q87406j361417r48095Q96797Q26936
12174d712344j525898k293210J081409N040897M120591q62335l280757j77083
12166b608730L499954K788892L39930J355638M087594K098330m542104p623665
$$ y = [-2120195, -1375693, 668236, 3245383, 3848287, 2480017, 2063742, 3918739, 5631444, 4461533, 980369, -1617274, -929903, 2113751, 3760733, 1295815, -3196980, -4690980, -1670312, 1818289, 2159701, 1019756, 1335369, 1782997, -198352, -2207917, 593774, 7421964, 11987362, 11176577, 8247942, 6170002, 3371461, -1148182, -3476918, 104750, 6774077, 10377264, 9299916, 7014880, 5644473, 3199617, -2062093, -7819178, -10108409, -8126015, -5013971, -4126565, -5487982, -6436077, -5539280, -4712344, -6238242, -8531452, -7450043, -2409146, 1711445, 849110, -2431647, -2608730, 891224, 3680116, 4020046, 5375684, 9463278, 11561608, 7019504, -604161]
12158f04161k710683L750172L737215j004784k999325q71946K98493r94172n28670
12149a927861K736552L594985k92043l250743n33797L427280K048877k485653
12141C317597k823217J407013L059557q81223m620452k743572J860924K887367
12133A463994m15970l142355j916243J181210K038986j8259j471196N10312L720976
12124A951455L619940K3593k454381j668423j176406l443415m567463o07343M789931
12115c532512N335302J920934N35384K090287J926615j034496k554283j266849
12107C420382q95650k551471k300775R75601K496562j77029k490681o45332K042415
12098a25978J195887j522490k293610j506761j325455j021392M23571R15135p21018
$$ y = [-604161, -3314844, 435328, 4172543, 3167759, 168434, -703512, -405019, -1399191, -1927861, 808691, 4403676, 4111633, 860890, 327093, 3754373, 5803250, 3317597, 494380, 1901393, 4960950, 4079727, -540725, -3284297, -1423373, 1463994, 1048024, -2094331, -4010574, -2829364, -790378, -808637, -2279833, -1769521, 1951455, 5571395, 5594988, 3140607, 1472184, 295778, -3147637, -7715100, -8322443, -3532512, 1802790, 3723724, 4259108, 6349395, 8276010, 7241514, 4687231, 3420382, 2524732, -26739, -2327514, -1351913, 1144649, 967620, -1523061, -2168393, -125978, 1069909, -452581, -2746191, -4252952, -5578407, -6599799, -6176228, -5261093, -5982111]
12089e982111j028970K683835O601629N315127k09439m461490m738697k296856
12081d116972J061914L218494J683734k202903k580380K511898O115251J810561
12073G501597n784457p299525k257736J684091J019961p00152j237524k087219
12065i160964k385729Q56690N302113M605289q45280k936945J473737N163136
12057B072047K101586l244780l804842p26060K38374j534288k195309p87866L71238
12048g509900Q29044J913706K715018J235531j105822p79296K163776L827266
12040C289323K191517m83847j564836j222018p40121j92488Q18817J657016J207361
12031D960724n80335k344983k483331q08816R15865P48784r31528j663859r0213
$$ y = [-5982111, -7011081, -4327246, 2274383, 7589510, 7380071, 2918581, -1820116, -4116972, -3055058, 163436, 1847170, -355733, -2936113, -424215, 5691036, 7501597, 1717140, -5582385, -7840121, -6156030, -5136069, -5836221, -7073745, -9160964, -11546693, -10690003, -5387890, -782601, -1627881, -4564826, -3091089, 2072047, 4173633, 928853, -2875989, -3602049, -3363675, -4897963, -7093272, -7881138, -7509900, -6680856, -4767150, -2052132, -816601, -1922423, -2701719, -537943, 3289323, 5480840, 4996993, 3432157, 2210139, 1470018, 1277530, 2096347, 3753363, 4960724, 4380389, 2035406, -447925, -1256741, -340876, 407908, -523620, -2187479, -2277692]
12022b277692K191574K717132J186578m55450m28654R89692J734201J77850k550501
12013C284730l330210j164117Q58426j86563k312338j508225J541095K140747
12005f76455p75391k826099j564307l26535j692396k256505J424517N815189N125143
11996B247161M16482k059050k04209K155239K187267Q96612q81355l419934m517716
11987c179503j113790M184515M468964j288571n677476l684248K31494L21546
11979e737069j475547q28377M35771j049400j601223L791367R890929O631153
11971A0057604l878849p786992r7097O994687K814548n433599m842747K773745
11963F01300M982082j066794n662892l190730P26731J119621J457300M701314
$$ y = [-2277692, -86118, 2631014, 3817592, 3362142, 2933488, 3923180, 5657381, 5835231, 3284730, -45480, -1209597, -351171, -537734, -2850072, -4358297, -2817202, -676455, -1451846, -4277945, -5842252, -6168787, -7861183, -10117688, -8693171, -2877982, 2247161, 2663643, 604593, 400384, 2555623, 4742890, 5639502, 4758147, 1338213, -3179503, -4293293, -108778, 4360186, 3071615, -2605861, -6290109, -6058615, -5737069, -7212616, -8040993, -7605222, -8654622, -10255845, -6464478, 3426451, 10057604, 6178755, -1608237, -1705334, 5289353, 8103901, 2670302, -2172445, 601300, 5583382, 4516588, -1146304, -4337034, -3610303, -2490682, -1033382, 3667932]
11955C667932O010327J102805n079567n432403j552873k84442k816173m456929
11947h841323l248134j723987p15987J967286N920457O870108K833169k604491
11939D57098n000515l866082j198300J874365M898390O446757M899795O41243
11931I152751l433957l920450q5368M555557N112338Q07611l825169m528728k252137
11922A582448n94626n11982n40557m98093j187696j431140N33328L041706K602555
11913B995943k41840j024493J626084L445774J093352k669944l416519j648142
11905A60215j160010k529891k386756P72081L593058K357125j518294k854296
11897c566768M45889M012327K232067l890023o865157j933046O291609R105521
$$ y = [3667932, 9678259, 10781064, 5701497, 269094, -1283779, -1568221, -4384394, -8841323, -12089457, -13813444, -14529431, -12562145, -6641688, 228420, 3061589, 457098, -4543417, -8409499, -9607799, -7733434, -2835044, 3611713, 8511508, 9152751, 5718794, 1798344, 1712976, 6268533, 11380871, 12188482, 8363313, 3834585, 1582448, 987822, 475840, -64717, -562810, -1750506, -3181646, -2648318, 393388, 2995943, 2754103, 1729610, 3355694, 6801468, 7894820, 5224876, 1808357, 160215, -999795, -3529686, -5916442, -5144361, -1551303, 805822, -712472, -3566768, -3120879, 891448, 3123515, -766508, -7631665, -9564711, -3273102, 5832419]
11889E832419M314148j920414l729141k199576j785860l279008l590149j207958
11881g565539J680529L052747M041498O005350O592259K271395n152123q508874
11873B417242m021466L088879N338994K735813P76337N15419k355959p989234
11865E06025r700155m115176K768662M378223K500206J880708J623816r18780
11857a076471k574204O89823M589529J863740m923469o012733R0875M138072J112739
11848b102099k427824j96698L590082J987227l298094n084954j185842M132356
11840d585846O444557M432831p05537n374953n334493l80263M757735O097471
11832E351502M221315J169866k373078m962752m120428p26330Q16573p03656j367647
$$ y = [5832419, 10146567, 8226153, 4497012, 2297436, 511576, -2767432, -6357581, -7565539, -5885010, -2832263, 1209235, 7214585, 13806844, 16078239, 10926116, 2417242, -1604224, 1484655, 6823649, 9559462, 10335799, 10851218, 8495259, 506025, -9194130, -13309306, -10540644, -6162421, -3662215, -1781507, -157691, -1076471, -3650675, -2960852, 1628677, 3492417, -1431052, -7443785, -7352910, -3214838, -2102099, -4529923, -4726621, -1136539, 850688, -2447406, -7532360, -8718202, -4585846, 1858711, 6291542, 5586005, 211052, -5123441, -5503704, -745969, 5351502, 9572817, 10742683, 8369605, 3406853, -713575, -1439905, -623332, -1326988, -2694635]
11823b694635N35279J137255j445963k539496J093021M652738K790118j546920
11815A981397k419155m59501j5523p13225N92314K624551J995784O9773J66090
11806C822505N90366j842121l996252p25048M954870N170377k29641l630007k028859
11797B086190j77816q08929j127107m60197k072905n088618l708880K420097N693631
11788c244534K053790l033408l905294k167792q30345J160917M005793M224660
11780a736213J420870M12672K164237R60167m263486n310602J510364O688329
11772A846338J818284o189516o152262k27184J913660K03725J603563M823311
11764c60081K544282l204512l050407K524085L235977k180912k859299M485953
$$ y = [-2694635, -2159356, -1022101, -2468064, -5007560, -3914539, 738199, 3528317, 1981397, -437758, -897259, -912782, -1626007, -1033693, 1590858, 3586642, 3656415, 3822505, 4412871, 2570750, -1425502, -2150550, 2804320, 7974697, 7745056, 4115049, 2086190, 1908374, 1099445, -27662, -487859, -2560764, -7649382, -11358262, -8938165, -3244534, -1190744, -4224152, -8129446, -10297238, -11127583, -9966666, -5960873, -1736213, -315343, 97329, 2261566, 3221733, -1041753, -6352355, -4841991, 1846338, 3664622, -2524894, -8677156, -8904340, -6990680, -6786955, -5183392, -360081, 2184201, -1020311, -4070718, -1546633, 1689344, -491568, -3350867, 1135086]
11756A135086Q193926R66311p446181o077304O27677K577343N27677J236154L790001
11747E530690K700308p64657j572666r73527k929582m520617r13648L523206R00533
11738I80040n618818n403857K073702O057991K195274j338066J233317M322090
11730D501673K357744o31614K51651J571409j049464l827985j550657K559984
11722D182741K422602j22287Q51046M028332K807153k795226n362531j819803
11714D192027K147539J423298j591304k365278j220595j209390k545860k842964
11706d012527j137928J102120K210644J829630O64228k59803l76082K7483M45814
11697D93579R15985J560277J825407J000957p45009k338495k475098m23925K766728
$$ y = [1135086, 9329012, 10295323, 2849142, -3228162, -2600485, -23142, 504535, 1740689, 5530690, 8230998, 7466341, 5893675, 4920148, 1990566, -2530051, -3443699, 79507, 980040, -4638778, -10042635, -7968933, -1910942, 284332, -1053734, 179583, 4501673, 6859417, 6227803, 6479454, 8050863, 7001399, 3173414, 1622757, 4182741, 6605343, 6483056, 7334102, 11362434, 14169587, 11374361, 6011830, 4192027, 6339566, 7762864, 6171560, 3806282, 2585687, 1376297, -1169563, -4012527, -5150455, -4048335, -1837691, -8061, 656167, 396364, 20282, 47765, 493579, 1409564, 2969841, 4795248, 5796205, 5051196, 2712701, 237603, -186322, 2580406]
11688B580406M051015J272902l443381n392531k986433N44265J705653K53302
11680a414802k452724n105528n332016r79265N517142Q147644N089298J170319
11672D640068L8294q48600l652423m509176k96589M081336K425185k597717l825173
11663d544795j134965j63646j521338m37927L246376L801254n59047m566405m282846
11654a0163339j617749Q30368K692521K669887n19553l280693p09285M417665
11646e680178M677652P04646P49448N634677N808062k100530p714304l226550
11638a147077L558733K085270m078673m401866J224368M099496J581312r99023
11630A922540j013915q42835p71151J130454K888769R45924k265490j407349J998968
$$ y = [2580406, 6631421, 7904323, 4460942, -931589, -3918022, -3373757, -1668104, -1414802, -3867526, -8973054, -14305070, -15284335, -9767193, -1619549, 3469749, 4640068, 4678362, 3829762, 177339, -4331837, -4628426, -547090, 1878095, -719622, -4544795, -5679760, -5843406, -7364744, -7802671, -4556295, -755041, -1314088, -5880493, -10163339, -11781088, -10950720, -8258199, -5588312, -6107865, -9388558, -10097843, -5680178, -1002526, -297880, 451568, 6086245, 11894307, 9793777, 2079473, -1147077, 2411656, 4496926, 418253, -3983613, -2759245, 1340251, 2921563, 1922540, 908625, 65790, -705361, 425093, 3313862, 4259786, 1994296, 586947, 2585915]
11621B585915J604686k379384l023396J334442M072496J385776j976287j261194
11613B343054J200464J217537q13421k417395l283412l665530k437937M35719
11605g420921K690587K985999K396940J703971N73997q0689J082346K271825L19655
11596F523710l478309m221571r71429J693108Q77852j133288k036152k673638
11588e419717l123167j136156L011979N227778L704934J401748K14736j707875
11580B174260m240592l273490J735412M610952J867920q89168J771698N137975
11572H894967J646912n901388p621690j503281L949989K784880p73051m20454
11564A056884K894199L797136P62707k530484k659493m44454N66372j375637l679185
$$ y = [2585915, 4190601, 1811217, -1212179, 122263, 4194759, 5580535, 3604248, 2343054, 3543518, 4761055, 3947634, 1530239, -1753173, -5418703, -7856640, -7420921, -4730334, -1744335, 652605, 2356576, 2930573, 2849884, 3932230, 6204055, 6523710, 3045401, -1176170, -2147599, -454491, 423361, -709927, -2746079, -5419717, -8542884, -9679040, -6667061, -1439283, 2265651, 3667399, 3882135, 2174260, -2066332, -5339822, -3604410, 1006542, 2874462, 1985294, 3756992, 8894967, 10541879, 4640491, -2981199, -4484480, -534491, 2250389, 1477338, 1056884, 3951083, 7748219, 8510926, 5980442, 3320949, 2876495, 3442867, 2067230, -1611955]
11555a611955k366835K199517M853774K487432j375830j857811N7185k4194k122456
11546B38827k170224L58241J269099o60651r66680K492408M364201l48297p102359
11537b525435o804372J284652P866341N842555j021910m377016k304478R2062
11529a947601o94037k098424n31221K673490L065663n13514m127084l748264j56439
11520h077431K441550J819786J78627Q48216L714409N226533K918111j445026
11512G624775m121070l799684k217979q74583O85371K762379L835953K549168
11504F444330l3052j863803k666830l518511m384594l955235j745213J171394
11496a0551514L411018M110253L020737J087474K23081R53618J181875p15906
$$ y = [-1611955, -3978790, -1779273, 3074501, 5561933, 4186103, 2328292, 2385477, 2361283, 238827, -1931397, -1573156, -304057, -964708, -1931388, 561020, 4925221, 4576924, -2525435, -9329807, -8045155, -178814, 5663741, 4641831, 264815, -2039663, -1947601, -2641638, -4740062, -5271283, -2597793, 467870, -45644, -4172728, -7920992, -8077431, -5635881, -3816095, -3637468, -2789252, 925157, 6151690, 9069801, 7624775, 3503705, -295979, -2513958, -3388541, -2703170, 59209, 3895162, 6444330, 6411278, 4547475, 1880645, -1637866, -6022460, -9977695, -11722908, -10551514, -7140496, -3030243, -9506, 1077968, 1301049, 2254667, 3436542, 2720636]
11488B720636k585071j174521K291573K800121j332652n408545m408195M20932
11480f675722L601989K512350l10387j422722m47579P88448J242635J414525J757304
11471B460841J768215J123840P15743J374741K025504Q02878j817821l022724
11463E431217j679891k09729p55180j547410K54491L462807L877008K39487l800059
11454E272741m353491j715476Q11849R95176m41062j384148j112919j048362k171966
11445e147658k610522p1362L655786M256186J626568M06338J875181J060971m102881
11436I48607o926598j930179M642250L259341l461927m358143K516944P220005
11428A910300M183623m68756j364776k326563o469608q061893k305593M873930
$$ y = [2720636, 135565, -1038956, 1252617, 4052738, 2720086, -2688459, -7096654, -6675722, -3073733, -561383, -871770, -2294492, -2742071, -1953623, -710988, 703537, 2460841, 4229056, 5352896, 6068639, 7443380, 9468884, 10271762, 8453941, 5431217, 3751326, 3541597, 2786417, 1239007, 1493498, 4956305, 8833313, 9072800, 5272741, 919250, -796226, 15623, 1010799, 569737, -814411, -1927330, -2975692, -5147658, -7758180, -7829542, -4173756, 82430, 1708998, 2115336, 3990517, 5051488, 948607, -5977991, -7908170, -3265920, -6579, -3468506, -7826649, -5309705, 1910300, 6093923, 5625167, 4260391, 1933828, -4535780, -12597673, -14903266, -10029336]
11420a0029336N636242K315415J608791K360004o72192m942318l144338L456380
11412c411352N442045l52409o221463n325648j89506L110711K843712R72477m38473
11403c569906L2454K191806L127843Q22756j631569k59699K428766P58683l995916
11394i4782m746027n55809J459581j301680j964195L388749P468434L264599l913589
11385C005281m864645r31804K88392p34441K542707Q091812N838624m908360j1014760
11376b687194m304058N678528O001414p77465k648816K193207M112191o47494
11368F920313l867719K11561N015286K509828l965616n758305k481896n99223
11360b015771j379663N3718L877310L526294k741458o890904k874619L553336
$$ y = [-10029336, -4393094, -2077679, -468888, 1891116, 1218924, -3723394, -6867732, -3411352, 2030693, 1678284, -4543179, -9868827, -10058333, -6947622, -4103910, -3131433, -3569906, -3537452, -1345646, 1782197, 2604953, 973384, 713685, 3142451, 3901134, -94782, -4840809, -5396618, -3937037, -5238717, -7202912, -3814163, 3654271, 6918870, 3005281, -1859364, -2791168, -2502776, -3237217, -694510, 7397302, 13235926, 8327566, -2687194, -6991252, -1312724, 4688690, 3911225, 1262409, 3455616, 7567807, 6920313, 3052594, 3264155, 8279441, 10789269, 6823653, 1065348, -1416548, -2015771, -3395434, -3341716, 535594, 4061888, 1320430, -5570474, -8445093, -4891757]
11352d891757L606698j021443j725709K605149M105232n49920m172819n65960
11344b610529N081189L653912m097211q430600m252963K817898N320586L183847
11336F66129R47938P8800j187259k479882j114961K569694M379556K310846m27037
11327E743824p27903m57017k657289n566848m742491N8383M374522N129035L297336
11318D451552M99828k853036n219867l952558N08008L866419L387326J117621
11310A805293j18358o69305j559613j253114J629980M525909L529205j217311
11302F672686n695583o855214m840224j243153K320124M316038M140693K777249
11294A592616J399382J04055r66740q50858L54156O43195q91356k029904p58129
$$ y = [-4891757, -1285059, -2306502, -4032211, -1427062, 2678170, 2128250, -2044569, -2610529, 2470660, 6124572, 2027361, -6403239, -10656202, -7838304, -2517718, 666129, 1614067, 1692867, 505608, -1974274, -3089235, -519541, 3860015, 6170861, 5743824, 5015921, 4558904, 1901615, -3665233, -8407724, -8349341, -3974819, 1154216, 4451552, 4951380, 2098344, -3121523, -7074081, -6566073, -2699654, 687672, 1805293, 1686935, 1017630, -541983, -1795097, -165117, 4360792, 7889997, 6672686, 977103, -5878111, -10718335, -11961488, -9641364, -5325326, -1184633, 1592616, 2991998, 3096053, 2129313, 1278455, 1632611, 2275806, 1384450, -645454, -1403583]
11285a403583J165616Q55671r43692j040651J099128K782849K386014J045184
11277E946536j49583j652387l327542l308346m42637L417878M864571K531532
11269G880022j149363k242030K360J481835j713512o957111p258732q67977N274203
11260e550305M432086j099989m004014k060576N92231R24556N49941J488708K714411
11251b012951K306900L54264j442098j559528J45354J923053J545215o48835j705364
11242a093990m78333L57791j064978k170638k96063K233390J732135o21342j167533
11233b569561k47705o21183j048877J943749O375753N888601m39054n777605n028462
11224a524344j058953Q68607K2425r98174m11584J964833M755669M739115K99276
$$ y = [-1403583, -237967, 617704, -325988, -1366639, -267511, 2515338, 4901352, 5946536, 5796953, 4144566, 817024, -2491322, -2933959, 483919, 5348490, 7880022, 6730659, 4488629, 4490989, 5972824, 4259312, -2697799, -9956531, -10824508, -5550305, -1118219, -2218208, -6222222, -8282798, -7690567, -6766011, -6216070, -4727362, -2012951, 293949, 648213, -793885, -2353413, -2208059, -285006, 1260209, 611374, -1093990, -1572323, -1214532, -2279510, -4450148, -4746211, -2512821, -780686, -1402028, -2569561, -2817266, -3438449, -4487326, -2543577, 3832176, 9720777, 9281723, 3504118, -1524344, -2583297, -1714690, -1692265, -2690439, -3102023, -1137190, 3618479, 8357594, 8656870]
11215H656870m315980k996932L149938O241368K564854k833259m573151l627504
11207B266204k552665n02806K639913K964604j374958n478230m454100p87372
11199g279410L57930o07649K16461L064327N096176N577052N188825K729840k216276
11190A2127276n833071m704776j520086p86435j559338l78166J394017K02503
11182a058076j902234O3330M590848M969237J914m349086m528502k833023n81501
11173e627093L692046P555186N238995j912904m556624M76642M036430r65937
11165G936741p627035o247511l21552k88252n684873n918449J928880Q131033
11157h091018N652194L3228q05812J734499J701261r97785j924979k45834J008980
$$ y = [8656870, 4340890, 1343958, 4493896, 10735264, 13300118, 10466859, 5893708, 2266204, -286461, -789267, 1850646, 4815250, 3440292, -2037938, -6492038, -7279410, -6921480, -7529129, -7312668, -4248341, 847835, 6424887, 11613712, 14343552, 12127276, 6294205, 1589429, 69343, -717092, -2276430, -2654596, -1260579, -1058076, -2960310, -2896980, 1693868, 6663105, 6665019, 2315933, -2212569, -5045592, -5627093, -1935047, 5620139, 10859134, 8946230, 4389606, 4866248, 8902678, 7936741, 309706, -5937805, -6259357, -6547609, -12232482, -18150931, -16222051, -8091018, -2438824, -2405596, -3211408, -1476909, 224352, -773433, -2698412, -2944246, -1935266]
11148a935266Q42617P10863K84690j783307l492756j321249L376820N095043K277477
11139D054932n58458n77014r39376l986393n420750q45923N572960N938744O36605
11130C875327j894692J882129N198149J599404n228880p155065k839006K192761
11122b369873L956523K946909L69999k875523m111869j363909J958295M35319
11114a054129m537763n232105J145988P619387P304921K681362J97645J94280
11106H319586j540326m980425n540413j857236K251882L935597L979101K746926
11098G314692r84903n674723o814129l416911j3605M33460R08499M292282P497875
11089C542537O203414J914689p24493j062448j715289k748866k093831n61979
$$ y = [-1935266, -1092649, -381786, -97096, -1880403, -5373159, -6694408, -3317588, 1777455, 4054932, 3496474, 2919460, 1980084, -2006309, -7427059, -8272982, -2700022, 3238722, 3875327, 1980635, 3862764, 9060913, 10660317, 5431437, -1723628, -4562634, -2369873, 1586650, 4533559, 4903558, 2028035, -2083834, -3447743, -1489448, -1054129, -5591892, -10823997, -9678009, -2058622, 5246299, 7927661, 8125306, 8319586, 6779260, 1798835, -3741578, -5598814, -3346932, 588665, 4567766, 7314692, 6329789, 655066, -6159063, -9575974, -9589579, -9156119, -8247620, -3955338, 3542537, 9745951, 11660640, 10936147, 9873699, 8158410, 5409544, 3315713, 2753734]
11081B753734q84259k283860j547278O10568Q8618l095489l889039l63729L106743
11072e503991L212299K490611L438604L349408m14437m491768m146601o23537
11064b689412J308204P03528K04835L69955n32257k136282k248593r60214k90520
11055f270756l80187N0787M85085n3353J69364K719474M450732J556493k882443
11046a54804k187390L043831M871229L57787l790925k180672J164005O77795j324115
11037D76741K39535L589686L190644m53225j835826m4526J69693k800104m496843
11028a964225k034767J215027J252842q17535j651769o98424N92211J736290K479010
11019A08660J449104j497869l463251j973626J169035K312305R37741o41949j239523
$$ y = [2753734, 1869475, -414385, -1961663, -1351095, -1262477, -4357966, -8247005, -8610734, -5503991, -2291692, 198919, 3637523, 6986931, 6572494, 2080726, -2065875, -2689412, -1381208, -677680, -472845, -102890, -635147, -2771429, -5020022, -5980236, -6270756, -6650943, -6600156, -6115071, -6168424, -5999060, -3279586, 1171146, 2727639, -154804, -2342194, 701637, 5572866, 5930653, 2139728, -40944, 1123061, 1800856, 476741, 716276, 4305962, 7496606, 7043381, 5207555, 5163029, 5332722, 2532618, -1964225, -3998992, -2783965, -1531123, -2348658, -4000427, -4698851, -4106640, -2370350, 108660, 1557764, 59895, -3403356, -5376982, -4207947, -1895642, -957901, -1599850, -2839373]
11010b839373j099410N16317L739582M689840p82103q813390r208125R49434J0908347
11001a938881R389287O1448l884125J245204N329389O61046o676368o814069n78398
10992c205467L294044J525932q32981J50561J863296M01442l461510n546288l257046
10983i068017J587468M032350J095499l589806l132539K823788O166803J998768
10975A914314l056352r21018M280425K346623n608934p614456K20658P156376
10967a282364M589997j496591j829295J567881J090779k834436l891434j606609
10959e692072j124591l223862l576102j245259L50471R08587L645612P481379
10951b475837O803492J101293k627829m25746K325972k56125m871242m102130
$$ y = [-2839373, -3938783, -3422466, 317116, 5006956, 4224853, -4588537, -13796662, -12847228, -1938881, 7450406, 7511854, 3627729, 4872933, 10202322, 10863368, 4187000, -2627069, -3205467, 88577, 1614509, 781528, 932089, 2795385, 3196827, -264683, -5810971, -9068017, -7480549, -3448199, -2352700, -5942506, -9075045, -6251257, -84454, 1914314, -1142038, -2063056, 2217369, 4563992, -1044942, -8659398, -8438740, -1282364, 3307633, 1811042, -18253, 1549628, 2640407, -194029, -4085463, -5692072, -6816663, -10040525, -13616627, -14861886, -14511415, -13602828, -9957216, -2475837, 4327655, 5428948, 2801119, 2375373, 4701345, 4445220, -426022, -4528152]
10943d528152K092990O200376L647617j823446m141327k306208J10276M44761
10935c03113m89683n90142P39016K283027K403161M44578k273067k853212N9701
10926e79734L170183J396453m411768o286299K91486Q027669O609711j966399
10918F251302n492752L44901N748004K527367l616016l519297R07168J854243
10910E004920p08576j101725J97000k005762o052099m629774K213168O020059
10902a062789L526692J102791K864068M153650R83393k872860l245053k380745
10894C069147l135904l193127n08716J620203L90140j178975N5783J777359J371496
10885B67406R85744K172424J488063k717253n284990k554884N96725o38596j936190
$$ y = [-4528152, -2435162, 3765214, 7412831, 5589385, 1448058, -858150, -747874, -303113, -792796, -1382938, -643922, 1639105, 4042266, 4486844, 2213777, -639435, -579734, 2590449, 3986902, -424866, -6711165, -6419679, 1607990, 8217701, 6251302, 758550, 1103451, 6851455, 9378822, 5762806, 2243509, 3150677, 5004920, 4296344, 3194619, 3391619, 1385857, -4666242, -9296016, -7082848, -1062789, 2463903, 3566694, 6430762, 10584412, 11567805, 8694945, 5449892, 3069147, -66757, -3259884, -3768600, -2148397, -1758257, -2937232, -2881449, -1104090, 267406, 1253150, 3425574, 4913637, 2196384, -3088606, -5643490, -5046765, -5685361, -7621551]
10876g621551J819530N542597K047806m099101l164048K862469L397184k284513
10868a499627l957954J392698M705253J443509p19419L512206P300846M052811
10860A6230323j213889j567625j25173k832845o757986n614827j261338K88462
10852b854898j65356J996225M748983K338978l243897l996635J078412M248418
10844D150230J438652k370426k319590n22638n82087j599690j297239k41746M94776
10835b849758J993620M581240N415794K141168l158610o233569n469043k596590
10827f175748J15933J768495K573077K801588K196293O92174m96567p7567P30704
10818D128382o44347l411628l363745L82568K767808M50233k229536n2997M200759
$$ y = [-7621551, -5802021, -259424, 1788382, -2310719, -5474767, -2612298, 784886, -1499627, -5457581, -4064883, 640370, 2083879, 1364460, 4876666, 12177512, 16230323, 15016434, 13448809, 13323636, 10490791, 3732805, -1882022, -3143360, -2854898, -3020254, -1024029, 3724954, 6063932, 2820035, -1176600, -98188, 4150230, 5588882, 3218456, 898866, 376228, -205859, -1805549, -3102788, -3344534, -2849758, -856138, 3725102, 9140896, 11282064, 8123454, 1889885, -3579158, -6175748, -6059815, -4291320, -1718243, 1083345, 3279638, 3971812, 3475245, 3397678, 4128382, 3484035, 72407, -3291338, -2908770, -140962, 309271, -1920265, -1973262, 2227497]
10809B227497M248500P41929l96408J649393K142399K59132K69318K207099K04896
10800A3553755o904122j1234533o517934K894158Q111441O183557Q59511l005853
10792C939980k690364J073744L784146J793146j923712j543041J875700J520150
10784G829749l182482m521751L05498L333657j202264o764160n010577Q74565
10776h337765K266736r02779j680819J724987M278631L029237J35352k069760
10768a556180k973007j911023L88612N58980k588383m798985k443465J852340
10760a3471111M284971N664172O689741L604200m116655q109996k475562M933555
10752b996685L393911l433234l568095L488162O831919K645372j575834j796281
$$ y = [2227497, 6475997, 7217926, 6821518, 8470911, 10613310, 10872442, 11141760, 13348859, 13553755, 6649633, -4584900, -11102834, -8208676, -97235, 6086322, 6945833, 3939980, 1249616, 2323360, 6107506, 7900652, 5976940, 4433899, 6309599, 7829749, 4647267, 125516, 431014, 3764671, 2562407, -4201753, -9212330, -8337765, -6071029, -6973808, -8654627, -6929640, -2651009, 378228, 513580, -1556180, -4529187, -6440210, -6051598, -5492618, -8081001, -12879986, -15323451, -13471111, -9186140, -3521968, 3167773, 6771973, 2655318, -5454678, -7930240, -2996685, 397226, -3036008, -6604103, -3115941, 3715978, 6361350, 4785516, 2989235]
10744B989235k381430m225664j852381M038770M618988j594046m379477R97161
10736a788844N148545R03047m096436j062323M508840K783982l570450n091775
10728b265414j891841j472728m054216k797774K756202N223491J895847j430633
10720d037066q04689N06572m65275j036868J443200M269509L579066P9999k725250
10711H09198l435710l032278j975056K76983L124469M111189J420022l120501
10703a821684m818515j189325M435871O214984K451135k989068n494539l613585
10695f824726J213547N698090N869360Q64120m471155m599301p69401R96681p59386
10686b782171j314214J627474M022899K554484l14154j555209k400910m126745
$$ y = [2989235, 607805, -3617859, -5470240, -1431470, 3187518, 1593472, -2786005, -1788844, 3359701, 4262748, 166312, -896011, 3612829, 6396811, 2826361, -2265414, -4157255, -5629983, -9684199, -12481973, -9725771, -4502280, -2606433, -4037066, -4841755, -4335183, -4800458, -5837326, -4394126, -124617, 3454449, 3534448, 809198, -2626512, -5658790, -7633846, -7356863, -4232394, -121205, 1298817, -1821684, -6640199, -7829524, -3393653, 2821331, 5272466, 2283398, -3211141, -6824726, -5611179, 86911, 5956271, 6820391, 2349236, -2250065, -3019466, -2022785, -2782171, -4096385, -2468911, 1553988, 4108472, 3794318, 2239109, -161801, -4288546]
10678d288546m023502j87278L658955K993290o31287j945775O85014L862162L791460
10669C914493r9064m849422o049687k206142K565556L059565N574j469097m5708
10660e173932O18529p50196r30170J248192K788401K636423L100258L456856j37820
10651F856541o022085o883867j587408J943371j5997o88343M266766P640651K743270
10642H252899m533682n442460k287285j949425k462585J887480P233534M938830
10634E637306k825160m915344J712857P979538O617115M49035m621414o408341
10626C625592m665990P351L789265K446079k228729m271042k217822k83491o76154
10617d474941p19307J418311L498244L197684J268185l96233q78867j58371P97403
$$ y = [-4288546, -8312048, -8499326, -4840371, -1847081, -2478368, -4424143, -3739129, 123033, 3914493, 3815429, -1033993, -7083680, -9289822, -6724266, -3664701, -3659127, -5128224, -5173932, -4555403, -5305599, -6235769, -4987577, -2199176, 437247, 3537505, 6994361, 6856541, 834456, -6049411, -7636819, -5693448, -5709445, -6397788, -2131022, 5509629, 8252899, 3719217, -1723243, -4010528, -5959953, -8422538, -6535058, 698476, 5637306, 2812146, -2103198, -390341, 7589197, 14206312, 14655347, 10033933, 3625592, -1040398, -1033047, 2756218, 5202297, 2973568, -1297474, -3515296, -3798787, -4474941, -5194248, -3775937, -277693, 2919991, 4188176, 3791943, 2913076, 2754705, 3552108]
10608C552108N26683n39693r0583J891673K144708l35660j758622L73232K936962
10599H700808K460087J71731j824308m219503o377557m541652J065151L767315
10591g97928N31749k360332Q17K394307p70930m527255j826186L540050L166427
10582f49281j844235l743976j176040J003415J501505K269606J756594j858038
10574b740450m140290o95783L670032J785181l698548m801046r91368K390924
10566i221348M164040N664037M009377k217639n804995r03789N355618L469763
10558D515064k267328j809613K514605J248037m008176m038478M59815J510311
10550a875763K87775L525334P016051J419633q018339p368542J641332L750243
$$ y = [3552108, 4078791, 3539098, 3448515, 5340188, 7484896, 7149236, 5390614, 5763846, 8700808, 11160895, 11332626, 9508318, 5288815, -1088742, -5630394, -4565243, -797928, -266179, -2626511, -2625694, -231387, -1002317, -5529572, -7355758, -3815708, -649281, -2493516, -6237492, -7413532, -6410117, -4908612, -2639006, -882412, -2740450, -6880740, -7576523, -3906491, -2121310, -5819858, -10620904, -11612272, -9221348, -5057308, 606729, 4616106, 2398467, -3406528, -4310317, 1045301, 4515064, 2247736, 438123, 2952728, 4200765, 192589, -3845889, -3386074, -1875763, -1587988, 1937346, 8953397, 10373030, 2354691, -5013851, -3372519, 377724]
10542C77724l294280n616958J348767N637865J148185k868520j37469L224462
10534a80224K973945L200146M029234j20071o332945m699207K887901L648070
10526E406849l624422o306628r05592K183595j08329Q26237N014690K207423n553192
10517h59369l885507O608749Q497750j311891n507282J707168N020049j411794
10509H857873l470840L140226L419021n763577p185154K309728L348444p178369
10501b522648o618359R162758J3500057j114304o611598N521756M661010j5670896
10493C07776j4669639J7137812K4149522j2727198j3886933P3485762J50750867
10486B24547969Q5474037p8643263j59644129q6855436J6079471K7709911j5171963
$$ y = [377724, -2916556, -8533514, -7184747, -1546882, -398697, -3267217, -3404686, -180224, 2793721, 5993867, 10023101, 9903030, 3570085, -1129122, 1758779, 5406849, 1782427, -4524201, -5429793, -3246198, -3354527, -2528290, 2486400, 4693823, -859369, -4744876, 1863873, 10361623, 9049732, 3542450, 5249618, 10269667, 8857873, 5387033, 8527259, 11946280, 6182703, -1002451, 1307277, 4655721, -2522648, -9141007, 21751, 13521808, 12407504, 5795906, 11317662, 15978672, 307776, -14361863, 2775949, 26925471, 14198273, 311340, 73797102, 224547969, 310022006, 231378743, 71734614, -15120822, 958649, 28668560, 13496597]
10479A3496597j9583720J0750079J3443736j2060860j6792172L361155R859933
10472B474748k245572k644870J0736254R946330o189274r484326M027822P829032
10464A4450144n257613j1776396j507272P105983K710392k515076k86678L51395
10456C274879m749852n850149j27198K203865j228912k16518O573670P191926
10448G071711r76993n193665m4543L849415L46381k142979J521209L296398j759282
10439E967652n497020j827700K403014M51909k992032j917431O67190K97491q70316
10430c317243l95936q49745k864896j855466L013091N622492L607875K695951
10422E656123N087443L758286m741556j1410530p296401K642889P007300L588978
$$ y = [13496597, -6087123, 4662956, 18106692, 6045832, -10746340, -7385185, 2474748, 229176, -2415694, 8320560, 18266890, 12077616, 2593290, 6621112, 14450144, 9192531, -2583865, -4091137, 3014846, 5725238, 3210162, 2923484, 3274879, -1474973, -7325122, -7452320, -5248455, -6477367, -6693885, -120215, 7071711, 6094718, 901053, 856510, 4705925, 5052306, 2909327, 4430536, 7726934, 5967652, 470632, -1357068, 1045946, 1497855, -1494177, -3411608, -2744418, -2446927, -3317243, -3713179, -4562924, -7427820, -9283286, -6270195, -647703, 2960172, 5656123, 10743566, 14501852, 9760296, -1650234, -8946635, -6303746, 703554, 4292532]
10414D292532r41421k604221k996611l125054j772374P63440K612005L382119
10406c89585L604001K536106k08118k591336k828213k279717k674743k560896
10398g392501n5306K650363J771665j657391k213632K042810N863517L652312
10390D661837k300381m366812j50229M010744K361058j709976j361759K296821
10382C441303J787801l892111o320487o10181O292479N749217k05880l489774
10374B752367k366513j328043j433813O59250M578100N251494J391820j846050
10366G658612r75556P58674n70419l132532k796094J5528J074283j140095l264166
10357b371765j958795J418880K760786Q83833j019073j63708J958887K403425
$$ y = [4292532, 3351111, 746890, -2249721, -5374775, -7147149, -6383709, -3771704, -389585, 3214416, 5750522, 5542404, 2951068, 122855, -2156862, -4831605, -7392501, -7447807, -4797444, -3025779, -4683170, -6896802, -4853992, 1009525, 4661837, 2361456, -2005356, -2155585, 1855159, 4216217, 2506241, 1144482, 3441303, 5229104, 1336993, -4983494, -5593675, 698804, 6448021, 6242141, 2752367, 385854, -942189, -2376002, -1716752, 2861348, 8112842, 9504662, 7658612, 6683056, 7441730, 6871311, 3738779, 942685, 958213, 2032496, 892401, -2371765, -4330560, -2911680, -150894, 732939, -286134, -449842, 1509045, 3912470]
10349C912470J282703L69024r79100m172699o743146m601600J003824M300901
10341e627623L463552K440029L131458K323081j195060l182488j225669Q19169
10333I46449j29031r55354J197458K944045P37191k412068k317668p78596j023989
10324a791563q16341K797149O052594L555205k287137m591757k462351p64665
10316c08866j331170j596371o54970O9662J040271L267549M253215J422830k208881
10307C953269k162000j34451o10606k149400n1454L932144L354600j869598m893273
10298f30769k926896l95815j05731L99619J954958J403770j421632j971282Q75942
10289b817836K145426n12646k436882j75112K460678J185057j599266j502787
$$ y = [3912470, 5195173, 5564197, 4585097, 412398, -6330748, -10932348, -9928524, -5627623, -2164071, 275958, 3407416, 5730497, 4535437, 1352949, 127280, 946449, 817418, -137936, 1059522, 4003567, 4740758, 2328690, 11022, -767574, -1791563, -2607904, 189245, 6241839, 9797044, 7509907, 2918150, 455799, -308866, -1640036, -3236407, -3891377, -3821715, -2781444, 486105, 4739320, 6162150, 3953269, 1791269, 1656818, 1046212, -1103188, -1154642, 2777502, 6132102, 4262504, -630769, -3557665, -3953480, -4059211, -3659592, -1704634, -300864, -1722496, -3693778, -2817836, -672410, -1185056, -3621938, -3797050, -1336372, -151315, -1750581, -3253368]
10281c253368O16239J227177K52022k62212n93015j819525k311572k52758K195366
10272d201646J610167j053053j709940N44836K390654J829154J014329J979719
10264B404220K510824o79873n770070o575174p85792N750080O165001J769882
10256D789098n26086J128736J622389j613032m177298k728514n87191p42622Q1395
10247b753125M171745N982682O75434n761159m590160J338112K191759k257626
10239a002338k809743K433211M283445j657681p285601n409130m64308R32341
10231a0979804J135742M906064Q651608N588197k393345o799493m607629q23802
10223e322462K43635k33686J34087J131218J513031J024601K7961p94827m62890
$$ y = [-3253368, -2637129, -1409952, -1157930, -1420142, -2013157, -3832682, -6144254, -6397012, -4201646, -2591479, -3644532, -5354472, -4809636, -2418982, -589828, 424501, 2404220, 4915044, 4235171, -1534899, -8110073, -8895865, -3145785, 3019216, 4789098, 4263012, 5391748, 7014137, 5401105, 1223807, -1504707, -2091898, -2834520, -2753125, 1418620, 7401302, 8076736, 2315577, -2274583, -936471, 1255288, -1002338, -3812081, -1378870, 2904575, 1246894, -6038707, -11447837, -11912145, -10979804, -9844062, -4937998, 3713610, 9301807, 6908462, 108969, -4498660, -5322462, -5078827, -5312513, -5178426, -4047208, -2534177, -1509576, -1481615, -2276442, -2739332]
10214b739332Q25236R97027j146280l358912k408005J272325L624282K139719
10206g93940o09926j2715M137541O072333J115959o573230p628438j87706O311543
10197A831421M063078j658216q62887N317008O577606K118n692124m163723J13212
10188E527493J164403L97959R20682O63443k482648m861523k938946J59209L56956
10179a092972p8092K240086M012553N36765m824069m910033k50150K215623O92409
10170a457880J36168K193065K244653j504746l774579o33138L831069L534916
10162D569528r75072m012809k464060J274454K921792R19793k071266k001834
10154a839474J408257L562905J113621k768015k913562p2114R26804k67360N06417
$$ y = [-2739332, -1914096, -917069, -2063349, -5422261, -7830266, -6557941, -2933659, -793940, -1403866, -1416581, 2720960, 8793293, 9909252, 3336022, -4292416, -4480122, 1831421, 5894499, 4236283, 3373396, 8690404, 15268010, 15270128, 9578004, 5414281, 5527493, 6691896, 7089855, 8010537, 8673980, 6191332, 1329809, -1609137, -1449928, -1092972, -1171064, 1069022, 5081575, 5618340, 794271, -4115762, -4365912, -2150289, -1457880, -1321712, 871353, 3116006, 1611260, -2163319, -2796457, 1034612, 4569528, 3594456, -418353, -2882413, -1607959, 1313833, 2233626, 162360, -1839474, -431217, 3131688, 4245309, 1477294, -1436268, -1508382, -581578, -848938, -342521]
10145c42521L181092K411200k521652m697638p37268K581993p74206n266084k360021
10136h525105M868486N872910o96014n085243j903952K580712J721578j654410
10128b821038j544823J766633L922004L240438M98478l600045o384007l490500
10120h412860L897663P144392J510542n414633l954789L175198N494965J099089
10112D539567j793001P73772K924914n8242m378303n102930l398827k229957j159143
10103i882150L96531L34055j610339j617438J987863N149940M530125K581683
10095A870270K256074J775192q81276l219852k767250j738631k324885j984581
10087g014939J354491L996537K061562j806597k966423j867332j017432M84262
$$ y = [-342521, 2838571, 5249771, 2728119, -1969519, -2706787, -124794, -899000, -6165084, -8525105, -3656619, 2216291, 1520277, -3564966, -5468918, -2888206, -1166628, -2821038, -4365861, -2599228, 1322776, 4563214, 5061692, 1461647, -4922360, -8412860, -4515197, 2629195, 4139737, -1274896, -5229685, -2054487, 3440478, 4539567, 2746566, 3520338, 6445252, 6387010, 2008707, -3094223, -6493050, -8723007, -9882150, -9485619, -9151564, -10761903, -12379341, -10391478, -5241538, -711413, 1870270, 4126344, 5901536, 5020260, 1800408, -966842, -2705473, -5030358, -7014939, -5660448, -1663911, 397651, -1408946, -4375369, -6242701, -7260133, -6775871]
10079f775871L201710L125511j706333n290201k341852K058168O89091k813354
10071i853131l16680N190693L459179m730004p015649R37429Q353248O066491
10063B091576j126852m363592l049269q77283K133295O461960Q215962M362188
10055A3847985j455789l847655k821165j722108j722332k098768k477919j799658
10047d097409J276771M700940M152067j46803k744554j100532J195707J362248
10039D598435J079261P53512k352560o714335n465603K172438O659056K051083
10031B781287l866961j953480L067217P39041o771507p239365J853445Q557065
10023b833258M106007m702736n853616J725092Q056684N304706l315047p724746
$$ y = [-6775871, -3574161, -448650, -2154983, -7445184, -9787036, -7728868, -7039777, -9853131, -10169811, -4979118, -1519939, -6249943, -13265592, -12328163, -3974915, 2091576, 964724, -3398868, -6448137, -7325420, -5192125, 1269835, 9485797, 13847985, 12392196, 8544541, 5723376, 4001268, 2278936, 180168, -2297751, -4097409, -2820638, 1880302, 6032369, 5885566, 3141012, 2040480, 3236187, 4598435, 5677696, 6431208, 4078648, -2635687, -8101290, -5928852, 730204, 2781287, -1085674, -3039154, 28063, 767104, -6004403, -13243768, -11390323, -2833258, 1272749, -3429987, -9283603, -7558511, 498173, 5802879, 2487832, -5236914]
10015e236914k582873O030233P110237j553902r624371p032812L012100Q781710
10007a096592N422052o04767k054487M16837J874316N67415j210712j166494O14184
9998B761752K394170K635940J414442l184j146031k644889l874868k599602J088610
9989B6340K898944l68277n305423n520063k10657M676504M240589K38087k221287
9980a545243j031159J534864K490125J545340O78078Q67595L65425k537231n732644
9971c364850m924803L58288N174554N101833J255679k406525m101054m062266
9963f969144j984055J920218M915041M382961J730258N54904J496909J949588
9955G996680N72069j031353j447922j538446k565011m191442n138657m531250
$$ y = [-5236914, -7819787, -1789554, 5320683, 3766781, -5857590, -12890402, -9878302, -1096592, 4325460, 3720693, 1666206, 2083043, 3957359, 4524774, 3314062, 2147568, 2761752, 5155922, 7791862, 9206304, 9203120, 8057089, 5412200, 1537332, -1062270, 26340, 2925284, 2557007, -2748416, -8268479, -8479136, -3802632, 437957, 676044, -1545243, -2576402, -1041538, 1448587, 2993927, 3672005, 4539600, 4905025, 2367794, -3364850, -8289653, -7931365, -2756811, 2345022, 3600701, 1194176, -2906878, -6969144, -8953199, -7032981, -2117940, 2265021, 3995279, 4550183, 6047092, 7996680, 8568749, 7537396, 6089474, 4551028, 1986017, -2205425, -7344082, -11875332]
9947a1875332k265751P38035K569162J976849J89307k40950J305135K800938K696896
9938b105711K219254L088963M048447K253562j574193k593602J197146M308098
9930A0841964O25281o527415p513984l35116N774065L955758m72636K01653L256598
9921I806168J252240m120458m458850J017413M267674J663796j841968k953621
9913D632394m154073n336237j876143N018375O307187r46030o968335l375662
9905f698524M340481N986986J251755l006173m220874m499376l888844j157752
9897a1892321J757346K449666K017928J453483j067582m252976j874303O184017
9889e224742Q710785j147484j1647148o454847J0902105K0168746J1453970l642740
$$ y = [-11875332, -14141083, -13403048, -10833886, -8857037, -8667730, -8908680, -7603545, -4802607, -2105711, 113543, 3202506, 7250953, 9504515, 7930322, 5336720, 6533866, 10841964, 11467245, 4939830, -2574154, -2909270, 2864795, 6820553, 6347917, 6549570, 9806168, 11058408, 6937950, 2479100, 3496513, 7764187, 9427983, 7586015, 4632394, 478321, -4857916, -6734059, -1715684, 4591503, 3645473, -3322862, -6698524, -2358043, 3628943, 4880698, 1874525, -2346349, -6845725, -10734569, -11892321, -10134975, -7685309, -5667381, -4213898, -5281480, -9534456, -11408759, -5224742, 3486043, 2338559, -9308589, -15763436, -4861331, 15307415, 26761385, 23118645]
9881B3118645r989797o493506j497974J07342p02715j994693k935830l155305
9873c543833k471993l42066L565197O576928M116284k814032n740161r1553O215464
9864E470235L463816m704216o660643o37192L980667K439306J7368M43847L78558
9855D191746j616481j279704K093954K413138k380045n393261k191305J527348
9847b634610P6620k384968J56400M367641L090785k376810m385541j154219J257684
9838c987018q74197l486691j204589M890481Q340944M929377k166060n644076
9830G98171k739069J468234J455683r11573m00762K312556K092812j032931j668550
9821A374571R54258J259675k296632l814549m79711K073826o6051j809620J497499
$$ y = [23118645, 13128848, 6635342, 5137368, 5244710, 4541995, 2547302, -388528, -3543833, -6015826, -6357892, -2792695, 3784233, 7900517, 5086485, -653676, -745229, 5470235, 8934051, 4229835, -2430808, -3068000, 912667, 3351973, 3369341, 3813188, 4191746, 2575265, 1295561, 3389515, 5802653, 3422608, -1970653, -4161958, -2634610, -2557990, -4942958, -4786558, -418917, 2671868, 295058, -4090483, -5244702, -3987018, -4861215, -8347906, -9552495, -4662014, 3678930, 8608307, 6442247, 798171, -1940898, -472664, 983019, 71446, -329316, 1983240, 4076052, 3043121, 1374571, 2328829, 3588504, 1291872, -2522677, -3002388, -928562, -994613, -2804233, -1306734]
9812a306734M810936J610239m542161n516613j442245R41738j98511r13850l59848
9803f917049j548808l497706j230568N141275Q816077N819626j05962m138479
9795B338406n993675o481280m232037M64429L190617J134340j926868p52818L542737
9786h716149N413015L308377J114778R45299j73837l957731n854952j245302N951240
9777c215262P092543J075738l824081k299068O65806q07884l295988n72145M420291
9768g60050L569332k352422l878291K017405O827583L719220k895635n580181
9760F66961m114665k018482O65554M751167P100416M899877J035624n49366j292499
9751A1144587m083099o417535l865989K061736N605244M588506J314860k308936
$$ y = [-1306734, 3504202, 5114441, 572280, -4944333, -6386578, -5444840, -5643351, -6557201, -6917049, -8465857, -11963563, -13194131, -8052856, 763221, 6582847, 6476885, 2338406, -3655269, -10136549, -14368586, -13904157, -10713540, -9579200, -11506068, -12258886, -8716149, -3303134, 5243, 1120021, 2065320, 1891483, -2066248, -7921200, -9166502, -3215262, 3877281, 4953019, 1128938, -1170130, -504324, -1312208, -4608196, -5180341, -760050, 2809282, 456860, -3421431, -1404026, 5423557, 9142777, 6247142, 666961, -3447704, -5466186, -4800632, -49465, 7050951, 11950828, 12986452, 12437086, 11144587, 7061488, 643953, -3222036, -1160300, 4444944, 9033450, 10348310, 8039374]
9743H039374n277565n314931j731298J517330R72560n41448R84743K941756O60151
9734B250672k919689j121039M048425L382980m490933r608172n545074J340035
9726a2662795K648015L7863L212K652490L278256J354506N10492J334555Q89162
9717D5756j061493j170879J512060L392721J521471k402576m576383l295120L94292
9708e640151M237406N862751L821297j084522n834845p270640m491850M02676
9700i997878L906763M079269K142959N70508o6913r80557k228944k284593j085574
9691e944960p74240j874588j457729K343849O223543N485214O97059l030922k998684
9682a331458j571711j626553k816964l377730k660522o31960K451447M623931
$$ y = [8039374, 2761809, -2553122, -4284420, -2767090, -1794530, -2335978, -1351235, 1590521, 2250672, -669017, -1790056, 2258369, 5641349, 1150416, -8457756, -14002830, -12662795, -10014780, -9976917, -9973705, -7321215, -4042959, -2688453, -2177961, -843406, 45756, -1015737, -2186616, -674556, 2718165, 4239636, 1837060, -2739323, -6034443, -5640151, -1402745, 4460006, 8281303, 7196781, 1361936, -5908704, -10400554, -9997878, -6091115, -2011846, 131113, 701621, 634708, -345849, -2574793, -4859386, -5944960, -6719200, -8593788, -10051517, -7707668, -1484125, 4001089, 4698148, 1667226, -1331458, -2903169, -4529722, -7346686, -10724416, -13384938, -14016898, -11565451, -6941520]
9674f941520L368365k07883j495794J072712K962732L52768l218387j899527K937332
9665c069202M312873M45750k589138o97753J892102j71741m613200n007061k53659
9656i751029M526217N399440L347654P98952j423942k869545k398380J28828K870957
9647F29152L840073K852507J291069N48846O17386n6636k479574m709262l445007
9638i11446J132878M551530L696149O28377j453796k933804m995392n234692j175131
9629f695327L734334L648497n39345j805075K260384N470444K482085l113510
9621E442487m332244q54094J326519j050062m184770k704980L048978O952972
9613C644806M238071k385803n428599j805852L195439L115575j170931l755318
$$ y = [-6941520, -3573155, -3781038, -5276832, -4204120, -1241388, -888620, -4107007, -6006534, -3069202, 1243671, 1689421, -899717, -1597470, 294632, 122891, -4490309, -9497370, -9751029, -5224812, 174628, 3522282, 4321234, 2897292, 27747, -2370633, -2241805, 629152, 4469225, 7321732, 8612801, 9161647, 9779033, 9722397, 7242823, 2533561, -911446, 221432, 4772962, 8469111, 9097488, 7643692, 4709888, -285504, -5520196, -6695327, -2960993, 687504, 148159, -1656916, 603468, 6073912, 8555997, 5442487, 1110243, 256149, 1582668, 532606, -3652164, -6357144, -3308166, 3644806, 7882877, 5497074, 68475, -1737377, 1458062, 4573637, 3402706, -352612]
9605c52612k473562n39296k25597j95684N32708R60499J178546K225404K312662
9596C423068j220890n254322k941745N145533R116683L334196m776170n401823
9588A424530r2482K474579J25924j829438q83499O4504r0755R23230K255856l26538
9578D045911n987302p432918j646866M425336L880694J16274N92542M137132K646825
9569D777628n135285r845686m509865M955509P422770J119185n347688n141531
9561a1704963l69268L551007M965853M715966K443898j507661l372478l1351N287431
9552C978434N935647N92949m746687m316417Q89028N058282L817265k104971p680257
9543A423273p845242k503712L103131M462255K830687K029000K281503R64374
$$ y = [-352612, -2826174, -3365470, -3591067, -3786751, -3254043, -2293544, -1114998, 1110406, 3423068, 2202178, -3052144, -5993889, -848356, 8268327, 11602523, 6826353, 1424530, 1332048, 3806627, 3932551, 2103113, 1219614, 1284118, 1193363, 2116593, 4372449, 4045911, -1941391, -9374309, -11021175, -6595839, -2715145, -2598871, -2006329, 2130803, 4777628, -357657, -10203343, -14713208, -9757699, -2334929, -1215744, -6563432, -11704963, -12074231, -8523224, -3557371, 1158595, 3602493, 2094832, -1277646, -1308997, 3978434, 9914081, 10507030, 5760343, 1443926, 2332954, 7391236, 11208501, 9103530, 1423273, -6421969, -8925681, -5822550, -1360295, 1470392, 3499392, 5780895, 6745269]
9535F745269j951934l660461l184975k075680r38045M88395O78667j288397j772802
9526f959963K783950P924978N595336k805802o546390j438004L489800K54719
9518B298624n634538m551164J967980M469013M32755l285250j768162K173691
9510c897051M068308L336545J562796j01113o63985J44880N39061j241528l639760
9501A08153l446510m90383K147999K387640J021106m35819j343893j401421m32122
9492a885250J136635K474524K581124L46636l738014n927162k605006L715054
9484c901459N822367J311717l618459l021188M21266M47503k765680l382656P72702
9475g913887N160919N014560Q79842k989672l192080J41814L521943L284204k33383
$$ y = [6745269, 4793335, 1132874, -2052101, -4127781, -5065826, -4577431, -3898764, -5187161, -6959963, -4176013, 3748965, 9344301, 6538499, -7891, -1445895, 2043905, 2298624, -3335914, -7887078, -5919098, -1450085, -1017330, -4302580, -6070742, -3897051, 171257, 3507802, 5070598, 4969485, 4305500, 4450380, 4989441, 3747913, 108153, -3338357, -3828740, -1680741, 706899, 1728005, 1292186, -51707, -1453128, -1885250, -748615, 1725909, 4307033, 4653669, 915655, -5011507, -7616513, -3901459, 1920908, 3232625, -385834, -3407022, -2985756, -2538253, -5303933, -8686589, -7913887, -2752968, 2261592, 3141434, 151762, -3040318, -2898504, 623439, 3907643, 3674260]
9466C674260k743195j244831K377753M012772J749691l078944p055492o535011
9458h842997j276931L674809L446654L88002N99202L734272L436262j073815k635673
9449A449785J444312L951842J66474l412763l22127M171456K153619k921922k255872
9440D424804K975003L916932q24315l694611j353377J017982m43519k905316k968027
9431A45556j227942N79934J485533K11260k816403l556474L00124M232453L063185
9422B417226n73642q05006J521603J395895p62225r56519m73401l083678n461796
9413f781543j211633O571368Q133180K527351j274193L96119J478389j044539
9405H794499k121734J50284N4168m255777n775071q23793L877319K516610o86453
$$ y = [3674260, 931065, -313766, 2063987, 6076759, 7826450, 4747506, -2307986, -8842997, -10119928, -6445119, -2998465, -2610463, -2011261, 1723011, 5159273, 4085458, 1449785, 2894097, 6845939, 7012413, 3599650, 3277523, 7448979, 9602598, 6680676, 4424804, 7399807, 11316739, 10492424, 6797813, 5444436, 6462418, 6018899, 3113583, 145556, -1082386, -502452, 983081, 1194341, -1622062, -5178536, -4878412, -645959, 2417226, 1843584, 1038578, 2560181, 3956076, 3193851, 2237332, 1763931, -1319747, -6781543, -7993176, -1421808, 6711372, 9238723, 7964530, 8360649, 9839038, 8794499, 6672765, 6823049, 6877217, 2621440, -3153631, -3977424, -100105, 2416505, 1730052]
9396A730052k71107J127792o52662k940915j690429J068567J873944J993830K891863
9387E130935J652760k955632n965108m001140j478733k518144l040948J508150
9379a1667860O401779M374616k051451l974880N12938M649293L733004L87991
9371B365430j017092K66569K083788J927925j074666m674678n368978l014133
9363h505835q08825K63664K554037N773562N562008Q95274k823412j744140R28669
9354B095002J320945R12537J723827J577732n83074p24972K842676L999617j948951
9345A1215339q663256o710869K221793P323193L289101m171564o921026k960973
9337e378262L245039N262962N83323n703946n863855K23040M583106K974429L09310
$$ y = [1730052, 1458945, 2586737, 1934075, -1006840, -2697269, -1628702, 245242, 2239072, 5130935, 6783695, 3828063, -2137045, -6138185, -7616918, -10135062, -13176010, -11667860, -5266081, -891465, -2942916, -6917796, -6404858, -1755565, 1977439, 2365430, 1348338, 1614907, 3698695, 5626620, 4551954, -122724, -5491702, -8505835, -9314660, -9050996, -6496959, -723397, 4838611, 5733885, 2910473, 1166333, 2095002, 3415947, 4328484, 6052311, 7630043, 7046969, 6321997, 9164673, 13164290, 11215339, 2552083, -4158786, -1936993, 5386200, 8675301, 4503737, -2417289, -5378262, -2133223, 3129739, 3713062, -1990884, -7854739, -7631699, -3048593, -74164, 235146]
9328B35146P05180M18960l363273n127368n70422M085013J954754k081960K06281
9319c537689N325687L873770k572067l903293Q70450K137212l387570p262433
9311h455933l849007J184021J387417q46406m21275J939544K502944Q04017j007729
9302f762407j524748l04046K138773L503729K103258q922K9663Q46709p57073
9293g35064l682293m062234j704038M41999J773619L261346L184915J55436j888637
9284c254951P99223L695891L61827n191129l199703N259945Q246621J417573n257012
9275B878285l410190J792885J644788k860895m552244p47556N232564Q499418
9267H477055M974627n166099j3636305j0446910K366109J0680671O150785l310393
$$ y = [235146, 940326, 1359286, -2003987, -7131355, -7701777, -3616764, -1662010, -3743970, -3537689, 1787998, 5661768, 3089701, -813592, 56858, 2194070, -1193500, -8455933, -12304940, -11120919, -9733502, -10579908, -11001183, -9061639, -6558695, -5754678, -6762407, -8287155, -8591201, -6452428, -2948699, -845441, -854363, -824700, 22009, -735064, -4417357, -8479591, -10183629, -9741630, -7968011, -4706665, -1521750, -1366314, -3254951, -2455728, 1240163, 1601990, -3589139, -6788842, -1528897, 6717724, 8135297, 2878285, -531905, 1260980, 2905768, 44873, -4507371, -5254927, -22363, 8477055, 13451682, 8285583, -5350722, -15797632, -13431523, -2750852, 3399933, 89540]
9259H9540n959401j584503K144870K186505J261144Q54366K68870j26643j46287
9250a011539j293393k795795n49916N283290P031693J55151p876529p039378O76533
9241g419883M638588J301838k330803q44562K429442K491102K04547p51508j70736
9232d51975p51651l042911l977716q37443M441841O340764K213960l546408m476173
9223d087712n10620K410965J289919n03662k19118l45153k819941l884548K80342
9214h389528O480497Q322472M701971j58817l102928m073528l486980j746654
9206a453495k09845N14338J541549K477846L27990m961280p584198l290409L476982
9197i160522N337971K157523n76084j185964k472182m057672j906120L598283
$$ y = [89540, -5869861, -7454364, -5309494, -3122989, -1861845, -1007479, -738609, -865252, -1011539, -2304932, -5100727, -5650643, -367353, 6664340, 6819491, -1057038, -8096416, -7419883, -2781295, -1479457, -3810260, -4654822, -2225380, 265722, 470269, -281239, -451975, -1203626, -4246537, -8224253, -9061696, -4619855, 1720909, 3934869, 388461, -4087712, -4598332, -2187367, -897448, -1401110, -1620228, -1965381, -4785322, -8669870, -8389528, -1909031, 6413441, 11115412, 10956595, 7853667, 3780139, 293159, -1453495, -1663340, -1149002, 392547, 2870393, 3198383, -1762897, -9347095, -12637504, -9160522, -3822551, -1665028, -2241112, -3427076, -5899258, -9956930, -11863050, -8264767]
9189h264767O287044L259374p40388r49073O63438m6172k335294k482326q0123
9180d688287J951028K407927K985165M494113N045726K922395p00672l135349
9172A1282046l319630k411563j631956q43881K84013Q68245k56004k717059m813252
9163c559041n038285k484042K926853Q665545R603110L243346n494484q558986
9155f95984m248792J322559K843202J608344J305447K422614L316049L184876
9147A1058315J488220k270287o013356o020074k534365k29898p35054J56894M517860
9138e81745P356787M560857J28667q07380r35510m917040q980789n964780J591864
9129h549069L834291r00507l319242J739171P060150M627088k189676m274965
$$ y = [-8264767, -1977723, 1281651, 541263, -407810, 255628, 209456, -2125838, -4608164, -4688287, -2737259, -329332, 2655833, 7149946, 12195672, 15118067, 14417395, 11282046, 7962416, 5550853, 3918897, 3075016, 3359029, 4227274, 3971270, 1254211, -3559041, -8597326, -11081368, -8154515, 511030, 10114140, 13357486, 7863002, -695984, -4944776, -3622217, -779015, 829329, 2134776, 4557390, 7873439, 11058315, 12546535, 10276248, 4262892, -1757182, -4291547, -4521445, -5256499, -5099605, -581745, 6775042, 11335899, 11464566, 10657186, 9721676, 4804636, -4176153, -10140933, -8549069, -4714778, -5615285, -8934527, -7195356, -135206, 4491882, 2302206, -1972759]
9121a972759K12329M701472L795990j091038n060989n193984k372549O63142K425714
9112c892672L410849L588617J375941k855853m894361k094663J587453R65632
9104b809057j821948m78492M598804O195007J927749j816425l48736K228240O24072
9095H299214l173606m165554k175392j57671J398844L246544L816866J795198
9087H884443m96145p27872o94609k432121l471258j062805J898083R65121k241807
9078F21030k682597l80116K63990j411118j702366R2309N51647q58618m63492
9069e969331K259485K732073n26053k200193J198127M705894K391446k825957
9061A765491l358704J329467M010453P19052l665341l020984J346672L259028
$$ y = [-1972759, -1760430, 2941042, 6737032, 5645994, 585005, -4608979, -6981528, -6318386, -3892672, -481823, 3106794, 4482735, 1626882, -3267479, -5362142, -3774689, -2809057, -4631005, -5109497, -510693, 5684314, 7612063, 5795638, 5446902, 7675142, 8299214, 5125608, 960054, -1215338, -1373009, 25835, 3272379, 7089245, 8884443, 8388298, 7660426, 6965817, 4533696, 1062438, -367, 1897716, 2862837, 621030, -2061567, -2441683, -2177693, -3588811, -5291177, -5198868, -4647221, -5505839, -5969331, -3709846, -977773, -1503826, -3704019, -2505892, 2200002, 4591448, 1765491, -1593213, -263746, 3746707, 4465759, 800418, -2220566, -873894, 2385134]
9053B385134P26494j605787L87193L840030K474976m110839q551586n135035K016390
9044g573030M329675O26094k115587j36428J641937j281468m536210j435220N927758
9035d552479R164906N538275M63605j720210k520414l573717k931878k514J509525
9026A375099n73402k804455j904508l04090j153710j852684J406032N539934M067975
9017C796191k384033o174566l768375n7232K34546q08810N45633L141564L824012
9008a651070L041969K973075K709346L9949l521610m199000k008978r47175k508139
8999f071633l020599O33004N526962N863918O92466m325000l619473J621255N249891
8990B550791L849270J25835j877434j949587j853298j031776J807759M287207
$$ y = [2385134, 3111628, 1505841, 1893034, 5733064, 8208040, 4097201, -4454385, -9589420, -7573030, -3243355, -2617261, -4732848, -4869276, -3227339, -4508807, -9045017, -10480237, -4552479, 4612427, 10150702, 10614307, 8894097, 6373683, 2799966, -131912, -134426, 1375099, 801697, -2002758, -3907266, -4211356, -5365066, -7217750, -5811718, -271784, 3796191, 1412158, -4762408, -8530783, -8588015, -8353469, -9162279, -8616646, -5475082, -1651070, 1390899, 4363974, 7073320, 7113269, 3591659, -607341, -2616319, -3563494, -6071633, -9092232, -8459228, -2932266, 2931652, 3624118, -700882, -4320355, -2699100, 2550791, 6400061, 6525896, 4648462, 2698875, 845577, -186199, 1621560, 5908767]
8982E908767K537341k181748m248387k148808o71701k411766l021734Q98770M648891
8973f90375K316282l053184l460206J808483N482952L634811L51396k31120K50466
8964F409505p51157j825493j244207q37772k229647k941025n36835K333075J673555
8955D9999j184170j565971R57848K055821l2074j540938N83427L427355K306130
8946E057427j959119l717175l18644L992579L651750p30018l172398m76400L358060
8937E686062K688175j766730l740599j92870M155909L031028k814095o245487
8929H01393k745666L888781O083475J345280n113491o585966k358425K035992
8921b648627J703805j877489l081461M52952M441394L205535k578125n677930
$$ y = [5908767, 8446108, 6264360, 2015973, -132835, -804536, -3216302, -6238036, -5339266, -690375, 1625907, -1427277, -4887483, -3079000, 2403952, 6038763, 6390159, 6159039, 6409505, 5658348, 3832855, 2588648, 1750876, -478771, -3419796, -3956631, -1623556, 49999, -1134171, -2700142, -1742294, 313527, 281453, -1259485, -676058, 2751297, 5057427, 3098308, -618867, -937511, 3055068, 6706818, 5976800, 2804402, 2328002, 5686062, 8374237, 6607507, 2866908, 2674038, 6829947, 9860975, 7046880, 801393, -1944273, 1944508, 8027983, 9373263, 4259772, -2326194, -4684619, -2648627, -944822, -2822311, -5903772, -5450820, -1009426, 2196109, -382016, -6059946]
8913f059946r97501P251463R794147L573730m532406o793862l929837j755667
8905c449879j402460J050067N524279N692497j149530p850726o264181J447532
8897f402401O157273M135072J5915j582459j185199o73263l2905M53677n92719
8888B92991k347646j730421J406999K974131Q00811j725140j029444J136882J085655
8879H64818o65346o08554K053665M633626M956866L012061n22525m342553n794995
8870C587063l267247Q19948K241593K93989j674162j172156O61153J673200J448618
8861D611999M83187r95408k007825p72990K418439L993770J272232l076383l733055
8852B193966r8278K234288q42332n482563m590735K075242O868373M375264j538013
$$ y = [-6059946, -7057447, 194016, 9988163, 13561893, 9029487, 2235625, -1694212, -3449879, -4852339, -3802272, 1722007, 7414504, 6264974, -1585752, -7849933, -6402401, -245128, 3889944, 3905859, 2323400, 1138201, 464938, 432033, 885710, 292991, -2054655, -3785076, -2378077, 596054, 1396865, -328275, -1357719, -220837, 864818, 199472, -409082, 1644583, 6278209, 11235075, 14247136, 13724611, 9382058, 3587063, 319816, 1139764, 3381357, 3675346, 2001184, 829028, 1490181, 3163381, 4611999, 5095186, 4099778, 2091953, 1318963, 3737402, 7731172, 9003404, 5927021, 2193966, 2095688, 4329976, 3487644, -1994919, -6585654, -4510412, 2357961, 6733225, 5195212]
8843E195212l653844j158246Q03244m53660k291259k377411k132124k808093k350655
8834a1226836R42641M588394M965850K340307j85114j436705k802260m613839
8826g427562m847074k028171K375698N249287M839167K365146R26730K311748
8818C764969M635442M126006k97596n417444p214909m632448N31414N407770O839458
8809G742662K989059l766982p607759n423555o71387J371849N24029O63373K957254
8800a221457M118855J773579j885551l114252j004284K321057M196409L210545
8792H394901N0998k609540k374001M4990J445295J00270k232599k923221j724166
8783a827073l84629j6813j10463J76252Q03155J128025Q68867L74401k8149m64313
$$ y = [5195212, 1541368, 383122, 1186366, 732706, -1558553, -3935964, -6068088, -8876181, -11226836, -10284195, -5695801, -729951, 1610356, 1425242, -11463, -2813723, -7427562, -12274636, -14302807, -11927109, -6677822, -1838655, 526491, 1453221, 3764969, 8400411, 12526417, 12228821, 6811377, -403532, -5035980, -4504566, 903204, 7742662, 10731721, 6964739, -643020, -6066575, -6737962, -5366113, -4842084, -4178711, -1221457, 2897398, 4670977, 2785426, -328826, -1333110, 987947, 5184356, 8394901, 8445899, 5836359, 3462358, 3507348, 4952643, 5052913, 2820314, -102907, -1827073, -2211702, -2228515, -2338978, -2162726, -1359571, -231546, 637321, 1011722, 983573, 519260]
8773E19260q55601l74307J339608K670037J435854j810003l799103k788009p61511
8764d423775N0412O28275K685777M567339L065001j247791l944076k428167J183258
8755A36253L595182M068252L405218J611566j395246l967982l661125j16325L845787
8746G521580M465177P36320m005577n085962j776456J625411J278287j164967
8738C593813j334634J212705K474872J25046l319767m526875l525229k118766
8730g418835o01308J615286L601028L525094J266967j181181j857579n79281J185320
8721d44489J751500Q73473k0529K04583P06510J29998r33605q80922k2544n5055
8711A308920p07249J0947J693548J184896k203570m639766l318246q17406o25965
$$ y = [519260, -336341, -710648, 628960, 3298997, 4734851, 2924848, -874255, -3662264, -4423775, -4373363, -3745088, -1059311, 3508028, 6573029, 5325238, 1381162, -1047005, 136253, 3731435, 7799687, 11204905, 12816471, 11421225, 7453243, 3792118, 3675793, 7521580, 11986757, 12723077, 8717500, 3631538, 1855082, 3480493, 4758780, 3593813, 2259179, 3471884, 5946756, 6071802, 2752035, -1774840, -5300069, -7418835, -8020143, -6404857, -2803829, 721265, 1988232, 807051, -1050528, -1629809, -444489, 1307011, 2180484, 2159955, 2364538, 3071048, 3201046, 2267441, 1386519, 1363975, 1308920, 601671, 612618, 2306166, 3491062, 1287492, -3352274, -6670520, -7487926, -8113891]
8702h113891j102234J611668O053478O005660n27692p112122o164628J666501
8694g683260Q000875O269319j061584n661765l051767K546074M110482Q90304
8686D358678j482431L35106K812854J531218k100597l670732k611847j845651
8678b673402k052432r71378J779384L526609K854938J441690O95977j38370j494272
8669B968744k145432j497364m80853O93188K673762M040585J871916l173917o036093
8660a085464l848390K449J138114K37210M66420J826059K126096J391477J005477
8651C259448J58667k378098m298525k465021J232236J946686l89864j044538J211263
8642b767746J919574j013174l222230j215836J754865J597009J99642R23364J618185
$$ y = [-8113891, -9216125, -7604457, -1550979, 4454681, 3926989, -3185133, -9349761, -7683260, 317615, 6586934, 5525350, -136415, -3188182, -642108, 3468374, 4358678, 2876247, 3211353, 6024207, 7555425, 5454828, 1784096, -827751, -2673402, -4725834, -5697212, -3917828, -391219, 2463719, 3905409, 4601386, 4463016, 2968744, 823312, -674052, -1154905, -461717, 2212045, 6252630, 8124546, 4950629, -1085464, -4933854, -4931405, -3793291, -3556081, -3089661, -1263602, 862494, 2253971, 3259448, 3418115, 1040017, -3258508, -5723529, -4491293, -2544607, -2934471, -3979009, -2767746, -848172, -1861346, -5083576, -6299412, -4544547, -2947538, -2747896, -1824532, -206347]
8633b06347j145672m120696j533853M415903N740057J431033r10778J829426K892556
8624H391629k120383o448726k991468L072549K066533m171566m991005J653047
8616e539390N776053J408711m285207k892838K563793L737301O5038j908410O40082
8607d34867L785746L683979O51915l325701o442205o534373k819259J892287M136188
8598e406290M208685M168000L118573o30623m116028k722343J524813J649681
8590A794468l072970m995779o7410N389195M602485N16832k88827J486282O90860
8581F055136k143593j910165J402040K424065j49029j602644M0586N55094k736274
8572A935216o054840n208165j346674K442464N417584O770547L890743k704766
$$ y = [-206347, -1352019, -5472715, -7006568, -2590665, 3149392, 4580425, 3669647, 5499073, 8391629, 6271246, -177480, -3168948, -96399, 1970134, -2201432, -7192437, -5539390, 236663, 1645374, -2639833, -5532671, -2968878, 768423, 833461, -1074949, -434867, 3350879, 7034858, 7686773, 4361072, -2081133, -8615506, -11434765, -9542478, -5406290, -1197605, 2970395, 6088968, 5458345, 1342317, -1380026, 144787, 1794468, -1278502, -6274281, -6341691, -952496, 3649989, 4166821, 3877994, 5364276, 6055136, 3911543, 2001378, 3403418, 5827483, 5678454, 4075810, 4116396, 4671490, 1935216, -4119624, -9327789, -10674463, -8231999, -2814415, 3956132, 7846875, 5142109]
8564E142109o902951m235057J636498M230314K931130J441888N87044j322073
8556C508902k884413j031293K346385J692063l357560o342525l202776K004471
8548g266746L388142J033004p97668j94848J209478J823494J718002J333986P34818
8539B981662j6142p04058q15908L72907K295633K234580j518488n832848n541444
8530f544106o93952K995888K394341J008017J980158K013984k576498p579782
8522g001950n703349J726578N417060J449419l146241j245371M091783N295546
8514H83475J968369M01839K988563M683808J250787m056395m959706m43938M421524
8505G138326M748012O53587l711710m450292j461845J511758R39225k132553l280980
$$ y = [5142109, -1760842, -5995899, -4359401, -129087, 2802043, 4243931, 4830975, 3508902, 624489, -406804, 1939581, 3631644, 274084, -6068441, -9271217, -7266746, -3878604, -2845600, -3643268, -3838116, -2628638, -805144, 912858, 2246844, 2981662, 2965520, 2261462, 1445554, 1818461, 4114094, 6348674, 4830186, -1002662, -6544106, -7238058, -4242170, -1847829, -839812, 1140346, 3154330, 577832, -7001950, -12705299, -10978721, -5561661, -4112242, -7258483, -8503854, -4412071, 883475, 2851844, 3253683, 6242246, 10926054, 12176841, 8120446, 3160740, 2716802, 7138326, 11886338, 12539925, 8828215, 4377923, 2916078, 4427836, 5367061, 3234508, -46472]
8496d6472q80111J443870M17365j643683q44745J218699k32863m307231m338965
8487i214136J480363N744195K370046l720185l548813K634689O094560K509452
8479D350171k856154l698535l60390K971680L906720K387553n57284k504337j359490
8470B279934J112139R99205j400700j482912J636741K438568k199219o763652
8462c379896m863639Q17826K593851o49981k669758l532L554017L689889J417521
8453E06298O598k369r5073n09300q0517J645908L586427M053228K210474r18435
8443A0403239l129615l230022j880630M2733K258121L469686J455680l310965
8435F078227o508354n020755j073691J415828K230421L121401L162969N52448
$$ y = [-46472, -926583, 517287, 934652, -709031, -1553776, -335077, -567940, -4875171, -9214136, -7733773, -1989578, 380468, -3339717, -6888530, -4253841, 1840719, 4350171, 1494017, -2204518, -2564908, 406772, 4313492, 6701045, 6143761, 3639424, 2279934, 3392073, 4391278, 2990578, 1507666, 3144407, 5582975, 3383756, -3379896, -8243535, -7425709, -4831858, -5481839, -8151597, -8155129, -4601112, -911223, 506298, 512896, 510527, 415454, -93846, -174363, 1471545, 5057972, 9111200, 11321674, 10403239, 7273624, 4043602, 2162972, 2205705, 4463826, 7933512, 9389192, 6078227, -430127, -5450882, -6524573, -5108745, -2878324, 243077, 3406046, 3958494]
8427C958494k511338k078107Q51784J192886k180519m368450j796400K838465
8419d093185M863178L247063P8805k475799k944907q86557K031592L308374K631967
8410E760531J543323L71005j424373k282136j29575K795107J542578l776497o601041
8401b201078k669835L923603O275892L051104j470079l166495j435630J276809
8393C584291J636321j083903l118555m91305M716309O214885K139508k659454
8385A0938097l955474k852761j720460p81935p45486l117553n377081k126576
8377i739229N487636Q261835J798452n594940m289728K938622O036526K242891
8369G142065k454976l594751k152616J40809K318632K220190p17892k275372Q59971
$$ y = [3958494, 1447156, -630951, 220833, 1413719, -766800, -5135250, -6931650, -4093185, 769993, 4017056, 4095861, 1620062, -1324845, -2211402, -179810, 3128564, 5760531, 7303854, 7674859, 6250486, 3968350, 3838775, 6633882, 8176460, 4399963, -2201078, -4870913, -947310, 5328582, 8379686, 6909607, 3743112, 2307482, 3584291, 5220612, 4136709, 1018154, 526849, 5243158, 11458043, 13597551, 10938097, 6982623, 4129862, 2409402, 1627467, 881981, -2235572, -7612653, -9739229, -4251593, 4010242, 5808694, 213754, -4075974, -1137352, 4899174, 7142065, 4687089, 1092338, -1060278, -919469, 1399163, 3619353, 2901461, 626089, 1486060]
8360A486060M439068K555838k115584k107495K246699L050450k082265o167160
8352A305611l953332J039149L303785K480134Q42314p35765j734045j486805j218038
8343a56992k308898k622223J33857K435750m40383m735059k398470M673340N526882
8334A07804k143595o878099j310253O175484N399145j18979j410824N48642q84330
8325e15005m258869k622609L275146N700047K524135r04186j683955j768272r87065
8316a240633K860709O675403M218681l153427o884580m151342j468037k732044
8308e875270k877944J993148O486591M298822j455690l200731q9123K251744O30349
8299B161896k694383m389791k937837J502755O327866P100740K588380k281543
$$ y = [1486060, 5925128, 8480966, 6365382, 4257887, 6504586, 9555036, 7472771, 1305611, -2647721, -1608572, 1695213, 4175347, 5017661, 4281896, 2547851, 1061046, -156992, -2465890, -5088113, -4954256, -2518506, -2958889, -7693948, -10092418, -5419078, 107804, -2035791, -8913890, -10224143, -4048659, 1350486, 1231507, -179317, 369325, -515005, -4773874, -7396483, -4121337, 1578710, 4102845, 3198659, 1514704, -253568, -1240633, 1620076, 8295479, 12514160, 9360733, 2476153, -1675189, -3143226, -5875270, -8753214, -6760066, -273475, 4025347, 2569657, -631074, -720197, 1531547, 2161896, -532487, -4922278, -7860115, -6357360, -29494, 7071246, 9659626, 7378083]
8291G378083k126807J567242K605360j356330o205975p083589l377138J991305
8283f607849N380713M472896J32466l592323l468147q41403P17932O79708J354921
8274a771086K860559K248139j337799m233080l030594P90781L170983K463515
8266A161418J14872j893280k178297j31176K753356L152460K6764k935504j999993
8257a929380P71132L79483k901258l250952J493341N616291L817029p28162j566001
8248A701523R22265J005078k015959k279655K207423M693640k96390p311173o800926
8239h174174R31005N748682K000737l874454l132839K950339N734666J890206
8231D074168k512109j410704K766541L374784n69081l341316j010614L371210
$$ y = [7378083, 5251276, 6818518, 9423878, 8067548, 1861573, -5222016, -8599154, -6607849, -1227136, 3245760, 3378226, -214097, -3682244, -4523647, -3805715, -3126007, -1771086, 1089473, 3337612, 1999813, -2233267, -5263861, -4473080, -1302097, 1161418, 1276290, -616990, -2795287, -2926463, -173107, 2979353, 3006117, 70613, -1929380, -1158248, -778765, -3680023, -6930975, -5437634, 178657, 3995686, 3267524, 1701523, 2623788, 3628866, 1612907, -666748, 1540675, 6234315, 5937925, -1373248, -8174174, -7243169, -1494487, 506250, -3368204, -6501043, -3550704, 2183962, 4074168, 1562059, 151355, 2917896, 6292680, 5723599, 2382283, 1371669, 4742879]
8223D742879M702834K503002k25921k304819m583702n942450l668569J457706
8215c319040M585119L143378K54088o62765j181807l904353o035575k632227M297386
8206e455796O215214k37653p194033n390050L454660R325981P249361J993313
8198I960997q01292j862621l743103m446286r96935L600116L237669k035618n534740
8189b621813l631745m03231l78528j746363n23554K402945L068950J001417o05418
8180c437340k71163K28475n65136j854912k145686n00554L040055O333274N964181
8171F791194J515314k965805m281131m023528l949789j440780M919999R044062
8163E609536M554870l745611m921603J598254M626569j349903p562872m947752
$$ y = [4742879, 9445713, 11948715, 11722794, 9417975, 4834273, -1108177, -4776746, -3319040, 1266079, 4409457, 4663545, 4000780, 2818973, -1085380, -7120955, -9753182, -5455796, 759418, 521765, -6672268, -12062318, -8607658, 718323, 7967684, 9960997, 9159705, 7297084, 3553981, -892305, -1889240, 1710876, 4948545, 2912927, -2621813, -6253558, -6656789, -7035317, -8781680, -9305234, -6902289, -3833339, -2831922, -3437340, -3708503, -3480028, -4045164, -5900076, -8045762, -8546316, -5506261, 827013, 6791194, 8306508, 5340703, 1059572, -2963956, -6913745, -8354525, -3434526, 5609536, 10164406, 6418795, 1497192, 3095446, 7722015, 6372112, -1190760, -6138512]
8155f138512K243833M224625L20942k599540j896344p50715l69021J273429L476496
8146b14807K666495j141317l363767j491474J595833K124372j5387k218504k413364
8137d471920p33808P89839M36953p46973k22255J794769K197916K99758m34153
8128a089874J856422L921273K688796Q4503j057858j813055l527575l451647O25976
8119a763039M842517M263016O41928q11510P5802m52167k496197k673574o51802
8110I74974P58438J040522J634942J541885o99597k354372l85584J943879j57430
8101D297657l541160j249850M914873N919828J43952l865866j486893J345087
8093F477628n82764l350735j984108J238283K325127K490206L800293M057098
$$ y = [-6138512, -3894679, 329946, 650888, -1948652, -3844996, -4595711, -4964732, -3691303, -214807, 2451688, 1310371, -2053396, -3544870, -1949037, 175335, 159948, -2058556, -4471920, -5205728, -4415889, -3978936, -4725909, -4948164, -3153395, -955479, -655721, -1089874, 766548, 4687821, 7376617, 7461120, 6403262, 4590207, 1062632, -2389015, -1763039, 3079478, 7342494, 7984422, 7172912, 7248714, 6796547, 4300350, 1626776, 974974, 1733412, 2773934, 4408876, 5950761, 5251164, 2896792, 2511208, 4455087, 4297657, 756497, -493353, 4421520, 10341348, 10485300, 6619434, 5132541, 6477628, 5894864, 2544129, 560021, 1798304, 4123431, 6613637, 10413930, 14471028]
8085A4471028J585025n50059l73123j253745m886483o105489j125783M631733
8077F393104M161759l82633k123319o46570o82412k481730j926601J002778J716057
8068E030433r87449l043710j832413O52607J845293J360917k89158j790704n73008
8059C72808L697421O473702L767231j257743k497186m53085j150681n639276p581838
8050d268647l128006L039329M669278K120213o8328j83886n909o37510j305866
8041B30668j455986j322073p13976P95081K499776K845823J410740k07037M483
8032D087499K051331L500401J934903k196510n816116o378973m026711n47543
8024g391719K588760M617628N003260L539153P17149k186122l385985j923375
$$ y = [14471028, 16056053, 15505994, 15132871, 13879126, 8992643, 2887154, 1761371, 6393104, 10554863, 10172230, 8048911, 7402341, 6719929, 4238199, 2311598, 3314376, 5030433, 4042984, 999274, -833139, -180532, 1664761, 3025678, 2736520, 945816, 372808, 4070229, 10543931, 14311162, 13053419, 10556233, 10103148, 8952467, 3313191, -4268647, -7396653, -4357324, 311954, 2432167, 2363839, 2179953, 2174044, 1536534, 230668, -1225318, -2547391, -3261367, -2466286, 33490, 2879313, 4290053, 4083016, 4087499, 6138830, 9639231, 11574134, 9377624, 3561508, -2817465, -6844176, -7391719, -4802959, -185331, 4817929, 8357082, 9074231, 6888109, 3502124, 1578749]
8016A578749N29054P47397j585668k495842N91192M016216K806593j373664k514489
8007B299538L96556K466742J405051J86587J40550j351010l990774l019762J803090
7998C36568L249601k197199p243727m296472L031651O162625M061597J605191
7990D709835j37617l254949n620315l150458J949209L421653P66942p36477O91386
7981a360791J445011j58055j791198k552536l729778l962816m76639M457928N209076
7972b919798J689561k54669J658104L211807J680358k51562o12511j426037l262333
7963d87080k860588P81403L689292L265740J896407J422434j57583l148163l304924
7954A096938J091400M558480J832234m210068p014404n226886k212280K14459
$$ y = [1578749, 2107803, 2855200, 1269532, -1226310, -635118, 3381098, 6187691, 4814027, 2299538, 2696094, 5162836, 6567887, 6754474, 6895024, 5544014, 1553240, -1466522, 336568, 3586169, 1388970, -5854757, -10151229, -7119578, -956953, 3104644, 4709835, 4572218, 1317269, -4303046, -7453504, -5504295, -2082642, -1315700, -2052177, -1360791, 84220, -73835, -1865033, -4417569, -8147347, -12110163, -12586802, -8128874, -2919798, -1230237, -1484906, 173198, 3385005, 5065363, 4813801, 4201290, 2775253, -487080, -3347668, -2566265, 1123027, 4388767, 6285174, 7707608, 7550025, 4401862, 1096938, 2188338, 6746818, 8579052, 4368984, -2645420, -7872306, -10084586, -9870127]
7946i870127K390530L322285J739860m31264o7988K185330K662736J53566k596017
7937e11089k993548j557042k46937K43076O50345J395426J539500Q6899j770412
7928c163782j375636J261466K243971o62711l426433r43299M498459N480704M12127
7919D324866l732982j628638K890469L003353j502446m942976l633673O87874
7911d534153M193266M837469L181979R76311q92474k815282m299636l136180R65477
7902a523223L882555K062368j587865j721144P61299L08712l204633l439455J705474
7893b755912N848253L976452k61884j658960j743002m186847o655915l971061
$$ y = [-9870127, -7479597, -4157312, -2417452, -2848716, -2916704, -731374, 1931362, 2084928, -511089, -3504637, -5061679, -5308616, -5065540, -4415195, -3019769, -1480269, -1393370, -3163782, -4539418, -3277952, -1033981, -1696692, -5123125, -6066424, -1567965, 3912739, 4324866, 591884, -1036754, 1853715, 4857068, 3354622, -1588354, -5222027, -4534153, -340887, 4496582, 7678561, 8654872, 7762398, 4947116, 647480, -2488700, -1523223, 2359332, 4421700, 2833835, 1112691, 1873990, 2182702, -1021931, -4461386, -2755912, 3092341, 7068793, 6806909, 5147949, 3404947, -781900, -7437815, -11408876]
$$ [...]
##END NTUPLES=NMR SPECTRUM
##END=
