##TITLE=31Pdec_1BEPA0207
 D2O, 24 sc
 5.07.2021
##JCAMPDX= 6.0         $$ Bruker NMR JCAMP-DX V2.0
##DATA TYPE= NMR SPECTRUM
##DATA CLASS= NTUPLES
##ORIGIN= UXNMR, Bruker Analytische Messtechnik GmbH
##OWNER= root
$$ XWIN-NMR		Version 3.5
$$ Mon Jul  5 10:06:29 2021 Russian Standard Time (UT+4h)  she@DPX200
##.OBSERVE FREQUENCY= 81.013821
##.OBSERVE NUCLEUS= ^31P
##.ACQUISITION MODE= SIMULTANEOUS
##.ACQUISITION SCHEME= undefined
##.AVERAGES= 24
##.DIGITISER RES= 16
##SPECTROMETER/DATA SYSTEM= spect
##.PULSE SEQUENCE= zgpg30
##.SOLVENT NAME= D2O
##.SHIFT REFERENCE= (INTERNAL, D2O, 0, 248.564)
##AUDIT TRAIL= $$ (NUMBER, WHEN, WHO, WHERE, WHAT)
$$ ##TITLE= Audit trail, XWIN-NMR		Version 3.5
$$ ##JCAMPDX= 5.01
$$ ##ORIGIN= Bruker BioSpin GmbH
$$ ##OWNER= she
$$ F:/spectra/data/she/nmr/P31/1/pdata/1/auditp.txt
$$ ##AUDIT TRAIL=  $$ (NUMBER, WHEN, WHO, WHERE, WHAT)
(   1,<2021-07-05 10:05:20.98 +0400>,<she>,<DPX200>,
      <created by zg, POWCHK disabled, PULCHK disabled
       configuration hash MD5:
       00 E9 B6 7A A2 85 ED C7 34 08 36 98 17 FE 4E 26
       data hash MD5: 32K
       3B B2 23 A6 F1 87 E7 64 77 A4 78 31 D3 F1 A0 63>)
(   2,<2021-07-05 10:05:23.75 +0400>,<she>,<DPX200>,
      <Start of raw data processing
       efp BC_mod = 2 LB = 1 FT_mod = 6 PKNL = 1 PHC0 = -7057.585 PHC1 = -752.114 SI = 64K 
       data hash MD5: 64K
       CE 72 E3 1A 43 3B 41 D7 65 1E 9C 0A 4C C1 07 A5>)
(   3,<2021-07-05 10:05:44.46 +0400>,<she>,<DPX200>,
      <pk PHC0 = 6.70305 PHC1 = -36 
       data hash MD5: 64K
       2F 06 2B 93 D5 1E 37 A9 37 EC 93 57 C0 18 0B C7>)
(   4,<2021-07-05 10:05:47.70 +0400>,<she>,<DPX200>,
      <abs ABSG = 5 
       data hash MD5: 64K
       6A 30 CC 03 E7 56 95 66 D3 56 AA D8 A8 AF 05 B2>)
$$ ##END=
$$ 
$$ hash MD5
$$ BF EE 95 93 E9 55 D1 DE 63 87 AC 0A 23 55 09 46
##$RELAX= 
##$RELAX= 
##$RELAX= 
##$RELAX= 
##$RELAX= 
##$RELAX= 
##$RELAX= 
##$RELAX= 
$$ Bruker specific parameters
$$ --------------------------
##$DU= <F:/spectra>
##$EXPNO= 1
##$NAME= <P31>
##$PROCNO= 1
##$TYPE= <nmr>
##$USER= <she>
##$AMP= (0..31)
100 100 100 100 100 100 100 100 100 100 100 100 100 100 100 100 100 100 
100 100 100 100 100 100 100 100 100 100 100 100 100 100 
##$AQSEQ= 0
##$AQ_mod= 1
##$AUNM= <au_zg>
##$AUTOPOS= <>
##$BF1= 81.014009
##$BF2= 200.13
##$BF3= 200.13
##$BF4= 200.13
##$BF5= 200.13
##$BF6= 200.13
##$BF7= 200.13
##$BF8= 200.13
##$BYTORDA= 1
##$CFDGTYP= 0
##$CFRGTYP= 5
##$CHEMSTR= <none>
##$CNST= (0..31)
1 1 145 1 1 1 1 1 1 1 1 1 1 1 1 1 1 1 1 1 1 1 1 1 1 1 1 1 1 1 1 1 
##$CPDPRG= <waltz16>
##$CPDPRG1= <>
##$CPDPRG2= <waltz16>
##$CPDPRG3= <>
##$CPDPRG4= <mlev>
##$CPDPRG5= <mlev>
##$CPDPRG6= <mlev>
##$CPDPRG7= <mlev>
##$CPDPRG8= <mlev>
##$CPDPRGB= <>
##$CPDPRGT= <>
##$D= (0..31)
0 1 0 0 0 0 0 0 0 0 0 0.03 2e-05 3e-06 0 0 0 0 0 0 0 0 0 0 0 0 0 0 0 0 
0 0 
##$DATE= 1625465120
##$DBL= (0..7)
120 120 120 11 120 120 24 19 
##$DBP= (0..7)
150 150 150 150 150 150 150 150 
##$DBP07= 0
##$DBPNAM0= <>
##$DBPNAM1= <>
##$DBPNAM2= <>
$$ [...]
##$SUBNAM3= <"">
##$SUBNAM4= <"">
##$SUBNAM5= <"">
##$SUBNAM6= <"">
##$SUBNAM7= <"">
##$SUBNAM8= <"">
##$SUBNAM9= <"">
##$SW= 501.771253377433
##$SWIBOX= (0..15)
0 1 3 0 0 0 0 0 0 0 0 0 0 0 0 0 
##$SW_h= 40650.406504065
##$TD= 32768
##$TD0= 1
##$TE= 0
##$TE2= 300
##$TE3= 300
##$TEG= 300
##$TL= (0..7)
0 120 53 12 22 120 120 120 
##$TP= (0..7)
150 150 150 150 150 150 150 150 
##$TP07= 0
##$TPNAME0= <>
##$TPNAME1= <>
##$TPNAME2= <>
##$TPNAME3= <>
##$TPNAME4= <>
##$TPNAME5= <>
##$TPNAME6= <>
##$TPNAME7= <>
##$TPOAL= (0..7)
0.5 0.5 0.5 0.5 0.5 0.5 0.5 0.5 
##$TPOFFS= (0..7)
0 0 0 0 0 0 0 0 
##$TUNHIN= 0
##$TUNHOUT= 0
##$TUNXOUT= 0
##$USERA1= <user>
##$USERA2= <user>
##$USERA3= <user>
##$USERA4= <user>
##$USERA5= <user>
##$V9= 5
##$VALIST= <valist>
##$VCLIST= <CCCCCCCCCCCCCCC>
##$VD= 0
##$VDLIST= <DDDDDDDDDDDDDDD>
##$VPLIST= <PPPPPPPPPPPPPPP>
##$VTLIST= <TTTTTTTTTTTTTTT>
##$WBST= 1024
##$WBSW= 4
##$XGAIN= (0..3)
0 0 0 0 
##$XL= 0
##$YL= 0
##$YMAX_a= 8510
##$YMIN_a= -8848
##$ZGOPTNS= <>
##$ZL1= 120
##$ZL2= 120
##$ZL3= 120
##$ZL4= 120
##$ABSF1= 248.5645
##$ABSF2= -253.2056
##$ABSG= 5
##$ABSL= 3
##$ALPHA= 0
##$AQORDER= 0
##$ASSFAC= 0
##$ASSFACI= 0
##$ASSFACX= 0
##$ASSWID= 0
##$AUNMP= <proc_1d>
##$AZFE= 0.1
##$AZFW= 0.5
##$BCFW= 0
##$BC_mod= 2
##$BYTORDP= 0
##$COROFFS= 0
##$CY= -3
##$DATMOD= 1
##$DC= 0
##$DFILT= <>
##$DTYPP= 0
##$F1P= 0
##$F2P= 0
##$FCOR= 1
##$FTSIZE= 65536
##$FT_mod= 6
##$GAMMA= 0
##$GB= 0
##$INTBC= 1
##$INTSCL= 5.30512e-09
##$ISEN= 30
##$LB= 1
##$LEV0= 0
##$LPBIN= 0
##$MAXI= 10000
##$MC2= 0
##$MEAN= 0
##$ME_mod= 0
##$MI= 50
##$NCOEF= 0
##$NC_proc= -6
##$NLEV= 6
##$NOISF1= 182.463
##$NOISF2= 159.3651
##$NSP= 0
##$NTH_PI= 0
##$NZP= 0
##$OFFSET= 248.5645
##$PC= 4
##$PHC0= -7050.882
##$PHC1= -788.114
##$PH_mod= 1
##$PKNL= yes
##$PPARMOD= 0
##$PSCAL= 0
##$PSIGN= 0
##$REVERSE= no
##$SF= 81.014009
##$SI= 65536
##$SIGF1= 159.3651
##$SIGF2= -187.1042
##$SINO= 113.3802
##$SIOLD= 16384
##$SREGLST= <1H.CDCl3>
##$SSB= 0
##$STSI= 65536
##$STSR= 0
##$SW_p= 40650.406504065
##$SYMM= 0
##$S_DEV= 0
##$TDeff= 32768
##$TDoff= 0
##$TI= <>
##$TILT= no
##$TM1= 0
##$TM2= 0
##$TOPLEV= 0
##$USERP1= <user>
##$USERP2= <user>
##$USERP3= <user>
##$USERP4= <user>
##$USERP5= <user>
##$WDW= 1
##$XDIM= 65536
##$YMAX_p= 349788433
##$YMIN_p= -19904390
$$ End of Bruker specific parameters
$$ ---------------------------------
##NTUPLES= NMR SPECTRUM
##VAR_NAME=  FREQUENCY,     SPECTRUM/REAL,   SPECTRUM/IMAG
##SYMBOL=    X,             R,               I
##VAR_TYPE=  INDEPENDENT,   DEPENDENT,       DEPENDENT
##VAR_FORM=  AFFN,          ASDF,            ASDF
##VAR_DIM=   65536,         65536,           65536
##UNITS=     HZ,            ARBITRARY UNITS, ARBITRARY UNITS
##FACTOR=    0.620285442955139, 1,           1
##FIRST=     20137.2065510759, 0,            0
##LAST=      -20513.1999529892, 0,           0
##MIN=       -20513.1999529892, -19904390,   0
##MAX=       20137.2065510759, 349788433,    0
$$ Real data points
##PAGE= N=1
##DATA TABLE= (X++(R..R)), XYDATA
$$ [...]
42195a234679N31981K4421n98288m55391J8832L6600j31118Q8845L01739p1245
42185a488303m82869r6547O57241P53977L18495K45007M81163K77105j25745J67023
42175G06547P04882J3364j683009k105331k67651J646272J240088o43134j247297
42166a635269J22197J400256R09899n44119j171920n19767M10021O20618P880
42157d00204q92973j485522j409437n74039P95501K013341K140969Q93030o86179
42148C94487j125349k80546N28851L93848q1564p4034P1253l14125q09291n46769
42138a843239K38647N53715K51911P8608K78198L59209J83466J09763O8329l14629
42128c6022o64730k22468O43519O82805k06816o53849o120O17016K17147n12441
$$ y = [-1234679, -702698, -678277, -1276565, -1731956, -1713124, -1676524, -1807642, -1718797, -1417058, -1488303, -1971172, -2067719, -1410478, -656501, -338006, -92999, 388164, 665269, 539524, 706547, 1411429, 1424793, -258216, -2363547, -2631198, -984926, 255162, -387972, -1635269, -1513072, -112816, 797083, 252964, -918956, -1438723, -1028702, -408084, -400204, -1293177, -2778699, -4188136, -4762175, -3966674, -1953333, 187636, 1080666, 394487, -730862, -1011408, -482557, -88709, -170273, -244307, -173054, -487179, -1296470, -1843239, -1604592, -1050877, -798966, -720358, -442160, -82951, 100515, 210278, 278607, -36022, -700752, -923220, -279701, 403104, 196288, -457561, -463681, 153335, 370482, -141959]
42118a41959n17468j11912j68870m56697q9688Q39252J261033O24881m56656j023486
42108b41570p25856n3517J86035j63151k88652L62148Q94504J76983j007326p80146
42098a640548O80480R83175o62706j815304n57109J290079R83205q16746j307484
42089b862958o2753P25322J54274k27919N17158J175957O99909j22008k80140
42080b83158p8628j07517j54982j6315j00368m61457m23208J59861M59300J22461
42070h84011p8514K62230L22589m53609j162428p47176L94008J049876P53458
42061e43577m3685o86175o28130K27041J034449P33197l27063n98891L08154Q33854
42051C09174j40525j499002j667575r11252l93153l6119Q99985J844340J487243
$$ y = [-141959, -659427, -771339, -940209, -1396906, -1486594, -647342, 613691, 1238572, 781916, -241570, -967426, -1020943, -834908, -998059, -1286711, -924563, -30059, 146924, -860402, -1640548, -960068, 23107, -639599, -2454903, -3012012, -1721933, -738728, -1555474, -2862958, -2925711, -2200389, -2046115, -2274034, -1756876, -580919, 118990, -3018, -283158, -361786, -469303, -624285, -640600, -740968, -1202425, -1625633, -1465772, -1006472, -884011, -962525, -700295, -377706, -831315, -1993743, -2740919, -2346911, -1297035, -543577, -587262, -1273437, -1901567, -1674526, -640077, 93120, -233943, -832834, -524680, 309174, 168649, -1330353, -2997928, -3909180, -4302333, -4338452, -3438467, -1594127, -106884]
42042a06884Q4960o85917k83397M7074m44790p69557l6361Q82106O93289k43238
42032h62715m92546K59403Q52787M67740l10773n34813j50538K36161K15311k83991
42022f03974j125662j691989j109541M68608J435355O90124n11144j65545J350034
42013a263734J737429M76613l31821L52612N97825j000015k357780j088678J250529
42004a627020J372051m55210r84560N43773J372271J32693r64579j50336J000771
41995B39854N55282o17525q04031l73937n30050q68199l80523M38173N14950J53420
41985a672586K64925O27266N28605J81999M5734j95748o14159l07183Q40653J163896
41975H63402k54831j592325r17735O09204O13829n86738o94484O49315J456882
$$ y = [-106884, -21924, -707841, -991238, -944164, -1388954, -2158511, -2194872, -1312766, -619477, -862715, -1355261, -1095858, -243071, 224669, -86104, -620917, -771455, -535294, -319983, -603974, -1729636, -3421625, -4531166, -4062558, -2627203, -1937079, -2448223, -2613768, -1263734, 473695, 950308, 618487, 971099, 1568924, 568909, -1788871, -2877549, -1627020, -254969, -710179, -1694739, -1150966, 221305, 353998, -610581, -760917, 239854, 795136, 177611, -626420, -1000357, -1530407, -2398606, -2779129, -2340956, -1826006, -1672586, -1407661, -780395, -251790, -69791, -24057, -219805, -833964, -1141147, -300494, 863402, 608571, -983754, -1901489, -1292285, -678456, -1265194, -1959678, -1310363, 146519]
41966A46519P21962m01475q49506q44803o77468k58819J2589k75407l54276N83796
41956b196888J405195M30195j419330j453614O08438J973890R57430p18886q93051
41947a306621L3145M70312J91210n5058j44585l22383k76754K84266Q02820N99141
41937B75493q5801m82887k84898K05175M96772K96922j07973j6482N79426N83032
41927A458779n63063j542193r11315M80045O78804k42318m64554L50270O13904
41918a41641j67275n18375K07507O89579K27343j6767M50505J68015j459717k400397
41908b961223j024589J074700J442914L25604l20836k0252K62119K85759M68132
41899d67672M55290k04518o67722j7582Q18809L52654q94494j158322l00294K03464
$$ y = [146519, 868481, 467006, -382500, -1227303, -1904771, -2163590, -2151001, -2426408, -2780684, -2196888, -791693, -361498, -1780828, -3234442, -2626004, -652114, 305316, -413570, -1306621, -1273476, -803164, -611954, -667012, -811597, -1133980, -1410734, -1126468, -323648, 275493, 189692, -293195, -578093, -372918, 123854, 420776, 312803, 296321, 875747, 1458779, 895716, -646477, -1557792, -1077747, -398943, -641261, -1105815, -755545, -141641, -308916, -827291, -619784, 69795, 297138, 280371, 730876, 898891, -560826, -2961223, -3985812, -2911112, -1468198, -1142594, -1463430, -1483682, -1221563, -935804, -467672, -12382, -216900, -884622, -902204, -83395, 269259, -625235, -1783557, -2083851, -1880387]
41889a880387j13062k02427L61722P24946M52189J47381J05223q7157l66352j19201
41879i77125M69513M73271j15327k60730K62216M03770k95403q34850m12400L36545
41869i50520N06568K15002m1939l34305p84203r37333m71107J15761K47746J32080
41859b302250K15292L53714K35144J36463M90496J016906J025260M24031k15499
41850A379557n09563n62653m23452J02900Q35255R41625j52173j731755k284094
41841b404353j222908L58949J044858P49808L88702K90912j1282m51302j70206
41832a426822R13807J464408N54231q02930j056367l35201K0343l41496m96813
41823a506840k4888L66510K02196m2283L0527R7511l0387O3589M37869L26766
$$ y = [-1880387, -1993449, -2195876, -1834154, -1109208, -657019, -509638, -404415, -491572, -857924, -977125, -507612, -34341, -149668, -410398, -148182, 255588, -39815, -874665, -1287065, -950520, -443952, -228950, -270889, -605194, -1389397, -2326730, -2797837, -2682076, -2434330, -2302250, -2086958, -1733244, -1498100, -1361637, -871141, 145765, 1171025, 1595056, 1379557, 869994, 307341, -116111, -13211, 822044, 1763669, 1611496, -120259, -2404353, -3627261, -3268312, -2223454, -1473646, -1084944, -794032, -805314, -1256616, -1426822, -513015, 951393, 1505624, 702694, -353673, -688874, -668531, -1010027, -1506840, -1531728, -1165218, -963022, -1005305, -974778, -877267, -907654, -844065, -406196, -79430]
41813g9430n79327j205825m46996J053617J550888M86316q52028j093279l70188
41804a536252K37783K19418r758Q350J58322J08041j41953l01739j79421J64921
41794a272288N12193N95848L01238j04182j89034O029q4347o27895q78924k12788
41784a954150P04243O83706j94287o21454l3670N65640K08810o24135r10413n88501
41774b764211k95286j75747J26148N93997P83851N41627J69262m7924m6995J30499
41764i84779L17986L04157J94879L38287O23891L69574o72986j698445j745105
41755b952541q17637L27088J083175J255936R07387M21222K77996L74560J10132
41746I87318n02726n79301K55883J053760Q33150n4237o43662p35973p01314n63706
$$ y = [-79430, -658757, -1864582, -2311578, -1257961, 292927, 779243, -72785, -1166064, -1536252, -1298469, -1079051, -1088809, -1080459, -922137, -814096, -956049, -1257788, -1437209, -1272288, -760095, -164247, 136991, 32809, -156225, -150196, -234543, -862438, -1741362, -1954150, -1249907, -566201, -760488, -1381942, -1415612, -849972, -641162, -1265297, -2175710, -2764211, -3059497, -3235244, -3109096, -2515099, -1731248, -1189621, -1020359, -1068283, -1115278, -984779, -666793, -362636, -167757, 170530, 794421, 1163995, 491009, -1207436, -2952541, -3770178, -3443090, -2359915, -1103979, -196592, 224630, 502626, 877186, 987318, 484592, -94709, 161174, 1214934, 2048084, 1993847, 1350185, 614212, -87102, -650808]
41736f50808j85330J89414L64709N55594O59504P6931r49370j010482L04224J214258
41726E68644K93925j033225n89235R63246J106242m42202j331508m18916O18075
41717b64954K26680p41254p78135L1403O56922O75412K19704n03123r24684m43695
41707a845724M40847N31730j42777k72582M11399N13930n37574j230822m05571
41698b537144P36962N93122k93415l73213L28257O15467L31331L08437N73287
41689B83091L73626j95320k34998K80935L72564k42862o68778l52867J06570R5815
41679a82224j12338j15732j75481o13448j032658q09399k3550O71969R17908Q71702
41669f03251O40669M9415q09644j228942o12982N33801R38792J16889r10252q87399
$$ y = [-650808, -836138, -646724, -282015, 273579, 933083, 1010014, 60644, -949838, -645614, 568644, 862569, -170656, -759891, 203355, 1309597, 867395, -464113, -883029, -264954, -38274, -779528, -1557663, -1526260, -869338, -193926, 25778, -477345, -1402029, -1845724, -1404877, -873147, -1015924, -1288506, -877107, -363177, -900751, -2131573, -2537144, -1800182, -1207060, -1500475, -1873688, -1545431, -929964, -598633, -290196, 283091, 656717, 461397, 226399, 507334, 879898, 637036, -31742, -384609, -278039, -182224, -294562, -410294, -585775, -1199223, -2231881, -3041280, -3064830, -2392861, -1474953, -603251, 37418, 86833, -722811, -1951753, -2564735, -2030934, -1092142, -975253, -1885505, -2772904]
41659b772904Q2725Q19441O82833J94222M9392J95567J40600k29895m59104j21992
41649a419115M48859L14563p65233j488253n03454J268659J375706n42302j746122
41640c056692l34936J707257J522867j81263n62149N44587O42408q29552j507732
41631b055205l16577P39083K17486m13913K79892J143233P20449k44105n40850
41622d70507n82829q36435l40321J115651J533632j63749j667098p03980J027318
41613a088318N44491j398196j588952L11332J471932O49962l43066k05219R3583
41604a552451k26991l89432k04Q2704l43940k29790O59026J095591N40724L8895
41594c25868K99473O75857O27446M46284J01403p86592j477250o88956R38247
$$ y = [-2772904, -2690179, -1870738, -1187905, -993683, -944291, -748724, -608124, -838019, -1297123, -1419115, -970256, -655693, -1420926, -2909179, -3412633, -2143974, -768268, -1310570, -3056692, -3391628, -1684371, -161504, -342767, -904916, -360329, 282079, -547473, -2055205, -2371782, -1632699, -1415213, -1829126, -1549234, -406001, 314448, 70343, -470507, -1053336, -1889771, -2230092, -1114441, 419191, 255442, -1411656, -2115636, -1088318, -543827, -1942023, -3530975, -3219643, -1747711, -1097749, -1440815, -1646034, -1552451, -1779442, -2168874, -2169078, -2086374, -2430314, -2660104, -2001078, -905487, -364763, -325868, -26395, 649462, 1276908, 1723192, 1824595, 1038003, -439247, -1128203, -189956]
41585a89956J221897j42055r78121k73617K15423p06826j374065j68354J518486
41576h77188J475393R8511o61841m38583k64285k86273R2306N00108J40127m39052
41566f60777q7136P67801N92191p15610j547147r69839J44266O27338L84847k6240
41556a490306j66845J72716Q22755J094394M91564m75547q72038n87293k71525
41547a282125k18721j47845J3398n290j49305m7593J98306j5503p78612j232335
41537c665625n79521P75506J543734J045782N2183k22658K08115J92955n74376
41528a223905p61896M68178J608139P78901j102500j343303M00009J492024L82486
41519F98133j216120j358346o48754l44591N2435J136759J512427J3742j512008
$$ y = [-189956, 1031941, 889886, -88235, -361852, -146429, -853255, -2227320, -2395674, -877188, 598205, 696716, 34875, -403708, -667993, -954266, -861960, -361852, -221725, -660777, -747913, 19888, 612079, -103531, -1650678, -2620517, -2476251, -1848913, -1464066, -1490306, -1657151, -1484435, -661680, 432714, 924278, 448731, -423307, -1010600, -1282125, -1500846, -1648691, -1635293, -1640583, -1789888, -1837481, -1639175, -1654678, -2433290, -3665625, -4245146, -3469640, -1925906, -880124, -827941, -1050599, -842484, -649529, -1223905, -1985801, -1517623, 90516, 869417, -233083, -1576386, -1176377, 315647, 698133, -517987, -1876333, -2525087, -2869678, -2817243, -1680484, -168057, -154315, -1666323]
41510a666323o07391J638615K005274J79533r56842j36185O11907j35685q56013
41501G6890j58278N87183k08411j307259n87609J310829J790979J88092j414064
41492B78352j309048k26108K44269j20703l52639Q2882P03044Q50090M84630m480
41482F30289m01691p17462p83818l26494M08112O60224J79373k91503j05806K50771
41472d98005j8157o33502o70035r0411K57382J01876P7805M90560Q45029Q42648
41462G05190Q10339Q20391M02528m44760r35924p23264n27040r04650j233560
41453b030750p21063K29194N70254J64068r2593L75750J026750R14927j50154
41444B86383j330919j586975p33547M08621R63158Q51047N20827K30192J9738
$$ y = [-1666323, -2273714, -635099, 1370175, 1549708, 592866, 456681, 1068588, 932903, 76890, -81388, 505795, 297384, -1009875, -1597484, -286655, 1504324, 1692416, 278352, -1030696, -1256804, -1012535, -1133238, -1485877, -1402995, -699951, 150139, 634769, 630289, 228598, -488864, -1272682, -1599176, -1191064, -530840, -351467, -642970, -748776, -498005, -516162, -1149664, -1819699, -1910110, -1652728, -1550852, -1473047, -982487, -137458, 705190, 1515529, 2335920, 2738448, 2293688, 1357764, 634500, 107460, -797190, -2030750, -2751813, -2522619, -1952365, -1788297, -1880890, -1505140, -478390, 436537, 286383, -1044536, -2631511, -3365058, -2956437, -1993279, -1142232, -621405, -391213, -371475]
41435c71475J6301J77702O4087m93874q64809m99973Q4475J39168L0533N45772
41425a172093J219541Q70880k80260p09669k7781L96644k18339p98836l55018
41416a074931L57398K58330k54860k23783J33598n2706o95887r07864l93790K71697
41406b582798M93278J39445m56982o00873O6153P58105L98679n21043l77920Q29024
41396a854932J025318o06393j853258p48334J199352J339637J7431l47208N89356
41387a239031Q67601r9335o50571n2691K86670l64469o13473M16129J231210L72557
41377A54597j094693j260239k25580M89058M48183M55597P57398P13524J00305
41368E38150n25215p17212m67270J84002R94261J205667K97357j053048j578298
$$ y = [-371475, -355174, -177472, -113385, -607259, -1472068, -1972041, -1887566, -1748398, -1717865, -1172093, 47448, 918328, 638068, -71601, -99382, 297262, 78923, -719913, -1074931, -717533, -459203, -714063, -937846, -804248, -856954, -1552841, -2460705, -2854495, -2582798, -2089520, -1950075, -2407057, -3007930, -2941777, -2183672, -1784993, -2306036, -2683956, -1854932, -829614, -1436007, -3289265, -4037599, -2838247, -1498610, -1481179, -1828387, -1239031, -371430, -470765, -1121336, -1174027, -887357, -1251826, -1865299, -1449170, -217960, 154597, -940096, -2200335, -2425915, -1936857, -1488674, -1033077, -275679, 437845, 538150, 12935, -704277, -1171547, -987545, 6716, 1212383, 1509740, 456692, -1121606]
41359a121606r35744R0012P65671J012593Q92381L44349l75897o94176m62645
41350d85062k13000l73769o39389m57030J43477O03883O25250N03636N55524N43025
41340H06545N2717o83985r10980m45869l9614k00538k94977L94393J241656J054120
41330I73468L4268m19410J8967Q9688p46944j119130R852J311848R38931n74606
41320E16932j153271l85556J86476j04931j56915M77910M71597q10446j623687
41311b581891l60566J625999J792226J96735p29126R170P17778L8628r39575p17366
41301i47988J79939L40964j20993k2172O50411O92654k32140j015511q58085l20057
41291a652978j74615k45468K2436N53128P86770M36654k53060p12080m18563N34723
$$ y = [-1121606, -2057350, -1967338, -1201667, -189074, 703307, 1047656, 671759, -22417, -485062, -698062, -1071831, -1711220, -2168250, -2024773, -1420890, -795640, -292004, 263520, 806545, 859262, 175277, -735703, -1181572, -1221186, -1421724, -1716701, -1322308, -80652, 973468, 1007736, 588326, 607293, 696981, -49963, -1169093, -1159241, 152607, 1091538, 516932, -636339, -1021895, -835419, -940350, -1097265, -619355, -147758, -958204, -2581891, -2942457, -1316458, 475768, 672503, -56623, -47453, 670325, 708953, -230622, -947988, -768049, -427085, -548078, -570250, 80161, 772815, 540675, -474836, -1332921, -1652978, -1827593, -2073061, -2050625, -1497497, -710727, -274073, -527133, -1239213, -1657776, -1123053]
41281a123053J282981J100676L41655j59678l58737p33786r88799l47442P84363
41272b01820R55375q6481p77277r2787Q99407Q00153j21245q04818j056987j084172
41262a570652n39156N62307J074383M13361q8830O87592J283634k82213k847150
41253a306724l194416p37065J565098J465504J47560k45828L56019P07826M26275
41244h15751J8753k16862k19313J19110N22267M19775n1485r3693L48555M11750
41234D43106p9677k15040K63167L23718n00742j110062o08561K88358N63279K81198
41224c51256k21900j048731j664347q01792J293654K284686R87091n62160k11803
41215b96558Q65457L08212j297937j420114N9489O80907m10378j165901j48245
$$ y = [-1123053, 159928, 1260604, 1602259, 1442581, 1083844, 350058, -638741, -986183, -201820, 753555, 667074, -110203, -202990, 696417, 1496570, 1375325, 570507, -486480, -1570652, -2109808, -1547501, -473118, -59757, -148587, 539005, 1822639, 1540426, -1306724, -4501140, -5238205, -3673107, -2207603, -2060043, -2305871, -1949852, -1242026, -815751, -796998, -1013860, -1233173, -1114063, -591796, -172021, -223506, -317199, 31356, 443106, 363429, 148389, 411556, 735274, 234532, -875530, -1484091, -1195733, -632454, -351256, -573156, -1621887, -3286234, -4088026, -2794372, -509686, 477405, -84755, -296558, 568899, 877111, -420826, -1840940, -1781451, -1100544, -1510922, -2676823, -2825068]
41206b825068J290752J372617L28323o38602j111773j107605m16145O56578J088367
41197a362556N79868Q6115J66049M1361q15824j410915p13249N56182Q91637J23690
41187a857642o04667n68445r1427L24515N43571N16750K28373j9918J54967O11582
41177g62341P49017K98911k68567l31130N4210K07851j79631m58800P5115Q72648
41167B57283N98400q63350j871360j153132M30207J173732Q14309L97564M74255
41158B57908O88458P34265M92276l52412j562877j796310l39949J165302O31605
41149h1734j226927j740138k62601J136023J196045J006336J280359Q63512o62981
41140A507894j441709k86602R85435L29087j217955j346562j49761N13977K67806
$$ y = [-2825068, -1534316, -161699, 166624, -471978, -1583751, -2691356, -3107501, -2450923, -1362556, -782688, -696573, -530524, -489163, -1304987, -2715902, -3429151, -2872969, -1981332, -1857642, -2462309, -3030754, -3122181, -2797666, -2254095, -1737345, -1508972, -1528890, -1373923, -762341, -13324, 285587, 17020, -314110, -259900, -52049, -231680, -690480, -615365, 257283, 855683, -7667, -1879027, -3032159, -2601952, -1428220, -613911, -216347, 257908, 946366, 1680631, 2172907, 1820495, 257618, -1538692, -1878641, -713339, -81734, -1308661, -3048799, -3311400, -2175377, -979332, 27004, 1307363, 2170875, 1507894, 66185, -220417, 765018, 1094105, -123850, -1470412, -1620173, -1106196, -838390]
41131h38390K71332O89339N80263o496q3603K96791J92691k88610k50743P271
41121E69845n52416j402441r88381L31479M43884r49661j537373r5897J513964
41112b666997J380891L05234j09552r3465m92905o51474K58358J107956M17205
41103e44749q26406m66674J190238J649227J69974j132502p43042O6078l13935
41094i51791j147848p89185N14751J091345M79463j34284P201K35124j74999q30811
41084a701034r77341o09603j98718J65143O79902J136750J001548K64230l20396
41075e59519j48242L71012L04001m86070j014502m84379M76560N38000m53017
41066a456156j132149m88715P01304J013442L46857k27415k35288j88767k24772
$$ y = [-838390, -567058, 122281, 702544, 696048, 612445, 909236, 1101927, 813317, 562574, 569845, 17429, -1385012, -2373393, -2041914, -1598030, -2547691, -4085064, -4180961, -2666997, -1286106, -980872, -1090424, -1183889, -1676794, -2328268, -2069910, -961954, -544749, -1371155, -1837829, -647591, 1001636, 1171610, 39108, -703934, -637856, -951791, -2099639, -2888824, -2374073, -1282728, -803265, -937549, -930348, -695224, -870223, -1701034, -2678375, -3287978, -3486696, -3321553, -2641651, -1504901, -503353, -239123, -559519, -707761, -336749, -32748, -518818, -1533320, -2017699, -1541139, -1003139, -1456156, -2588305, -3077020, -2375716, -1362274, -1015417, -1242832, -1478120, -1666887, -1891659]
41057a891659K49870J128365J212516J11245p27564j16643Q17491L12118j075765
41048A9974j223636R7178P89019j24579q88934k532J156740M87322j392850j992510
41038c074808o39491P83560Q13685J99668J82395N62668M57851l0057k7445O21919
41028a50055J007900L63961q68620j416793n89824P75646J084038q3938j227081
41019a104766p37896Q26395J274781k65724j989998j685818L88251J883710J334663
41010g6402k73184j059476n02119L96378O51664K59897k79684o84180q33612m78189
41000b878907M77380J515832J797605J021584k41992j127574j196973o35492j5742
40991a284279J28351k15383m72750k00195K13648M6264n68855o31943K82406J249829
$$ y = [-1891659, -1641789, -513424, 699092, 810337, 82773, -33870, 783621, 1095739, 19974, -1203662, -1106484, -317465, -442044, -1330978, -1333510, -176770, 310552, -1082298, -3074808, -3714299, -2930739, -2117054, -1917386, -1734991, -1172323, -714472, -744529, -771974, -150055, 857845, 1221806, 353186, -1063607, -1653431, -877785, 206253, 122315, -1104766, -1842662, -1016267, 258514, -7210, -1997208, -3683026, -3294775, -1411065, -76402, -349586, -1409062, -1911181, -1514803, -863139, -603242, -882926, -1567106, -2400718, -2878907, -2401527, -885695, 911910, 1933494, 1691502, 563928, -633045, -1268537, -1284279, -1155928, -1371311, -1844061, -2044256, -1830608, -1784344, -2353199, -2985142, -2702736, -1452907]
40981a452907J180192K66446l92522k79926J32910L13241K73327J76757k6957
40972A90561k94966k48963L57616J067177R84936k08553j643885j972828q52437
40963b621342N35517P73896j81006j131961j206350o29467M3761O44464J068378
40954b704110J011857N05639J18318J55744K02938p7428k82347L5991N54531O77933
40944A99066L99748R0834j18229k06019l0757K32583N1464m92602m93404K71447
40934i5869N89450l35439j258909o41137P59823R25574j96231o42070K97444R79520
40924C82156K47664p04513m99820J24181k07831r72948n78353Q56834J436220
40915H3590K98541j078549r84205K08867P39175m5564r02811n56116M95128P75292
$$ y = [-1452907, -272715, -6269, -398791, -678717, -545807, -232566, 40761, 217518, 190561, -104405, -353368, 4248, 1071425, 2056361, 1847808, 203923, -1768905, -2621342, -2085825, -1311929, -1492935, -2624896, -3831246, -4460713, -4416952, -3772488, -2704110, -1692253, -1186614, -1068296, -912552, -709614, -787042, -1069389, -1033398, -478867, 199066, 598814, 689648, 571419, 365400, 334643, 567226, 618690, 126088, -367316, -95869, 493581, 158142, -1100767, -1741904, -982081, -56507, -252738, -894808, -597364, 382156, 629820, -74693, -574513, -450332, -658163, -1631111, -2209464, -1352630, 83590, 382131, -696418, -1680623, -1471756, -732581, -778145, -1680956, -2237072, -1741944, -966652]
40905i66652P0134k71487M47197R75750K9338j427587j333545L91043J605484
40896d80325R69965m10673r48286o90466m90575k68393N34206J415306J172734
40887H03493k26091j260357p10022P50191J309127K14403j237108j229331K45909
40878a339786J334947Q65399o4366L4966N69070m2313j338111j167900O59783
40869d88311J507753j79654k247949j919106J27510J010026L444q08305k6274
40860c020866J215750J347051M87271k88017n06623l26140P0597L87636K06421
40851d26920l37980m42556K59872R90649Q08291n9341n05114n2188N25256K79398
40841A039367o19824j119292p40131k23207l61731p13178k71793Q08020J237483
$$ y = [-966652, -896518, -1168005, -720808, 254942, 284280, -1143307, -2476852, -2085809, -480325, 489640, 78967, -869319, -1559785, -2050360, -2318753, -1784547, -369241, 803493, 577402, -682955, -1392977, -642786, 666341, 880744, -356364, -1585695, -1339786, -4839, 860560, 796194, 831160, 1400230, 1357917, 19806, -1148094, -488311, 1019442, 839788, -1408161, -3327267, -3199757, -2189731, -2186287, -2994592, -3020866, -1805116, -458065, 29206, -258811, -765434, -1091574, -1020977, -633341, -426920, -764900, -1207456, -947584, 43065, 851356, 792015, 286901, 234713, 759969, 1039367, 419543, -699749, -1439880, -1663087, -2024818, -2737996, -3009789, -2201769, -964286]
40832i64286N23601k49644j15863L39939Q7903o65839r52036n85254j61062N4642
40822b687899J94914J42956j41023n8837P05747J138056J62919j344311j493974
40813c381452l08535J93482p35387j252758M7844J623192J219634o16240j321787
40804d532007o5761J349237J374634N89741J38626l1699l57855l74796L94100
40795a515780J049542L49237j139689j463820q3971J178098O72624p92945j265570
40786c012274m00550M39694M53083L00634O02464Q61973M81221j04915p5297N44499
40776I0532R69622O84342q3253o97794o61054q7589K48052k51798j082413j158367
40766b029720l37020L92123M48243L95599O84726P32727M8315o76442o05007j27608
$$ y = [-964286, -440685, -690329, -806192, -466253, -378350, -1044189, -1996225, -2581479, -2742541, -2687899, -2492985, -2350029, -2491052, -2549889, -1844142, -706086, -543167, -1887478, -3381452, -3689987, -3496505, -4231892, -5484650, -5436806, -3813614, -2593980, -3210220, -4532007, -4597768, -3248531, -1873897, -1284156, -1145530, -1177229, -1535084, -1909880, -1515780, -466238, -117001, -1256690, -2720510, -2804481, -1626383, -953759, -1746704, -3012274, -3412824, -2973130, -2520047, -2219413, -1616949, -754976, -273755, -378670, -453967, 90532, 1060154, 1744496, 1661243, 963449, 302395, 214806, 462858, 211060, -871353, -2029720, -2366740, -1974617, -1526374, -1130775, -446049, 286678, 334993, -341449, -946456, -1074064]
40756a074064j05245l76993j98164L29844N06184L39155L35780K68166m61060
40747d36397j333355j096601J77890Q88463K35318n75736k10309Q31130J122320
40738c97277M33144j67613m6234J80596k37186r16600p39245N39156J598635J010359
40728A257735p57466j631829n70915R90265J114666R7n58545R7569P26462K09780
40718H77819r53169j548045j060613J77686J428220J822544J002921k06586n12287
40709A028490K37123R64764J102170J384677K387546L210470K480266J96319k145281
40700A0846544l093189k509718j467343j079010j306689j072623J35841J228160
40692A681973Q84982m08937r31394k44774L04862r7460m92193N639N42564n7421
$$ y = [-1074064, -1179309, -1556302, -1754466, -1424622, -918438, -579283, -243503, 24663, -436397, -1769752, -2866353, -2688463, -1800000, -1564682, -2140418, -2350727, -1519597, -397277, 35867, -131746, -177980, 2616, -234570, -1151170, -1890415, -1351259, 247376, 1257735, 500269, -1131560, -1702475, -712210, 402456, 402553, -155992, -58423, 668039, 877819, -75350, -1623395, -2684008, -2506322, -1078102, 744442, 1747363, 1540777, 1028490, 1265613, 2230377, 3332547, 4717224, 7104770, 10315240, 12795506, 12991825, 10846544, 7753355, 5243637, 3776294, 2697284, 1390595, 317972, 453813, 1681973, 2566955, 2158018, 1226624, 981850, 1286712, 1189252, 697059, 702698, 1245262, 1187841]
40682A187841j206095j282557K8194J369842J534877P03072r6398r0114O03012
40673B751674J021424L21193r81216j290694J5684J489216J369681j09439j179485
40664C408038r57283k77887j25146l34338k45460J35632K28954j79703n84074
40655A068733l97829K32828M54505k80383j318752j330481J03599J787435K109258
40646B428913P58131j002113j637214p58733O18694J110113L39595p27639r41294
40637A88453k48108M67808N53284J19569l63217m44112J15550R14840R74026m3598
40627B234495j060702r85522m07559n71683j068815l78975J261943J667036L5366
40618G25584j529410r96388P80848J615342R63441j28037q98082j169750p03325
$$ y = [1187841, -18254, -1300811, -1272617, 97225, 1632102, 2335174, 2238776, 2148662, 2751674, 3773098, 4094291, 3113075, 1822381, 1838065, 3327281, 4696962, 4587523, 3408038, 2450755, 2172868, 2047722, 1713384, 1467924, 1603556, 1832510, 1652807, 1068733, 670904, 903732, 1358237, 1077854, -240898, -1571379, -1467780, 319655, 2428913, 3187044, 2184931, 547717, -211016, 407678, 1517791, 1857386, 1129747, 188453, -59655, 408153, 961437, 1081006, 717789, 273677, 389227, 1304067, 2278093, 2234495, 1173793, 188271, -219288, -790971, -1859786, -2238761, -976818, 690218, 725584, -803826, -1800214, -1019366, 595976, 1559417, 1431380, 533298, -636452, -1339777]
40609a339777K64965O09680k03208j012822o48245K07973L08013J4646M27738
40600a371037J147960R10229m5086k82114L63211O31193J59728o253N09332O57712
40590B674875j99573j226058j449132r25741j27854P06807J233178J033599L10796
40581B030897k89213n82714p27257m78788K99634P66946J57209o66286l91767
40572A18661L47250j61031j527514j404362P08537K290228J485600k65558o93380
40563H98431J20135O46755M29709j7960n95424j230421j134089k1265Q38574L39658
40553B74103n64585l21380O40583O15340n50438j207296m59457O89064J018446
40544A34380N86008J19667p6522j44503k24905l22900l12762m9077L09424L37118
$$ y = [-1339777, -1074812, -465132, -668340, -1681162, -2329407, -2121434, -1813421, -1798775, -1371037, -223077, 687152, 642066, 359952, 723163, 1354356, 1514084, 1507831, 2017163, 2674875, 2475302, 1249244, -199888, -1125629, -1253483, -546676, 686502, 1720101, 2030897, 1741684, 1158970, 431713, -47075, 252559, 1019505, 1176714, 510428, 118661, 465911, 304880, -1222634, -2626996, -1918459, 371769, 1857369, 1591811, 898431, 1018566, 1665321, 2095030, 2077070, 1481646, 251225, -882864, -904129, -65555, 274103, -290482, -611862, 28721, 644061, 93623, -1113673, -1573130, -884066, 134380, 720388, 840055, 763533, 619030, 394125, 71225, -241537, -290614, 18810, 355928]
40534C55928l0038l16881k70391k29018l49038k00546L16020M82599n7385m72317
40524g71067l0296N83510L45040m22292o91738m62714m49875m97355J37072J091460
40514a168255J096910Q338q35851o29093j28752j50823k39989L74792J341740
40505c30983J562522O33883o79308j278045p92924O7458K58215l41533p17474
40496a618189j50308O38591N18874k96238n73778L8181N96713M50575J00152J30068
40486a65359K89381J43254j58937l09189m10053o07987o47528k52899L85113Q17095
40476i17109P58872K06032n03003p35787j85474N50676N94118j2111l95445j63907
40466h03138J70809J90120J16095J20063k6991k44962K7765P69684R46808j59698
$$ y = [355928, 325890, 9009, -261382, -490400, -839438, -1039984, -723964, -241365, -298750, -771067, -801363, -217853, 127187, -295105, -986843, -1449557, -1899432, -2396787, -2259715, -1168255, -71345, -63007, -898858, -1527951, -1656703, -1807526, -2047515, -1672723, -330983, 1231539, 1865422, 1186114, -91931, -884855, -817397, -559182, -900715, -1618189, -1768497, -1129906, -611032, -907270, -1481048, -1442867, -846154, -395579, -295427, -165359, 124022, 267276, 108339, -200850, -610903, -1218890, -1866418, -2119317, -1734204, -917109, -158237, 47795, -455208, -1190995, -1376469, -825793, -231675, -243786, -639231, -803138, -632329, -442209, -326114, -206051, -233042, -478004, -450239, 319445, 1266253, 1106555]
40456A106555j773202k437400j623783l0847J303623J727098J217010L59524j87103
40447c38525m03056o63441p90134j88826Q59466J113356J37694q71768p97114
40438a942348j40219J05119J42227O46661J127266N76252o08495r30627j1194
40429a035358R25798R39501M38277Q6413j34732l65605m32543m01537o20887q68891
40419a469564m76663L42621M60547l24208o63832K70319J286263R03671l77189
40410d8035r20834l87939J83891L26086N48095Q35197L64931q55079j460092n88071
40400b001850P49277J007968J37230n93620l92148K50844M76683J65370o3470
40391b63716K62005P82315P00474r8081p31752n02511P2159R2394k78178j99731
$$ y = [1106555, -666647, -3104047, -4727830, -4758677, -3455054, -1727956, -510946, -151422, -338525, -741581, -1405022, -2195156, -2383982, -1524516, -411160, -273466, -1145234, -1942348, -2082567, -1977448, -1835221, -1188560, -61294, 514958, -93537, -1024164, -1035358, -109560, 829941, 1268218, 1354631, 1219899, 854294, 421751, 20214, -600673, -1469564, -1946227, -1603606, -1143059, -1467267, -2131099, -1860780, -574517, 329154, -48035, -968869, -1356808, -1172917, -846831, -298736, 536461, 901392, 46313, -1413779, -2001850, -1252573, -244605, -107375, -700995, -1093143, -842299, -365616, -200246, -263716, -1711, 780604, 1481078, 1382997, 651245, 148734, 220893, 313287, 35109, -164622]
40381a64622K80314L40413M4906L62073J177106R64059p34211k108020j599474
40372a437456k11873K10118k35640k55452J32649m0402m85963j03598O64114L21246
40362a442257p96679o41477J065461J989271P81559q24117q57164P2050M31562
40353b21791L30545M85485K78522r04853j686162n27738J291678J169174p12620
40344d97760j473672M4837J580299J055071l94126n01357O05717Q39443n42220
40335G16232j822061j278108M08656J053140j9982q96939K94432K388945K374027
40326C218342l14837k598008j887884L75280J116032R1031m75376J43085M24310
40317I1975k57497n71980R6966M82229j08663m80513J16196M98511j76402o87982
$$ y = [-164622, 115692, 456105, 501011, 863084, 2040190, 3004249, 2270038, 162018, -1437456, -1649329, -1439211, -1674851, -1930303, -1797654, -1838056, -2324019, -2427617, -1763503, -1442257, -2238936, -2880413, -1814952, 174319, 955878, 131761, -725403, -653353, -221791, 108754, 594239, 872761, -32092, -1718254, -2245992, -954314, 214860, -497760, -1971432, -1926595, -346296, 708775, 314649, -186708, 419009, 1258452, 716232, -1105829, -2383937, -1975281, -922141, -942123, -1839062, -1544630, 844315, 3218342, 2903505, 305497, -1582387, -1207107, -91075, -44, -475420, -332335, 91975, -165522, -737502, -640536, -158307, -266970, -747483, -631287, -132776, -309178, -997160]
40307i97160j3302N76385k54180j212747l75873J314984J316320l36625r90451
40298i72649L56479J501995O16031r56203r05149O44366J604888R15184m88010
40289B316932j346811j410452j015834l79960K68896M75615L9691m89981l10599
40280a852503N82090J269274J067738L88799o122j97488p79817j535162j461221
40271b524412l39257O98901O56038p9413n28969m44175j80083J16260M60703O42697
40261a521710N37739M16311M34222L20220M4740J07298N38363M13616p49756j816088
40251a275045j347027L49100J567018J347409L03841m95553n79847j26313L11056
40242E4639K50202o3572J51062R44141J310605P35694O5835l3243k90014j232848
$$ y = [-997160, -1010462, -434077, -688257, -1901004, -2276877, -961893, 354427, 17802, -972649, -616170, 885825, 1501856, 545653, -359496, 284870, 1889758, 2804942, 2316932, 970121, -440331, -1456165, -1836125, -1567229, -1091614, -1051923, -1541904, -1852503, -1270413, -1139, 1066599, 1455398, 1449276, 1251788, 471971, -1063191, -2524412, -2863669, -2164768, -1508730, -1588143, -2117112, -2561287, -2741370, -2625110, -2164407, -1521710, -983971, -567660, -133438, 186782, 231522, 338820, 877183, 1290799, 541043, -1275045, -2622072, -2272972, -705954, 641455, 945296, 449743, -130104, -256417, 54639, 304841, 241269, 392331, 1336472, 2647077, 3382771, 3448606, 3415363, 3125349, 1892501]
40232A892501j662406n06526Q99932O10848o57816o18530O65739Q69741m65709
40223A027774j016228K71864J240369J86599j192869o55716Q74964R35619n18068
40214A154308j304748m73649P12601J030712O46469J99861J7877K59032O82326
40205B924789M44593p64942j725605j099213M34228R12416n9543p23921J84996
40196E27798J584242J641094L29218o23037q0334J055445J063446l14047j448682
40187C735143r46275M24200P65114k97932j224937r31535j36189K21018M54371
40178B062978R91172J044714j12491j445696j350069m3294Q09333N91051K86308
40169B834006N40479O72401k4168j152330j828067j636948p21119M12120J034822
$$ y = [1892501, 230095, -276431, 623501, 1234349, 576533, -41997, 623742, 1493483, 1027774, 11546, 283410, 1523779, 1710378, 517509, -138207, 736757, 1672376, 1154308, -150440, -624089, 88512, 1119224, 1765693, 1965554, 1983431, 2242463, 2924789, 3369382, 2604440, 878835, -220378, 213850, 1126266, 1066723, 342802, 527798, 2112040, 3753134, 4082352, 3459315, 3378981, 4434426, 5497872, 5183825, 3735143, 2788868, 3213068, 3978182, 3680250, 2455313, 1523778, 1387589, 1608607, 2062978, 3054150, 4098864, 3986373, 2540677, 1190608, 1147314, 1956647, 2547698, 2834006, 3374485, 4046886, 4022718, 2870388, 1042321, -594627, -1315746, -903626, 131196]
40160A31196P75204J17478j83560o2056K3739n7521q1679j7853M4309J82785K68798
40149A140840j38380q46039p91757L04761J024362K85322p17325l33266P14452
40140F42970N29088n63511m56219R95994J514549K06403r48724m86299K58644
40131A692895k08895r03666l04654Q59103R02580j6930m82426k87657l43070p28649
40121A78631o81083j62120J66189K65696O02724R59521O96123J4262k41668R7582
40111A895857M30830L95194P0626m75520r82440q25434L8940N65781N6946o18816
40101E51964m03339J48627j19838q55987p71701J29321O41288M16518K06265J84803
40091A27921k06546p48983n59253J50441J88532m95110n85923L06405R18124M66641
$$ y = [131196, 906400, 1023878, 840318, 778262, 802001, 744480, 662801, 644948, 689257, 872042, 1140840, 1002460, 156421, -635336, -330575, 693787, 979109, 261784, -71482, 642970, 1172058, 608547, 152328, 1148322, 2662871, 2869274, 1920550, 1434251, 1692895, 1484000, 580334, 275680, 1134783, 2037363, 2020433, 1538007, 1250350, 907280, 178631, -502452, -664572, -498383, -232687, 370037, 1329558, 2025681, 2039943, 1798275, 1895857, 2326687, 2721881, 2792507, 2316987, 1334547, 509113, 548053, 1113834, 1170780, 551964, 148625, 297252, 177414, -678573, -1450274, -1320953, -679665, -263147, -56882, 127921, -78625, -827608, -1386861, -1236420, -1047888, -1542998, -2128921, -1822516, -904392, -437751]
40081d37751j88295k19207l7943m2825K34279Q17185P09771k82173o89804L45676
40071B08913J343315N87616j167716j816895r37191L2161K00867J41320M62434
40062i45176Q82382R09979M81523j81440o72436n21811J24411K96690n51299j482554
40052a659731j180295J92611J199951J001774R3387o63159q20738k73056O62175
40043a447081J101874M25256p12842j009791k03103O65169P43514L22161J08799
40034f044K82446N52099O24212L77582m7885k56348l9216K48445J55588j73189
40024A717690k69644j36858j91820n26737p95713p32570k76155N78953J473073
40015H40219J584424O24585m16506m70061r950k94561j186792j201321Q1613J175003
$$ y = [-437751, -626046, -845253, -883196, -926021, -691742, 125443, 835214, 553041, -136763, 208913, 1552228, 2139844, 972128, -844767, -1781958, -1749797, -1548930, -1407610, -945176, -62794, 847185, 1328708, 1147268, 474832, -46979, 77432, 374122, -177177, -1659731, -2840026, -2647415, -1447464, -445690, -352303, -1015462, -1836200, -2109256, -1447081, -345207, 80049, -632793, -1642584, -1845687, -1180518, -437004, -114843, -6044, 276402, 828501, 1452713, 1830295, 1782410, 1526062, 1486846, 1735291, 1890879, 1717690, 1448046, 1311188, 1119368, 592631, -203082, -935652, -1211807, -632854, 840219, 2424643, 3049228, 2632722, 2162661, 2152711, 1858150, 671358, -529963, -448350, 726653]
40005G26653Q79501o53l0286P97583J390735J217223O38675P8917k29706j980
39995E466662P81804J488471J399968N75566k32588l34230M14256J456773J729026
39986A2745708O79667o95949p87603K80153M81564j098034k473946j495622P27242
39977H363180J208393n65157j972565j214756K84071L81662o92189j191856o03895
39968C996888N0829P3502j91426l20574l42635k70612J2386L01665J90954k48123
39958C252854m46513j11432L66318L66445k89513j059310j043388K482R73941
39949B011884M76144j127715j744775l67192J260279J067368k55046m68203N29309
39940A382053O19452q30223j751048p70689N49325M04870l54941l9015P82078
$$ y = [726653, 1606154, 1605501, 1575215, 2372798, 3763533, 4980756, 5619431, 5698348, 5468642, 5466662, 6248466, 7736937, 9136905, 9712471, 9479883, 9145653, 9559909, 11016682, 12745708, 13425375, 12729426, 11941823, 12221976, 12703540, 11605506, 9131560, 7635938, 8363180, 9571573, 9006416, 7033851, 5819095, 6103166, 6484828, 5792639, 4600783, 3996888, 4047717, 4121219, 3929793, 3609219, 3266584, 2995972, 3008358, 3310023, 3500977, 3252854, 2806341, 2694909, 3061227, 3427672, 3138159, 2078849, 1035461, 1037943, 2011884, 2488028, 1360313, -384462, -751654, 508625, 1575993, 1320947, 852744, 1382053, 2001505, 1171282, -579766, -1350455, -801130, -396260, -751201, -790216, -8138]
39931h138L92579q63785j042519J78268J161228J104153Q58628Q20725K83110
39922B884249o98582r57969l22434k2570l86468k49309O06092P30488k44509n72622
39912G66366M78824R60214l95690j579383n49794J116777Q26486n86028m86157
39903E51615P69978N47451j149266j523156R0268J136600M55219Q4563J079866
39894B043138J290372n83327k083210q82462J165375R82079q33233j397800l72675
39885f71743Q1050n89826p00734K35650N95707k73413p40499L74563J862551K042675
39875B215981J045039J09189k16330k20633k41494m88430j014462j391068j038101
39866a240309j54818M05089M01317M93100R57449J043731J53125j054300j380758
$$ y = [-8138, 384441, -479344, -1521863, -1343595, -182367, 921786, 1780414, 2601139, 2884249, 2185667, 1227698, 905264, 882694, 496226, 246917, 853009, 1583497, 1338988, 766366, 1245190, 2205404, 1809714, 230331, -319463, 797314, 1623800, 1037772, 551615, 1321593, 1869044, 719778, -803378, -713110, 423490, 878709, 963272, 2043138, 3333510, 2750183, 666973, -215489, 949886, 1931965, 1098732, -299068, -671743, -590693, -1180519, -1881253, -1645603, -1049896, -1323309, -2063808, -1689245, 173306, 2215981, 3261020, 3370209, 3153879, 2933246, 2691752, 2203322, 1188860, -202208, -1240309, -1395127, -990038, -588721, -95621, 861828, 1905559, 2058684, 1004384, -376374]
39857c76374n44458N55788Q34563O5521q93181r16279J33804J165998J193051
39848A218433N19243N4976p0328l39420o47299l73661M09629Q68535O23584P5131
39838B338823n17606j234894j702095j268514k12374M12252M36764P94457J606170
39829F52983J519747r8307j630391j243469M13499J078020K9317j135855r09475
39820a323931K88954J095408J008804N49404K01523o3664l55764n49893n60184
39811B90657n58479o22641l99340M08260J262064J145062m2155j093497j006657
39802f16726k57404J25891J12987K88252M49707n9523q21288o46003M27876R23884
39792g2347J82400n74971j66545P96771J018170M03408j65655k51901j28198r6452
$$ y = [-376374, -920832, -365044, 469519, 535040, -358141, -1274420, -1140616, 25382, 1218433, 1737676, 1792652, 1722324, 1382904, 735605, 361944, 771573, 1640108, 2263692, 2338823, 1821217, 586323, -1115772, -2384286, -2596660, -2184408, -1747644, -953187, 652983, 2172730, 2074423, 444032, -799437, -385938, 692082, 721399, -414456, -1323931, -1034977, 60431, 1069235, 1618639, 1820162, 1756498, 1400734, 850841, 290657, -267822, -890463, -1289803, -881543, 380521, 1525583, 1483428, 389931, -616726, -874130, -748239, -635252, -347000, 102707, 43184, -778104, -1424107, -996231, -72347, 110053, -464918, -631463, 165308, 1183478, 1586886, 1421231, 1169330, 1041132, 944680]
39782I44680k50447n14851n13032K1968M95933O0956p83645n40802Q27200J436051
39772A184011M05432n66765l5467O05754m69210k024225j460612P99689J698187
39763A36794K63458j063332m38502Q27193Q81160J16289j90537j35591l97645
39754g13o29174k88974N4715j88328k54721O71037J671003J328355J01495l33956
39744B130739K28736L26292o57348j499633j115443j34726J97093k36753m95494
39735a256537Q8166J125784J525397N76180j063396j730646o42432R31995J181659
39726G36170J43205m97557P5662P69829M25681m78638p14421r3944M59050K25382
39716A050419n66314j104229p47479L34446J130832Q20645j10141m37738L5429
$$ y = [944680, 694233, 179382, -333650, -311682, 184251, 245207, -538438, -1079240, -252040, 1184011, 1589443, 1022678, 987211, 1592965, 1123755, -900470, -2361082, -1561393, 136794, 400252, -663080, -1101582, -274389, 606771, 723060, 532523, 396932, -713, -629887, -918861, -864146, -1052474, -1307195, -636158, 1034845, 2363200, 2464695, 2130739, 2359475, 2685767, 2028419, 528786, -586657, -721383, -524290, -761043, -1256537, -1168371, -42587, 1482810, 2058990, 995594, -735052, -1377484, -445489, 736170, 879375, 381818, 457480, 1227309, 1652990, 1174352, 459931, 365987, 825037, 1050419, 484105, -620124, -1367603, -1033157, 97675, 918320, 808179, 370441, 405870]
39707D05870K42576l04586o11413R6029Q83513N16872m78014o12638J88411N74992
39697I01612K5785m41291o6994N35179N62413J51782k60819o79940r89449o01283
39687h63005N30976J320786Q53720k82567q26312n38602j92196j93416j59599
39678c50215J74162M45868K63685j87973l55047P3862Q09379J162234P46886j4940
39668B767901m11407m23485o18236r91931p42624M06642J459882J377359M49367
39659C273468k41259k36504P5667K18691q120n23866q58625n77300j54419n63473
39649D04260j531554j424563K66424J687293J193460j42801l29064M17661N00482
39640A041598n573K89826J116056P30333p98152j308722j41576P13704L2030p02337
$$ y = [405870, 648446, 343860, -267553, -171524, 711989, 1228861, 750847, 138209, 326620, 901612, 927397, 486106, 419112, 954291, 1516704, 1668486, 1407667, 727727, -261722, -863005, -332029, 988757, 1842477, 1559910, 733598, 194996, 2800, -190616, -350215, -176053, 269815, 533500, 345527, -9520, 64342, 873721, 2035955, 2782841, 2767901, 2356494, 1933009, 1314773, 322842, -419782, -13140, 1446742, 2824101, 3273468, 3032209, 2795705, 2871372, 3090063, 3081943, 2558077, 1699452, 1122152, 967733, 404260, -1127294, -2551857, -2285433, -598140, 595320, 452519, 123455, 541116, 1041598, 1036025, 1325851, 2441907, 3172240, 2374088, 1065366, 923790, 1637494, 1669524, 967187]
39630I67187j17090P25560N38731J52654O44413J037609J45015q55374j92615
39621C046090J261936J142072o31095j744738j036957J58258M29706N2964j62105
39612B516131j90385l17058m41737l72034j20205K63926O04758N09713l6250l65819
39602B051040r7131J49829j95801n94638l80240l0404k43882n00418L3806Q07281
39592I99442O65642j41506l56271K10151N79139L38419k9622k79918m17201q036
39582A560239R75745J235177j06313j493772q87869Q32672J025977m23875r52906
39573A765075L09473J164087J92086j042027r73660m66207o04916n58578M53353
39564B38686J246603P39529j3510J13913J39188r05304j517870n4699J964745
$$ y = [967187, 850097, 1575657, 2114388, 2267042, 2911455, 3949064, 4094079, 3238705, 3046090, 4308026, 5450098, 4819003, 3074265, 2037308, 2195566, 2625272, 2678236, 2516131, 2325746, 2008688, 1566951, 1194917, 1074712, 1338638, 1943396, 2453109, 2416859, 2051040, 1953909, 2103738, 1907937, 1313299, 933059, 902655, 658773, 158355, 192161, 999442, 1665084, 1523578, 1167307, 1377458, 1956597, 2295016, 2265394, 1985476, 1568275, 1560239, 2535984, 3771161, 3664848, 2171076, 1283207, 2115879, 3141856, 2717981, 1765075, 2074548, 3238635, 3430721, 2388694, 1415034, 948827, 343911, -214667, 238686, 1485289, 2224818, 2211308, 2325221, 2464409, 1559105, 41235, -13464, 1951281]
39555A951281J823488o5762q18036L54177J210483K99421j007852j025648j48086
39546B573466K43914k04574p71594p03722J50332J098468J051466m2512o52532
39537B742712L66137J834763J746862K22370q00786n74494k50039n04484n56675
39528D226366m8237J07064l93455l29768R26727J938851J213495m93023j303872
39519E844148q01579q9967J13170P6970Q2937J06111L68474J131457J912373J842129
39509A0586223R12220M9624j97102k43981m64841m01481M10709J359617J330632
39500A3341620K78612n49457k18711O84954R41909L45832k40212k64420p4939
39491A4245188l9131N4702L28019L14480k49704p15360l31879O01679J125186
$$ y = [1951281, 3774769, 3709007, 2890971, 3245148, 4455631, 4755052, 3747200, 2721552, 2573466, 2817380, 2612806, 1841212, 1137490, 1287822, 2386290, 3437756, 3395244, 2742712, 3108849, 4943612, 6690474, 6912844, 6112058, 5537564, 5287525, 4783041, 4226366, 4178129, 4285193, 3891738, 3561970, 4488697, 6427548, 7641043, 7148020, 5844148, 5042569, 4952602, 5065772, 5142742, 5225679, 5331790, 5700264, 6831721, 8744094, 10586223, 11498443, 11548067, 11350965, 11106984, 10642143, 10240662, 10651371, 12010988, 13341620, 13620232, 13070775, 12852064, 13537018, 14478927, 14824759, 14584547, 14320127, 14245188, 14206057, 14260759, 14588778, 14903258, 14653554, 13938194, 13606315, 14207994, 15333180]
39482A5333180R22054N32619M02626M14390L71451L42673L96957M13813K83148
39473A9412911O8643k9321K31574Q85423J501448J544949J161778J099760J587955
39464B7465120J925372J598315J095618J010264J061618Q21991P38038J411352
39456C7127688K378017K721640K541267K651060L071232L067856K649523K767055
39448E8975338L798250M895123N191034M870641M762877N461991O931402Q445474
39440A03332130R077297Q854944R063465J0577086J2410778J3105764J3074171
39433A79495635J3991346J6036155J7538220J7613756J7357811J7780063J8128393
39426B97941379J7107871J4503507J0844208O658989K732479k24591k904067o952056
$$ y = [15333180, 16255234, 16787853, 17190479, 17604869, 17976320, 18318993, 18715950, 19129763, 19412911, 19481554, 19452233, 19683807, 20569230, 22070678, 23615627, 24777405, 25877165, 27465120, 29390492, 30988807, 32084425, 33094689, 34156307, 34978298, 35716336, 37127688, 39505705, 42227345, 44768612, 47419672, 50490904, 53558760, 56208283, 58975338, 62773588, 67668711, 72859745, 77730386, 82493263, 87955254, 94886656, 103332130, 112409427, 121264371, 130327836, 140904922, 153315700, 166421464, 179495635, 193486981, 209523136, 227061356, 244675112, 262032923, 279812986, 297941379, 315049250, 329552757, 340396965, 347055954, 349788433, 349563842, 346659775, 339707719]
39418C39707719j2256625j6223509j7037630j6195986j6207121j7081514j7067896
39411B27637438j5887923j4931671j4617015j3856448j2323638j1172167j0919190
39404A33929386j0379774q594361o475480n531356n853599o280098n946255m935414
39396G9933049l846374l306748l554320m072555l995666l156090k263463j806780
39388E3931053j437075q50728n53333j034349j743160j774927j244582r97425
39380D4295474j063314n18455Q17313J623196P97730p75365j205005l6087J365896
39371D5301383J897404K027134K548404L072800K739208J815934J447785J957302
39363F2807354K451919K235749J674395J354408J176394P09443j43338j204792
$$ y = [339707719, 327451094, 311227585, 294189955, 277993969, 261786848, 244705334, 227637438, 211749515, 196817844, 182200829, 168344381, 156020743, 144848576, 133929386, 123549612, 114955251, 108479771, 102948415, 97094816, 90814718, 84868463, 79933049, 76086675, 72779927, 69225607, 65153052, 61157386, 58001296, 55737833, 53931053, 52493978, 51643250, 51089917, 50055568, 48312408, 46537481, 45292899, 44295474, 43232160, 42713705, 43531018, 45154214, 45951944, 45176579, 43971574, 43935487, 45301383, 47198787, 49225921, 51774325, 54847125, 57586333, 59402267, 60850052, 62807354, 65259273, 67495022, 69169417, 70523825, 71700219, 72409662, 72266324, 71061532]
39355G1061532k231640k797927k596123k155059k502358l646373m218927l343942
39347D7569183k072826j956910k803976l110222k411917j785427j905353k026733
39339B9495819j453644q15757r83212j560625j532906r32278p48654j301931j746932
39330A8419880j389241o27858k00373j73053k07314l26642p65038j297037j367485
39321A2065839q74733l10160o4813m2571m5852j04862k52711l53224l76184n43613
39311I097116r66922j349437j237834m51019P33858J596944J328456j31127j655262
39302F964773j980105j226340o08575n63972k64645O25216J025367K08684o78219
39293C502184k35274Q89604R28687k58876j083775p30221m5915K25988M32567
$$ y = [71061532, 68829892, 66031965, 63435842, 61280783, 58778425, 55132052, 50913125, 47569183, 45496357, 43539447, 40735471, 37625249, 35213332, 33427905, 31522552, 29495819, 28042175, 27226418, 26243206, 24682581, 23149675, 22217397, 21468743, 20166812, 18419880, 17030639, 16402781, 16202408, 16029355, 15822041, 15495399, 14730361, 13433324, 12065839, 11191106, 10880946, 10816133, 10773562, 10727710, 10622848, 10370137, 10016913, 9640729, 9097116, 8130194, 6780757, 5542923, 5091904, 5825762, 7422706, 8751162, 8620035, 6964773, 4984668, 3758328, 3149753, 2585781, 2321136, 2946352, 3971719, 4180403, 3502184, 3266910, 4156514, 5085201, 4826325, 3742550, 3012329, 2966414, 3192402, 3624969]
39284C624969P89577P13780M2942l92693j42990R0422k31462n55736l95959k51352
39274C291498m61150k98573O69936J360284O36542p84984j293399o88095j39280
39265B292779k30563m29944l33203j28178J39858N81272P69431K03345n51226
39256B313571m27478L64305M96236k67931n35184L74393J043124J20265j293941
39247B187360j081049O41563J518270L29172j311232j335780K8766J014653R01248
39238B892971M50703J77457k79799r25790r78401k28255L43567M9072m23373k71935
39228H06217O2071j06712k74224K92369Q90716L48076p73407p69388M78884J232194
39218B186796N84892l86113o28868n04231m91561k13626L69290L89818l00971
$$ y = [3624969, 4414546, 5128326, 5171268, 4778575, 4635585, 4726007, 4494545, 3938809, 3542850, 3291498, 2830348, 2531775, 3201711, 4561995, 5198537, 4413553, 3120154, 2432059, 2292779, 2062216, 1632272, 1299069, 1170891, 1310749, 1892021, 2661452, 2864797, 2313571, 1886093, 2250398, 2746634, 2478703, 1943519, 2317912, 3361036, 3481301, 2187360, 1106311, 1747874, 3266144, 3595316, 2284084, 948304, 977070, 1991723, 2892971, 3343674, 3521131, 3241332, 2315542, 1337141, 1108886, 1452453, 1501525, 1078152, 806217, 868288, 761576, 487352, 779721, 1670437, 2018513, 1245106, 475718, 954602, 2186796, 2771688, 2385575, 1756707, 1252476, 760915, 547289, 916579, 1306397, 1005426]
39209A005426m70912M17698R92699J35135j095733j194363n27035k63791k23511
39200a224387L58381R42899N75507j12634J73282J040532J004266M456o87345
39191B074957p34870q52131r14007j31712R61133R36189j8249k87080K63865L4829
39181A332924j158301j326482K85786J597669R97584p0850K59743J078720M66732
39172C463525j026816j282582j64155M06746l06021r14232m47885K56740L19899
39163C05219K22676N65811P88576K07654n88256n24615K75011O78332K80057o1914
39153B148551L28916Q12744M02570o05893r07357j20907N23595m8043j124330
39144A409846j253294l66621L21139L16734L81956Q57043Q61521j11086r69991
$$ y = [1005426, 534514, 952212, 1944911, 2080046, 984313, -210050, -737085, -1000876, -1224387, -866006, 76893, 652400, 539766, 713048, 1753580, 2757846, 2762302, 2074957, 1340087, 487956, -426051, -557763, 403370, 1339559, 1321310, 1034230, 1298095, 1332924, 174623, -1151859, -866073, 731596, 1729180, 1658330, 1918073, 2996793, 3463525, 2436709, 1154127, 989972, 1396718, 1090697, 176465, -271420, -14680, 305219, 527895, 1093706, 1882282, 2089936, 1501680, 977065, 1252076, 1930408, 2210465, 2148551, 2477467, 3290211, 3692781, 3086888, 2179531, 2058624, 2582219, 2534176, 1409846, 156552, -210069, 111070, 427804, 809760, 1666803, 2528324, 2417238, 1447247]
39135A447247m99865O77576Q61141k71788j149762m47212J140436J755443O05342
39126D118558j156565j777792q39578M24797P32612K40917K9285M19075N82743
39117B774052p8151r43657j030272l43946J99422L5254l59816j44664P47126J388424
39107B243772R36830k03937p68220k90785K64874l8558p64088r72418p38272o89001
39097a019803n97346J38198R28337N81781n33337p25489K87590P98747o682n53467
39087g01471M77525J764435J337381l61118j345968j107739p37332o03106k7060
39078a304453Q37737Q67670K2081k87076N23734J142315M11648q46802j091151
39069B75703k28051N53202N78481L06418L14550M78312L20145k18904n80506j96794
$$ y = [1447247, 947382, 1624958, 2486099, 2214311, 1064549, 617337, 1757773, 3513216, 4118558, 2961993, 1184201, 344623, 769420, 1502032, 1742949, 1772234, 2191309, 2774052, 2695901, 1752244, 721972, 378026, 577448, 612702, 252886, 108222, 855348, 2243772, 3180602, 2976665, 2208445, 1917660, 2182534, 2143976, 1379888, 407470, -330802, -1019803, -1617149, -1478951, -550614, 31167, -502170, -1227659, -940069, -141322, -148004, -701471, -223946, 1540489, 2877870, 2516752, 1170784, 63045, -674287, -1277393, -1304453, -466716, 400954, 423035, 135959, 659693, 1802008, 2213656, 1366854, 275703, 47652, 600854, 1179335, 1485753, 1800303, 2278615, 2598760, 2379856, 1799350, 1602556]
39059A602556P06047J158610N79492m15138q15018n68733m19864n40855k92051
39050I95046M79381Q90791K89926p19849j164085r69147o38058k28387M47394
39041f16988R67949O75487j59544n22211j38983J55160j53984m15953j4468M37636
39031B14101O6582o36269l55868R57730J736062Q81590p51041j539127j043180
39022d69420j25910L25311Q3014o18812j230949j062203K5283J227375J644885
39013b01426J303864P88209K18361n99825j252903r62210J42938Q83755M67906
39004G88669n76243j165549q41861O410O45506N91584P0654j60463J95295M78827
38994C2829J19813l26948q9625L88935J85096l28008l2842P47983N20232o83775
$$ y = [1602556, 2308603, 3467213, 4046705, 3631567, 2816549, 2247816, 1827952, 1287097, 995046, 1474427, 2365218, 2655144, 1935295, 771210, -197937, -835995, -1064382, -616988, 350961, 1026448, 866904, 344693, 205710, 360870, 206886, -209067, -223535, 214101, 280683, -355586, -711454, 246276, 1982338, 2863928, 2112887, 573760, -469420, -595330, -270019, -187005, -805817, -2036766, -3098969, -3073686, -1846311, -201426, 1102438, 1890647, 2109008, 1509183, 256280, -705930, -562992, 320763, 788669, 212426, -953123, -1794984, -1788574, -1143068, -551484, -480830, -641293, -445998, 32829, 152642, -174306, -263931, 125004, 310100, -17908, -50750, 697233, 1217465, 533690]
38984E33690r61100L68171J402306O15195p41076q16339q4446j19160p66980p57559
38974a327298k32940l43319q27119l37142R60814J406643O36317J40810N70512
38965F47278O38683m22379j272315n98185P01784R47924K13542j02395L97832
38956A151769P08767K18113l29681K2944J029726J394115K51341j655706k541684
38947B49704j577084J8456M93651j51739m31905J76732M81156k62238q96604j77915
38937b077786J080831J160503R3733m68280R8084N32592j37928j038507q90190
38928a646948O5366O44787N11355K30945j4205m83657p84950j18914J128534J455116
38918I87429N29072k3128P95297J370725j49256k500134k675290m10407J283892
$$ y = [533690, -427410, -59239, 1343067, 1958262, 1217186, 400847, 316401, 197241, -569739, -1327298, -1560238, -1903557, -2730676, -3067818, -2107004, -700361, -64044, 76766, 647278, 1285961, 863582, -408733, -1006918, -305134, 642790, 856332, 753937, 1151769, 1860536, 2078649, 1748968, 1771912, 2801638, 4195753, 4447094, 2791388, 249704, -1327380, -1308924, -815273, -967012, -1398917, -1222185, -741029, -1003267, -1899871, -2077786, -996955, 163548, 257281, -210999, -112915, 419677, 281749, -756758, -1646948, -1581582, -936795, -425440, -194495, -208700, -692357, -1477307, -1596221, -467687, 987429, 1516501, 1493373, 2288670, 3659395, 3510139, 1010005, -1665285, -2075692, -791800]
38909g91800N96085o24990j49996J174501J210802O6184m96924j40966m8164m66289
38899C28443m70723k6473j15950p02933o04090L35107Q71045N39964K89863M59289
38889I03542J20065q52134j086826j16450N20325j01869m96027O79226J977675
38880A547527J280456o76197j333465k10698O92054K39973m64183l83960q2178
38871F09329k27956l57926n8354O3020m13018p41515k87861K62854Q8385k75143
38861a338185J18816Q61033P68904j21941n77075j32644L34081K31216J17137
38852B61342M01103L98065m31407j239531r09082J89929P61463N53517M62872
38843D48271P29378M55630o54056j394876p66079M00693O10831j17344m54695
$$ y = [-791800, -195715, -820705, -970701, 203800, 1414602, 1480786, 983862, 842896, 794732, 328443, -142280, -168753, -284703, -987636, -1591726, -1256619, -385574, 154390, 444253, 903542, 1023607, 171473, -915353, -1031803, -511478, -613347, -1109374, -430148, 1547527, 2827983, 2151786, 818321, 607623, 1299677, 1539650, 1075467, 691507, 609329, 381373, 23447, -34907, 28113, -384905, -1126420, -1414281, -1151427, -1063042, -1338185, -1219369, -358336, 410568, 288627, -288448, -421092, -87011, 144205, 261342, 662445, 1060510, 629103, -610428, -1519510, -1329581, -568118, -14601, 448271, 1177649, 1633279, 979223, -415653, -1181732, -781039, -170208, -287552, -742247]
38834g42247J29234P14052N36628J25569K85413P46998O11689k21778q71415p44791
38824E69352l23490l12200m92709j39130N54089M46948p01115j352434k09903
38815a960592J591605J823383L97943n81344j98298n097j003109j523026N8131
38806a400404K162297J983133k99807j797405j100758K27726M92338q9335o98331
38797e20546j224890j465222p35603P87514J717803J252357J35705o87509j059400
38788a799791q48868J67794J120331N73658r95815j276368K83147J223501N588
38779a546823j177005R8961K208821J848306n95189j593910p5194J102531j08635
38770A61863j910797j750363J1977J225184J018023R8975p75081j139237n58260
$$ y = [-742247, -613013, 101039, 637667, 763236, 1048649, 1795647, 2407336, 2185558, 1314143, 569352, 245862, -66338, -559047, -698177, -144088, 302860, -398255, -1750689, -1960592, -368987, 1454396, 1852339, 1270995, 1072697, 1067600, 64491, -1458535, -1400404, 761893, 2745026, 2445219, 647814, -452944, -225218, 267120, 177785, -520546, -1745436, -3210658, -3946261, -3158747, -1440944, -188587, -52882, -740391, -1799791, -2648659, -2480865, -1360534, -786876, -1782691, -3059059, -2775912, -1552411, -1546823, -2723828, -2624867, -416046, 1432260, 837071, -756839, -832033, 270498, 161863, -1748934, -3499297, -3487320, -2262136, -1244113, -1145138, -1920219, -3059456, -3617716]
38761c617716O55690J202407M21658n31326k38538R27164J483182J021636M31275
38752A755432K41261L8920m46472q08081p37370m67283j93381K10142O27605N39097
38742G59870j82089q27536o77900M0538M70039K51520o8173J80296Q62688J121487
38732A930740M09942p17640j117273m25621M09850K92107n87483j034621n47203
38723a387202O026k28700o94136k12762J120005J825345J011766m14659j008725
38714A6958n76689j6596J41003J54168K21463J27668j40918j93448P8893K18491
38704C0993p8635m51408m08429L0593N18079Q17922P78801K58918n78269j183471
38694b64906j138133n46100K14972P93447Q31024J65649o83769p84286Q1590J019849
$$ y = [-3617716, -2962026, -1759619, -1337961, -1869287, -2107825, -1180661, 302521, 1324157, 1755432, 1996693, 2035613, 1589141, 781060, 43690, -423593, -616974, -406832, 220773, 759870, 577781, -249755, -927655, -887117, -417078, -165558, -233731, -53435, 809253, 1930740, 2340682, 1623042, 505769, 80148, 489998, 782105, 194622, -839999, -1387202, -1381176, -1609876, -2304012, -2516774, -1396769, 428576, 1440342, 1025683, 16958, -559731, -576327, -435324, -281156, -59693, 67975, -72943, -266391, -187498, 30993, -47642, -499050, -907479, -876886, -358807, 459115, 1237916, 1496834, 918565, -264906, -1403039, -1949139, -1734167, -940720, -109696, 55953, -627816, -1412102, -1330512, -310663]
38684c10663J133007N50607l0352k88862k70630P590L14777O7485q18727j350815
38674i96583n97524Q31845J361648M76405o78210q60713j52468M85448N04086
38665C73934J89194M1054R6119m3790n47931r23458n88426J74708M17353j40989
38655i52232o40986l39974L39853O10922N27414O07296P49961M33191l01899q97167
38645A36379j094405r77673m92653L02994Q18131N80578K3853j70611j12589k00213
38635a186209j21501M89975R16990K94075o90589o43228J99097L04243m74800
38626i11947o12501L04462O84880k74643r91137r0313J174412Q79904m87813q61585
38616a186281K63527J370986J277099L68455m14210n76643j08415N15923N23298
$$ y = [-310663, 822344, 1372951, 1342599, 1053737, 783107, 790697, 1105474, 1172959, 354232, -996583, -1594107, -762262, 599386, 1075791, 397581, -463132, -615600, -130152, 373934, 563128, 604182, 700301, 656511, 108580, -814878, -1403304, -1228596, -811243, -952232, -1593218, -1933192, -1593339, -982417, -455003, 152293, 902254, 1335445, 1033546, 136379, -958026, -1935699, -2428352, -2125358, -1307227, -726649, -702796, -873407, -985996, -1186209, -1307710, -817735, 99255, 393330, -297259, -940487, -741390, -437147, -911947, -1524448, -1219986, -535106, -809749, -1800886, -1891199, -716787, 163117, -324696, -1186281, -922754, 448232, 1725331, 2093786, 1679576, 1102933, 994518, 1510441, 2033739]
38607B033739k18694q28918o70331l04379l41087k42644N19917J026814K14555
38598A188972j054816j029338K14787R48363N03817r0916j98922l18540n06775
38589c43368p3239O63816L36100r98622j329786K64099J886984J525833j06719
38580A825098r90944p03802j95606K13467P52863R11903J10269q32713o78647
38571D11888J23888P8303q17872j012087K0675R16190N73285l62247p58798m83331
38561a310106r791L94766N09350J03721m45546l33718M44873R07205N17139r9986
38551F77907k99891k98707l87777k75128J13820J29623m94630q72147k13466Q32273
38541a088123J028973K27660o83360j044588q13432j30217O46094Q19369R9162
$$ y = [2033739, 1815045, 986127, 315796, 11417, -329670, -572314, -52397, 974417, 1188972, 134156, -895182, -680395, 267968, 771785, 680869, 481947, 163407, -343368, -416607, 247209, 583309, -415313, -1745099, -1481000, 405984, 1931817, 1825098, 834154, 130352, -65254, 148213, 901076, 1812979, 1923248, 1090535, 411888, 535776, 614079, -203793, -1215880, -1195205, -279015, 294270, -67977, -826775, -1310106, -1319897, -925131, -415781, -312060, -757606, -1091324, -646451, 260754, 777893, 677907, 378016, 79309, -308468, -583596, -469776, -340153, -834783, -1706930, -1920396, -1088123, -59150, 168510, -514850, -1559438, -2372870, -2503087, -1856993, -1037624, -938462]
38532i38462p82891q67982r5024Q83524J499576J336265J57525j338222j645453
38523a791144l98208O61448Q315j200590p56924J075212J850336P37390l04083
38514a18248K23978J096027N77980p99486j248271m13787M76507N49054Q2731
38505D26485k84955j85328L40488O52974j9157j297571j603748k39585J293038
38496i17359J179276j85482r08076l75596K14122K1320k89027N8398O96977Q92168
38486C86721O28954K57137k29241q43365j055581l89348O23702Q16830j52629
38477D3180j232681j193630j31395P23114O64503L44642N67313Q91132L24637
38468A000815q96912j416231p56493K0905J15321J75094Q60406J410218Q73374
$$ y = [-938462, -1721353, -2589335, -2684359, -1800835, -301259, 1035006, 1192531, -145691, -1791144, -2189352, -1527904, -1519589, -2720179, -3477103, -2401891, -551555, 185835, -118248, 105730, 1201757, 1779737, 980251, -268020, -681807, -205300, 343754, 426485, 141530, -43798, 296690, 949664, 930507, -367064, -1970812, -2210397, -917359, 261917, 76435, -831641, -1207237, -993115, -971795, -1260822, -1202424, -505447, 386721, 1015675, 1272812, 1043571, 200206, -855375, -1244723, -621021, 195809, 43180, -1189501, -2383131, -2514526, -1791412, -1126909, -782267, -214954, 676178, 1000815, 103903, -1312328, -2068821, -2047916, -1932595, -1757501, -897095, 513123, 1386497]
38459A386497j26379k89844K86654M38097n1278l33880k46584n15953j077173
38450e29843q42869L71226J188859O69738k94981m28738J38551M42990K15892
38441I30825r5043k28029j99255L4810L27210K23568l18989o35373l57225r7552
38431d15053m55069r56456p93434p9690M86598P48035R56140R10272K53313n84357
38421G0299p59215k91765l0758l00942m89805j42440L54736M57974J83222j17993
38411a066687j77797J44556P16487R46853L45689o28936r51315m22608M8292j48685
38401a194151m20310j1979P02457P32466o4797p82485o82903n0435K90358j4622
38391a496401m71983l29319M66070J047366O47459l13835p17683l06649K4826
$$ y = [1386497, 1260118, 970274, 1256928, 1695025, 1643747, 1309867, 1063283, 547330, -529843, -1372712, -1001486, 187373, 857111, 562130, 133392, 271943, 714933, 930825, 835782, 607753, 408498, 443308, 770518, 994086, 675097, 39724, -317501, -415053, -870122, -1826578, -2620012, -2699702, -2213104, -1465069, -508929, 401343, 654656, 70299, -688916, -980681, -1011439, -1312381, -1802186, -1944626, -1589890, -1131916, -948694, -1066687, -1244484, -1099928, -383441, 563412, 909101, 280165, -671150, -1093758, -1045466, -1194151, -1614461, -1626440, -923983, -191517, -256314, -1038799, -1721702, -1772137, -1481779, -1496401, -1968384, -2297703, -1831633, -784267, -136808, -450643, -1168326, -1474975, -1450149]
38382a450149k55071m27966K14617J038665R42700J6057p22071q61358p53781
38373b258357m04437M70041J290695R68310k55708p30673J96081J019958K98217
38364E94127j103692j267882J6198J126770R15282j06298q18586p15552j8531
38355a378164O68829Q03595N09748M84907Q38686O65420m56695j362423r07329
38346a33426O0222o4482r50368q21127M84287J082891O4199j125768j072554k92280
38336b768406K02723M78673P13095L26499o55523r62030j58060K68436n41783
38327c096376r40437N20345K154423J517377n01135r36760N53016J412706N46436
38318A229595k59227J42039L56607p16370j765288j365853k98570J14185K19771
$$ y = [-1450149, -1705220, -2133186, -1918569, -879904, 62796, 78853, -643218, -1504576, -2258357, -2662794, -2192753, -902058, 66252, -189456, -920129, -724048, 295910, 594127, -509565, -1777447, -1761249, -634479, 280803, 174505, -644081, -1359633, -1378164, -709335, 94260, 604008, 1088915, 1927601, 2593021, 2136326, 773903, -133426, -73204, -137686, -1088054, -1909181, -1424894, -342003, -277804, -1403572, -2476126, -2768406, -2565683, -2087010, -1373915, -1047416, -1702939, -2664969, -2823029, -2554593, -3096376, -4036813, -3516468, -1362045, 155332, -345803, -1282563, -729547, 683159, 1229595, 970368, 1112407, 1469014, 752644, -1012644, -2378497, -2677067, -2562882, -2343111]
38309b343111Q19594J239493N20398n71741o19988J33196L37857j64326l52986
38300a001614l7692j30592q39695j081944j08010J312838J795506Q82942n37404
38291B54335j084903k51289Q87144P44823p02501j629372p07883J041587J625859
38282A77800O56988n04489p44883k26677L53334N13858Q9228n86795p50398j73765
38272a195799L09440N5512j92045M82882J306419P52648q43957j416708k18649
38263i60257R98650O05339o34265j001867l50207J32279o0367l11289j48584K00903
38253a529665M79746P11319P81625M31882k08502o21705n48137k41068m1805n2493
38243h38803k23446m17834l94353n0418L32066L99219K45526K59813M60691M20103
$$ y = [-2343111, -1523517, -284024, 236374, -335367, -955355, -822159, -484302, -648628, -1001614, -1039306, -1169898, -2009593, -3091537, -3199547, -1886709, -91203, 791739, 254335, -830568, -1081857, -194713, 550110, -152391, -1781763, -2489646, -1448059, 177800, 834788, 330299, -414584, -641261, -287927, 225931, 315159, -271636, -1022034, -1195799, -886359, -830847, -1022892, -540010, 766409, 1519057, 675100, -741608, -960257, 38393, 643732, 9467, -992400, -1342607, -1210328, -1270695, -1581984, -1730568, -1529665, -1049919, -338600, 443025, 874907, 666405, 44700, -503437, -744505, -786310, -838803, -1062249, -1480083, -1874436, -1924854, -1592788, -1193569, -948043, -688230, -227539, 192564]
38233A92564l0589m49207m15902j79582k49540n04814k38790P71072J679329J455793
38223B030334J81500r74433j098292m39389J77419M03391M31856L24415j15557
38214I21244p79228j114219p88000j28962L39877N10247N68230N48164L65541
38205D42894J19686j2134r0506k62296l65299j09319L27688L56541j93206p21209
38195e07160o24275p9381K91081K61480R9971L4262R1580L39902P65000R50309
38185A622769M53447m23741q28253n01890j43692l28764o58855m62603J56065
38176a115517N59734N07869K28143j56864n95235o84993m3590Q93128J139858
38167G32533L85273n99123r16940m34821L73737R34984P88851j26883j143027
$$ y = [192564, 161975, -287232, -703134, -882716, -1132256, -1637070, -1875860, -1104788, 574541, 2030334, 2211834, 1237401, 139109, -300280, -122861, 280530, 712386, 1036801, 921244, 142016, -972203, -1760203, -1889165, -1549288, -1039041, -470811, 77353, 442894, 562580, 550446, 459940, 197644, -167655, -276974, 50714, 407255, 214049, -507160, -1131435, -1210816, -919735, -658255, -558284, -524022, -432442, -92540, 672460, 1622769, 2076216, 1652475, 824222, 322332, 178640, -150124, -808979, -1271582, -1115517, -555783, -47914, 180229, 23365, -571870, -1256863, -1300453, -407325, 732533, 1117806, 518683, -398257, -833078, -459341, 475643, 1264494, 1137611, -5416]
38158e416j314062n29720K51013K04705l23515l94440K43858R27457R79221M09967
38148D49068k65644n84823m45258p7585J63666M4606l89816p99396p22525J6134
38138b611573R53079J265226O30219l60492q75492p21550k78416J64408N72612
38129a261979Q49023Q18935M70130j05540p95665j179351o27612O92930J405373
38120B66244M58124j206964j638428m70032O89416O56243J67682L99585J124343
38111D46213J253621M84972n00462j043062r43475k33219P78052J402645J114498
38102B759783J55140p38897j112070j066969r30158q35345n54054K20154J229992
38093h72424J558415O71537o63228j171250o21018J71752O60153Q83277O45272
$$ y = [-5416, -1319478, -1849198, -1598185, -1393480, -1716995, -2111435, -1867577, -940120, 39101, 449068, 183424, -401399, -846657, -924242, -760576, -715970, -1105786, -1905182, -2627707, -2611573, -1658494, -393268, 236951, -123541, -999033, -1720583, -1998999, -1834591, -1261979, -412956, 405979, 876109, 770569, -25096, -1204447, -1832059, -1139129, 266244, 724368, -482596, -2121024, -2591056, -1901640, -1245397, -1077715, -678130, 446213, 1699834, 2184806, 1684344, 641282, -302193, -535412, 242640, 1645285, 2759783, 2914923, 2176026, 1063956, -3013, -933171, -1768516, -2322570, -2102416, -872424, 685991, 1357528, 694300, -476950, -1097968, -926216, -266063, 617214, 1262486]
38084A262486l03076j160645o28092R91235J688284M63215j189201j410971l95942
38075f82707L71113K55868k67057o63533n81748K39610J363442J681051Q76410
38066B592449J391k04936m28854j197416j524060o09544L38011j50788j178260
38057b362007p26140J007020J766972O85178o01237o41847p2416j00850n92877
38048a638204n82708K29601J226768J618451J112512K19474j73762N5532j3377
38039B054287q42841j366377n09117Q70246J001515j99186j097686p88479n0423
38030i28061K24347J46567J47316L31463O52393P96221J05419j319654j933020
38021a777009n90408J389072J737972M54356m73914l33722l87079j164783j479920
$$ y = [1262486, 959410, -201235, -829327, 161908, 1850192, 2313407, 1124206, -286765, -682707, -311594, -55726, -322783, -986316, -1568064, -1328454, 34988, 1716039, 2592449, 2593840, 2388904, 1960050, 762634, -761426, -1370970, -1032959, -1183747, -2362007, -3088147, -2081127, -314155, 371023, -230214, -872061, -944477, -1045327, -1638204, -2220912, -1991311, -764543, 853908, 1966420, 2185894, 2012132, 2067664, 2054287, 1211446, -154931, -664048, 206198, 1207713, 1008527, -89159, -877638, -928061, -703714, -557147, -409831, -78368, 574025, 1370246, 1475665, 156011, -1777009, -2367417, -978345, 759627, 1213983, 740069, 406347, 19268, -1145515, -2625435]
38012b625435p48056m4373k3088J24264P31020P64004n9465l24225O17595J194000
38002c93759J45125j267660j269822k54596K90971K07123K33877L02201J0969
37993a995571j42744L35016O90574J57745m64867q0043P43189P44028J04306j12958
37983b1325O0860j44557n16128k81898K24890Q3334m47968m11580N223j04664
37973a553813m59615j1527R33786R98643J31107k57424K58794M85714j62510o55073
37963b91918k02726N03499O35363L97677J68331k14716o29677m08887L75301N73525
37953I05772l02638j118735p35440L88332J042128Q52074K49814l38012n54676
37944C88619j64080L23149l6540j043109j179750J24906J253523O57644p12994
$$ y = [-2625435, -3373491, -3417864, -3440952, -3316688, -2585668, -1821664, -1881129, -2205354, -1587759, -393759, -248634, -1516294, -2786116, -3040712, -2749741, -2542618, -2308741, -2006540, -1995571, -2138315, -1803299, -1112725, -954980, -1419847, -1499890, -756701, -12673, 91633, -21325, 39535, -105022, -621150, -903048, -678158, -594824, -1042792, -1454372, -1449149, -1553813, -2013428, -2024955, -1091169, -92526, 38581, -218843, 39951, 525665, 363155, -291918, -494644, 8855, 644218, 1041895, 1210226, 995510, 365833, -43054, 332247, 905772, 603134, -515601, -1251041, -862709, 179419, 1031493, 1281307, 943295, 388619, 224539, 547688, 511148, -531961, -1711711, -1586805, -333282, 324362, -388632]
37935c88632q43564K58299P99883J89806k62969J58091L94481l15652r33881l94359
37925a338497M77619L05300n20794n15274M23346R18282L98606j86836j73702
37916b11950j09736l53341k58108M14906O41580k23656j129525q89248r997M07000
37906a722075N64589J120366J374993L33433j054053r77060K18065N29787k29795
37897A58250j97275R07630R01316r80634k230824r33978J048534J061385k75084
37888e40680o17554J11974J92777m92049m64374M14749P46644K08786q3391J50506
37878c72612J924n83544n65777J67685N44597K81928J82323L20004m8480o08528
37868f80480k00587Q04275O63356o83908j140705J16124J123480K71223j238576
$$ y = [-388632, -1232196, -973897, -174014, 15792, -247177, -89086, 305395, -10257, -944138, -1338497, -860878, -555578, -1076372, -1591646, -1168300, -250018, 148588, -38248, -211950, -321686, -675027, -933135, -518229, 123351, -100305, -1229830, -2119078, -2129075, -1722075, -1157486, -37120, 1337873, 1671306, 617253, -359807, -141742, 388045, 158250, -39025, 868605, 1769921, 789287, -1441537, -2375515, -1326981, -265596, -540680, -1158234, -1046260, -853483, -1345532, -1809906, -1395157, -648513, -439727, -523118, -372612, -370688, -954232, -1520009, -1352324, -807727, -525799, -343476, -23472, -71952, -680480, -881067, -76792, 586564, -97344, -1238049, -1121925, 1555, 272778, -965798]
37859i65798j546521q16451j54141M30984J236031J483083N31249o34101p40345
37850a176010p4822L97696O33473Q14495L42591q38307j209110J44359J520169
37841E54534R21770o52874p00456P52916J342285L21523n32286k63005j70758
37832A573649j031781j449896l90202P46052L20390q34281p78561N05993J316398
37823b2239Q77083O5445k97433l48642l08878k0036L60164K55549l57334p13094
37813e09415l83588R6409J70193J26101M13088O67957K51580n38383o99711J0816
37803c94953O94797O27883J73846l5279r6780l69078o11290m27807j58686l80203
37793i77550p56778m25479N26689J053655P48046L45052L32222K00081l81144
$$ y = [-965798, -2512319, -3328770, -3482911, -3051927, -1815896, -332813, 198436, -435665, -1176010, -1250832, -853136, -219663, 594832, 937423, 99116, -1109994, -965635, 554534, 1476304, 823430, 122974, 875890, 2218175, 2539698, 2007412, 1744407, 1573649, 541868, -908028, -1298230, -552178, -231788, -1066069, -1844630, -1338637, -22239, 854844, 920289, 622856, 274214, -34664, -54700, 305464, 561013, 203679, -509415, -893003, -796594, -626401, -500300, -87212, 580745, 832325, 293942, -405769, -394953, 299844, 927727, 1101573, 1066294, 969514, 600436, -10854, -438661, -597347, -977550, -1734328, -2159807, -1633118, -579463, 168583, 513635, 845857, 1045938, 664794]
37784F64794p43582l82314J2021l32856q62463n05563N93057J264276R87754L48349
37774A043473p4861l34709n82006o69830m23915J55217Q86451J253075O57519
37765A910414o12869j219652m20506O27018L28691r42864j297173j38761R95179
37756g70523Q08656J5027q2821L82957L62203k76514o06848j20287O04711P51306
37746A067867J61285o74985j110670q21491r3429M25406M66505M26851O43660
37737D90999P02272q272j187168j713605j033762N1169L88527k3903j02641P18595
37727a717789J551578J188152j78587j113939q50986k11324k00052m64329j0006
37718b007282J013218J366204N69332l67166m19533J21683L61901J49544j5139
$$ y = [664794, -78788, -461102, -449081, -781937, -1644400, -2149963, -1556906, -292630, 695124, 1043473, 968612, 633903, 51897, -617933, -1041848, -886631, -180, 1252895, 1910414, 1297545, 77893, -342613, 284405, 613096, -329768, -1626941, -1765702, -770523, 38133, 53160, -29661, 353296, 715499, 438985, -167863, -288150, 316561, 1067867, 1229152, 554167, -556503, -1377994, -1471423, -1046017, -579512, -152661, 490999, 1193271, 1184999, -2169, -1715774, -2749536, -2698367, -2309840, -2333743, -2436384, -1717789, -166211, 1021941, 843354, -270585, -1121571, -1332895, -1532947, -1997276, -2007282, -994064, 372140, 941472, 574306, 154773, 276456, 638357, 787901, 772762]
37709G72762J5811q0120l47274l90049m2980L15091K84203n9055l36394l07586
37699a75591l5195J98357P4882m57624r87990r49644k58340N15096P68173N35360
37689g72516L24429L65407L34533o6403n37268m90262J41167P14445N96614j14140
37679D96006p10945o41238o5820L39909J68407j71512O8794Q46341J104534J39461
37669A573937j192354j415088m24519M46520M38490K53377M67575L63056o15289
37660a04295j326713l92679J408131J919649O65573n95445o34003l30142p27250
37651a17174j080151j81651J359252J714522L97101j088558j228306j51730R07580
37642E30885J063308L78503m81241q39342m76060K24856O04720L02385m09643
$$ y = [772762, 788573, 708453, 361179, -28870, -71850, 243241, 527444, 468389, 131995, -175591, -210786, -12429, 62453, -395171, -1383161, -2332805, -2591145, -2076049, -1307876, -772516, -448087, -82680, 251853, 185450, -351818, -842080, -700913, 13532, 610146, 496006, -214939, -856177, -921997, -582088, -413681, -585193, -516399, 329942, 1434476, 1573937, 381583, -1033505, -1458024, -1011504, -573014, -319637, 147938, 510994, -104295, -1431008, -1823687, -415556, 1504093, 2169666, 1574221, 940218, 610076, -117174, -1197325, -1378976, -19724, 1694798, 2091899, 1003341, -224965, -376695, 530885, 1594193, 1972696, 1491455, 652113, 176053, 400909, 1005629, 1308014, 898371]
37633H98371q08230l95273M24469N98942k25400r30077k75010J145796J435419
37624A869007R2051j143694q28060J18607R1812n66339l41025O77803Q27889k81745
37614E16306r84848k56438O03413J32107q70872o34560P16853J291450K07996
37605G21407j284391j690800j027050k01364L78636Q59346J206190J183414Q36729
37596I82117M17658m3337o00864r51011o84838k0792K89554M991j95254K47516
37586e54260Q01977N97662j15682j69519P11154J218073J95918j570641k190374
37577a075692j057318M86275R71813M66406J6912P6225J82034j6553j56384J63893
37567E7611N74436L22970n88954j192016p51680K15195O27734K89473m9954j2772
$$ y = [898371, 90141, -305132, 119337, 718279, 492879, -437198, -712208, 433588, 1869007, 1961058, 817364, -10696, 107911, 199723, -366616, -707641, -29838, 798051, 516306, -468542, -724980, -121567, 10540, -860332, -1494892, -778039, 513411, 721407, -562984, -2253784, -3280834, -3482198, -3103562, -2244216, -1038026, 145388, 982117, 1399775, 1356438, 755574, -195437, -880275, -901067, -611513, -606522, -801776, -554260, 247717, 845379, 729697, 560178, 1271332, 2489405, 2685323, 1114682, -1075692, -2133010, -1646735, -674922, -208516, -191604, -115379, 66655, 50102, -106282, 57611, 632047, 955017, 366063, -825953, -1577633, -1362438, -734704, -445231, -495185, -507957]
37557e07957p2477m60588n56834J0386N07528K19091k78553n0039N48998M56578
37547a83867j94739k46886M42414O97985N8775m59715k23140n3243n26389o53136
37537a341941M28199J612813J294765r0976p09370j28954K66008l09159r01722
37528A19663n74577J14183J92515j53655l3548O53516J057002N92276l08158p91179
37518H68038o10911l08844l62438m40196Q2778R48303J069899Q8631q50910n43382
37508e9032O13665J223315P65501l6768m84428n78731m89372k42021j5458l2351
37498F64320j27231l3640M5905j65473l28261k1414L51572J85008j49687M3195
37488D64294K94680l34431j245711q42383P33347J416784L85156o31114k17038
$$ y = [-507957, -580434, -1041022, -1597856, -1587470, -1079942, -860851, -1139404, -1189443, -640445, -183867, -378606, -625492, -183078, 514907, 573682, 113967, -109173, -162416, -688805, -1341941, -913742, 699071, 1993836, 1902860, 1193490, 1064536, 1330544, 1021385, 119663, -454914, -340731, -148216, -301871, -335419, 318097, 1375099, 1967375, 1659217, 868038, 257127, -51717, -414155, -854351, -771573, 176730, 1246629, 1335260, 484350, -59032, 554633, 1777948, 2543449, 2506681, 2022253, 1443522, 954150, 712129, 696671, 664320, 537089, 503449, 549354, 383881, 55620, 34206, 385778, 570786, 421099, 464294, 758974, 424543, -821168, -1663551, -930204, 486580, 871736, 240622, 23584]
37479B3584N37435J81044n66107l19798L63745P5380p61871o31919K41831K26279
37469f30397p21794q46467K89273Q62587j62947j176313m80043R51713J018144
37460h96244k53879q90978l8125R44789P15408j64979l22447L77782Q48160M62375
37450G81862k60926p00663r52470j205858j089751l68708K94287K33630K7789
37441c240808O44810J557514J237390k90177j102173k57793P17325L78226k84356
37432f40042K47845J144828N16235j209888j688397l33141Q12585L20516o73612
37423a503071o24651J35292M13150J01153r4196O0922L36060O24281P31713K83558
37413D64211m84742o15701J98794R29036O37057j89936n46857l80097k28169j04957
$$ y = [23584, 561019, 742063, 175956, -143842, 219903, 295283, -466588, -1098507, -856676, -630397, -1352191, -2198658, -1909385, -1046798, -1209745, -2386058, -2866101, -1914388, -896244, -1150123, -2041101, -2079226, -1134437, -419029, -584008, -906455, -528673, 319487, 781862, 520936, -179727, -1132197, -2338055, -3427806, -3796514, -3502227, -3268597, -3240808, -2595998, -1038484, 198906, -91271, -1193444, -1451237, -733912, -355686, -640042, -392197, 752631, 1268866, 58978, -1629419, -1962560, -1149975, -829459, -1503071, -2127722, -1992430, -1579280, -1478127, -1572323, -1511401, -1175341, -551060, 180653, 464211, -20531, -636232, -437438, 491598, 1128655, 938719, 391862, 11765, -216404, -321361]
37403c21361J97885K55431l93189j155725j044463k12962K98301K39722L53414
37394a782947P94999O65493l70433j164144o67892L93601N48277j94380m09799
37385b187225M69195J253516Q53107j09962m38534k30714l80460p47520l23934
37376a842531Q46393J444630Q58241o0767o34147j168958j478471m44234J704153
37367g75691K501484N20507j956398j850025K40036J146919O6291o52514K98184
37358d61207J264964P33682l26327m72460L7039L91971O49333P21020k07858j857348
37348D72809k256829n79199J084122N84090j094096j460168j64924J038143J133684
37339a242368O46136J61136j45583N1713O53046N40599q29668j894999q86329
$$ y = [-321361, -123476, 131955, -261234, -1416959, -2461422, -2674384, -2376083, -2136361, -1782947, -987948, -322455, -692888, -1857032, -2524924, -2131323, -1583046, -1777426, -2187225, -1718030, -464514, 388593, 278631, -159903, -390617, -771077, -1518597, -1842531, -996138, 448492, 1306733, 1245966, 611819, -557139, -2035610, -2479844, -775691, 1725793, 2246300, 289902, -1560123, -1320087, -173168, -106877, -759391, -461207, 803757, 1537439, 1211112, 738652, 775691, 1167662, 1816995, 2538015, 2330157, 472809, -1784020, -2363219, -1279097, -695007, -1789103, -3249271, -3414195, -2376052, -1242368, -596232, -435096, -580679, -528966, 124080, 664679, -164989, -2059988, -2946317]
37330b946317J251611J884118M37256r47899o67189M08549P61078L12097r8546
37321C94758j28046m4509j13273l32975m02146J7887O05890M32565o03994j129633
37311a303476j56831J164382J085870r6084o47413j88783O5268l01359l55871
37302g34297J28063J04924o96038j008736j03893R44218R19831R2850n75653o82163
37292a610894k03530P47644J407175Q16322o13136j225828m11024N27689M34856
37283a30726j41939k61427q0396m7966J41444O94323R10031L35203k55143j13578
37273A049826J94505j12539n52691k17582O39464J038949P07398K7994q06024
37264A969300j549344j491509m31095N11141K22538p28959r09393j13991N30303
$$ y = [-2946317, -1694706, 189412, 626668, -321231, -988420, -579871, 181207, 493304, 394758, 266712, 222203, 108930, -224045, -626191, -608304, -2414, 430151, -173843, -1303476, -1460307, -295925, 789945, 693861, 46448, -142335, -77067, -378426, -734297, -606234, -501310, -1197348, -2206084, -2309977, -1365759, -445928, -353078, -928731, -1610894, -1814424, -1066780, 340395, 1156717, 543581, -682247, -1093271, -565582, -130726, -272665, -534092, -614488, -662454, -521010, 173313, 1083344, 1418547, 1163404, 1049826, 1244331, 1131792, 579101, 361519, 1000983, 2039932, 2747330, 2775324, 1969300, 419956, -1071553, -1502648, -991507, -768969, -1497928, -2407321, -2521312, -1991009]
37255a991009L32262k00845l38993k622L75850L30470j76907n02921L016Q59464
37245a312235Q44625j09656n87553R1656O94369J44625o55383n06843m1647l37037
37235a775079o13798M28808J825241J441247m79992j468980o24092K90382L063
37226i73200m76598r8542M29750K51465j21368j35003l55755j024390j036668
37217c540309K07353J360120J062267N3251k58949j33747n56463r65724q0044
37208b852245J513597J798399L67467r38346p36314K80295Q92170R27088O10477
37199A862588k15410j290070j514119m36910O65279L71645p58853q85675M68305
37190a733220J709640J379753J9095q30583p63905o70953r84353r03898J81324
$$ y = [-1991009, -1658747, -1859592, -2198585, -2201207, -1825357, -1494887, -1671794, -2174715, -2171699, -1312235, -467610, -577266, -1164819, -1073163, -378794, -234169, -889552, -1396395, -1438042, -1775079, -2388877, -1960069, -134828, 1306419, 826427, -642553, -1266645, -976263, -973200, -1449798, -1548340, -1118590, -867125, -988493, -1123496, -1479251, -2503641, -3540309, -3332956, -1972836, -910569, -857318, -1116267, -1250014, -1806477, -2772201, -2852245, -1338648, 459751, 827218, -111128, -847442, -567147, 325023, 1252111, 1862588, 1647178, 357108, -1157011, -1593921, -928642, -556997, -1315850, -2201525, -1733220, -23580, 1356173, 1375268, 544685, -219220, -890173, -1874526, -2778424, -2597100]
37181b597100J376275J310767J00274p67024m93996J30173J94378k7241J00036
37172f73458L13590o542n55179m05716N56894J383749J258495L08896p30706j130944
37162C19079o01972L33592O37836p124o35362l47990L09168K98206j27701N2814
37152B30546O69868N69475k43501m66877J87149M24631k50220n50004J50817L62243
37142A084127r27056j951838o17670J950880K697920Q88983j210364j706999r83276
37133g75293j60565L23303K78274l41788p47286o8399J013623J034746K25635
37124G82250K44230J175037J106272n63618j789745j107267N4525k5347m79503
37115f03166K78342J432366J024442o47728j407705n54916M34457M64497L7753
$$ y = [-2597100, -1220825, 89942, 190216, -576808, -1070804, -940631, -746253, -773494, -673458, -359868, -366410, -921589, -1327305, -770411, 613338, 1871833, 2180729, 1450023, 319079, -282893, 50699, 688535, 681411, 46049, -301941, 7227, 305433, 177732, 230546, 900414, 1469889, 1226388, 759511, 946660, 1371291, 1121071, 571067, 721884, 1084127, 157071, -1794767, -2412437, -461557, 2236363, 3125346, 1914982, 207983, -775293, -935858, -612555, -334281, -676069, -1423355, -1491754, -478131, 556615, 782250, 1026480, 2201517, 3307789, 2744171, 954426, -152841, -98316, -123663, -603166, -324824, 1107542, 2131984, 1484256, 76551, -478365, -43908, 420589, 458342]
37106D58342k14733m27324o17389l77446K26944N89945N19795K81119j38395p24624
37096d23766p67471K01701J187277R29667m3590k53946J89551q6916r70208p71030
37086h08731P16824J432683K37599j238362j178778j77331K05014m8819L6399
37077h23502M90925O06332L20904M2721k76053p20205p31053P226O33626K31616
37067b17463o51932p71828n1202M53398K04336k19609r7781O05033J299005J207104
37057A759061N9479j294258j518149m33405O69104P93307M24435L64881M15455
37048A239910R4152k65081j68123M3497j51216n11444o66514q69424j165615p82176
37038c202034N00187J372943P69239l34022l98763L06980N25265K97210M46264
$$ y = [458342, 243609, -183715, -801104, -1178550, -951606, -361661, 158134, 439253, 300858, -423766, -1191237, -989536, 197741, 1127408, 1083818, 829872, 1019423, 932507, -37701, -808731, -91907, 1340776, 1578375, 340013, -838765, -1016096, -811082, -859901, -823502, -332577, 273755, 594659, 637380, 361327, -358878, -1089931, -1082705, -449079, -217463, -869395, -1641223, -1692425, -1239027, -1034691, -1254300, -1352081, -747048, 551957, 1759061, 1818540, 524282, -993867, -1427272, -758168, 35139, 459574, 824455, 1239910, 1334062, 1068981, 900858, 944355, 793139, 281695, -384819, -1254243, -2419858, -3202034, -2701847, -1328904, -559665, -893687, -1292450, -985470, -460205, -162995, 283269]
37029B83269N25643m12357j452566p79840J031220J371533l12988j464613m11451
37020a622150J094100Q29460n33839r12344r0497N18626L95850K42194L07001
37011B28401J19168l01807l82153r9128j8692k58490l66917j89962o194J43013
37001a132761M45569O67227K96920n70822j172905j048826n37544j38722J71064
36992c020800P22561J475212J806550J099544l78630j368970q42089O28816J303649
36983A425843L68154j019092j293301n23982l9505l13861l43252N98574J578332
36974D37910J195347l30862j286232p43409K40143K35434n18640o55150J26680
36965a298779O51823K03007l67994p4995O62832P96070K40914k44396k66754O843
$$ y = [283269, 808912, 396555, -1056011, -1835851, -804631, 566902, 253914, -1210699, -1622150, -528050, 301410, -232429, -1144773, -1235270, -716644, -320794, -78600, 228401, 347569, 45762, -336391, -435519, -454211, -712701, -1079618, -1269580, -1275774, -1132761, -687192, -19965, 276955, -293867, -1466772, -2515598, -3053142, -3191864, -3020800, -2298239, -823027, 983523, 2083067, 1704437, 335467, -506622, 122194, 1425843, 1793997, 774905, -518396, -1042378, -1081883, -1395744, -1738996, -1140422, 437910, 1633257, 1302395, 16163, -727246, -487103, -251669, -770309, -1425459, -1298779, -646956, -443949, -811943, -886938, -224106, 571964, 812878, 568482, 301728, 308571]
36955C08571M01009O27972J58517q81265j292552l77933P07861N06566m65981
36946c07235o11966Q0763K20585l51263l20616N04357O74861k01687n50867L77987
36936d85081J052862L76366k85086L80160J010162k04168k116545k100566j48785
36927b520681J148731N16606n77057o36549p8830J59384J63710L69848O31644
36918h23194O71097N22637J17190o63237j283215r39301J03681O41039K75231
36909a378072r7582J00025K51566j47198m86391j44753M05268N13198N33180J041090
36899E90331J487215Q14675q03689j929298j644178n27651L63093P56695R73739
36890H0932R90294M19659n79347j063164m50015M69950L90998o98377j400560
$$ y = [308571, 709580, 1337552, 1496069, 614804, -677748, -1055681, -347820, 158746, -307235, -919201, -838438, -617853, -969116, -1289732, -785375, -110514, -312201, -863068, -485081, 567781, 944147, 659061, 1039221, 2049383, 1845215, -271330, -2371896, -2520681, -1371950, -855344, -1432401, -2068950, -2147780, -1988396, -1824686, -1454838, -823194, -152097, 370540, 487730, -175507, -1458722, -2398023, -2294342, -1653303, -1378072, -1475654, -1375629, -1124063, -1271261, -1757652, -1902405, -1497137, -983939, -450759, 590331, 2077546, 2892221, 2088532, 159234, -1484944, -2012595, -1649502, -892807, 80932, 1071226, 1490885, 911538, -151626, -601641, -131691, 259307, -439070, -1839630]
36881a839630q39888K00092O20197N67036P34795Q98190M14977k88840j99566
36872B67363M53166L56594p11207j342167o14878N76108R85689O51948K64835
36863H87451p0580m94652o26748j38110M57121M52650n4476n30938q42553j004242
36853a965077o92758J44145P31789M48193j05327J1439N56562N79828R8284K5726
36843a67196M84737N14155k59796q66014m58518M21336P64636N61994N37003Q36990
36833B369327Q33263J64174o94807j070671q66840m40426J8371N92992J150684
36824B056067J194622N08423l52957o78442n19843m28342m35731j11728L60301
36815A592370K10306n17271p46786j63766J5142r28331j631310o00458J196775
$$ y = [-1839630, -2679518, -2479426, -1859229, -1292193, -557398, 340792, 755769, 466929, 267363, 720529, 1077123, 365916, -976251, -1591129, -1015021, -29332, 622616, 887451, 816871, 322219, -304529, -442639, 14482, 467132, 412656, -118282, -960835, -1965077, -2657835, -2513690, -1781901, -1333708, -1439035, -1427596, -871034, -291206, -192922, -167196, 317541, 831696, 571900, -294114, -752632, -331296, 433340, 995334, 1532337, 2369327, 3202590, 3366764, 2671957, 1601286, 734446, 294020, 312391, 905383, 2056067, 3250689, 3759112, 3406155, 2727713, 2207870, 1779528, 1343797, 1232069, 1592370, 1802676, 1285405, 538619, 374853, 389995, -538336, -2169646, -2770104, -1573329]
36806a573329J582357M85331j14692M92503P47058l16651j345758r22211J87655
36797g77737M41648j02078l03636P1690L48689L39632M07036M76814J39321m67101
36787E74278p75035n74178j1050P65328J307143Q68940m54954j280549o38247
36778b18324N02624N54941l95084q94261l32941M65267O72800K85551l36868p12588
36768d08883k81980P67144J164767K00636q96302o22714M27207O11869M8171J80665
36758A190580Q78137M99370r85746j578034n63048L12785j07766o61033l41156
36749a355911k7597k96263J3492J266834J527490k09345j590009l60584J770746
36740G38853J749188j9921q04406k02615o6050n76302j95527P45745K84802j141408
$$ y = [-1573329, 9028, 494359, 379667, 872170, 1619228, 1302577, -43181, -965392, -777737, -336089, -438167, -741803, -670113, -321424, 18208, 425244, 902058, 1041379, 574278, -200757, -774935, -785985, -20657, 1286486, 2155426, 1700472, 419923, -218324, 284300, 839241, 444157, -450104, -783045, -317778, 355022, 640573, 303705, -408883, -690863, 76281, 1241048, 1441684, 545382, -77332, 349875, 961744, 1009915, 1190580, 2068717, 2568087, 1582341, 4307, -558741, -245956, -353722, -1014755, -1355911, -1383508, -1679771, -1666279, -399445, 1128045, 918700, -671309, -1031893, 738853, 2488041, 2468120, 1663714, 1461099, 1395049, 818747, 623220, 1368965, 1653767, 512359]
36730E12359q33344J262349J758210o36623k608772j408870R11179J180557J10322
36721B47367K99453J413358J049196p65680j564005o06660J85421k70601o35000
36712f47151J84860J122985Q56866m8719j50896P13665J359526Q80401l70381
36703C901156j279641j150884l98341L3638m5507Q8213O95121Q78002k6585j153887
36693A541285j225875l81701K17511J70770M6394J14794P9212p1072n3980k7673
36683D09665k89019m46265j7557M14134j0154o72172j30884J355346J724638J04125
36673B441857j721261j775750m99411K56262j65618q66650r91565n00809L15784
36664c507161J096637J347049Q96365K75657N1773N7577j15588k37253J49371
$$ y = [512359, -320985, 941364, 2699574, 2062951, -545821, -1954691, -1043512, 137045, 247367, 546820, 1960178, 3009374, 2243694, 679689, 73029, 258450, -12151, -647151, -462291, 660694, 1517560, 1468841, 1317945, 2031610, 3391136, 4271537, 3901156, 2621515, 1470631, 1072290, 1105928, 1060421, 1148634, 1843755, 2721757, 2695172, 1541285, 315410, -66291, 151220, 321990, 368384, 483178, 562390, 491318, 437338, 409665, 120646, -325619, -343176, 70958, 60804, -611368, -742252, 613094, 2337732, 2441857, 720596, -1055154, -1554565, -1298303, -1463921, -2330571, -3322136, -3822945, -3507161, -2410524, -1063475, -167110, 108547, 160320, 217897, 102309, -134944, 14427]
36655A4427O82290M88080m29189r94126n39333K53000L48937k34271o15953l55542
$$ y = [14427, 696717, 1184797, 755608, -238518, -777851, -524851, -175914, -410185, -1026138, -1381680]
$$ [...]
##END NTUPLES=NMR SPECTRUM
##END=
