##TITLE=31Pdec_1BBPA2001
 aceton-d6, 64 sc
 20.1.2023
##JCAMPDX= 6.0         $$ Bruker NMR JCAMP-DX V2.0
##DATA TYPE= NMR SPECTRUM
##DATA CLASS= NTUPLES
##ORIGIN= UXNMR, Bruker Analytische Messtechnik GmbH
##OWNER= root
$$ XWIN-NMR		Version 3.5
$$ Fri Jan 20 15:47:12 2023 Russian Standard Time (UT+4h)  she@DPX200
##.OBSERVE FREQUENCY= 81.013821
##.OBSERVE NUCLEUS= ^31P
##.ACQUISITION MODE= SIMULTANEOUS
##.ACQUISITION SCHEME= undefined
##.AVERAGES= 64
##.DIGITISER RES= 16
##SPECTROMETER/DATA SYSTEM= spect
##.PULSE SEQUENCE= zgpg30
##.SOLVENT NAME= Acetone
##.SHIFT REFERENCE= (INTERNAL, Acetone, 0, 248.564)
##AUDIT TRAIL= $$ (NUMBER, WHEN, WHO, WHERE, WHAT)
$$ ##TITLE= Audit trail, XWIN-NMR		Version 3.5
$$ ##JCAMPDX= 5.01
$$ ##ORIGIN= Bruker BioSpin GmbH
$$ ##OWNER= she
$$ F:/spectra/data/she/nmr/P31/1/pdata/1/auditp.txt
$$ ##AUDIT TRAIL=  $$ (NUMBER, WHEN, WHO, WHERE, WHAT)
(   1,<2023-01-20 15:45:47.82 +0400>,<she>,<DPX200>,
      <continue with go, POWCHK disabled, PULCHK disabled
       configuration hash MD5:
       00 E9 B6 7A A2 85 ED C7 34 08 36 98 17 FE 4E 26
       data hash MD5: 32K
       4C E2 25 54 97 C5 85 A6 31 E3 62 32 33 89 A9 1E>)
(   2,<2023-01-20 15:45:51.92 +0400>,<she>,<DPX200>,
      <Start of raw data processing
       efp BC_mod = 2 LB = 1 FT_mod = 6 PKNL = 1 PHC0 = -10960.37 PHC1 = 87.65779 SI = 64K 
       data hash MD5: 64K
       BB B4 BF B5 8E CB B8 CD 20 D8 AC D6 2B 31 70 51>)
(   3,<2023-01-20 15:46:09.50 +0400>,<she>,<DPX200>,
      <pk PHC0 = -15.72722 PHC1 = 7.599999 
       data hash MD5: 64K
       53 54 C6 5E F7 C6 48 1B BE B1 B1 75 F2 08 7C CC>)
(   4,<2023-01-20 15:46:14.14 +0400>,<she>,<DPX200>,
      <abs ABSG = 5 
       data hash MD5: 64K
       C0 E8 AD 2D 2B 4C E5 62 97 84 03 E4 8E CC C1 99>)
(   5,<2023-01-20 15:46:38.31 +0400>,<she>,<DPX200>,
      <pk PHC0 = -48.19657 PHC1 = 96.59998 
       data hash MD5: 64K
       04 D0 E3 DD 9C 73 C5 C3 19 CA 78 3A B0 2D E6 3A>)
(   6,<2023-01-20 15:46:43.75 +0400>,<she>,<DPX200>,
      <abs ABSG = 5 
       data hash MD5: 64K
       D1 5B 82 B9 7E 64 94 90 A4 C3 85 C6 70 40 05 16>)
$$ ##END=
$$ 
$$ hash MD5
$$ 1B C3 CF CD F6 A1 0C 98 A8 2D 43 74 0D 70 05 D0
##$RELAX= 
##$RELAX= 
##$RELAX= 
##$RELAX= 
##$RELAX= 
##$RELAX= 
##$RELAX= 
##$RELAX= 
##$RELAX= 
$$ Bruker specific parameters
$$ --------------------------
##$DU= <F:/spectra>
##$EXPNO= 1
##$NAME= <P31>
##$PROCNO= 1
##$TYPE= <nmr>
##$USER= <she>
##$AMP= (0..31)
100 100 100 100 100 100 100 100 100 100 100 100 100 100 100 100 100 100 
100 100 100 100 100 100 100 100 100 100 100 100 100 100 
##$AQSEQ= 0
##$AQ_mod= 1
##$AUNM= <au_zg>
##$AUTOPOS= <>
##$BF1= 81.014009
##$BF2= 200.13
##$BF3= 200.13
##$BF4= 200.13
##$BF5= 200.13
##$BF6= 200.13
##$BF7= 200.13
##$BF8= 200.13
##$BYTORDA= 1
##$CFDGTYP= 0
##$CFRGTYP= 5
##$CHEMSTR= <none>
##$CNST= (0..31)
1 1 145 1 1 1 1 1 1 1 1 1 1 1 1 1 1 1 1 1 1 1 1 1 1 1 1 1 1 1 1 1 
##$CPDPRG= <waltz16>
##$CPDPRG1= <>
##$CPDPRG2= <waltz16>
##$CPDPRG3= <>
##$CPDPRG4= <mlev>
$$ [...]
##$SUBNAM3= <"">
##$SUBNAM4= <"">
##$SUBNAM5= <"">
##$SUBNAM6= <"">
##$SUBNAM7= <"">
##$SUBNAM8= <"">
##$SUBNAM9= <"">
##$SW= 501.771253377433
##$SWIBOX= (0..15)
0 1 3 0 0 0 0 0 0 0 0 0 0 0 0 0 
##$SW_h= 40650.406504065
##$TD= 32768
##$TD0= 1
##$TE= 0
##$TE2= 300
##$TE3= 300
##$TEG= 300
##$TL= (0..7)
0 120 53 12 22 120 120 120 
##$TP= (0..7)
150 150 150 150 150 150 150 150 
##$TP07= 0
##$TPNAME0= <>
##$TPNAME1= <>
##$TPNAME2= <>
##$TPNAME3= <>
##$TPNAME4= <>
##$TPNAME5= <>
##$TPNAME6= <>
##$TPNAME7= <>
##$TPOAL= (0..7)
0.5 0.5 0.5 0.5 0.5 0.5 0.5 0.5 
##$TPOFFS= (0..7)
0 0 0 0 0 0 0 0 
##$TUNHIN= 0
##$TUNHOUT= 0
##$TUNXOUT= 0
##$USERA1= <user>
##$USERA2= <user>
##$USERA3= <user>
##$USERA4= <user>
##$USERA5= <user>
##$V9= 5
##$VALIST= <valist>
##$VCLIST= <CCCCCCCCCCCCCCC>
##$VD= 0
##$VDLIST= <DDDDDDDDDDDDDDD>
##$VPLIST= <PPPPPPPPPPPPPPP>
##$VTLIST= <TTTTTTTTTTTTTTT>
##$WBST= 1024
##$WBSW= 4
##$XGAIN= (0..3)
0 0 0 0 
##$XL= 0
##$YL= 0
##$YMAX_a= 1958
##$YMIN_a= -3974
##$ZGOPTNS= <>
##$ZL1= 120
##$ZL2= 120
##$ZL3= 120
##$ZL4= 120
##$ABSF1= 248.5645
##$ABSF2= -253.2056
##$ABSG= 5
##$ABSL= 3
##$ALPHA= 0
##$AQORDER= 0
##$ASSFAC= 0
##$ASSFACI= 0
##$ASSFACX= 0
##$ASSWID= 0
##$AUNMP= <proc_1d>
##$AZFE= 0.1
##$AZFW= 0.5
##$BCFW= 0
##$BC_mod= 2
##$BYTORDP= 0
##$COROFFS= 0
##$CY= -3
##$DATMOD= 1
##$DC= 0
##$DFILT= <>
##$DTYPP= 0
##$F1P= 0
##$F2P= 0
##$FCOR= 1
##$FTSIZE= 65536
##$FT_mod= 6
##$GAMMA= 0
##$GB= 0
##$INTBC= 1
##$INTSCL= 6.047779e-11
##$ISEN= 30
##$LB= 1
##$LEV0= 0
##$LPBIN= 0
##$MAXI= 10000
##$MC2= 0
##$MEAN= 0
##$ME_mod= 0
##$MI= 50
##$NCOEF= 0
##$NC_proc= -10
##$NLEV= 6
##$NOISF1= 182.463
##$NOISF2= 159.3651
##$NSP= 0
##$NTH_PI= 0
##$NZP= 0
##$OFFSET= 248.5645
##$PC= 4
##$PHC0= -11024.3
##$PHC1= 191.8578
##$PH_mod= 1
##$PKNL= yes
##$PPARMOD= 0
##$PSCAL= 0
##$PSIGN= 0
##$REVERSE= no
##$SF= 81.0140089999694
##$SI= 65536
##$SIGF1= 159.3651
##$SIGF2= -187.1042
##$SINO= 113.3802
##$SIOLD= 16384
##$SREGLST= <1H.CDCl3>
##$SSB= 0
##$STSI= 65536
##$STSR= 0
##$SW_p= 40650.406504065
##$SYMM= 0
##$S_DEV= 0
##$TDeff= 32768
##$TDoff= 0
##$TI= <>
##$TILT= no
##$TM1= 0
##$TM2= 0
##$TOPLEV= 0
##$USERP1= <user>
##$USERP2= <user>
##$USERP3= <user>
##$USERP4= <user>
##$USERP5= <user>
##$WDW= 1
##$XDIM= 65536
##$YMAX_p= 415836346
##$YMIN_p= -427439557
$$ End of Bruker specific parameters
$$ ---------------------------------
##NTUPLES= NMR SPECTRUM
##VAR_NAME=  FREQUENCY,     SPECTRUM/REAL,   SPECTRUM/IMAG
##SYMBOL=    X,             R,               I
##VAR_TYPE=  INDEPENDENT,   DEPENDENT,       DEPENDENT
##VAR_FORM=  AFFN,          ASDF,            ASDF
##VAR_DIM=   65536,         65536,           65536
##UNITS=     HZ,            ARBITRARY UNITS, ARBITRARY UNITS
##FACTOR=    0.620285442955139, 1,           1
##FIRST=     20137.2065510682, 0,            0
##LAST=      -20513.1999529968, 0,           0
##MIN=       -20513.1999529968, -427439557,  0
##MAX=       20137.2065510682, 415836346,    0
$$ Real data points
##PAGE= N=1
##DATA TABLE= (X++(R..R)), XYDATA
$$ [...]
12143b476692m157561r991282J7356074L8657170J2023262l2033931l2545851
12136a3168811R974296L8627503K5706452N58625p750937p197688j2088420j5370531
12128A9290489p865171L189026Q920088J0320519O350554o982416j8892092j0355361
12120C975636J2788967J9716014k44202j8746414j0787414R211338J3809990K556739
12112C2280654p916679j4505464k1505651j8846998L624111K8282398K6050908
12105B7463279r35862j9743969j1816351O423479J2931777P434154O02908m988990
12097A7370425j0467812j0419979m55994J1941174J4818498O714817k568233l394233
12089B3538663N770106J8191698K2945624J3390508m207733j4635553j1305937
$$ plain form
12143 -2476692 -6634253 -16625535 730539 39387709 51410971 19377040 -13168811
12136 -13168811 -3194515 35432988 61139440 61698065 53947128 46749440 34661020 19290489
12128 19290489 11425318 14614344 23534432 33854951 40205505 33223089 14330997 3975636
12120 3975636 16764603 36480617 36236415 17490001 6702587 15913925 29723915 32280654
12112 32280654 24363975 9858511 -11647140 -30494138 -26870027 1412371 27463279
12105 27463279 26527417 6783448 -5032903 1390576 14322353 21756507 22359415 17370425
12097 17370425 6902613 -3517366 -3973360 7967814 22786312 29501129 26932896 23538663
12089 23538663 29308769 47500467 70446091 83836599 79628866 64993313 53687376
12082E3687376n698013j1759411k3656928k0873168J200641J9149860J1919077
12075B3969434p252857r386137M484436M284339j6704426k4187737J533281K5252440
12067A992773R229013j9646160o729297L7954606M5965501l159455m5126446k7552643
12059g072108J3862477J8396606p464938j5295409P60384N672304p524510j1098206
12051i763400o89528l233756k1213339k0642747J1140140L9509787L3506703Q003300
12043C6617160m793599J368732J0037657P329214r808155l2691007m0349967j8850319
12035e1140284J4555450K7867898J6787817O017796P613103Q250379J438996j024931
12027C0366224K702836j519439j2216120r202820P096801J0016331o252817j3028789
$$ plain form
12082 53687376 47989363 36229952 12573024 -8300144 -7099503 12050357 23969434
12075 23969434 16716577 7330440 11814876 16099215 -605211 -24792948 -23259667 1992773
12067 1992773 11221786 -8424374 -15153671 22800935 68766436 65606981 20480535 -7072108
12059 -7072108 6790369 25186975 17722037 2426628 3187012 8859316 1334806 -9763400
12051 -9763400 -10452928 -13686684 -34900023 -55542770 -44402630 -4892843 28613860 36617160
12043 36617160 31823561 33192293 43229950 50559164 40751009 8060002 -32289965 -51140284
12035 -51140284 -36584834 -8716936 8070881 14088677 21701780 29952159 31391155 30366224
12027 30366224 33069060 31549621 19333501 10130681 17227482 27243813 20990996 7962207
12019G962207K314190J3360234L881134k969667P829720J0677590j0781552k4953273
12011G320583o324351J3155645k279724k5050555j0798434J9942985J6459276
12004A2425425q571559M97642L6874756L2080690k7014107o5876624l6395071
11997e5978848J2235191J9295266K645652Q013227K3095856Q906656k0594663
11990b381663k1015253J366682J203892k1212459j6949863K3229994M4799709
11983I041039J6202725j9039815j1771111J8788214K3938478K727806r338354
11976C0548982n681903r366898j8335614m525983K7901632L4887141L50908l2245964
11968B3532301k2435199Q774292J5135385o993999k2931647j4609601L998877
$$ plain form
12019 7962207 10276397 23636631 27517765 24548098 32377818 43055408 32273856 7320583
12011 7320583 996232 14151877 11872153 -13178402 -23976836 -4033851 12425425
12004 12425425 3853866 4351508 41226264 73306954 46292847 -19583777 -55978848
11997 -55978848 -43743657 -24448391 -21802739 -13789512 9306344 18213000 -2381663
11990 -2381663 -23396916 -22030234 -20826342 -42038801 -58988664 -35758670 9041039
11983 9041039 25243764 6203949 -5567162 13221052 37159530 39887336 30548982
11976 30548982 24867079 15500181 -2835433 -7361416 20540216 55427357 55778265 23532301
11968 23532301 1097102 9871394 25006779 18012780 -4918867 -19528468 -15529591
11961a5529591J6751538J9148814Q824405r498553j6273645j722696J0559735
11954A2260007n055474l0578174k6327207O865069K7629741J6512675k997590
11947a690953j0304226j1584474r209677P670103K7679101J8401536j6779457
11940D181953k9676991j649539K1107060K832978j8744513M675015M4418761L3577069
11932F0721793k6753092o5284406m2793779J765578J7771145O183676l629404
11925e2018489k896764k923801o524407m187826P327105J7279425J3784916M35978
11917b9723863m969142O140858J7221506R239040o410702k997259J5107807J6128739
11909A9736984l157517p858699J2706574K0596161m838724k5012516o593828J7327157
$$ plain form
11961 -15529591 1221947 20370761 29195166 19696613 3422968 1700272 12260007
11954 12260007 7204533 -23373641 -49700848 -42835779 -15206038 1306637 -1690953
11947 -1690953 -11995179 -23579653 -32789330 -25119227 2559874 20961410 4181953
11940 4181953 -25495038 -27144577 -6037517 -3204539 -21949052 -17274037 27144724 60721793
11932 60721793 33968701 -31315705 -74109484 -72343906 -54572761 -48389085 -52018489
11925 -52018489 -54915253 -57839054 -64363461 -68551287 -61224182 -43944757 -30159841 -29723863
11917 -29723863 -34693005 -28552147 -11330641 -2091601 -8502303 -11499562 3608245 19736984
11909 19736984 16579467 8720768 21427342 42023503 37184779 12172263 5578435 22905592
11901B2905592K477842k8700806k5167740N799755J5362308k720240j1507813
11894b1551102k710459k402948j0356753K17019K2121543J8320649q609058j4891895
11886a9863004P963036J8372081l03156j2510701J914047J1655692q816366l6252631
11878c7841002l9034364j8728063Q478784L2197483L6900139J3111250j2104644
11871a7020417k691011K4700583K2299214l825803n95863L1580941K8716442k1771120
11863F1392966m5565669m830287L0389132l225351n4210221m0794828J8614144
11856c8230114M4938355K3356835K489502n62513j0370215k5745440j9265876
11849b3389466L115552Q142107l961107k838003J3420644J6684994P81418j3037164
$$ plain form
11901 22905592 25383434 -3317372 -28485112 -22685357 -7323049 -10043289 -21551102
11894 -21551102 -24261561 -26664509 -37021262 -36804243 -14682700 3637949 -4971109 -19863004
11886 -19863004 -11899968 6472113 6168957 -6341744 -4427697 7227995 -1588371 -37841002
11878 -37841002 -76875366 -95603429 -87124645 -54927162 -18027023 -4915773 -17020417
11871 -17020417 -19711428 4989155 27288369 23462566 22866703 54447644 83164086 61392966
11863 61392966 15827297 10997010 41386142 38160791 -16049430 -56844258 -38230114
11856 -38230114 6708241 30065076 32554578 31992065 21621850 -4123590 -23389466
11849 -23389466 -20273914 -12131807 -16092914 -18930917 -5510273 11174721 11956139 -1081025
11841a081025j6019044j4475934m123330J6991587K7014103J3249321L021795
11834B4577473J6542450K0328831j6100808n0180612k3604397L5726268M8755435
11827E6044640P457311k1746513j1190969j280353j1024575p943892J3679169
11820B3994818R244584l1152560n1393603k0565450J4475867J0360115l650348
11813d8686577J2431737L4922799K1343233j3193164k3005543o148497K375898
11806a9960114p429997j3595187o324951J115092R03572L96180O421742J8048393
11798b0425270K7735206K0424862j1264721m2785862l5078039J0039626M1588249
11791i765949K6078385o991262j0799865J4555844L2401541K3360687J37730j7051914
$$ plain form
11841 -1081025 -17100069 -31576003 -35699333 -18707746 8306357 21555678 24577473
11834 24577473 41119923 61448754 45347946 -4832666 -28437063 7289205 56044640
11827 56044640 63501951 41755438 30564469 29284116 18259541 10315649 23994818
11820 23994818 33239402 2086842 -49306761 -69872211 -55396344 -45036229 -48686577
11813 -48686577 -36254840 -1332041 20011192 6818028 -16187515 -22336012 -19960114
11806 -19960114 -27390111 -40985298 -47310249 -46195157 -45291585 -44895405 -38473663 -20425270
11798 -20425270 7309936 27734798 16470077 -26315785 -61393824 -51354198 -9765949
11791 -9765949 16312436 9321174 -1478691 13077153 45478694 68839381 68977111 51925197
11783E1925197j6312506J342692J5275929L68647l4522365m5753875j2893095
11776d0569376K7089967K9570273K909825j2105066m342369K721570k347729m597084
11768a669989M857028J2879353P309948n497913j2932159j1799985o925731k972955
11760a6752403l54644M022567R999912Q999844m881792j8843815j2398181J1441549
11752a8766963K4448045J1135826r871205j3810935j795274Q709952R973252N836341
11744A5859039O5105l519733J27657P699101Q180293J430662J797395J4016369
11736D5655888K1383568R276049j3973657l0554034l4039891k8086559j8725332
11729d9063968j4757320j9339187j6651850J1327213M9328899N7775282K8103071
$$ plain form
11783 51925197 35612691 36955383 52231312 52599959 18077594 -27676281 -40569376
11776 -40569376 -13479409 16090864 19000689 6895623 2553254 5274824 2927095 -1669989
11768 -1669989 3187039 16066392 23376340 17878427 4946268 -6853717 -13779448 -16752403
11760 -16752403 -17107047 -13084480 -3084568 5915276 1033484 -17810331 -30208512 -18766963
11752 -18766963 5681082 16816908 6945703 -6865232 -8660506 49446 10022698 15859039
11744 15859039 15924144 12404411 12532068 20231169 28411462 29842124 31639519 45655888
11736 45655888 67039456 76315505 62341848 31787814 -2252077 -30338636 -49063968
11729 -49063968 -63821288 -83160475 -99812325 -88485112 -39156213 18619069 46722140
11722D6722140j088657k79367R021937o876046l9179303n1036073k9897004K242449
11714g0369924K0031396J4998038m041076j4381113J770226K8066545K5347844
11707A421936j1371292l5279271j1830284K8536807L5621546J2249457j01381
11700A9247518Q821785J0234058o326529j4632749P49478J6468118N919656k2474288
11692A8007047l8325860k5727558M011280K6495139K5541471P264947n545022
11685A1721444K050381K0670883K8395085J3250452j8336478m5877001m6681020
11678c4806254j8267022J0163604Q726098j0050358p234375K0033607L0410752
11671a023948O191690j4346200N37674K2786407J2332434j6422406k1331516k1355
$$ plain form
11722 46722140 45633483 45354116 54376053 47500007 8320704 -42715369 -72612373 -70369924
11714 -70369924 -50338528 -35340490 -39381566 -53762679 -51992453 -23925908 1421936
11707 1421936 -9949356 -45228627 -57058911 -28522104 7099442 19348899 19247518
11700 19247518 28069303 38303361 31976832 17344083 18093561 34561679 40481335 18007047
11692 18007047 -20318813 -46046371 -42035091 -15539952 10001519 17266466 11721444
11685 11721444 13771825 34442708 62837793 76088245 57751767 11874766 -34806254
11678 -34806254 -53073276 -42909672 -34183574 -44233932 -51468307 -31434700 -1023948
11671 -1023948 5167742 -9178458 -8640784 14145623 26478057 10055651 -11275865 -11297220
11663a1297220J6103050J5968690J0935509o68668k4079099l6439229j2767380
11656d2244347K5309602L3437597R908101q481703p617760m417607j410027J3422247
11648A7906103K4443073L296479l1097610k7345133J3643860L0405906l075461
11641B8177217l4320446j6654251J8977549J9412284p135386j2959500J0802050
11634F299517K6717670J0653711k0557170l8227835l0744402m920364K1330363
11627b9448510K8891441J3754780q140152j8945152j6109156q386493m059445
11620d2442687n609218o500303N273853K8475887L9697177K1679947o139001j0064167
11612B4371488R131934J8765616M981486j0540754r508768k284731m642913j4176270
$$ plain form
11663 -11297220 4805830 20774520 31710029 31041361 6962262 -29476967 -42244347
11656 -42244347 -16934745 16502852 26410953 17929250 10311490 5893883 4483856 17906103
11648 17906103 42349176 45645655 14548045 -12797088 846772 31252678 28177217
11641 28177217 -6143229 -22797480 -3819931 15592353 8456967 -4502533 6299517
11634 6299517 33017187 43670898 23113728 -15114107 -45858509 -50778873 -29448510
11627 -29448510 -557069 13197711 5057559 -13887593 -29996749 -38383242 -42442687
11620 -42442687 -48051905 -54552208 -49278355 -20802468 18894709 40574656 34435655 24371488
11612 24371488 33503422 52269038 57250524 46709770 37201002 34916271 30273358 16097088
11604A6097088j9300008j3027667N143886K3522238K0020973p885501k6510426
11597a939417r105391J9540588K0756489O741819J5140242L2944967J3236844
11590I7316141l3924116m3786536l723271K1038117l565553k4320032K765759
11583A1800509L3222733J0578623l7670989m7209901j5591824J1329424J6499824
11576a7041601J3340080Q39281k2654491k7315032P855364M6596359M3381032
11569D5000992J4208797J983520L02039k1472024m2772306j8940781K9567241
11562G877478L5700535o835733l3137012j3666016M613485j4977611l9623363
11555f0048237k6544576J2799276M1050191M4599007K7194962o660664l6138867
$$ plain form
11604 16097088 -3202920 -16230587 -11086701 12435537 32456510 24571009 -1939417
11597 -1939417 -11044808 8495780 29252269 35994088 51134330 84079297 97316141
11590 97316141 63392025 19605489 15882218 36920335 33354782 9034750 11800509
11583 11800509 45023242 55601865 17930876 -29279025 -44870849 -33541425 -17041601
11576 -17041601 -3701521 -2862240 -25516731 -52831763 -44976399 1619960 45000992
11569 45000992 59209789 61193309 61495348 40023324 -2748982 -21689763 7877478
11562 7877478 43578013 36742280 3605268 -10060748 -5447263 -20424874 -60048237
11555 -60048237 -86592813 -73793537 -32743346 11855661 39050623 32389959 -3748908
11548c748908k9117511J0933539L6143711J7024483j6947107k3757151n826331
11541a5295275O537850L506020j251158P31318N829640J0032656J0199178J892941
11533B2183170j3289153k6385882l1326797k6616615r300027J7005138L3250943
11526c4479223K5499643R077119P625498J5076606Q670621p368837q697921K023491
11518A7426997k336561k1416380k3619932k734044Q477981m501611j3839477k232140
11510d4775167O219849n726284j2635068Q571061L4989998L4704461J6517552
11503C7866402P459173P475797J761563m954924j137952M097148j700667q139798
11495D2726742l310261j350378j6731512l0084113j4339922J9899306L8774534
$$ plain form
11548 -3748908 -32866419 -21932880 14210831 31235314 14288207 -9468944 -15295275
11541 -15295275 -8757425 -5251405 -6502563 -5771245 58395 10091051 20290229 22183170
11533 22183170 8894017 -17491865 -48818662 -75435277 -84735304 -67730166 -34479223
11526 -34479223 -8979580 97539 7723037 22799643 31470264 24101427 15403506 17426997
11518 17426997 15090436 -6325944 -29945876 -32679920 -24201939 -28703550 -42543027 -44775167
11510 -44775167 -38555318 -44281602 -56916670 -48345609 -13355611 21348850 37866402
11503 37866402 45325575 52801372 54562935 49608011 48470059 52567207 50866540 42726742
11495 42726742 39416481 38066103 21334591 -8749522 -23089444 -3190138 35584396
11488C5584396L2545198J7048784O93432j7313308k6699912j7169771k161204
11481B2527615j987794j1907596j5169495j5466790k4053288k7158584m497901
11474g7713833K7681087L3246567J3526423N729191K0691998K5608583J094224
11467D9864240k4890801k1298370k28143O630367m431118j0984295r46309J5156362
11459H871933K2579676J7116125M593995m563690m113403j047570q914586k6340550
11451H181930l1662471r332047K4222085L4305132R632015j9802473j5757464
11444b13293J9635542M0852858J2789193m1993431o6176211l5331796J6424898
11437e4012240M1403812K8277410j194233k3582305k6287041o709244K1013184
$$ plain form
11488 35584396 68129594 85178378 85871810 68558502 41858590 24688819 22527615
11481 22527615 20539821 8632225 -6537270 -22004060 -46057348 -73215932 -77713833
11474 -77713833 -50032746 -16786179 -3259756 2469435 23161433 48770016 49864240
11467 49864240 24973439 3675069 3446926 10077293 5646175 -5338120 -6284429 8871933
11459 8871933 31451609 48567734 53161729 48598039 44484636 43437066 34522480 8181930
11451 8181930 -23480541 -32812588 -8590503 25714629 35346644 15544171 -213293
11444 -213293 19422249 60275107 73064300 31070869 -35105342 -70437138 -54012240
11437 -54012240 -12608428 15668982 14474749 -9107556 -35394597 -42103841 -21090657
11430b1090657L0484613J2948170p668801o889337N734714N207865p628420r893719
11422A204428M111182J5201943J1386778K071956m611755j4965734k9877531l1313010
11414d6791743n544743K9052037L5398441L044186l1021187k0857392K8414458
11407h305943N7840060K6994095k8668001m2810854r529861J4299187N52050j0058113
11399C12620J7161530M8305926L6207231k275741j7696989q401113j1114587k8829236
11391C3669641k9315774q853816L090753L585072J9837418M5025880L3322947
11384A00362121k0367517n4702597k8362308J7512957K2639308o998684k1528021
11377H555259n899070J0506268P535838m373095j1079327j0189569j913675J0021547
$$ plain form
11430 -21090657 9393956 22342126 14673325 7783988 13518702 18726567 11098147 1204428
11422 1204428 5315610 20517553 31904331 33976287 29364532 14398798 -15478733 -46791743
11414 -46791743 -52336486 -23284449 12113992 15158178 -15863009 -36720401 -8305943
11407 -8305943 49534117 76528212 47860211 5049357 -4480504 9818683 10370733 312620
11399 312620 17474150 65780076 101987307 99711566 82014577 73613464 62498877 33669641
11391 33669641 4353867 -4499949 -1409196 2175876 22013294 67039174 100362121
11384 100362121 79994604 25292007 -3070301 14442656 37081964 30083280 8555259
11377 8555259 2656189 13162457 20698295 16325200 5245873 -4943696 -6857371 3164176
11369C164176J1311538o664117k6405070k1193366Q172214L1906592K8001080
11362B8293047N588362j1375151j2131099n155496j805224j145016M729666J2691943
11354A9691032P882747j1756304k3757533j0098641J2926098J5584557k237351
11347H234605j4667963j1809273q247269r874398m529075Q954112J4055877P481010
11339a0402374O099153J3366726J0836941m537368q239625R621422K2500041Q987287
11331D8232203j3370340j8867419j1231179o735776n127031j557026l554675j2162273
11323b4373516r677808J0248991K4423114J5356043r96810o173477q417366j4717292
11315a4328121p346369J8556509K8626607J255757k6847625j4515381J4736713
$$ plain form
11369 3164176 14475714 7811597 -18593473 -39786839 -31614625 291967 28293047
11362 28293047 33881409 22506258 10375159 5219663 3414439 2269423 6999089 19691032
11354 19691032 27573779 15817475 -7940058 -18038699 -5112601 10471956 8234605
11347 8234605 -6433358 -18242631 -26489900 -36364298 -40893373 -31939261 -17883384 -10402374
11339 -10402374 -4303221 9063505 19900446 15363078 7123453 16744875 39244916 48232203
11331 48232203 34861863 15994444 4763265 -1972511 -7099542 -8656568 -12211243 -24373516
11323 -24373516 -34051324 -23802333 620781 15976824 14980014 8806537 389171 -14328121
11315 -14328121 -21674490 -3117981 25508626 26764383 -83242 -14598623 138090
11308A38090J2407748j1922390j0692194J5343298K0248075k816248j1351389
11301A1354990O012864Q493133j9420109l4628434q036705K6049644K7719431
11294A7544814J0543633M789076K562349j7725997m2305256l9975133j0435464
11287g5001978K0072661L6076802L6967589K0723450p050209k2267741r361690
11280A58884J1978984J2897255k842616q928721J230168Q950662J978972j1831738
11272A3591850k0027753j5722583L669799K9895985M0793586K2125814j0555071
11265F3771627k8037519k1451054m625251J1015912K3714211K6588253Q938755
11258G9914934k2119004m0006989k8861104l698044R414849N267833M54718N539758
$$ plain form
11308 138090 12545838 623448 -10068746 5274552 25522627 22706379 11354990
11301 11354990 17367854 25860987 6440878 -28187556 -36224261 -10174617 17544814
11294 17544814 28088447 32877523 35439872 17713875 -24591381 -64566514 -75001978
11287 -75001978 -54929317 -18852515 18115074 38838524 31788315 9520574 158884
11280 158884 12137868 25035123 22192507 13263786 14493954 23444616 25423588 13591850
11272 13591850 -6435903 -22158486 -18488687 11407298 52200884 74326698 63771627
11265 63771627 35734108 14283054 9657803 20673715 44387926 70976179 79914934
11258 79914934 57795930 17788941 -11072163 -14770207 -5355358 -87525 367193 5906951
11250E906951R057679m172952k6302067l1508325j0040968J6490927K3387378
11243a7181377J4363873R488072J1754986Q114527k95576L723500J9751239K0770602
11235G0489846p705474l9545254l7815681j776217L2156984L1339199j673988
11228D5469415l4704211l7300988j0593322J4057722J2623773k245414m187578
11221a6880603M543440J074178j2455424q447395J4680131K1137435m442854k6523331
11213b7314423j2370151J8084230K7712035J6625365N522557n917207k1910444
11206D31962j8556295K0154214N3194969K6762136l9863051p1132629l9841642
11199f8850336K898974J2182733N325525J1575979J9594449Q656121q958434j2340774
$$ plain form
11250 5906951 14964630 10791678 -15510389 -47018714 -57059682 -40568755 -17181377
11243 -17181377 -2817504 6670568 18425554 26540081 26244505 29968005 49719244 70489846
11235 70489846 62784372 23239118 -14576563 -16352780 15804204 47143403 45469415
11228 45469415 10765204 -26535784 -37129106 -23071384 -10447611 -12693025 -16880603
11221 -16880603 -12337163 -11262985 -23718409 -32165804 -17485673 3651762 -791092 -27314423
11213 -27314423 -39684574 -21600344 6111691 22737056 28259613 22342406 431962
11206 431962 -18124333 2029881 55224850 81986986 42123935 -29008694 -68850336
11199 -68850336 -65951362 -53768629 -48443104 -36867125 -17272676 -8616555 -17574989 -29915763
11191b9915763p487536o959567l013067Q883018R526965q459086j4908506J0063408
11183d2270134L1731433J0718485k5960750j8627720L1439703N9677866L2150912
11176G8859795j1876831k4315907q236635O531526Q504350R86195j5939345l5451807
11168i38659l9392591k3983728q843785m149606N655654K6817428L4210341J1039475
11160D14529j5842533j3462497N465555N390986j3236399j9302840o473610R56231
11152e6090578k525899O012601K8088661K8456774q132140m1342268k7473897
11145g3006746J7672558M1828995K7193585M196165k19712N178555J481857r085737
11137A5239520j2303603p221674n170685p979600k775222J6217047L1425471K1193976
$$ plain form
11191 -29915763 -37403299 -44362866 -47375933 -38492915 -28965950 -37425036 -52333542 -42270134
11183 -42270134 -10538701 179784 -25780966 -44408686 -12968983 46708883 78859795
11176 78859795 66982964 42667057 34430422 40961948 49466298 50452493 34513148 -938659
11168 -938659 -40331250 -64314978 -73158763 -77308369 -71652715 -44835287 -10624946 414529
11160 414529 -15428004 -28890501 -23424946 -18033960 -31270359 -50573199 -57046809 -56090578
11152 -56090578 -58616477 -52603876 -24515215 3941559 -4190581 -45532849 -73006746
11145 -73006746 -55334188 -13505193 13688392 17884557 17664845 22843400 24325257 15239520
11137 15239520 2935917 -4285757 -9456442 -17436042 -20211264 -3994217 27431254 48625230
11129D8625230o368382j6976508K861790K0439414l63464m3238239n7137559k7682694
11121g9840412M493562O066334m701964K137771J6522011J0811630p842851q443827
11113f0797746R340370J3074865p027782j8829567K010324L3542881L8781075
11106A0094420J4569023j2001362k2154563j8480512o434141J4501780L7618584
11099A7713229M3897862K1605885j4815780l6252248l0533550j4270284q480008
11092b1134894j1083813n118596J1003327J9023211Q842863o930173j3759222
11085a9157297j3352187j0554507K05346J9598921K9969212J7108770n393520
11078A8424738j3736266p337141m389518j0826225j4496566o513363R500415K5311937
$$ plain form
11129 48625230 42256848 25280340 28142130 48581544 48218080 4979841 -52157718 -79840412
11121 -79840412 -75346850 -69280516 -73982480 -71844709 -55322698 -44511068 -52353919 -60797746
11113 -60797746 -51457376 -38382511 -45410293 -64239860 -62229536 -28686655 10094420
11106 10094420 24663443 12662081 -9492482 -27972994 -34407135 -19905355 17713229
11099 17713229 61611091 83216976 68401196 32148948 1615398 -12654886 -21134894
11092 -21134894 -32218707 -37337303 -26333976 -7310765 1532098 -5398075 -19157297
11085 -19157297 -32509484 -43063991 -42858645 -23259724 6709488 23818258 18424738
11078 18424738 4688472 -2648669 -7038187 -17864412 -32360978 -38874341 -29373926 -4061989
11070d061989L0502952J6146404p757125j2499812J0438228K7472422Q144449
11063F8385529k5082536k9208346q108180j130147j2310931o263129K0909339
11056G191599K5852674p352850l2443614j2874959J9659869J9288325j021095
11049A8299949J287624K3578855K4465157o991768l5436799l2080075p151536
11042a4028593J3528638J7367416P789917k237824k49955Q559094K902217k1586035
11034A2044875l6522095j9036417J0135974J4130569o441565j7733532m167493
11027d7589684J4450975J6666954M176221q993921j1435977J930621K3577640
11020g217171L2832202J7652365p399281j9426106j4943123m349789P732094J7173475
$$ plain form
11070 -4061989 26440963 42587367 34830242 22330430 32768658 60241080 68385529
11063 68385529 43302993 14094647 5986467 4856320 -7454611 -13717740 7191599
11056 7191599 33044273 25691423 -6752191 -19627150 32719 19321044 18299949
11049 18299949 19587573 43166428 67631585 60639817 25203018 -6877057 -14028593
11042 -14028593 -499955 16867461 24657378 22419554 22169599 30728693 33630910 12044875
11034 12044875 -24477220 -43513637 -33377663 -19247094 -25688659 -43422191 -47589684
11027 -47589684 -33138709 -16471755 -12295534 -21289455 -32725432 -30794811 -7217171
11020 -7217171 25615031 43267396 35868115 16442009 1498886 -2850903 4881191 22054666
11012B2054666J1265388j0481903k2137901o330117J2546551L282514j9837166
11005i637968j9648803K096517J2708416J0429564K3427593M4785523K8804650
10998I2965492k9769562o9264498m4764988Q053427K8947531J3954922m22319
10991b99995j658941l331254l668058J0272359K5599770J4210953j9272909l6948406
10983a5096481k0401681O561755J6373035J2627581J3191116J7502920Q909005
10976C9667250j6288118l6858143k9543155m8620J8848368P355586j2418385m844527
10968c4129744K6453396L9967966J5575979j6182431j9482751j621567P040228
10961A7621076N6356o432607o706019o996671m029515Q029408J6396892O055531
$$ plain form
11012 22054666 33320054 22838151 700250 -5629867 6916684 10199198 -9637968
11005 -9637968 -29286771 -27190254 -14481838 -4052274 19375319 64160842 92965492
10998 92965492 63195930 -6068568 -50833556 -42780129 -13832598 122324 -299995
10991 -299995 -1958936 -5290190 -8958248 1314111 26913881 41124834 21851925 -15096481
10983 -15096481 -35498162 -28936407 -12563372 64209 13255325 30758245 39667250
10976 39667250 23379132 -13479011 -43022166 -43070786 -24222418 -16866832 -29285217 -34129744
10968 -34129744 -7676348 32291618 47867597 31685166 12202415 10580848 17621076
10961 17621076 17677432 11244825 4538806 -2457865 -6487380 1542028 17938920 23994451
10953B3994451q308335n80050J8734194J1401956k5611582m6756756k4293048
10946e1419170R350288J2034155o338212o976606J4281964K5561614J1378231
10939G872264j0826689k4598474k9918012k2054292R003586M7014200N2090653
10932B8583236J5662510j6044180j647680L4177376L4132594q909608m2190892
10925D3763356k8536633N516630J2535086j2497851l4326785k7504999k015744
10918d3066940J5892859J2024763n936542j7513819r512802Q815496J5384064
10911b3912921J990069j7413497k6762621k2603681n516527K3857767N0516570
10904a9844841M8005481J3172661j9698539k0381499k585019J500993q800822
$$ plain form
10953 23994451 15686116 15106066 33840260 45242216 19630634 -27126122 -51419170
10946 -51419170 -42068882 -30034727 -36372939 -43349545 -29067581 -3505967 7872264
10939 7872264 -2954425 -27552899 -57470911 -79525203 -70521617 -23507417 28583236
10932 28583236 44245746 28201566 26553886 60731262 94863856 85954248 43763356
10925 43763356 15226723 20743353 33278439 20780588 -13546197 -41051196 -43066940
10918 -43066940 -27174081 -15149318 -21085860 -38599679 -48112481 -39296985 -23912921
10911 -23912921 -21922852 -39336349 -66098970 -88702651 -94219178 -70361411 -19844841
10904 -19844841 28160640 41333301 21634762 1253263 -1331756 169237 -8631585
10897h631585q644918O270720J4434603P588431J363663L542521L521807n55247
10889A8889995M173709J5012680R411954j5383908k9193777j3669147P903445
10882b855049P193479q049529j3889035q885775n798049l203787N928277J2160397
10874a7399071M850733l455344K437511P961663q826290l1257062k0382100K2066902
10866d4003058M7416390K7319968q550509j8968029m178103R764620J3774624
10859B2575903J4821520R391995j1442267l6485741m0797919j9008906P412276
10852e3533139J8315313J3807604L138513q237238j4714451q732880P509567J8902367
10844b3544344J5685510O786308M779783N060430n871192k4258603k7859355n899012
$$ plain form
10897 -8631585 -17276503 -11005783 3428820 11017251 12380914 15923435 19445242 18889995
10889 18889995 23063704 38076384 47488338 32104430 2910653 -10758494 -2855049
10882 -2855049 4338430 -3711099 -17600134 -26485909 -32283958 -35487745 -29559468 -17399071
10874 -17399071 -12548338 -16003682 -13566171 -5604508 -14430798 -45687860 -66069960 -44003058
10866 -44003058 3413332 30733300 22182791 3214762 -963341 8801279 22575903
10859 22575903 37397423 46789418 35347151 -1138590 -41936509 -60945415 -53533139
10852 -53533139 -35217826 -21410222 -18271709 -26508947 -41223398 -49956278 -42446711 -23544344
10844 -23544344 -7858834 -1072526 3707257 8767687 2896495 -21362108 -49221463 -55120475
10836e5120475K3012587L2621546K0150151M501638j118785j480383n199807j1898285
10828E468187j7322760k0166302j7756775m628402J6166369K8067861J8370829
10821H199007l189522j4006842n469039R676859J6121648J1013954j031174j5210101
10813F104790k3599540j7291897o46232P078592l705395j5863476q442280J0970613
10805d5394825J7300104P848664N230407J6414183J7932870l364241k2183019
10798f215857j1989963J1075308J2624647o029269j3464104l29482J1341416J0275409
10790G288105R323649J1551771J352218j9736224k5907398j0741491m76927n475758
10782c2822055Q86138K9081883M1558535J1292502k5368851k0630034J0020348
$$ plain form
10836 -55120475 -32107888 513658 20663809 25165447 24046662 22566279 17366472 5468187
10828 5468187 -11854573 -32020875 -49777650 -54406052 -38239683 -10171822 8199007
10821 8199007 5009485 -8997357 -14466396 -4789537 11332111 22346065 21314891 6104790
10813 6104790 -17494750 -34786647 -35432879 -28354287 -32059682 -47923158 -56365438 -45394825
10805 -45394825 -28094721 -20246057 -15015650 1398533 19331403 15967162 -6215857
10798 -6215857 -18205820 -7130512 5494135 -535134 -13999238 -14328720 -2987304 7288105
10790 7288105 16611754 28163525 29515743 9779519 -16127879 -26869370 -27346297 -32822055
10782 -32822055 -31935917 -2854034 38704501 49997003 24628152 3998118 14018466
10775A4018466J6551417n011361j6520010p203334r74387j372117J1855811L0970860
10767D2315345K3237753q202804k3169634j3710245j6214001l9001201l8621675
10760g3366462N268141M8001148M7189867K2417011J0468743O728543p152542
10753E9554449j8129193r960209k285818j5628276k7568356j0369707J5231068
10746i156042J2665562p588780q187918J1078507K0361411J5333526J4069102
10739D8575368J0832907j3033450l9340937k9757680P805091K3491185K043864
10732A0616348j6394512l403389J7669637J5971447l247010j8567429k3326996
10725b0681904j9899559r982298j890270l040722j487547J6863615L4390156K1993223
$$ plain form
10775 14018466 30569883 25558522 9038512 1835178 860791 -511326 11344485 42315345
10767 42315345 65553098 57350294 34180660 20470415 4256414 -34744787 -73366462
10760 -73366462 -68098321 -20097173 27092694 49509705 59978448 66706991 59554449
10753 59554449 41425256 31465047 29179229 13550953 -14017403 -24387110 -9156042
10746 -9156042 3509520 -4079260 -12267178 -1188671 19172740 34506266 48575368
10739 48575368 59408275 46374825 7033888 -22723792 -14918701 8572484 10616348
10732 10616348 -5778164 -9181553 8488084 24459531 21212521 2645092 -20681904
10725 -20681904 -40581463 -50563761 -52454031 -55494753 -56982300 -40118685 -5728529 16264694
10717A6264694p492784j0876952J5700699K8272939P479229j3326590j1042001
10710B4979234q816838k1211940j8559027J4752059L6871258J1787978k6735002
10703A3067722k8201014n682931l780546j6560327m448002K5556144K7203028
10696G154074k511439j6682291K86335J0087064o621091j6928640O26874J5419197
10688i169917Q00992j7018653n555380J6546972J2129602j1404322j5529009Q614271
10680b0585444L2422361L4699854K1055987L336673j1830652j6890634r721068
10673C2487077l386518r701197j8278689j1025255R156547K3201183K1988709
10666D4441857R610164q725564k2360386j3388688J5665580K8336536M23953l5345660
$$ plain form
10717 16264694 8771910 -2105042 13595657 41868596 49347825 36021235 24979234
10710 24979234 16162396 -5049544 -23608571 -8856512 28014746 39802724 13067722
10703 13067722 -15133292 -20816223 -24596769 -41157096 -45605098 -20048954 7154074
10696 7154074 4642635 -12039656 -11753321 -1666257 -8287348 -25215988 -24589114 -9169917
10688 -9169917 -8368925 -25387578 -30942958 -14395986 -2266384 -13670706 -29199715 -20585444
10680 -20585444 11836917 46536771 67592758 70929431 59098779 42208145 32487077
10673 32487077 29100559 19399362 1120673 -9904582 -748035 22453148 44441857
10666 44441857 54052021 45326457 22966071 9577383 25242963 53579499 54003452 18657792
10658A8657792l0816055L391221J4751725m447462o832221K2979237L4896965
10651E2581202k613699m2619758l0282003J1457482K2082824k156783j4460796
10644f011531j53947Q831055j094993l934188J2818462K3525341J0153215o521351
10636C7612063j644474J6786983K4102237J0863981j4319295l5794927l7235386
10629C71182j5515850P893146R057907m748601o827675N599202R433300k673292
10621B589319j2577393j2547511j4782131j7823166k454300K6543358L4793107
10614C741283J2340381o462615O18783P641707r950584k8151903j4531215J5448083
10606a9306080K4211758J1619852O111350J1507474N060806j7188971l0329078
$$ plain form
10658 18657792 -12158263 -8767042 5984683 1537221 -5295000 17684237 52581202
10651 52581202 49967503 7347745 -22934258 -11476776 10606048 8449265 -6011531
10644 -6011531 -6165478 2665577 1570584 -2363604 10454858 33980199 44133414 37612063
10636 37612063 35967589 52754572 76856809 87720790 73401495 37606568 371182
10629 371182 -15144668 -7251522 1806385 -2942216 -9769891 -4170689 5262611 2589319
10621 2589319 -9988074 -22535585 -37317716 -55140882 -57595182 -31051824 3741283
10614 3741283 16081664 9619049 10237832 17879539 7928955 -20222948 -34754163 -19306080
10606 -19306080 4905678 16525530 22636880 34144354 39205160 22016189 -8312889
10599h312889j7998167N811017J4812642l833203l6950818n0491607k2015205
10592a18978230K4596628M0630737J7904073o03065J0040628K0162873N032111
10585a214245o504264J4686090L8805348K4203903j1334728k4187834j9079325
10578A5374945k6284418l1833711k857027L5617875K7597839j7093205l2277632
10571c1755334l245769J5210175j627831j2788316L825706J1878061o792538j1927052
10563c7222898J8296977M0011212K0432750k275306J0688490K7183351L740397
10556H0854973l3000532l0948618m21132R783414m564212r957749l759733j0827502
10548b841091k4802436j5308203J2078599K0702325N791241j348513P245518N481579
$$ plain form
10599 -8312889 -26311056 -20500039 -5687397 -9520600 -46471418 -96963025 -118978230
10592 -118978230 -94381602 -53750865 -35846792 -36449857 -26409229 -6246356 -1214245
10585 -1214245 -7718509 6967581 45772929 69976832 58642104 34454270 15374945
10578 15374945 -10909473 -42743184 -45600211 -9982336 17615503 522298 -31755334
10571 -31755334 -35001103 -19790928 -21418759 -34207075 -30381369 -18503308 -25295846 -37222898
10563 -37222898 -18925921 21085291 41518041 39242735 49931225 77114576 80854973
10556 80854973 47854441 16905823 16484691 26268105 21703893 11746144 7986411 -2841091
10548 -2841091 -27643527 -42951730 -30873131 -10170806 -4379565 -5728078 1517440 6999019
10540F999019j2080589j5312157Q332379K8692059J7991253j2142848l3288249
10533a0809133l2718886j3458535J2589924K4610128J0854395r028712n081526
10526b3042345J8254891K7999797J4632636L246650O413325M413122j2908517
10519C9009559k2668356j1009155m647687k7367615n0124720k5496765L7637959
10512f4666780P4325751M4708538j6107576m4191463k1481285J5704544L0950474
10505A9242203K5361793J8419114J4367947M268152j0798006j9889852k2394481
10498B8576870k7058951k9885562j5879262J1024562K3842442J0285414q028004
10491g122491q600726L682408J8899873M3179905O8743349N3474160k3268964
$$ plain form
10540 6999019 -5081570 -20393727 -12061348 16630711 34621964 22479116 -10809133
10533 -10809133 -43528019 -56986554 -44396630 -19786502 -8932107 -17960819 -23042345
10526 -23042345 -4787454 23212343 37844979 41091629 47504954 51918076 39009559
10519 39009559 16341203 5332048 684361 -26683254 -76807974 -102304739 -64666780
10512 -64666780 9658971 54367509 38259933 -5931530 -27412815 -11708271 19242203
10505 19242203 44603996 63023110 77391057 81659209 70861203 50971351 28576870
10498 28576870 1517919 -28367643 -44246905 -33222343 -9379901 905513 -7122491
10491 -7122491 -15723217 -12040809 6859064 50038969 118782318 172256478 148987514
10484A48987514j02517273r9791664j7817678M9298601L7252834j4833763l5468816
10477c4890245j5999947M290402R982523J5591015J9981568O843335j3735793
10470g937142j1477869J1178633J5805974r113129k2797050O291429M7654915
10463B9605761N1245086J8892114o568280j0391281j8817285m1418816m6638139
10456b4090840j4002410K5655152L1287287Q592131n653309J99404N768684m08314
10448B7347785o861217o111598n849344q986829p893685l392096o241307j4898779
10440c2887070j4489431k720985N951989O249867P645499R899505J294906j1830946
10432c0886666n442669K0372893L2649293J5547577l736682j152236M981767r654818
$$ plain form
10484 148987514 46470241 -53321423 -71139101 -21840500 15412334 578571 -34890245
10477 -34890245 -50890192 -46599790 -36617267 -21026252 -1044684 5798651 -7937142
10470 -7937142 -19415011 -8236378 7569596 -1543533 -24340583 -18049154 29605761
10463 29605761 80850847 99742961 93174681 82783400 63966115 22547299 -24090840
10456 -24090840 -38093250 -12438098 18849189 27441320 21788011 21987415 27756099 27347785
10448 27347785 20486568 14374970 8525626 -461203 -8354888 -11746984 -17988291 -32887070
10440 -32887070 -47376501 -50097486 -44145497 -37895630 -30250131 -20350626 -19055720 -30886666
10432 -30886666 -36329335 -15956442 16692851 32240428 28503746 27351510 32333277 22678459
10424B2678459k9177227k3996840j722032P247861M44264Q78051J2256551J4324197
10416B933284J285755q281926k524102R099391J4607599J1816034K757008n788187
10408B5904856j418114J5447392K1444938M83123k6805646k9529880j1576582
10401f049913o01549j853334K363427J2570395R670959n510794p536201J0358830
10393A3411820K1350118N816772k0276188l0820630k0988581j856473J6387684
10386a6975478K5045398J7655923J23391j1863104j0567511j845800N096669K646825
10378I316313j2846741k9500148k3564271O405063K7010595J7764688Q221115
10371B806614K8479873M6530055J2056978n0283544o1862458r532966L0509288
$$ plain form
10424 22678459 -6498768 -30495608 -32217640 -24969779 -24525515 -23647464 -11390913 2933284
10416 2933284 4219039 -4062887 -6586989 2512402 17120001 28936035 31693043 25904856
10408 25904856 24486742 39934134 61379072 61862195 35056549 5526669 -6049913
10401 -6049913 -6651462 -8504796 -6141369 6429026 16099985 10589191 3052990 13411820
10393 13411820 34761938 40578710 20302522 -10518108 -31506689 -33363162 -16975478
10386 -16975478 8069920 25725843 25849234 13986130 3418619 1572819 6669488 9316313
10378 9316313 -3530428 -33030576 -56594847 -50189784 -23179189 -5414501 2806614
10371 2806614 31286487 77816542 89873520 39589976 -22272482 -31805448 -1296160
10364a296160J1523998j5578035L761668L2870424P997677m9503008o1299020
10357g1522456j1675852L3622430K7563801j920475r402845M648211J2150666
10350a6536520N828257J916348R232046J6558395R535658q634994j7407013l915617
10342c423440J4671768Q127504k3517718m3168679k5294029Q248788J9668068
10335d4687738N753922o207334j075268J0602537J5740900J2868704N710067Q23011
10327d71199Q203867K7615405L8804660K2322132j3242189l9881108m1926808
10320A424760k5790936n281685O787595k07783k2580642l5201158j5579937K4942787
10312g1486999M9535998L6141357j666140l1671927l0824981j439036K9111389
$$ plain form
10364 -1296160 10227838 -5350197 -1588529 31281895 39279572 -10223436 -71522456
10357 -71522456 -83198308 -49575878 -22012077 -23932552 -33335397 -28687186 -16536520
10350 -16536520 -10708263 -8791915 440131 16998526 26534184 17899190 492177 -3423440
10342 -3423440 11248328 19375832 -4141886 -47310565 -72604594 -64355806 -44687738
10335 -44687738 -38933816 -45141150 -46216418 -35613881 -19872981 -7004277 -1294210 -471199
10327 -471199 7732668 35348073 74152733 96474865 83232676 43351568 1424760
10320 1424760 -24366176 -29647861 -22860266 -23068049 -45648691 -80849849 -96429786 -71486999
10312 -71486999 -21951001 14190356 12524216 -19147711 -49972692 -51411728 -22300339
10305b2300339L0896809M482646j6648810p790849J5080636K0627436N864712
10298C0212241p367728r537548j0724937j4488701j0944103J371587R507800P888942
10290d082447P743556J7633314K8238818K3350066j680078l3783878m8666924
10283a1247573k9577254R906281L0602337J1236616k0650600k1631600R249841
10276b2111952K9766807J2891465j9428669k9147536q712126J6817097K1204147
10269A279233Q33500k4382217k8186824l725732K5348906K8188122K444704k3049291
10261b1249599k2548852j22207K0127102K1317881P690103l508805k129450K866451
10253B442624l015156j4870120j2065519P733079J8988975O916109o693385Q92600
$$ plain form
10305 -22300339 8596470 13079116 -3569694 -11360543 3720093 24347529 30212241
10298 30212241 22844513 13306965 2582028 -11906673 -22850776 -21479189 -11971389 -4082447
10290 -4082447 3661109 21294423 49533241 72883307 71203229 37419351 -11247573
10283 -11247573 -40824827 -30918546 -316209 10920407 -9730193 -31361793 -22111952
10276 -22111952 7654855 20546320 1117651 -28029885 -36742011 -19924914 1279233
10269 1279233 2112733 -22269484 -50456308 -54182040 -28833134 -645012 1799692 -21249599
10261 -21249599 -43798451 -43920658 -23793556 -2475675 5214428 1705623 -423827 2442624
10253 2442624 -572532 -15442652 -27508171 -19775092 -786117 6129992 -563393 329207
10245C29207J3357031K902780j9278901j9780510o10978M149040j2096042j8407151
10237d9435524k254260J0898225P453833Q798153K3433963K1626002j1224414
10230I295978l6653446j7851165K0402898L0171871J2956053O041402J4420161
10223C8783752Q867169j4044487k2130033m202165R124119m427726k5327444k6755610
10215d0112425j1788680L398597J7452472L2806514L6470487J5674603j7874888
10208C6026680l8435197l4795060j5765738M905047J7124894J5551400L889187
10201a1498787p005960j2911396k0133879k8640924k3776713K388882L1794500
10194f9784277L8846422K2628998N018710K13961K510954L763037N736092J0013897
$$ plain form
10245 329207 13686238 16589018 -2689883 -22470393 -23081371 -18932331 -31028373 -49435524
10237 -49435524 -51689784 -40791559 -33337726 -24539573 -1105610 20520392 9295978
10230 9295978 -27357468 -45208633 -24805735 5366136 18322189 24363591 38783752
10223 38783752 47650921 33606434 11476401 7274236 16398355 11970629 -13356815 -40112425
10215 -40112425 -51901105 -48502508 -31050036 1756478 38226965 53901568 36026680
10208 36026680 -2408517 -37203577 -52969315 -48064268 -30939374 -15387974 -11498787
10201 -11498787 -18504747 -31416143 -51550022 -80190946 -103967659 -101578777 -69784277
10194 -69784277 -30937855 -8308857 -3290147 -3076186 -565232 3197805 8933897 18947794
10186A8947794R314334k425074j8608401k5689397j6865712L087740K2624022
10179i614694L0834827K4269161Q898336o406713j7127505k1156727j4916480
10172e219795K31242J1800235Q829488k07058L260555J8297000K1084629o01143
10164E7475153k5463509k5529888l889372J1363452N314963q685542j1622717
10157a037460j554483J0013267J4271752J2209229R481245P105395r08519j5975418
10149C3605008k3611226p833094J9499321K3392054p191355l6720153k8866710
10142b7726155K715799J8143999J1523363R722212J7318779P909695k2205664
10135A7402028l6506586j4383561J3712971J3936712j361739l586407J749312
$$ plain form
10186 18947794 28262128 25837054 7228653 -18460744 -35326456 -32238716 -9614694
10179 -9614694 21220133 45489294 54387630 47980917 30853412 9696685 -5219795
10172 -5219795 -4988553 6811682 15641170 15434112 18694667 36991667 58076296 57475153
10164 57475153 32011644 6481756 2592384 13955836 19270799 10585257 -1037460
10157 -1037460 -2591943 7421324 21693076 33902305 43383550 50488945 49580426 33605008
10149 33605008 9993782 2160688 21660009 45052063 37860708 1140555 -27726155
10142 -27726155 -25010356 -6866357 4657006 14379218 31697997 39607692 17402028
10135 17402028 -19104558 -33488119 -19775148 -5838436 -7200175 -10786582 -9037270
10128i037270o127214j5553795Q49262L1107224L1895328n063490l5926300k6390429
10120c4246684L913314J7236854J0915298J0121927K3070579K9972836J5161003
10113G6145127r955245k3633561k2145583j8822794j7878438o807429J5942134
10106g155789K4229272r78890l2002086k4837346J2737757K6603130o28268k1986909
10098b4019129o449489O944403j9235265m4074230j0260733N0373849N4339672
10091G619078k515688l7422832j1999308J5352325k872155k4644038J635763M4101256
10083a0745599L9944712k588498k3102099m993504J2623324Q142199K647442R928915
10075C1856892J2261065k325309j6425528j1118622P673627K0909574J7308242
$$ plain form
10128 -9037270 -15164484 -30718279 -29869017 1238207 33133535 28070045 -7856255 -34246684
10120 -34246684 -30333370 -13096516 -2181218 7940709 31011288 60984124 76145127
10113 76145127 66189882 42556321 20410738 1587944 -16290494 -23097923 -7155789
10106 -7155789 17073483 16094593 -15907493 -40744839 -28007082 -1403952 -2032220 -24019129
10098 -24019129 -30468618 -23524215 -42759480 -86833710 -97094443 -46720594 7619078
10091 7619078 5103390 -32319442 -44318750 -28966425 -31838580 -56482618 -54846855 -10745599
10083 -10745599 29199113 26610615 3508516 -1484988 11138336 19280535 21927977 31856892
10075 31856892 44117957 41792648 25367120 14248498 21922125 42831699 60139941
10068F0139941j462829k2188221k7268698j2971890M291136J0681088J2194297
10061B3414824J5724602J0394382j1334054l0826113k6770864o646879J0739098
10054a5305004K5996926M2034595L7438155j528668l8742433k8281461J1053994
10047C2666104J6546623k1723674m4704938j8896496J3525368Q336333j1689378
10040b5940058m210708J9063179J7510033p634459k0348117j2274416p621003
10033d1455549j1717179l064222J9731570K7102121O734787j3897354j0111882
10026b6677708M673080O191715k100195j152042R352803J3431171P321668K918902
10018A3959394M831507L682700n127892j1977072q140515J287548O261697M978604
$$ plain form
10068 60139941 58677112 36488891 9220193 -3751697 539439 11220527 23414824
10061 23414824 39139426 49533808 38199754 7373641 -19397223 -26044102 -15305004
10054 -15305004 10691922 52726517 90164672 88636004 49893571 21612110 32666104
10047 32666104 49212727 27489053 -17215885 -36112381 -22587013 -14250680 -25940058
10040 -25940058 -30150766 -11087587 6422446 -1212013 -21560130 -33834546 -41455549
10033 -41455549 -53172728 -56236950 -36505380 -9403259 -2668472 -16565826 -26677708
10026 -26677708 -22004628 -15812913 -17913108 -19065150 -9712347 3718824 11040492 13959394
10018 13959394 18790901 22473601 17345709 5368637 -2771878 -1484330 4777367 9755971
10010I755971J798726n44004J42459O960145J5623236J1965092r697772l0162817
10002E841036k3465982P148655K7570686J4290147j5529569k6006341o137971
9995a6289339J9505791J9901821j0148230m4352216m8433049j4529178K6917982
9988f7426418L8676756J9962897L157132N986152J0669669J341138n454404P814016
9980A4726938J9999353j454459m3097918n3375582j1976752M0271113N1821803
9973A6914496J7939629k3266898l4736436j0080127K7067767M3977090K7439075
9966F5254596m077185k2425111k0420362j1255986n334841l210807m719536p474169
9958a3663401l043607P597994N898849j4765313k6414497m384627K6670255K5236699
$$ plain form
10010 9755971 11554697 11010693 11153152 18113297 33736533 45701625 36003853 5841036
10002 5841036 -17624946 -10476291 17094395 31384542 15854973 -10151368 -16289339
9995 -16289339 3216452 23118273 12970043 -31382173 -79815222 -94344400 -67426418
9988 -67426418 -28749662 -8786765 -5629633 356519 11026188 12367326 6912922 14726938
9980 14726938 34726291 33271832 -9826086 -63201668 -75178420 -34907307 16914496
9973 16914496 34854125 11587227 -23149209 -33229336 -6161569 37815521 65254596
9966 65254596 61177411 38752300 18331938 7075952 1741111 -1469696 -6189232 -13663401
9958 -13663401 -16707008 -9109014 -3210165 -17975478 -44389975 -48774602 -22104347 3132352
9950C132352N16381k408183J8731610J8346905j4578309l1658886o037496K1645928
9942G690302J2761138q478094o584136K391606r339686k1571892m403175J7853553
9934i680384M145175k6506613k1591482J5805975L0953527P028224j2822919M43463
9926a2225034K2332600K2753240O087178j1119684k2924047k2429508l013133
9919b0538388J9159009J6391070r893633k9806680k7861456j4079022M032955
9912f2596145K4294555K9922722Q149898j6185493j0448831R342334L544549j7683066
9904c1659477r483533K1366502J9288983k1756469m1777662j6509410O211037
9897g4320029R75489Q757315M3908883M7330859p898143n1361641k9236721J839824
$$ plain form
9950 3132352 3648733 1240550 19972160 38319065 23740756 -7918130 -13955626 7690302
9942 7690302 20451440 11973346 5389210 7780816 -1558870 -23130762 -27533937 -9680384
9934 -9680384 -5535209 -32041822 -53633304 -37827329 -6873802 154422 -12668497 -12225034
9926 -12225034 10107566 32860806 38947984 27828300 4904253 -17525255 -20538388
9919 -20538388 -1379379 15011691 5118058 -24688622 -52550078 -66629100 -62596145
9912 -62596145 -38301590 -8378868 -228970 -16414463 -26863294 -17520960 -13976411 -31659477
9904 -31659477 -41143010 -19776508 -487525 -22243994 -64021656 -80531066 -74320029
9897 -74320029 -73344540 -64587225 -20678342 26652517 18754374 -32607267 -61843988 -60004164
9889f0004164j7399380l4918045M826605K2712977p2002080j75584795r5070675
9882d27439557J40445952K67658946J44789123n3831352r5887641L331225O5915919
9875D4982615L1547611q580300k853846j347413k8960884l4979387J086439K1980713
9867B2875548o463499l3117765r666576K7937125K2083734j3710177k4116293
9860a4177903o45502J7371190J2326243M249499K721559p065229k4259446k2383958
9852c1863547M652815K3121100R919454p045727Q480442L8398329L2188192j3709252
9844F4141806m4620495k7751885Q98081j841662j7056159k459466K5835650J1991009
9836I136879m2267955o4132638j4351496N0742867N8532554J7592150j0404964
$$ plain form
9889 -60004164 -77403544 -112321589 -107494984 -84782007 -156784087 -332368882 -427439557
9882 -427439557 -286993605 -19334659 125454464 71623112 -24264529 -20933304 44982615
9875 44982615 76530226 67949926 65096080 63748667 34787783 -191604 894835 22875548
9867 22875548 16412049 -16705716 -26372292 1564833 23648567 9938390 -14177903
9860 -14177903 -14823405 2547785 14874028 19123527 21845086 14779857 -9479589 -31863547
9852 -31863547 -27210732 -4089632 5829822 -1215905 7264537 45662866 77851058 64141806
9844 64141806 19521311 -8230574 -7332493 -9174155 -26230314 -28689780 -2854130 9136879
9836 9136879 -33131076 -97263714 -111615210 -60872343 -2339789 15252361 4847397
9829D847397m458802M020173k904560p295941J276857P646832M218419K573085
9821I923460K903225j0485018l1483189k7922820O931109L3592409K0860454r175523
9813d855893j8214697p082898j199997k150677P345117K1354626J4079085j4527326
9805e252660l2081579j9662178N090338J9483239K2950349K0816289P347290j6305714
9797B385374k7835237j0367412J8819127K7776305J0838486r686815j7544805
9790e614977j7168128j4959535p707913L605566O350232n087964j4430384j984164
9782e6997267K5660729L7990088J6131321k2260732m0472097k2712353R893460
9775e2766851K4894393J4087870k480130m563859O048016J3380800Q057960o039381
$$ plain form
9829 4847397 388595 4408768 1504208 -5791733 -4514876 3131956 7350375 9923460
9821 9923460 12826685 2341667 -29141522 -57064342 -50133233 -16540824 4319630 -4855893
9813 -4855893 -23070590 -30153488 -31353485 -33504162 -26159045 -4804419 9274666 -5252660
9805 -5252660 -37334239 -56996417 -51906079 -32422840 -9472491 11343798 18691088 2385374
9797 2385374 -25449863 -35817275 -16998148 10778157 21616643 11929828 -5614977
9790 -5614977 -22783105 -37742640 -45450553 -41844987 -35494755 -40582719 -55013103 -56997267
9782 -56997267 -31336538 6653550 22784871 524139 -39947958 -62660311 -52766851
9775 -52766851 -27872458 -13784588 -16264718 -20828577 -14780561 -1399761 6658199 618818
9767F18818j9671243k5187620j8638071j758537J8023580L1424571K9724035P387211
9759B1922744k6871029m3494935j6898617L4686017N6596809K3847162k0178575
9752B9609576j8850989J9787945L7813816J3419125j3346181r309897L361607
9745F2485002p599921k8642719k6403690n286493J844911j0679415j4755791K562894
9737b6475222J8805603J3496172j766749m493525O359668J4651259J2835783Q540638
9729D1953627P831784L740317j2164063l0406624k7800711L51576K3166985R483711
9721A6156602k4411361l1195173j197904K0206827J173764k6387791j6374231
9714f2029267K1242790M0442843K8616827J0395064m033331k3602176l4708269
$$ plain form
9767 618818 -19052425 -44240045 -62878116 -64636653 -46613073 -15188502 14535533 21922744
9759 21922744 -4948285 -48443220 -65341837 -30655820 25940989 49788151 29609576
9752 29609576 10758587 30546532 68360348 81779473 68433292 59123395 62485002
9745 62485002 54885081 26242362 -161328 -5447821 -3602910 -14282325 -29038116 -26475222
9737 -26475222 -7669619 5826553 4059804 -433721 5925947 20577206 33412989 41953627
9729 41953627 49785411 53525728 41361665 10955041 -16845670 -16494094 6672891 16156602
9721 16156602 -8254759 -39449932 -40647836 -20441009 -19267245 -45655036 -62029267
9714 -62029267 -40786477 -343634 28273193 38668257 34634926 11032750 -23675519
9707b3675519j0052723L4071185M3293774N006523k7249034j3342258J6563597
9700B4615545J6945807l976150j1613667p388279j5137415k7117675j4488541
9693c8160375J7205098L0405263J3828683l397372j965319J174395j0556693k2297419
9685a3763739j2935234R719566J9299213N975244j4118806j9997171p154985R925202
9677b3050710J3018884L34930j0129371l224331J1284635J0413623r467266k5578630
9669c6398236j8346694M018602J8537871J6575210R209886O650656M514542m078545
9661F83292j1337886k723200J7325272K2573653j345909l1622588l3776010o793352
9653d7016728J7591919J9521331J1311189Q475927O266259j677379m537527N782653
$$ plain form
9707 -23675519 -33728242 342943 43636717 48643240 21394206 8051948 24615545
9700 24615545 41561352 37585202 25971535 18583256 3445841 -23671834 -38160375
9693 -38160375 -20955277 9449986 23278669 19881297 17915978 19090373 8533680 -13763739
9685 -13763739 -26698973 -16979407 2319806 8295050 -5823756 -25820927 -32975912 -23050710
9677 -23050710 -10031826 -9696896 -19826267 -23050598 -11765963 -1352340 -10819606 -36398236
9669 -36398236 -54744930 -50726328 -32188457 -15613247 -6403361 247295 4761837 683292
9661 683292 -10654594 -13377794 3947478 26521131 25175222 -6447366 -40223376 -47016728
9653 -47016728 -29424809 -9903478 1407711 9883638 16149897 14472518 9934991 15717644
9645A5717644J3656629J889711j7398314j8715308k534014P001550J695014O49569
9637A962481J6239330L0713917J9864588j2011839l4334524k4988705M940921
9630B386169K3030171J0360802j8298023l2148549j9491450K378392J1440357
9623b0342131L801346j0191670j9776626j7434071n93795K1976328L4776889L3094145
9615B5310415K6371216K0289450R567929n851963j4522558j2129040r020342r523143
9607C0491964l481268R779596J1760411m549440j7742868j2089616m213072j0364299
9599d08592j2358253J0083745L4424100K3731165j3170229l2606587k0374781
9592a0679432k764288L920164J0671659J9028746J1069001j2288697k1786816
$$ plain form
9645 15717644 29374273 31263984 13865670 -4849638 -7383652 -382102 1312912 1962481
9637 1962481 18201811 48915728 68780316 56768477 22433953 -2554752 2386169
9630 2386169 25416340 35777142 17479119 -14669430 -34160880 -31782488 -20342131
9623 -20342131 -16540785 -26732455 -46509081 -63943152 -64536947 -42560619 -7783730 25310415
9615 25310415 51681631 71971081 81539010 75687047 61164489 49035449 40015107 30491964
9607 30491964 27010696 36790292 48550703 44001263 26258395 14168779 9955707 -408592
9599 -408592 -12766845 -2683100 31741000 55472165 42301936 9695349 -10679432
9592 -10679432 -13443720 -9523556 1148103 20176849 31245850 18957153 -2829663
9585b829663l988816J7635148J9948540Q234510n476571k0735514l1394870k1968486
9577d0575722K294976J2787582K254582o62103J7950838K7632206L736244k5172455
9569B46148j8113777J3450168K3318532M29030j9608222j0034311J4866573K6529294
9561C1083435J4464049j2222579l4896142l4239921o479853K7016985L9412644
9554B4138618K6474342M389718j3215503k1544929j6451524Q03018J5198050J2854960
9546C2646750J281267k001763L450105L512850n111199j2020684j3300681j4127615
9538e670970j2289665n43200J3595493J2333093m755086j8769260k0872991k0230220
9530e7202806j6844660N005337M1094615N3271007J8538477k6963037k7424584
$$ plain form
9585 -2829663 -6818479 10816669 30765209 38999719 33523148 12787634 -18607236 -40575722
9577 -40575722 -38280746 -25493164 -23238582 -23900685 -5949847 21682359 25418603 246148
9569 246148 -17867629 -4417461 18901071 19330101 -278121 -10312432 4554141 31083435
9561 31083435 45547484 33324905 -1571237 -35811158 -42291011 -15274026 24138618
9554 24138618 50612960 55002678 41787175 20242246 3790722 4593740 19791790 32646750
9546 32646750 33928017 31926254 35376359 38889209 33778010 21757326 8456645 -5670970
9538 -5670970 -17960635 -18503835 -4908342 7424751 2669665 -16099595 -36972586 -57202806
9530 -57202806 -74047466 -69042129 -27947514 25323493 43861970 16898933 -10525651
9523a0525651J6194345M5268620K3664557j6607713k7457947j1630032n750925
9516A3155254j5315534r579849J7537949K5585917j0977247n2758281m3257495
9509g5609286J0238758M4467979K6692444p060375j1428783O867615J1314243
9502E482595n571007j7027084o583776R732056P982786j3716047l3964927k9479830
9494h3145234J453598L3082712L5981542J0788280j1955593j0491942M778457
9487a9508180J5249715K1569846K9486658K6653961J11866l3246917m1816645
9480a499696k1465809K620308J3552636J6031652J3745930L400728n438468L936985
9472B4884266K1219375J3186896k2814790m2208378j4575763K6746891K9622444
$$ plain form
9523 -10525651 5668694 50937314 74601871 57994158 30536211 18906179 13155254
9516 13155254 -2160280 -11740129 5797820 31383737 20406490 -32351791 -75609286
9509 -75609286 -65370528 -20902549 5789895 -1270480 -12699263 -5831648 5482595
9502 5482595 -88412 -17115496 -23699272 -13967216 -5984430 -19700477 -53665404 -83145234
9494 -83145234 -81691636 -48608924 -12627382 -1839102 -13794695 -24286637 -19508180
9487 -19508180 -4258465 17311381 46798039 73452000 73563866 40316949 -1499696
9480 -1499696 -22965505 -20345197 -6792561 9239091 22985021 26385749 20947281 24884266
9472 24884266 46103641 59290537 36475747 -5732631 -20308394 6438497 36060941
9465C6060941k959436k3304374j2628298k70559o390549r025619J2773588L7024254
9457C1279948K9336277m512254k7320649k2649145q739278j755317N308598J8009285
9449A8957465K0231723j679857k8869479k7687487M475404L1430688K2424360
9442C9282817j0691689l1148785k2750393l707963K951584j499615J104957J7204448
9434i254639L1416172K6581435O271870r452427q945911j689737k311535q752553
9426B3862675o394515P176081J4403297J807872j8097898k1539498n669170Q803300
9418D352144P793473O22241J31742J629509m928380j3316866r963139J102974
9410a2576302K639347o362772o817697Q781482K0985912J1565299r446266j9711836
$$ plain form
9465 36060941 33101505 9797131 -2831167 -3101726 -9492275 -18517894 -5744306 31279948
9457 31279948 60616225 56103971 28783322 6134177 -2605101 -4360418 948180 18957465
9449 18957465 39189188 37509331 8639852 -19047635 -14572231 16858457 39282817
9442 39282817 28591128 -2557657 -25308050 -29016013 -26064429 -27564044 -26459087 -9254639
9434 -9254639 22161533 48742968 55014838 45562411 36616500 34926763 32615228 23862675
9426 23862675 17468160 24644241 39047538 40855410 22757512 1218014 -4451156 4352144
9418 4352144 12145617 12767858 12899600 14529109 9600729 -3716137 -13679276 -12576302
9410 -12576302 -9936955 -16299727 -23117424 -14335942 6649970 18215269 8769003 -10942833
9402a0942833j4367107l775332O633330J5852641J6651026O361915O60979J3435322
9394C0509941K8360826J6868982j6975146l7802180k8100074p052699O181229
9387h009121J6536604K7393959K2696905l518789k6150039k3551656j1578281
9380f180418j4889329k2661773o306559K9046770M5337505K3357809j4516959
9373C3187046l6533213l4083869j8383586l003213N578795J1124382K1205634
9366b0908024L1085792K4012402j725268k1446360j6930464m053522n351547j2428285
9358b7745276m671757J0017533Q473071m236554k994692J1308473J3974953L004656
9350G130407J488750J0847138N301685j8228729k7783169q531865J2482848J1747797
$$ plain form
9402 -10942833 -25309940 -29085272 -22451942 -6599301 10051725 16413640 17074619 30509941
9394 30509941 58870767 75739749 58764603 20962423 -7137651 -14190350 -8009121
9387 -8009121 8527483 35921442 58618347 55099558 28949519 5397863 -6180418
9380 -6180418 -21069747 -43731520 -50038079 -20991309 24346196 47704005 33187046
9373 33187046 -3346167 -37430036 -55813622 -58816835 -53238040 -42113658 -20908024
9366 -20908024 10177768 34190170 32464902 11018542 -5911922 -9965444 -15316991 -27745276
9358 -27745276 -32417033 -22399500 -13926429 -18162983 -21157675 -9849202 4125751 7130407
9350 7130407 8619157 19466295 24767980 6539251 -21243918 -29775783 -17292935 -5545138
9342e545138K976455N597070J2882954J2191558P348258K644813o610157j3307017
9334A8178796j195134J8780816J4110483j2329395j7670094P672872J6428814
9327D3977158j3346701l1124132J976158L7116247J1728040m3863776n0893637
9320d4430643n179944K5774558J4751943J191210O361826L999290j1710122o235630
9312a5477512K3305862K6955231j4839873n0064352l5662845k189064N971581
9305f2000972K801338K0595000M1040984K6728089p594922j6639310k59736K300199
9297F970670j4078381j2479836J6024305L0563382O090173k5451913k4828974
9290a7190574j176826J0551775J950822r179581j4159636j7546037j4895998L253113
$$ plain form
9342 -5545138 -2568683 3028387 15911341 28102899 35451157 38095970 31485813 18178796
9334 18178796 16983662 35764478 49874961 37545566 19875472 27548344 43977158
9327 43977158 30630457 -493675 1482483 38598730 50326770 6462994 -44430643
9320 -44430643 -49610587 -23836029 -9084086 -7892876 -1531050 2468240 -9241882 -15477512
9312 -15477512 7828350 34783581 19943708 -30120644 -65783489 -67972553 -62000972
9305 -62000972 -59199634 -38604634 2436350 29164439 21569517 4930207 4670471 6970670
9297 6970670 -7107711 -19587547 -3563242 27000140 33090313 7638400 -17190574
9290 -17190574 -18367400 -7815625 -5864803 -15044384 -29204020 -46750057 -61646055 -58392942
9282e8392942K5538528K5419101k85398k1439678j5100577L597061Q381660L254973
9274b9027272J0920319K7141957J9482339j9754710m9025779k8649762K1927121
9267d6985787M6353470K3989638q843611j3437613L141495R128403k348425p620811
9259C376759Q834233L1166901L4381268J7353052J541763j01113N99130j1713646
9251H5438347k9147873l0101630j2515941J182007k517198q839631j238907R883202
9243A2142376M891709j0382573j2547688J123208R027780K662119P73687J4773854
9235B2464472K4266387P718949j8679087j9521049O962314K1782959j059942l5265709
9227H669294l4586681N884831M1566357L2273213j2719827m9584278m6606779
$$ plain form
9282 -58392942 -32854414 -7435313 -7720711 -29160389 -44260966 -40663905 -32282245 -29027272
9274 -29027272 -18106953 9035004 28517343 8762633 -40263146 -68912908 -46985787
9267 -46985787 -632317 23357321 14513710 1076097 4217592 13345995 10997570 3376759
9259 3376759 12210992 43377893 77759161 95112213 96653976 96552863 97151993 85438347
9251 85438347 56290474 26188844 13672903 14854910 12337712 3498081 2259174 12142376
9243 12142376 17034085 6651512 -5896176 -4772968 4254812 6916931 7690618 22464472
9235 22464472 46730859 54449808 35770721 16249672 23211986 44994945 43935003 8669294
9227 8669294 -25917387 -20032556 21533801 53807014 41087187 -8497091 -55103870
9220e5103870q113094L5304439M9019722J8713218l1845668n5778569l2257410
9213h0061232P345147K0270024Q167313N635172K1329148K7144244R759457n300184
9205A4289089L560789J9984535J9603998P223000P68401J17182m508997j1198654
9197D9839343j4798401j9472132k4258106j6514010J289322L345262j7233637
9190c7802359k5635104L988959M1142792M0216631P714874j3575809j0688417
9183E361567n538348n573543K726452J5194031J1177729n537134r855051j458498
9175F497205n073159k0656890j7392455J2919089L7601922L1341536O450521j6899345
9167C4788424l4905493m1966812k4254754J1729149L4555164K7403348O551638
$$ plain form
9220 -55103870 -63216964 -27912525 21107197 39820415 7974747 -47803822 -80061232
9213 -80061232 -72716085 -52446061 -44278748 -38643576 -17314428 9829816 19589273 14289089
9205 14289089 17849878 37834413 57438411 64661411 65429812 65546994 61037997 49839343
9197 49839343 35040942 15568810 -8689296 -25203306 -23913984 -20568722 -37802359
9190 -37802359 -63437463 -59448504 -18305712 21910919 29625793 16049984 5361567
9183 5361567 -176781 -5750324 -3023872 12170159 23347888 17810754 7955703 6497205
9175 6497205 1424046 -19232844 -36625299 -23706210 13895712 45237248 51687769 34788424
9167 34788424 -117069 -42083881 -66338635 -54609486 -20054322 7349026 13900664
9160A3900664q757995j6616697j6179081l388066R964342O516679k374832R067649
9152g867337K8891093J7553737k0132714k8739320J0653849M3136270K2371230
9145F5866808k1263064l4870660j9078923m971482L441275J4044865R784213j9856982
9137f903950l9897890j6409994K2931628K9775410J3531385J8475411L9501759
9130F1003759K7850944k2032258n6087674m0403533k636890J8599503J7447964
9123C741815J792117k2657406l4558048q303520L8637182N2341738J7390931j6215610
9115C2169199o862635J8172619J0871185k1707403l2482673o354868K5031663
9108A8837087L3489667K2149603L030756j9924231l7521399l2283733l518421
$$ plain form
9160 13900664 5142669 -11474028 -27653109 -31041175 -21076833 -14560154 -16934986 -7867337
9152 -7867337 21023756 38577493 18444779 -10294541 359308 43495578 65866808
9145 65866808 44603744 9733084 -9345839 -14317321 -10876046 3168819 12953032 -6903950
9137 -6903950 -46801840 -63211834 -40280206 -10504796 3026589 21502000 61003759
9130 61003759 88854703 66822445 10734771 -29668762 -32305652 -13706149 3741815
9123 3741815 5533932 -17123474 -51681522 -59985042 -21347860 30993878 48384809 32169199
9115 32169199 25306564 43479183 54350368 32642965 160292 -6194576 18837087
9108 18837087 52326754 74476357 77507113 57582882 20061483 -12222250 -15740671
9101a5740671K1991591K0170251L55694r139777J83733R746105N242976l273003
9093B9536899j529273M273165n10631j1422695j0192822M510661J3136668N401824
9085C3203796o306839j0309218j1686717j4887781j1120012K191794Q274004m160941
9077a4801914j8428722j2730134O354164J4365585M754222o046880m233549Q102334
9069b2664894K1252201K5276553J4479630l679588j2542762j0003900j4594824
9062b477584l3164376l9914296j1149888L2211344M5575776J9445653r663907
9055H62722q466641J4943783K7049977Q617304k5508303m0655869k0292881Q958406
9047c4491502O291033k4685016l3793923L506056M4262435L8116933m77352k1062908
$$ plain form
9101 -15740671 6250920 26421171 26776865 17637088 17820821 27566926 32809902 29536899
9093 29536899 28007626 32280791 31770160 20347465 10154643 14665304 27801972 33203796
9085 33203796 26896957 16587739 4901022 -9986759 -21106771 -18914977 -10640973 -14801914
9077 -14801914 -33230636 -45960770 -39606606 -25241021 -20486799 -26533679 -30767228 -22664894
9069 -22664894 -1412693 23863860 38343490 34663902 22121140 12117240 -2477584
9062 -2477584 -35641960 -75556256 -86706144 -54494800 -8919024 10526629 862722
9055 862722 -7603919 7339864 34389841 43007145 17498842 -23157027 -43449908 -34491502
9047 -34491502 -28200469 -52885485 -86679408 -83173352 -38910917 -793984 -1271336 -22334244
9039b2334244j4673185j2277541j9245645p596151K5395837M3970169L0200248
9032B3439488Q272810l24811l953666r284992m223892R938776Q663589j3121997
9024A9405305k5516521j2674724j91679p975947j2993714Q241605L2791202K5708641
9016B6794168l291067j7873523j1949759p797245r072034K552740K6189385L5107789
9008D0660454J6957123q511233j8782678j2875466j335710P361242N536249r309351
9000A9700630k2987403j4801778J3916615L6285937L1725169P989687j5156346
8993E6672511k9691905l6123262k9722174p355447J6849442K1309899N945309
8986b115627m840099K858506R859148o077886k8990290k1639432J6005734L8115075
$$ plain form
9039 -22334244 -37007429 -49284970 -68530615 -76126766 -50730929 -6760760 23439488
9032 23439488 31712298 31387487 27433821 18148829 13924937 23863713 32527302 19405305
9024 19405305 -6111216 -18785940 -18977619 -26953566 -39947280 -31705675 1085527 26794168
9016 26794168 23503101 5629578 -6320181 -14117426 -23189460 -20636720 5552665 40660454
9008 40660454 57617577 49106344 30323666 17448200 16112490 23473732 29009981 19700630
9000 19700630 -3286773 -18088551 -4171936 32114001 63839170 71828857 56672511
8993 56672511 26980606 -9142656 -38864830 -46220277 -29370835 -8060936 -2115627
8986 -2115627 -6955726 -4097220 5761928 -315958 -29306248 -50945680 -34939946 3175129
8978C175129J7204069j4151259j2502296J1249772J3468830j0975150k3608551
8971a6139456o247615J4213055J3586078L311423L33981j176997q540184j0738234
8963a1397949j231721M911960k022592o173921M893186J3861737J456124j9115959
8955a4819135k2165171q333332K514603M114285M608610N847006N440467R131719
8947a3660948J9364866K2868962J0740393k746665l833873n152178k0500051l0871787
8939b3791281j0692792K3691630L0997925O377229j3079199n472811J1116363
8932A9147064J6682786J5318087J2469730J96597k0031526k9124815k0244053
8925e586130j0117421o502934O184373L0548732L6666555O431725k7841544k3148024
$$ plain form
8978 3175129 20379198 6227939 -6274357 4975415 18444245 7469095 -16139456
8971 -16139456 -22387071 -8174016 5412062 8723485 9057466 7880469 -659715 -11397949
8963 -11397949 -12629670 -7717710 -9740302 -15914223 -11021037 2840700 4296824 -14819135
8955 -14819135 -36984306 -45317638 -42803035 -38688750 -34080140 -28233134 -22792667 -13660948
8947 -13660948 5703918 28572880 39313273 36566608 32732735 27580557 7080506 -23791281
8939 -23791281 -34484073 -10792443 20205482 26582711 13503512 8030701 19147064
8932 19147064 35829850 51147937 63617667 63814264 43782738 14657923 -5586130
8925 -5586130 -15703551 -22206485 -16022112 14526620 51193175 57624900 29783356 6635332
8917F635332J1633361K8122733O258694k4097723k9545775j0294239J4888299
8910C600682L2928869L3888372Q187866l4588115n9296919l9591847O210032L2299584
8902a6361476J8476147j0763506k3668784j9072446j4260048j1102147J894666
8895g4857594J8801851J6386699o663679j7508470M765595L2638997K7328204
8888H91603k390184j3104006O751906K2139572R685001p972829m888725M672417
8880A5784755n498570k5719485k5608765m603333P632676j413014j1008866l212278
8872e3646880J1225421J2647072l11969j2822725j1039613P683864L0669013L5163510
8864A9567693J1461733j9211965k6237850r078323M453216P13738l845821L460001
$$ plain form
8917 6635332 18268693 46391426 52650120 28552397 -993378 -11287617 3600682
8910 3600682 36529551 70417923 78605789 44017674 -15279245 -54871092 -48661060 -16361476
8902 -16361476 2114671 -8648835 -32317619 -51390065 -65650113 -76752260 -74857594
8895 -74857594 -56055743 -39669044 -46332723 -63841193 -59075598 -26436601 891603
8888 891603 -1498581 -14602587 -7850681 14288891 23973892 16001063 11112338 15784755
8880 15784755 10286185 -15433300 -41042065 -45645398 -38012722 -39425736 -50434602 -53646880
8872 -53646880 -42421459 -29774387 -30086356 -42909081 -53948694 -46264830 -15595817 19567693
8864 19567693 31029426 11817461 -14420389 -23498712 -19045496 -18331758 -22177579 -18717578
8856a8717578R012527K3533j0000585m744835N115803M75465j2282749j2335441
8848d3453860R55221J1344649J5865323K3300720K7466664J3051178j1434504
8841C7095391j7966108j939952R347243O26368q711958p07010J0232473L579071
8833C1555518j1576122j0739534R534778K9583639L1132927R529367k5445744
8826F3574829m7946380l2967447Q736692L2358518J5460481r820626p009376P486541
8818B9873232l820249l0077932k5696106J1333710K9604280M249727k4015789
8811h549127j3975706J4809694J9387697r654r819925j81843O813625j889155
8803F585606j4757195k0586097k2085515k1619671j3728729L997851K5503897
$$ plain form
8856 -18717578 -9705051 -9681518 -19682103 -24426938 -19311135 -18835670 -31118419 -43453860
8848 -43453860 -42498639 -31153990 -15288667 8012053 35478717 48529895 37095391
8841 37095391 19129283 17189331 26536574 27162942 18450984 17743974 27976447 31555518
8833 31555518 19979396 9239862 18774640 48358279 79491206 89020573 63574829
8826 63574829 15628449 -17338998 -8602306 23756212 39216693 29396067 22386691 29873232
8818 29873232 26052983 -4024949 -29721055 -18387345 11216935 15466662 -8549127
8811 -8549127 -22524833 -7715139 11672558 11662904 1842979 1661136 8474761 6585606
8803 6585606 -8171589 -28757686 -50843201 -72462872 -86191601 -82193750 -56689853
8796e6689853M1709878M2288691J9686241j5102399l0767914r392536K4656494
8789A6388602L1226994N748064j9140827k1187240j0709340j598593J0529106
8782A1256766K7668337L1652049Q539083k3341587l1149625q044429K0038964
8775C6619558K5820953P474655j4273854j7971879k403998J0803588J697677j9342361
8767B8424339k0876981N670608K9456761K1933235k615668j1034941k081681k393920
8759D6481752j6579040j6970155Q429348K9699826J5065364k4954014n2770981
8752a1597900m7126354j5001017K3002685M1561974K2975908j7081558l2462943
8745c5729205j330762L6701181K9490614j3668265l5822418j5593823Q080531
$$ plain form
8796 -56689853 -14979975 27308716 46994957 31892558 1124644 -8267892 16388602
8789 16388602 47615596 53363660 34222833 13035593 2326253 727660 11256766
8782 11256766 38925103 70577152 79116235 55774648 24625023 16580594 36619558
8775 36619558 62440511 69915166 55641312 37669433 35265435 46069023 47766700 28424339
8767 28424339 7547358 13217966 42674727 64607962 61992294 50957353 48875672 46481752
8759 46481752 29902712 12932557 21361905 51061731 66127095 41173081 -11597900
8752 -11597900 -58724254 -73725271 -50722586 -9160612 13815296 -3266262 -35729205
8745 -35729205 -37059967 -358786 29131828 15463563 -20358855 -35952678 -27872147
8738b7872147K296308j3576710r165755P465872J2003785P688903J3023698K3407544
8730A5271498J8126407l578952k1387626k3074498j2514939L827240J7237996
8723f092874J3096948j0150742k7260991j5269674J2129395K3585008J3759094
8716C796164R63636p894921j6793957j3784398J4817453M4950070L4087279j2185029
8708D7956297l7587804j5233633J3676605O560048j6623087j3152057J1374436
8701c029195J7772136P48656o296137R889816K2236645R516189j2313107j9019293
8693A9505710j2591926r491742j0913423l171548J7660658L5048083K9075403
8686F5121215R30545k4029124k3289138n843426j558516j8062741k6137658j836349
$$ plain form
8738 -27872147 -25575839 -39152549 -48318304 -40852432 -28848647 -21159744 -8136046 15271498
8730 15271498 33397905 29818953 8431327 -14643171 -27158110 -23330870 -6092874
8723 -6092874 7004074 -3146668 -30407659 -45677333 -33547938 -9962930 3796164
8716 3796164 4759800 -3135121 -19929078 -33713476 -18896023 26054047 60141326 47956297
8708 47956297 10368493 -4865140 8811465 15371513 -1251574 -14403631 -3029195
8701 -3029195 14742941 15491597 9195460 19085276 41321921 50838110 38525003 19505710
8693 19505710 6913784 -2577958 -13491381 -16662929 997729 36045812 65121215
8686 65121215 66051760 42022636 18733498 12890072 11331556 -6731185 -32868843 -34705192
8678c4705192L4237784M2941476K0047241n045173j7659061k9815639m0967190
8671c0965754k6708785J4918764M1450763K1325722j4973012j7485762P330786
8664e107278J0296789j6095295k1618335J7871525N2565312L0767567k0241990
8657D8438295l4547671n509002J2871404m681068k3510117j7327747r771429k0455364
8649e4492699k0668660J4412055M8404959L2333543j3177035k3561975R724139
8642g025673K6148352p340129m4191051l0289767J6882996M0156388K4952480
8635A9293596O416122P004912R478915l967766j9898479j6909544n6111P864997
8627I226642J037471k747689Q189730J9866140J3594577m526726j2161848m870281
$$ plain form
8678 -34705192 -467408 42474068 62521309 57476136 39817075 10001436 -30965754
8671 -30965754 -57674539 -42755775 -1305012 20020710 5047698 -12438064 -5107278
8664 -5107278 5189511 -10905784 -32524119 -14652594 37912718 68680285 48438295
8657 48438295 13890624 8381622 21253026 16571958 -6938159 -24265906 -34037335 -54492699
8649 -54492699 -75161359 -60749304 -12344345 19989198 6812163 -16749812 -7025673
8642 -7025673 19122679 11782550 -32408501 -62698268 -45815272 -5658884 19293596
8635 19293596 25709718 32714630 42193545 38225779 18327300 1417756 1361645 9226642
8627 9226642 10264113 7516424 15706154 35572294 49166871 44640145 32478297 27608016
8619B7608016j349147j1521052k0857101j5858818m352041L280547J2300779K5178907
8611A4430090K6198718P853086p621735j543307N850530j1625598l4981561k5526054
8603b6965831Q512215K0333147n58106j3285600M434683K1501119R247174j2059269
8595A1159532j0641289P155863J4021069L326268j1258356j7154761n954042K2048880
8587A2703164M2162938K2434612k7451480n5558645l4664577K955271J8195441
8580a9223276J5758241J5513450J1400080n679520j6973471p001530K660233r723493
8572a3269286k2511253o798264J8789680J6302300q177579j7534433m957847N480078
8564c2676604P234531J2190670J3413354l444119j8835744q59689L4886106L9252988
$$ plain form
8619 27608016 26258869 14737817 -6119284 -21978102 -26330143 -23049596 -10748817 14430090
8611 14430090 40628808 48481894 40860159 39316852 45167382 33541784 -1439777 -26965831
8603 -26965831 -18453616 1879531 1321425 -11964175 -7529492 13971627 23218801 11159532
8595 11159532 518243 7674106 21695175 25021443 13763087 -3391674 -9345716 12703164
8587 12703164 54866102 77300714 49849234 -5709411 -40373988 -37418717 -19223276
8580 -19223276 -3465035 12048415 23448495 17768975 795504 -6206026 -3545793 -13269286
8572 -13269286 -35780539 -42578803 -23789123 -7486823 -15664402 -33198835 -38156682 -32676604
8564 -32676604 -25442073 -13251403 161951 -3282168 -22117912 -22977601 11908505 51161493
8556E1161493N324239k1503406j5752246l297056q853750k0280352k1759926j9450533
8548e4411537j6394885j185754K1523371K7342005J5043369J3637126K9010008
8541C4563703K6063855j1333320m3628711l1253376O720005K4955494J6086497
8534B2174147O224290O528082O000568R19673j076490o53729m932555j0309195
8526B4874791p585321K38056K155851l540238r358501j0188352n009289M621152
8518c791851J0316767L020446r766947q834457O478810J2557475j787625j4233807
8510f041189k483527K0009028K3820606N234504j4036345j8784567j1189395K066740
8502a404145J3267833J0301910j0195241k9089915k2154407Q349331L3398468
$$ plain form
8556 51161493 56485732 34982326 19230080 15933024 7079274 -13201078 -34961004 -54411537
8548 -54411537 -70806422 -71992176 -50468805 -23126800 -8083431 5553695 34563703
8541 34563703 60627558 49294238 5665527 -25587849 -18867844 6087650 22174147
8534 22174147 28398437 34926519 40927087 41846760 40770270 40116541 35183986 24874791
8526 24874791 17289470 17527526 19683377 16143139 6784638 -3403714 -8413003 -3791851
8518 -3791851 6524916 9545362 -221585 -9056042 -2577232 9980243 8192618 -6041189
8510 -6041189 -8524716 11484312 35304918 40539422 26503077 7718510 -3470885 -1404145
8502 -1404145 11863688 22165598 11970357 -17119558 -39273965 -30924634 2473834
8495B473834K9979391M584044j6570115j4562220M199693J4325425l13287k4887122
8487g70357k9560432p882200J4678663J4902257j033898j2458331j0767478O6063
8479c2825713J5598244K9532704L0354620J3518174q757250k0326549j8666007
8472H428223j2505264q841021q819047r547247n056157P129897J8109335J6294725
8464E193444M899108k375562l376040p841477j4125351p534324J1630204K1266129
8456G736131R522438p603504j3009048j1533989j1818117o747094R113090K0711838
8448c628255J1895198r584080k4183864k5118788j5510880L560990K4590036K8586783
8440i392860Q784749j2825118j2248739M058097J2172171N618856j823499o1607
$$ plain form
8495 2473834 32453225 37037269 20467154 5904934 10104627 24430052 24116765 -770357
8487 -770357 -30330789 -38212989 -23534326 -8632069 -9665967 -22124298 -32891776 -32825713
8479 -32825713 -17227469 12305235 42659855 56178029 47420779 27094230 8428223
8472 8428223 -4077041 -12918062 -21737109 -31284356 -36340513 -29210616 -11101281 5193444
8464 5193444 10092552 7716990 4340950 -3500527 -17625878 -25160202 -13529998 7736131
8456 7736131 17258569 9655065 -3353983 -14887972 -26706089 -33453183 -24340093 -3628255
8448 -3628255 8266943 -1317137 -25501001 -50619789 -66130669 -62569679 -37979643 -9392860
8440 -9392860 -608111 -13433229 -25681968 -21623871 -9451700 -3832844 -5656343 -5717950
8432e717950P738328J3056485P310366j1028500k5081177j1404800K4156098M1871504
8424D0900354J7416453k2157379l2318874n492260K8548295M1744413K7496216
8417I6137218l493215k7981967k6180180r003898r110908k9955277l3868186k790186
8409d6246599K5745154J6662639n987665m800872M202233j2561466l2907969j0601460
8401f6496005L5822597M1333328k42882k5355280n902887J0731030q625556k5664100
8393d4399755l075105K6945728J7397570j5751918k3782915k154056J3230346
8386c1590105O613672n517433j0394093r448756j615662J3082840K0976790J0857805
8378g034942n561846r262738O80710J3429507K2931326K2993155N626748j8791183
$$ plain form
8432 -5717950 2020378 15076863 22387229 11358729 -13722448 -25127248 -971150 40900354
8424 40900354 58316807 36159428 3840554 -1651706 26896589 68641002 96137218
8417 96137218 92644003 64662036 38481856 29477958 20367050 -9588227 -43456413 -46246599
8409 -46246599 -20501445 -3838806 -9826471 -14627343 -10425110 -22986576 -55894545 -66496005
8401 -66496005 -30673408 10659920 10417038 -14938242 -20841129 -10110099 -18735655 -44399755
8393 -44399755 -47474860 -20529132 -3131562 -18883480 -42666395 -44820451 -31590105
8386 -31590105 -24976433 -30493866 -40887959 -50336715 -51952377 -38869537 -17892747 -7034942
8378 -7034942 -12596788 -21859526 -21178816 -7749309 15182017 38175172 43801920 25010737
8370B5010737k2472745m64636J5112789K661875j4967598j0272363M761827O546910
8362E916796K940254R792344J0769577j4486175m2669961l5480869j316511J9836951
8354d4697594K0352450K2681959K4138008K237206k7562888k1615384J6589524
8347g876719L1953480M708818j8080655k707016J7329981L162366k4449895k5424540
8339b1384180n084389P391254J2216112K3075724K4691011l632890m0310395m6140069
8331d9177822k4254596q618707l093581J7383050M7933176M9462257J2917692
8324D2551469j9565971j5741886L438016L037397j5331771k6174588j9040765
8317d6828099j333098J9620554L5818206L4002005J1892155j0267094j0673858
$$ plain form
8370 25010737 2537992 2073356 17186145 19848020 4880422 -5391941 -630114 5916796
8362 5916796 8857050 18649394 29418971 14932796 -27737165 -63218034 -64534545 -44697594
8354 -44697594 -24345144 -1663185 22474823 24712029 -2850859 -24466243 -7876719
8347 -7876719 24076761 28785579 10704924 7997908 25327889 28490255 4040360 -21384180
8339 -21384180 -26468569 -19077315 -6861203 16214521 40905532 37272642 -3037753 -49177822
8331 -49177822 -73432418 -82051125 -85144706 -67761656 -19828480 29633777 42551469
8324 42551469 22985498 7243612 10681628 13719025 -1612746 -27787334 -46828099
8317 -46828099 -48161197 -28540643 7277563 41279568 53171723 42904629 32230771
8310C2230771P608306K1702774J3719013j4945242m3621762m4020386q520033
8303c5846559K9224091K4611620j8107007m3327215j7981183K1028544K1142374
8296a9255335r220656j7989221R608164L2464519J8937211r871079j7181391n35187
8288a3042975J4922442J3042906k042124j8219855k4052696j4484674J720826
8281d2156150R293662P310762R726290J9310541J9511247L398157r413170k758405
8273A4222934P138904l209307k3952745k5482023o007089O029621j897224r773293
8265d2930222l169289K759968n664600j1969311L941407K9169517L4667032J7269225
8257B4073727j557631j1149963j8165397k1793982j2299705L804328O289118n223660
$$ plain form
8310 32230771 39839077 61541851 75260864 60315622 16693860 -27326526 -35846559
8303 -35846559 -6622468 17989152 -117855 -43445070 -61426253 -40397709 -19255335
8296 -19255335 -28475991 -46465212 -36857048 -4392529 14544682 4673603 -12507788 -13042975
8288 -13042975 1879467 14922373 12880249 -5339606 -29392302 -43876976 -42156150
8281 -42156150 -32862488 -25551726 -15825436 3485105 22996352 26394509 16981339 14222934
8273 14222934 21361838 18152531 -5800214 -31282237 -37289326 -31259705 -33156929 -42930222
8265 -42930222 -46099511 -43339543 -49004143 -60973454 -57032047 -27862530 6804502 24073727
8257 24073727 22516096 11366133 -6799264 -28593246 -40892951 -37088623 -30799505 -36023165
8249c6023165q745607J193828L483980q230851r189048J0311332J8793774l923079
8241c2328836k2458916Q78028L6075456K5723974k0087842l4564560M53180K9017250
8233a7292266J6425081O82361J5988145K9418101L899488k8581036j8940407J1696875
8225A3296342N504803l3012094m1916659l00133M3100423M5597893J8824127q547395
8217D2547307k5937789k6609596m798054J9237400J4104744j0963026j3384085
8210e803099J2445465K2487196j381684j7645591L283569K5792082Q704511k5312760
8202B2569689k8638391m583589O290251o136302j5986927r793297K503781J4644168
8194a9130617K4571022J9206020n476282k2135332o575878J9341132J8544158
$$ plain form
8249 -36023165 -44768772 -43574944 -40090964 -48321815 -57510863 -47199531 -28405757 -32328836
8241 -32328836 -54787752 -53909724 -17834268 7889706 -12198136 -46762696 -46309516 -17292266
8233 -17292266 -867185 -184824 15803321 45221422 49120910 20539874 1599467 13296342
8225 13296342 18801145 -14210949 -56127608 -56427741 -13327318 32270575 51094702 42547307
8217 42547307 16609518 -10000078 -14798132 4439268 18544012 7580986 -5803099
8210 -5803099 6642366 29129562 27747878 10102287 13385856 39177938 47882449 22569689
8202 22569689 -6068702 -10652291 -4362040 -10498342 -26485269 -36278566 -33774785 -19130617
8194 -19130617 5440405 24646425 19170143 -2965189 -9541067 9800065 28344223
8187B8344223j928014o975442L103485l659992k7441637l0473085j152311K4905911
8179a5276862K0751995J819786j0009369j5274069j4949530M00692K1829814K0485734
8171I778191n579749j9908297m019417J2094038J151955j6497427j0715664Q031736
8163b5664634J2205220M997755O824135J4441019J1552972M495941R647148J7224509
8155E5724065N457289j7145246k1431759n775437K381676o457810j1582231k235829
8147a065282M514535k569206p441300N063285K2914401K6004959J4653231L045977
8139F5120600k985885o782322q444465n065063J137265M226493J330719o923565
8131D1613777j8507311k8428915k9296305j7689872J125571J5581738J5340130
$$ plain form
8187 28344223 26416209 19440767 22544252 18884260 -8557377 -39030462 -40182773 -15276862
8179 -15276862 5475133 7294919 -2714450 -17988519 -32938049 -32537357 -10707543 9778191
8171 9778191 4198442 -15709855 -19729272 -7635234 -6483279 -22980706 -33696370 -25664634
8163 -25664634 -13459414 -8461659 -1637524 12803495 24356467 28852408 38499556 55724065
8155 55724065 61181354 44036108 22604349 16828912 19210588 12752778 1170547 -1065282
8147 -1065282 3449253 880047 -6561253 -1497968 21416433 47421392 62074623 65120600
8139 65120600 62134715 55352393 46907928 41842865 42980130 47206623 48537342 41613777
8131 41613777 23106466 -5322449 -34618754 -52308626 -51183055 -35601317 -20261187
8124b0261187J442190r300994L82870K2491949K6192459j217584k8746237j7713569
8116b6730103K4465291N0957864L4510682m389288l0262259k8942883n797407
8109A3811897K6646628M7416167L5343444n544852m3444318n3220914l9348413
8102a8340361j6844358R876685L5588836M2752680K1763578j0734001l0741448
8095C3321611l1795344j8670696M628930K4569844J9191821p578375j6963600
8088F704191R743375L2567439R238814l2036811k9345473J4367523L1688600m256355
8080C8671303l8353870k0656136K0881068L1144553P363865j4034557j7217752
8073G798474j1094995J439766J7232069J5638770j2914256l8252648k8599184
$$ plain form
8124 -20261187 -18818997 -28119991 -27737121 -5245172 20947287 19729703 -9016534 -26730103
8116 -26730103 -2264812 48693052 83203734 78814446 48552187 19609304 13811897
8109 13811897 40458525 87874692 123218136 117673284 74228966 21008052 -18340361
8102 -18340361 -35184719 -25308034 10280802 53033482 74797060 64063059 33321611
8095 33321611 1526267 -17144429 -12515499 12054345 31246166 23667791 6704191
8088 6704191 16447566 49015005 58253819 26217008 -3128465 11239058 42927658 38671303
8080 38671303 317433 -20338703 542365 31686918 39050783 25016226 7798474
8073 7798474 -3296521 -1856755 15375314 31014084 18099828 -20152820 -48752004
8066d8752004m32429R257998K550567P199531J9045012J0014355j3650316j5678595
8058c0445881P299660K0640718J3976771J3684694K3962099J3737372j9650133
8051D3205300l2025063m561267K0757434J0788655p220274l128558M93100j9851799
8043H457528l1023809O28668L6493364K0291517k3938002k6171858J4120978K9482087
8035B8340473n00323k0292525M19J5251526r643141l6222392j9982745J5005442
8027b8043266K1471832O128190O486156K1210183J9223065k44576r221675l305450
8019C3704459m699755j5999347j4531513M595837J8404193J4967652Q290315O704535
8011E1436376j249099j7953200k3081270m852154J8098628K2745058J1244516
$$ plain form
8066 -48752004 -49184433 -39926435 -37375868 -30176337 -11131325 -1116970 -14767286 -30445881
8058 -30445881 -23146221 -2505503 11471268 25155962 49118061 62855433 43205300
8051 43205300 11180237 6618970 27376404 38165059 30944785 27816227 28309327 8457528
8043 8457528 -22566281 -21937613 14555751 34847268 10909266 -15262592 -1141614 28340473
8035 28340473 27840150 7547625 7548044 22799570 13156429 -23065963 -43048708 -28043266
8027 -28043266 -6571434 -443244 6042912 27253095 46476160 46231584 37009909 33704459
8019 33704459 29004704 13005357 -1526156 3069681 21473874 36441526 44731841 51436376
8011 51436376 50187277 32234077 9152807 4300653 22399281 45144339 56388855
8004E6388855j068021j0163651j8223181j8491593n790725O669253J856340j3341060
7996b163783j4818330L392738J9038944J2806416o089015j5773952j1848627p873646
7988b3329255j0979988j1977061j901581J3275982K0921420J7846504J0998685
7981A4854706N649413J76008p504365j3858629j2729276l268676O626284P173133
7973b881402q37987m195259N033378J3025981q13766k9796510l9148984j1912907
7965g1527456K1075351J9173131j0701386k3900323l982301J5001495M477837
7958e0383652j2423526K135026L8327494M9380388K0037067j1171082p713015
7951B8188700J5508588J7996778r358200l7059109l9206657j9667230M033262
$$ plain form
8004 56388855 55320834 45157183 26934002 8442409 2651684 9320937 11177277 -2163783
7996 -2163783 -16982113 -13589375 5449569 18255985 12166970 -3606982 -15455609 -23329255
7988 -23329255 -34309243 -46286304 -48187885 -34911903 -13990483 3856021 14854706
7981 14854706 20504119 20680127 13175762 -682867 -13412143 -16680819 -10054535 -2881402
7973 -2881402 -3719389 -7914648 -2881270 10144711 9330945 -20465565 -59614549 -71527456
7965 -71527456 -50452105 -31278974 -41980360 -65880683 -69862984 -54861489 -50383652
7958 -50383652 -62807178 -60672152 -22344658 27035730 47072797 35901715 28188700
7951 28188700 43697288 61694066 52335866 15276757 -23929900 -43597130 -39563868
7944c9563868K1268349K6142830J4136970o113961j2426330L153549J7618396
7937B4215935P747807j1873446q034724J7240733K5083343L28868k0788303n278127
7929B8642086K3575016K0670157j2844825l4851979k6946140j2659641r412578
7922b3827904l835446J1838501J6667485j896238j7280926p45341K9858971L1178419
7914D1957521l924885l6529566l4117961p106120J3288753J3522682L810287j335410
7906a0434699K336246Q317532O732960m911885j5821363j1360098Q481541K4785652
7898H125886J9373362k934936j8197677j1838657L176935M636475o532408p385047
7890a1576067R506967J8653041j952263l2004366l2411565j629712K1574379J4491271
$$ plain form
7944 -39563868 -18295519 7847311 21984281 15870320 3443990 6597539 24215935
7937 24215935 31963742 20090296 12055572 29296305 54379648 54708516 33920213 28642086
7929 28642086 52217102 72887259 60042434 25190455 -1755685 -14415326 -23827904
7922 -23827904 -27663350 -15824849 842636 -1053602 -18334528 -19079869 10779102 41957521
7914 41957521 38032636 1503070 -32614891 -39721011 -26432258 -12909576 -9099289 -10434699
7906 -10434699 -8098453 219079 6952039 2040154 -13781209 -25141307 -16659766 8125886
7898 8125886 27499248 24564312 6366635 -5472022 -2295087 2341388 -4191020 -11576067
7890 -11576067 -2069100 16583941 14631678 -17372688 -49784253 -51413965 -29839586 -15348315
7882a5348315j814347k589891L874801R87230j209586J3787250L0931126K0325397
7874D8943665j4013330l4579019k1690481L272173J2046046K964272r129993j6345349
7866b8532016j8266801j2524225K169972J9416507K8779558K3183358L506170
7859A7732523j7452686k0536273k723883J1089299j928773k3615383j2662463
7852e0097639L3000760O1943063L5215526j9120245m4084284k8157919q790246
7845b0090984j0146537j4435929j618776J4829485J0922187q559356j5899629
7838d4999539J376349K5714565L2748608J7825892k970949j2131787q382750n661800
7830C518589j3535788k1081027q440959K3320306M4728418L0244392p687406k9754901
$$ plain form
7882 -15348315 -17162662 -19752553 -15877752 -14890522 -16100108 -2312858 28618268 48943665
7874 48943665 34930335 351316 -21339165 -18066992 -6020946 -3056674 -12186667 -28532016
7866 -28532016 -46798817 -59323042 -57153070 -37736563 -8957005 14226353 17732523
7859 17732523 279837 -20256436 -22980319 -11891020 -13819793 -37435176 -50097639
7852 -50097639 -17096879 44846184 80061710 60941465 16857181 -11300738 -20090984
7845 -20090984 -30237521 -44673450 -46292226 -31462741 -20540554 -29099910 -44999539
7838 -44999539 -43623190 -17908625 14839983 32665875 29694926 17563139 9180389 3518589
7830 3518589 -10017199 -31098226 -39539185 -16218879 28509539 58753931 51066525 21311624
7822B1311624j5530496J3407661K1656694K641582j7564205j7003773m989291
7815C929796l792504j2286032o654513J9125161L4555483J2566846k5654496l3556662
7807a1766921l920786K1400903J4364211q35815O501347K0767725Q484099k1216126
7799C3778637k8707069r208193N66935j4078287k1949989k371824J7284612Q516856
7791a6168322q967452r31251K3529598K7897142O985483j0568307j1844819j2436408
7783b504336j8959201j5582994L826271K0899851K1352285J3107441N051636q180432
7775A9010521k6918069l3989423j8467431M535490J4295709J1652653R990525
7768a9890025J0421582L676772r235566j4980374o680199O403699J0569629L959884
$$ plain form
7822 21311624 5781128 19188789 40845483 43487065 25922860 8919087 3929796
7815 3929796 137292 -12148740 -18803253 321908 34877391 47444237 21789741 -11766921
7807 -11766921 -15687707 5713196 20077407 19241592 25742939 46510664 54994763 33778637
7799 33778637 5071568 -4136625 -3569690 -17647977 -39597966 -41969790 -24685178 -16168322
7791 -16168322 -25135774 -26067025 -2537427 25359715 32345198 21776891 9932072 -2504336
7783 -2504336 -21463537 -37046531 -33220260 -12320409 9031876 22139317 27190953 19010521
7775 19010521 -7907548 -41896971 -60364402 -55828912 -41533203 -29880550 -19890025
7768 -19890025 -9468443 -5791671 -15027237 -30007611 -36687810 -30284111 -19714482 -15754598
7760a5754598j424534M819548J4174663N608911k2698856l8920034j4177513L1810339
7752c6562074M8326176K0459555j0963215q980615R856987R949763m206401j08073
7744B7772103K2717461K6433317n125674l6453293k9701196J249651J2203847
7737A9096216q973375k9526354k0272056Q442443K7657796K6762017J4706311
7730C7892998j511582j9259425k7718840j5864587N333461J0508799l313579q569433
7722b2502188J2245328L7960232L8318574J5040363q006038k0743270k7416025
7715B4896976k3429389k924358J6105177P831440j8988730k7513828p593869R089718
7707b2526863J10640j4043429o316521J4601122K2449697J3982189O772829R387899
$$ plain form
7760 -15754598 -17179132 -12359584 1815079 7423990 -15274866 -54194900 -68372413 -36562074
7752 -36562074 11764102 32223657 21260442 12279827 22136814 32086577 27880176 27772103
7744 27772103 50489564 76922881 71797207 35343914 5642718 6892369 19096216
7737 19096216 10122841 -19403513 -39675569 -31233126 -3575330 23186687 37892998
7730 37892998 36381416 17121991 -10596849 -26461436 -21127975 -10619176 -13932755 -22502188
7722 -22502188 -10256860 27703372 66021946 81062309 73056271 52313001 24896976
7715 24896976 1467587 -1456771 14648406 22479846 3491116 -24022712 -31616581 -22526863
7707 -22526863 -22416223 -36459652 -42776173 -28175051 -5725354 8256835 15029664 24417563
7699B4417563J5002644J5813041P740545r823437k6563928k6027973r465953Q36409
7691h071089n540848j0534644M9102J0022508J441327j1618700p160031M058446
7683b7353929m019567k5490757k8657793n396427J9910571L0327977L1831097
7676h848828K6701385O251099k1630374l0096981j1437764J0170719J6566521
7669a2324223J7941511K2175315J2692594j8412452m0995382k3035797J8987509
7662b2970925L8673260K1360660l738408j0575912m337578J683034P601011J3472083
7654D1167225Q738275q317490j9063581j0744566N22922o287705k1073382j4949089
7646c0007391J5072781L8359760L1156303M076494j7363315k1716988j3145635
$$ plain form
7699 24417563 39420207 55233248 62973793 53150356 26586428 558455 -8907498 -8071089
7691 -8071089 -13611937 -24146581 -24097479 -14074971 -12633644 -24252344 -31412375 -27353929
7683 -27353929 -31373496 -56864253 -85522046 -90918473 -71007902 -40679925 -8848828
7676 -8848828 17852557 24103656 2473282 -27623699 -39061463 -28890744 -12324223
7669 -12324223 5617288 27792603 40485197 22072745 -18922637 -41958434 -22970925
7662 -22970925 15702335 37062995 33324587 22748675 18411097 20094131 27695142 41167225
7654 41167225 49905500 41588010 22524429 11779863 12302785 6015080 -15058302 -30007391
7646 -30007391 -14934610 23425150 54581453 58657947 41294632 19577644 6432009
7639F432009m52210N676296j617814j3536079j2982408k85506O118093K180390
7631h467229P300008K6705046L2597002P580038j8738788j0700835J5269218J4016734
7623F5561194j7851080l7876177k1782328R198727K7025478K4701084L162055
7616E2138953l0306612m7066924k2345787J9073701K7009087K070250m566386
7609c993718K0412650K6540006j0152873l5522028l511413M1511704L0703071
7602F5987399k1252788m2884832j6254809Q867996J139529j6927324k0564262
7595d1889091j2931656K210904K7812242M5780262K8506250j1653935k7426798
7588A0408178l335192K2394391J6318323p436479j9644623j7394883j2928113
$$ plain form
7639 6432009 5979799 11656095 10038281 -3497798 -16480206 -16765712 -10647619 -8467229
7631 -8467229 -1167221 25537825 58134827 65714865 46976077 36275242 51544460 65561194
7623 65561194 47710114 9833937 -11948391 -2749664 24275814 48976898 52138953
7616 52138953 21832341 -25234583 -47580370 -28506669 -1497582 572668 -3993718
7609 -3993718 16418932 42958938 32806065 -2715963 -6227376 35284328 65987399
7602 65987399 44734611 1849779 -14405030 -5537034 -4397505 -21324829 -41889091
7595 -41889091 -54820747 -52609843 -24797601 20982661 49488911 37834976 10408178
7588 10408178 7072986 29467377 45785700 38349221 18704598 1309715 -11618398
7581a1618398q082158k70686M888922K287160n345450j5685636k6207887k3831485
7573h3865618K382420L5150181M0929683J4478066j2828189j6590996o965534
7566b7309987l317540n040541j108202R017711J7018277J7449018J1250803N779054
$$ plain form
7581 -11618398 -19700556 -19971242 -15082320 -12795160 -18140610 -33826246 -60034133 -83865618
7573 -83865618 -81483198 -46333017 -5403334 9074732 -3753457 -20344453 -27309987
7566 -27309987 -30627527 -35668068 -36776270 -27758559 -10740282 6708736 17959539 23738593
$$ [...]
##END NTUPLES=NMR SPECTRUM
##END=
