##TITLE=31Pdec_1ABPA2704
 , 24 sc
 27.04.2021
##JCAMPDX= 6.0         $$ Bruker NMR JCAMP-DX V2.0
##DATA TYPE= NMR SPECTRUM
##DATA CLASS= NTUPLES
##ORIGIN= UXNMR, Bruker Analytische Messtechnik GmbH
##OWNER= root
$$ XWIN-NMR		Version 3.5
$$ Tue Apr 27 14:05:51 2021 Russian Standard Time (UT+4h)  she@DPX200
##.OBSERVE FREQUENCY= 81.013821
##.OBSERVE NUCLEUS= ^31P
##.ACQUISITION MODE= SIMULTANEOUS
##.ACQUISITION SCHEME= undefined
##.AVERAGES= 24
##.DIGITISER RES= 16
##SPECTROMETER/DATA SYSTEM= spect
##.PULSE SEQUENCE= zgpg30
##.SOLVENT NAME= D2O
##.SHIFT REFERENCE= (INTERNAL, D2O, 0, 248.564)
##AUDIT TRAIL= $$ (NUMBER, WHEN, WHO, WHERE, WHAT)
$$ ##TITLE= Audit trail, XWIN-NMR		Version 3.5
$$ ##JCAMPDX= 5.01
$$ ##ORIGIN= Bruker BioSpin GmbH
$$ ##OWNER= she
$$ F:/spectra/data/she/nmr/P31/1/pdata/1/auditp.txt
$$ ##AUDIT TRAIL=  $$ (NUMBER, WHEN, WHO, WHERE, WHAT)
(   1,<2021-04-27 14:04:53.81 +0400>,<she>,<DPX200>,
      <created by zg, POWCHK disabled, PULCHK disabled
       configuration hash MD5:
       00 E9 B6 7A A2 85 ED C7 34 08 36 98 17 FE 4E 26
       data hash MD5: 32K
       2D 42 47 85 FA 8C 9E 83 D0 05 6B 63 9D AB 50 AE>)
(   2,<2021-04-27 14:04:56.31 +0400>,<she>,<DPX200>,
      <Start of raw data processing
       efp BC_mod = 2 LB = 1 FT_mod = 6 PKNL = 1 PHC0 = -6057.077 PHC1 = 608.4016 SI = 64K 
       data hash MD5: 64K
       7E 07 E3 CF 11 E5 DC 06 8A 0D 40 54 43 4E 3C B9>)
(   3,<2021-04-27 14:05:22.84 +0400>,<she>,<DPX200>,
      <pk PHC0 = -74.85799 PHC1 = 205 
       data hash MD5: 64K
       DC D2 F5 51 A1 AD 7A 6F 31 ED 3E D8 45 68 25 DE>)
$$ ##END=
$$ 
$$ hash MD5
$$ EE 6A 61 EA 1F 9B CE 2D 7E 47 B1 62 A7 53 0E B0
##$RELAX= 
##$RELAX= 
##$RELAX= 
##$RELAX= 
##$RELAX= 
##$RELAX= 
##$RELAX= 
##$RELAX= 
$$ Bruker specific parameters
$$ --------------------------
##$DU= <F:/spectra>
##$EXPNO= 1
##$NAME= <P31>
##$PROCNO= 1
##$TYPE= <nmr>
##$USER= <she>
##$AMP= (0..31)
100 100 100 100 100 100 100 100 100 100 100 100 100 100 100 100 100 100 
100 100 100 100 100 100 100 100 100 100 100 100 100 100 
##$AQSEQ= 0
##$AQ_mod= 1
##$AUNM= <au_zg>
##$AUTOPOS= <>
##$BF1= 81.014009
##$BF2= 200.13
##$BF3= 200.13
##$BF4= 200.13
##$BF5= 200.13
##$BF6= 200.13
##$BF7= 200.13
##$BF8= 200.13
##$BYTORDA= 1
##$CFDGTYP= 0
##$CFRGTYP= 5
##$CHEMSTR= <none>
##$CNST= (0..31)
1 1 145 1 1 1 1 1 1 1 1 1 1 1 1 1 1 1 1 1 1 1 1 1 1 1 1 1 1 1 1 1 
##$CPDPRG= <waltz16>
##$CPDPRG1= <>
##$CPDPRG2= <waltz16>
##$CPDPRG3= <>
##$CPDPRG4= <mlev>
##$CPDPRG5= <mlev>
##$CPDPRG6= <mlev>
##$CPDPRG7= <mlev>
##$CPDPRG8= <mlev>
##$CPDPRGB= <>
##$CPDPRGT= <>
##$D= (0..31)
0 1 0 0 0 0 0 0 0 0 0 0.03 2e-05 3e-06 0 0 0 0 0 0 0 0 0 0 0 0 0 0 0 0 
0 0 
##$DATE= 1619517893
##$DBL= (0..7)
120 120 120 11 120 120 24 19 
##$DBP= (0..7)
150 150 150 150 150 150 150 150 
##$DBP07= 0
##$DBPNAM0= <>
##$DBPNAM1= <>
##$DBPNAM2= <>
##$DBPNAM3= <>
##$DBPNAM4= <>
##$DBPNAM5= <>
##$DBPNAM6= <>
##$DBPNAM7= <>
##$DBPOAL= (0..7)
0.5 0.5 0.5 0.5 0.5 0.5 0.5 0.5 
##$DBPOFFS= (0..7)
0 0 0 0 0 0 0 0 
$$ [...]
##$SUBNAM2= <"">
##$SUBNAM3= <"">
##$SUBNAM4= <"">
##$SUBNAM5= <"">
##$SUBNAM6= <"">
##$SUBNAM7= <"">
##$SUBNAM8= <"">
##$SUBNAM9= <"">
##$SW= 501.771253377433
##$SWIBOX= (0..15)
0 1 3 0 0 0 0 0 0 0 0 0 0 0 0 0 
##$SW_h= 40650.406504065
##$TD= 32768
##$TD0= 1
##$TE= 0
##$TE2= 300
##$TE3= 300
##$TEG= 300
##$TL= (0..7)
0 120 53 12 22 120 120 120 
##$TP= (0..7)
150 150 150 150 150 150 150 150 
##$TP07= 0
##$TPNAME0= <>
##$TPNAME1= <>
##$TPNAME2= <>
##$TPNAME3= <>
##$TPNAME4= <>
##$TPNAME5= <>
##$TPNAME6= <>
##$TPNAME7= <>
##$TPOAL= (0..7)
0.5 0.5 0.5 0.5 0.5 0.5 0.5 0.5 
##$TPOFFS= (0..7)
0 0 0 0 0 0 0 0 
##$TUNHIN= 0
##$TUNHOUT= 0
##$TUNXOUT= 0
##$USERA1= <user>
##$USERA2= <user>
##$USERA3= <user>
##$USERA4= <user>
##$USERA5= <user>
##$V9= 5
##$VALIST= <valist>
##$VCLIST= <CCCCCCCCCCCCCCC>
##$VD= 0
##$VDLIST= <DDDDDDDDDDDDDDD>
##$VPLIST= <PPPPPPPPPPPPPPP>
##$VTLIST= <TTTTTTTTTTTTTTT>
##$WBST= 1024
##$WBSW= 4
##$XGAIN= (0..3)
0 0 0 0 
##$XL= 0
##$YL= 0
##$YMAX_a= 6319
##$YMIN_a= -7781
##$ZGOPTNS= <>
##$ZL1= 120
##$ZL2= 120
##$ZL3= 120
##$ZL4= 120
##$ABSF1= 0
##$ABSF2= 0
##$ABSG= 0
##$ABSL= 0
##$ALPHA= 0
##$AQORDER= 0
##$ASSFAC= 0
##$ASSFACI= 0
##$ASSFACX= 0
##$ASSWID= 0
##$AUNMP= <proc_1d>
##$AZFE= 0.1
##$AZFW= 0.5
##$BCFW= 0
##$BC_mod= 2
##$BYTORDP= 0
##$COROFFS= 0
##$CY= -3
##$DATMOD= 1
##$DC= 0
##$DFILT= <>
##$DTYPP= 0
##$F1P= 0
##$F2P= 0
##$FCOR= 1
##$FTSIZE= 65536
##$FT_mod= 6
##$GAMMA= 0
##$GB= 0
##$INTBC= 1
##$INTSCL= 5.30512e-09
##$ISEN= 30
##$LB= 1
##$LEV0= 0
##$LPBIN= 0
##$MAXI= 10000
##$MC2= 0
##$MEAN= 0
##$ME_mod= 0
##$MI= 50
##$NCOEF= 0
##$NC_proc= -6
##$NLEV= 6
##$NOISF1= 182.463
##$NOISF2= 159.3651
##$NSP= 0
##$NTH_PI= 0
##$NZP= 0
##$OFFSET= 248.5645
##$PC= 4
##$PHC0= -6131.935
##$PHC1= 813.4016
##$PH_mod= 1
##$PKNL= yes
##$PPARMOD= 0
##$PSCAL= 0
##$PSIGN= 0
##$REVERSE= no
##$SF= 81.014009
##$SI= 65536
##$SIGF1= 159.3651
##$SIGF2= -187.1042
##$SINO= 113.3802
##$SIOLD= 16384
##$SREGLST= <1H.CDCl3>
##$SSB= 0
##$STSI= 65536
##$STSR= 0
##$SW_p= 40650.406504065
##$SYMM= 0
##$S_DEV= 0
##$TDeff= 32768
##$TDoff= 0
##$TI= <>
##$TILT= no
##$TM1= 0
##$TM2= 0
##$TOPLEV= 0
##$USERP1= <user>
##$USERP2= <user>
##$USERP3= <user>
##$USERP4= <user>
##$USERP5= <user>
##$WDW= 1
##$XDIM= 65536
##$YMAX_p= 424858389
##$YMIN_p= -47377609
$$ End of Bruker specific parameters
$$ ---------------------------------
##NTUPLES= NMR SPECTRUM
##VAR_NAME=  FREQUENCY,     SPECTRUM/REAL,   SPECTRUM/IMAG
##SYMBOL=    X,             R,               I
##VAR_TYPE=  INDEPENDENT,   DEPENDENT,       DEPENDENT
##VAR_FORM=  AFFN,          ASDF,            ASDF
##VAR_DIM=   65536,         65536,           65536
##UNITS=     HZ,            ARBITRARY UNITS, ARBITRARY UNITS
##FACTOR=    0.620285442955139, 1,           1
##FIRST=     20137.2065510759, 0,            0
##LAST=      -20513.1999529892, 0,           0
##MIN=       -20513.1999529892, -47377609,   0
##MAX=       20137.2065510759, 424858389,    0
$$ Real data points
##PAGE= N=1
##DATA TABLE= (X++(R..R)), XYDATA
$$ [...]
$$ plain form
44245 4016504 1929234 1158918 1008839 728922 693787 1286106 1830652 1481576 491325
44236 491325 -80422 458519 1893652 3323193 3693526 2527385 318200 -1915158 -3184389
44227 -3184389 -2556761 301828 3793103 4884600 2517895 -571071 -1411543 -1003563 -2199661
44218 -2199661 -4315461 -3662571 375578 3889861 4267460 3553076 4052519 4319629 2336681
44209 2336681 -390862 -1145256 -53696 1208520 2522051 3961554 3594355 345634
44201 345634 -2741604 -2080165 944108 2075879 814672 600896 2718302 4382257 3436867
44192 3436867 1173086 -401476 -935901 -601382 574915 1565402 1083283 -147461 -341621
44183 -341621 172275 -387802 -1536091 -894878 1401485 2331526 827249 -587810 -159103
$$ packed form
44245D016504k087270p70316j50079k79917l5135N92319N44546l49076r90251
44236D91325n71747N38941J435133J429541L70333j166141k209185k233358j269231
44227c184389O27628K858589L491275J091497k366705l088966q40472M07980j196098
44218b199661k115800O52890M038149L514283L77599p14384M99443K67110j982948
44209B336681k727543p54394J091560J262216J313531J439503l67199l248721
44201C45634l087238O61439L024273J131771j261207k13776K117406J663955r45390
44192C436867k263781j574562n34425L34519J176297R90487m82119j230744j94160
44183c41621N13896n60077j148289O41213K296363R30041j504277j415059M28707
$$ plain form
44174 -159103 575053 97076 -567507 -413102 -465495 -1242240 -1008272 1263839 3630100
44165 3630100 4008584 3080357 2336779 1454029 -110933 -861622 874224 4076619 6191641
44156 6191641 6318238 5682179 5763301 7005618 8393493 7745817 3908967 -973596 -3350203
44147 -3350203 -2738611 -1865349 -2094168 -2051193 -1537908 -2653814 -5146530 -4966639 -569515
44138 -569515 3175334 1388582 -3481936 -5150531 -2167759 1441025 2760602 2589287
44130 2589287 2049434 927127 -349539 -480596 640647 2181715 4237136 6723884
44122 6723884 7301973 3854049 -1381054 -3807077 -2648808 -1502065 -2344750 -2827835 -727978
44113 -727978 2387990 3916667 4075684 4857938 6734720 8263545 8125374 6320893 3877612
$$ packed form
44174a59103P34156m77977o64583J54405n2393p76745K33968K272111K366261
44165C630100L78484r28227p43578q82750j564962p50689J735846L202395K115022
44156F191641J26597o36059Q1122J242317J387875o47676l836850m882563k376607
44147c350203O11592Q73262k28819M2975N13285j115906k492716J79891M397124
44138e69515L744849j786752m870518j668595K982772L608784J319577j71315
44130B589287n39853j122307j276666j31057J121243J541068K055421K486748
44122F723884N78089l447924n235103k426023J158269J146743q42685m83085K099857
44113g27978L115968J528677J59017P82254J876782J528825j38171j804481k443281
$$ plain form
44104 3877612 1989772 1007319 249443 -661313 -933144 -143518 273734 -1181750 -3465382
44095 -3465382 -4159762 -2806257 -1014775 280878 1337898 1688191 361690 -1778840
44087 -1778840 -2414579 -936522 898731 1720894 1799736 1504744 953751 1262711 3377161
44078 3377161 5434002 4422397 1045598 -536183 1074022 2249360 221726 -2392579
44070 -2392579 -1841777 946496 2286933 1362470 261178 -180678 -765528 -880559 1060259
44061 1060259 3945983 4380757 1764885 -194862 1276650 3872362 3668041 1042923
44053 1042923 206355 3113444 6637814 6849450 4121524 2079001 2429422 3221148 2513585
44044 2513585 1464583 2258403 4462246 5531865 4422498 2718778 2089912 2295223 2143158
$$ packed form
44104C877612j887840r82453p57876r10756k71831P89626M17252j455484k283632
44095c465382o94380J353505J791482J295653J057020L50293j326501k140530
44087a778840o35739J478057J835253Q22163P8842k94992n50993L08960K114450
44078C377161K056841j011605l376799j581781J610205J175338k027634k614305
44070b392579N50802K788273J340437r24463j101292m41856n84850j15031J940818
44061A060259K885724M34774k615872j959747J471512K595712k04321k625118
44053A042923q36568K907089L524370K11636k727926k042523L50421P91726p07563
44044B513585j049002P93820K203843J069619j109367j703720o28866K05311j52065
$$ plain form
44035 2143158 1191494 49987 -213173 1032267 2868671 3095558 870844 -1516143 -1307114
44026 -1307114 762010 1452885 -176754 -1749040 -1801925 -1984666 -3657521 -5091673 -4101941
44017 -4101941 -1284198 1529137 4064209 6438406 7038769 4624466 1496726 1390408
44009 1390408 4462119 7236450 7613844 7122748 7593283 8221596 7251903 4714280 2066200
44000 2066200 347456 -103671 845470 2593193 3445495 2108303 -560741 -2213974 -1541458
43991 -1541458 417699 1595638 1092798 -211335 -1041766 -1261921 -1711319 -2766824 -3736137
43982 -3736137 -3882020 -3435605 -3155209 -3366720 -3950935 -4802297 -5613330 -5560370 -4059400
43973 -4059400 -1812403 -397773 -672875 -2001753 -3052804 -2918556 -1498741 626782
$$ packed form
44035B143158r51664j141507k63160J245440J836404K26887k224714k386987K09029
44026a307114K069124O90875j629639j572286n2885j82741j672855j434152R89732
44017d101941K817743K813335K535072K374197O00363k414303l127740j06318
44009A390408L071711K774331L77394m91096M70535O28313r69693k537623k648080
44000B066200j718744m51127R49141J747723Q52302j337192k669044j653233O72516
43991a541458J959157J177939n02840j304133q30431k20155m49398j055505r69313
43982c736137j45883M46415K80396k11511n84215q51362q11033N2960J500970
43973d059400K246997J414630k75102j328878j051051J34248J419815K125523
$$ plain form
43965 626782 2429201 2845967 1366563 -1523535 -4333467 -5285489 -3725661 -1038352 435140
43956 435140 -221700 -1669511 -2166823 -1545290 -752627 -206590 358280 869831 987787
43947 987787 1099114 1973409 3189531 3156302 1318850 -733284 -1281438 -723825 -551080
43938 -551080 -663534 562318 3368123 5573312 5438208 4154752 3934887 4597882 4136171
43929 4136171 2378343 1683968 3347602 5493773 5858744 4876001 4284623 4127407 3254762
43920 3254762 1883356 1373129 1853973 2203602 2198469 2600675 3188625 2911020 2125774 2332618
43910 2332618 3247377 2634596 -18489 -2056537 -1304526 849318 1658998 662411 -570419
43901 -570419 -915096 -161460 1794016 4332795 5491083 3782339 332213 -2125282 -2094159
$$ packed form
43965F26782J802419M16766j479404k890098k809932r52022J559828K687309J473492
43956D35140o56840j447811m97312O21533P92663N46037N64870N11551J17956
43947I87787J11327Q74295J216122l3229j837452k052134n48154N57613J72745
43938e51080j12454J225852K805805K205189j35104j283456k19865O62995m61711
43929D136171j757828o94375J663634K146171L64971r82743n91378j57216q72645
43920C254762j371406n10227M80844L49629n133M02206N87950k77605p85246K06844
43910B332618R14759o12781k653085k038048P52011K153844Q09680r96587j232830
43901e70419l44677P53636J955476K538779J158288j708744l450126k457495L1123
$$ plain form
43892 -2094159 -296615 1546279 2060229 1107853 122958 717420 2435083 3169384 2289192
43883 2289192 1441257 1432774 813202 -888631 -1298551 886850 2661627 811679 -2646179
43874 -2646179 -3050591 90135 3027084 3844730 4145585 4626532 3661539 1366390 719516
43865 719516 2797001 4633416 3922093 2408434 2228295 2161341 482094 -1280530 -840178
43856 -840178 735494 959076 373269 1383737 3660442 4476165 3294551 2349258 2413111
43847 2413111 1601595 -630614 -1670536 199841 2535151 1959959 -944693 -2591719
43839 -2591719 -1535226 -117651 -709530 -2496616 -3168037 -2336990 -1546630 -1439583 -903126
43830 -903126 587093 1670333 1399033 1284712 3038384 5226134 4770042 1663615 -596152
$$ packed form
43892b094159J797544J842894N13950r52376r84895N94462J717663P34301q80192
43883B289192q47935q483o19572j701833m09920K185401J774777j849948l457858
43874b646179m04412L140726K936949Q17646L00855M80947r64993k295149o46874
43865G19516K077485J836415p11323j513659j80139o6954j679247j762624M40352
43856h40178J575672K23582n85807J010468K276705Q15723j181614r45293O3853
43847B413111q11516k232209j039922J870377K335310n75192k904652j647026
43839b591719J056493J417575n91879j787086o71421Q31047P90360J07047N36457
43830i03126J490219J083240k71300j14321J753672K187750m56092l106427k259767
$$ plain form
43821 -596152 73043 1788905 2406353 2940833 4937412 6746870 5716531 2884977 1955945
43812 1955945 3734596 4941953 3314960 934943 914256 2919673 4020736 2873998
43804 2873998 1088150 592595 1171094 1236948 422795 397572 2530599 5312708 5557921
43795 5557921 2542327 -676102 -1153058 335100 1275643 1396992 2038500 2614739 1089555
43786 1089555 -2016517 -3496968 -2165875 -567700 -682254 -929206 629616 2778081
43778 2778081 3303222 2609160 2557457 3263785 3627155 3706337 3937773 3259751 994663 -393288
43768 -393288 2116255 6985983 9092011 6346546 2182479 444785 764315 604228 -543070
43759 -543070 -1107628 -144415 1728986 3332634 3793086 3204614 2947163 4155134 5607410
$$ packed form
43821e96152O69195J715862O17448N34480J996579J809458j030339k831554r29032
43812A955945J778651J207357j626993k380017k0687K005417J101063j146738
43804B873998j785848m95555N78499O5854q14153k5223K133027K782109K45213
43795E557921l015594l218429m76956J488158R40543J21349O41508N76239j525184
43786A089555l106072j480451J331093J598175j14554k46952J558822K148465
43778B778081N25141o94062n1703P06328L63370P9182K31436o78022k265088j387951
43768c93288K509543M869728K106028k745465m164067j737694L19530j60087j147298
43759e43070n64558R63213J873401J603648M60452n88472k57451J207971J452276
$$ plain form
43750 5607410 5017142 2928022 2772599 5691806 7994874 6157278 2111043 418744
43742 418744 1626622 2019894 -385384 -3086239 -2945630 -118269 2766086 3404015 1249315
43733 1249315 -2086101 -3618190 -2084842 -243057 -1663657 -5206957 -5930024 -2265611
43725 -2265611 1486589 1794980 1180570 3417887 6584736 5764342 1198098 -1620455 -303573
43716 -303573 1013141 -1554690 -5602729 -6173967 -2792702 582629 1219424 122086 -622436
43707 -622436 -336776 638398 1862479 2780564 2933668 2417289 1407756 -368618 -2626157
43698 -2626157 -3559514 -1574236 2045852 3926139 2584424 288981 259321 3048531 6417101
43689 6417101 7984973 7260504 5522010 4266815 3633301 2395532 -66553 -2254160
$$ packed form
43750E607410n90268k089120j55423K919207K303068j837596m046235j692299
43742D18744J207878L93272k405278k700855J40609K827361K884355O37929k154700
43733A249315l335416j532089J533348J841785j420600l543300p23067L664413
43725b265611L752200L08391o14410K237317L166849q20394m566244k818553J316882
43716c03573J316714k567831m048039n71238L381265L375331O36795j097338p44522
43707f22436K85660R75174J224081R18085J53104n16379j009533j776374k257539
43698b626157r33357J985278L620088J880287j341715k295443k9660K789210L368570
43689F417101J567872p24469j738494j255195o33514j237769k462085k187607
$$ plain form
43681 -2254160 -2117905 102477 2126304 2783956 3068620 3571723 3100597 1162459 -274269
43672 -274269 437396 1704069 1065124 -688164 -730483 1004537 1587484 18157 -971924
43663 -971924 604864 2682451 2477868 845296 564347 1740861 1957538 506896 -546993
43654 -546993 6493 450458 -1058950 -3492097 -4412149 -3373298 -2095482 -1602024 -932328
43645 -932328 787367 2313900 1593682 -1209411 -3238483 -1996455 1870838 5553066
43637 5553066 7304874 7674160 7653999 6900514 4492360 836978 -1963090 -1720472 1867845
43628 1867845 6581066 9172215 8176645 5294128 3392938 3308020 3549746 3005687 2439880
43619 2439880 2931154 4302930 5792268 6877042 6679226 4216916 493977 -1306195
$$ packed form
43681b254160J36255K220382K023827O57652K84664N03103m71126j938138j436728
43672b74269P11665J266673o38945j753288m2319J735020N82947j569327r90081
43663i71924J576788K077587k04583j632572k80949J176514K16677j450642j053889
43654e46993N53486M43965j509408k433147r20052J038851J277816M93458O69696
43645i32328J719695J526533p20218k803093k029072J242028L867293L682228
43637E553066J751808L69286k0161p53485k408154l655382k800068K42618L588317
43628A867845M713221K591149r95570k882517j901190q4918K41726n44059n65807
43619B439880M91274J371776J489338J084774j97816k462310l722939j800172
$$ plain form
43611 -1306195 523792 3629423 4509371 2818105 714314 -766102 -1939199 -1993597 337739
43602 337739 3619333 4604324 3001846 2196194 4039979 6004521 5273233 2861008 1352865
43593 1352865 931875 401122 277402 1750760 3733813 4107566 3329426 3749569 5527778
43584 5527778 6322276 5351903 4651537 5259080 5015874 1964617 -2203980 -4263351 -3658719
43575 -3658719 -2444365 -1802239 -863670 959715 2410401 2017340 301093 -628034 458211
43566 458211 2401719 2907752 1200667 -1001668 -1507022 -231135 994611 1002444 584745
43557 584745 943208 1905587 2330419 1533795 -269608 -2208552 -2918234 -1456225 1140776
43548 1140776 2285545 981284 -481896 506036 3081620 4020202 2119995 -740410
$$ packed form
43611a306195J829987L105631Q79948j691266k103791j480416j173097n4398K331336
43602C37739L281594R84991j602478q05652J843785J964542p31288k412225j508143
43593A352865m20990n30753j23720J473358J983053L73753p78140M20143J778209
43584E527778P94498r70373p00366O07543k43206l051257m168597k059371O04632
43575c658719J214354O42126R38569J823385J450686l93061j716247r29127J086245
43566D58211J943508N06033j707085k202335n05354J275887J225746P833m17699
43557E84745L58463R62379M24832p96624j803403j938944p09682J462009K597001
43548A140776J144769j304261j463180R87932K575584R38582j900207k860405
$$ plain form
43540 -740410 -2744639 -3770006 -3503650 -812965 3609010 6434704 5543223 2871830 1467718
43531 1467718 1466221 1318095 1304590 2791978 5023847 5936527 5739713 6385183 7543531
43522 7543531 6647554 3452825 921092 399690 -489559 -3323507 -5681413 -5096722 -3322203
43513 -3322203 -3500531 -5246326 -5857716 -4798377 -3583454 -2403000 -376743 1491959
43505 1491959 1097017 -1174132 -2786004 -3009040 -3463896 -4592568 -4792085 -3604304 -2634171
43496 -2634171 -2366828 -1050279 1941975 4328307 4123766 2411359 1291158 1019166 855018
43487 855018 1031452 2052593 3205114 3309731 2158434 289104 -1667065 -2826356 -2594544
43478 -2594544 -1869391 -2057405 -2505054 -1140314 1669019 2741267 1029415 -24082 2495571
$$ packed form
43540g40410k004229j025367K66356K690685M421975K825694q91481k671393j404112
43531A467718j497j48126j3505J487388K231869R12680j96814O45470J158348
43522G543531q95977l194729k531733n21402q89249k833948k357906N84691J774519
43513c322203j78328j745795o11390J059339J214923J180454K026257J868702
43505A491959l94942k271149j611872k23036m54856j128672j99517J187781R70133
43496b634171K67343J316549K992254K386332k04541j712407j120201k71992j64148
43487H55018J76434J021141J152521J04617j151297j869330j956169j159291K31812
43478b594544P25153j88014m47649J364740K809333J072248j711852j053497K519653
$$ plain form
43469 2495571 6134749 6386811 3106292 187342 -220191 296280 95372 -86168 764398
43460 764398 1743611 1209292 -995238 -3314853 -4009893 -2739337 -842803 281886 981084
43451 981084 2334718 3403744 1870010 -1612475 -2621543 1095240 5358280 4603131
43443 4603131 -392175 -3603018 -1886392 1775658 3207833 1644868 -1231427 -3688601
43435 -3688601 -4366328 -2906715 -1114442 -1253104 -2637188 -2424440 -268137 939698 76760
43426 76760 201597 3818452 8465899 9743549 6889042 2726262 -438898 -2097012 -1794106
43417 -1794106 767131 3892900 4768649 2770407 124682 -1161995 -1334713 -1286710 -692119
43408 -692119 979957 2719855 2874498 1511590 430784 571300 742063 -298807 -1691923
$$ packed form
43469B495571L639178K52062l280519k918950m07533N16471k00908j81540Q50566
43460G64398R79213n34319k204530k319615o95040J270556J896534J124689O99198
43451I81084J353634J069026j533734l482485j009068L716783M263040p55149
43443D603131m995306l210843J716626L662050J432175j562965k876295k457174
43435c688601o77727J459613J792273j38662j384084K12748K156303J207835q62938
43426G6760J24837L616855M647447J277650k854507m162780l165160j658114L02906
43417a794106K561237L125769Q75749j998242k645725j286677j72718M8003N94591
43408f92119J672076J739898J54643j362908j080806J40516J70763j040870j393116
$$ plain form
43399 -1691923 -1841952 -1195077 -1635609 -3092932 -3040152 -307596 2659899 2895596 615494
43390 615494 -1925465 -3765187 -5282720 -6145118 -5658589 -4445729 -3537375 -2594991 -1288101
43381 -1288101 -1182482 -3198093 -4332357 -957429 4929705 7260030 4323935 1062915
43373 1062915 1501889 3533179 3656819 2513565 2274554 2258620 1237534 1095956 3615924
43364 3615924 5859257 3770629 -838666 -1990155 1973226 6328423 6902671 4682148
43356 4682148 2425129 775569 -402271 -220779 1346519 2184668 858231 -1016339
43348 -1016339 -1050283 734464 2553180 3295460 2916336 1785744 989329 1840520 3729014
43339 3729014 4010091 1585295 -1067443 -1338868 -249732 -243110 -695413 978330 4266314
$$ packed form
43399a691923j50029O46875m40532j457323N2780K732556K967495K35697k280102
43390F15494k540959j839722j517533q62398M86529J212860R08354R42384J306890
43381a288101J05619k015611j134264L374928N887134K330325k936095l261020
43373A062915M38974K031290J23640j143254k39011j5934j021086j41578K519968
43364C615924K243333k088628m609295j151489L963381M355197N74248k220523
43356D682148k257019j649560j177840J81492J567298Q38149j326437j874570
43348a016339l3944J784747J818716P42280l79124j130592p96415Q51191J888494
43339C729014K81077k424796k652738k71425J089136O622m52303J673743L287984
$$ plain form
43330 4266314 5398855 2975530 277077 318302 1642767 1521951 846228 2366718 5330747
43321 5330747 5731781 2125075 -2158386 -3618997 -2563749 -1023976 617350 2642903
43313 2642903 3737342 2676594 1206896 2155905 4891872 5616666 2664121 -1158029
43305 -1158029 -2530024 -1615217 -638467 -335319 293943 1733121 3215640 3875157 3509146
43296 3509146 2549140 1961819 2521708 3550128 3291587 1286699 -726923 -1211807 -852477
43287 -852477 -865589 -584357 1353357 4182829 5474129 4221394 1695632 -597787 -1980063
43278 -1980063 -1757147 490914 3319625 4169397 2603444 1089724 1562207 2910231 3256631
43269 3256631 3091631 4048689 5535477 5128827 2430803 208816 737681 2792896 3786756
$$ packed form
43330D266314J132541k423325k698453M1225J324465j20816o75723J520490K964029
43321E330747M01034l606706m283461j460611J055248J539773J641326K025553
43313B642903J094439j060748j469698R49009K735967P24794k952545l822150
43305a158029j371995R14807R76750L03148O29262J439178J482519O59517l66011
43296C509146r60006n87321N59889J028420k58541k004888k013622m84884L59330
43287h52477j3112K81232J937714K829472J291300j252735k525762k293419j382276
43278a980063K22916K248061K828711Q49772j565953j513720M72483J348024L46400
43269C256631j65000R57058J486788m06650k698024k221987N28865K055215R93860
$$ plain form
43260 3786756 3656322 4558586 6996985 8460301 6704460 2725391 -822349 -2929251
43252 -2929251 -4267277 -4778602 -3493737 -864394 885262 572367 -473954 -725961 -554837
43243 -554837 -644733 8571 2334297 4465273 3497132 -6689 -1860563 453830 4379404
43234 4379404 5636262 3569312 1338928 1470916 3160772 4157610 3648085 2439197 1441402
43225 1441402 1194906 2270943 4649635 6721925 6492817 4369240 3238821 4618319
43217 4618319 6126709 4664016 1126083 -590201 863314 2511416 1560254 -962803
43209 -962803 -2511075 -2621332 -2192384 -1073878 1087217 2798524 2177223 -90317 -1615590
43200 -1615590 -1767743 -1930695 -2508278 -2173794 -431213 1295076 1707133 978835 -280655
$$ packed form
43260C786756j30434R02264K438399J463316j755841l979069l547740k106902
43252b929251j338026n11325J284865K629343J749656l12895j046321k52007J71124
43243e54837q9896O53304K325726K130976r68141l503821j853874K314393L925574
43234D379404J256858k066950k230384J31988J689856R96838n09525j208888r97795
43225A441402k46496J076037K378692K072290k29108k123577j130419J379498
43217D618319J508390j462693l537933j716284J453515J648102r51162k523057
43209i62803j548272j10257M28948J118506K161095J711307o21301k267540j525273
43200a615590j52153j62952n77583L34484J742581J726289M12057p28298j259490
$$ plain form
43191 -280655 -1564209 -1738988 93213 2573988 3176352 1909137 1451356 2711088 3130162
43182 3130162 1083726 -894656 125454 2791994 3733912 2889197 3004571 4653777 5556447
43173 5556447 4957668 4970752 6541924 7377376 5659803 3210642 2740591 3818864 3920332
43164 3920332 2263065 301168 -906448 -1640574 -2101951 -2017681 -1732245 -1985483 -2362412
43155 -2362412 -1478757 914099 3335828 4479703 4435039 3595203 1799083 -578906 -1927941
43146 -1927941 -1025235 1311258 3228395 3966765 4058195 3963192 3652268 3306408 3356241 3750795
43136 3750795 3908449 3397309 2148611 242570 -1896304 -3400557 -3765284 -3433250 -2867411
43127 -2867411 -1581432 844139 3269844 3989724 3134998 2559197 3089771 3424232 2338806
$$ packed form
43191b80655j283554j74779J832201K480775O02364j267215m57781J259732M19074
43182C130162k046436j978382J020110K666540R41918q44715J15374J649206R02670
43173E556447n98779J3084J571172Q35452j717573k449161m70051J078273J01468
43164C920332j657267j961897j207616p34126m61377Q4270K85436k53238l76929
43155b362412Q83655K392856K421729J143875m4664q39836j796120k377989j349035
43146a927941R02706K336493J917137P38370R1430r5003l10924l45860M9833L94554
43136C750795J57654n11140j248698j906041k138874j504253l64727L32034N65839
43127b867411J285979K425571K425705P19880q54726n75801N30574L34461j085426
$$ plain form
43118 2338806 588826 -278940 96614 1052019 2085744 2808413 2472138 820251 -926983
43109 -926983 -1125485 217844 1352373 984086 -163288 -439049 506923 1283529 702163
43100 702163 -490494 -629894 361038 761631 -262206 -1236341 -742808 176495 -250461
43091 -250461 -1423358 -1252438 399425 1665773 1950285 2536463 3589891 3450558 1871887
43082 1871887 1146231 2497683 3892496 3261044 1582216 710387 362665 -275112 47357
43073 47357 2650571 5681379 5946826 3335095 691918 -250415 -292561 -483454 -881086
43064 -881086 -1451016 -2010361 -1494471 597811 2361493 1376036 -1730391 -3833954 -3283747
43055 -3283747 -1129765 1303404 3518733 4560545 3357528 833318 -693432 -717438
$$ packed form
43118B338806j749980q67766L75554R55405J033725P22669l36275j651887j747234
43109i26983j98502J343329J134529l68287j147374k75761R45972P76606n81366
43100G02163j192657j39400R90932M00593j023837r74135M93533R19303m26956
43091b50461j172897J70920J651863J266348K84512N86178J053428j39333j578671
43082A871887p25656J351452J394813o31452j678828q71829l47722o37777L22469
43073D7357K603214L030808K65447k611731k643177r42333m2146j90893l97632
43064h81086n69930n59345N15890K092282J763682r85457l106427k103563N50207
43055c283747K153982K433169K215329J041812j203017k524210j526750k4006
$$ plain form
43047 -717438 -964187 -2236278 -3181953 -2775207 -1783110 -1085395 -541283 -32436 316476
43038 316476 1138285 2849193 3795673 2219857 44801 1032156 4522142 5251452 1169636
43029 1169636 -2817200 -1822131 2046805 3520574 2031105 1138556 1856700 1526534 -837883
43020 -837883 -2549081 -1592166 427282 1140808 791476 1195029 2912644 4836188 5669029
43011 5669029 4832676 2519418 -346745 -2379942 -2431113 -313736 2828770 4983970 4873050
43002 4873050 3310350 2171041 1942028 1567362 899812 1344232 3107152 3879893 2052880
42993 2052880 -385709 -371654 1910880 3549339 3096395 1921819 1588666 2024231 2440695
42984 2440695 2312345 1281109 -400852 -1333722 -396906 1314365 1572497 102923 -1042026
$$ packed form
43047g17438k46749j272091r45675M06746R92097O97715N44112N08847L48912
43038C16476Q21809J710908R46480j575816k175056R87355L489986P29310m081816
43029A169636l986836R95069L868936J473769j489469q92549P18144l30166k364417
43020h37883j711198R56915K019448P13526l49332M03553J717615J923544Q32841
43011E669029q36353k313258k866163k033197n1171K117377L142506K155200j10920
43002D873050j562700j139309k29013l74666o67550M44420J762920P72741j827013
42993B052880k438589J4055K282534J638459m52944j174576l33153M35565M16464
42984B440695j28350j031236j681961r32870R36816J711271K58132j469574j144949
$$ plain form
42975 -1042026 -414389 1145250 2194240 2521532 2540288 2064166 713733 -972623 -1595184
42966 -1595184 -145422 2751258 4840849 4138748 1258715 -1001730 -1118799 -758800 -1998737
42957 -1998737 -3854019 -3634743 -1133890 937752 826767 -154120 30567 1571866 3405725
42948 3405725 4790933 5354023 4800211 3491468 2352669 1534900 211827 -1642526 -2500104
42939 -2500104 -1337251 541027 1015110 -102986 -1186172 -1433752 -1891962 -3292504 -4101039
42930 -4101039 -2148590 1996537 4914001 4428025 2501704 2455438 4257303 4961318 3525052
42921 3525052 2105870 1849818 862862 -1639893 -2575493 255102 3382752 2105655 -1895971
42912 -1895971 -2484872 1734835 5467954 4911200 2701474 2522747 3482883 3214393 2825773
$$ packed form
42975a042026O27637J559639J048990L27292J8756m76122j350433j686356o22561
42966a595184J449762K896680K089591p02101k880033k260445j17069L59999j239937
42957a998737j855282K19276K500853K071642j10985r80887J84687J541299J833859
42948C405725J385208N63090n53812j308743j138799q17769j323073j854353q57578
42939b500104J162853J878278M74083j118096j083186k47580m58210j400542q08535
42930d101039J952449M145127K917464m85976j926321m6266J801865P04015j436266
42921C525052j419182k56052r86956k502755r35600K830595L127650j277097m001626
42912a895971n88901M219707L733119n56754k209726j78727R60136k68490l88620
$$ plain form
42903 2825773 4593416 7132835 7142334 4715769 3052662 3445200 4008128 3253441 1832385
42894 1832385 579663 -415760 -566881 722418 1949682 592815 -2911438 -4796363
42886 -4796363 -2769441 1026999 3307512 3841761 4395671 5113684 4614222 3196131 3270405
42877 3270405 5840194 8460059 8136005 5301653 3281454 3891345 5137910 4050440
42869 4050440 663975 -2212987 -2771909 -2097597 -1965327 -2308051 -1949977 -865412 -315003
42860 -315003 -985657 -2083668 -2362713 -1422407 16852 761226 267318 -651425 -758849
42851 -758849 -282707 -910092 -3227201 -5270464 -4860544 -2527485 -620421 -183112 -497538
42842 -497538 -1244203 -2799455 -4132132 -2823609 1606585 6103450 7204429 4636791
$$ packed form
42903B825773J767643K539419R499k426565j663107L92538N62928p54687j421056
42894A832385j252722r95423j51121J289299J227264j356867l504253j884925
42886d796363K026922L796440K280513N34249N53910P18013m99462j418091P4274
42877C270405K569789K619865l24054k834352k020199O09891J246565j087470
42869D050440l386465k876962n58922O74312J32270l42724L58074J084565N50409
42860c15003o70654j098011k79045R40306J439259P44374m93908r18743j07424
42851g58849M76142o27385k317109k043263M09920K333059J907064M37309l14426
42842d97538p46665j555252j332677J308523M430194M496865J100979k567638
$$ plain form
42834 4636791 723001 -2440039 -3787279 -2648505 559541 3615739 4585511 4419735
42826 4419735 5370334 6889669 5760120 1139307 -3247585 -3902805 -2363851 -2426822 -4004011
42817 -4004011 -3404702 322403 3216504 2094769 -807722 -1433449 223371 1033753 48552
42808 48552 -798153 -910205 -2082918 -4479664 -5041053 -1828105 2595047 4366029 3134687
42799 3134687 1486974 979440 1032275 811658 15609 -1554888 -3191590 -2739656 912189
42790 912189 5236354 6295974 3496583 -97024 -2162896 -3354929 -4673450 -5140382
42782 -5140382 -3385456 170016 3941474 6755337 7941022 7162861 5101370 3242681
42774 3242681 2249326 1502567 642906 274879 730856 1582738 2774604 4559806 5918851
$$ packed form
42834D636791l913790l163040j347240J138774L208046L056198R69772j65776
42826D419735R50599J519335j129549m620813m386892o55220J538954o2971j577189
42817d004011N99309L727105K894101j121735k902491o25727J656820Q10382r85201
42808D8552q46705j12052j172713k396746n61389L212948M423152J770982j231342
42799C134687j647713n07534N2835k20617p96049j570497j636702M51934L651845
42790I12189M324165J059620k799391l593607k065872j192033j318521m66932
42782e140382J754926L555472L771458K813863J185685p78161k061491j858689
42774C242681r93355p46759q59661l68027M55977Q51882J191866J785202J359045
$$ plain form
42765 5918851 5155420 2794203 1525613 2188580 2426680 906213 -36812 1578439 3425064
42756 3425064 2295664 -551449 -1318929 347552 1388212 776991 769977 2475316 4107135
42747 4107135 4501529 4851554 5765770 5759029 4060089 2178283 1386709 1223930 1534683
42738 1534683 3094104 5027714 4878000 2831104 2355879 4504560 5423417 2675657 231180
42729 231180 2651302 7256106 7632181 3376604 377607 1501078 2980111 1542139
42721 1542139 -263902 1234944 4836614 6665691 5777437 4208306 3114140 1981072
42713 1981072 718468 -245041 -1482912 -3764842 -5891778 -5514369 -2335910 1233034
42705 1233034 2916762 2617736 1376909 -135168 -1363210 -1340415 451075 3125082 5066459
$$ packed form
42765E918851p63431k361217j268590O62967K38100j520467r43025J615251J846625
42756C425064j129400k847113p67480J666481J040660o11221p014J705339J631819
42747D107135L94394L50025R14216o741j698940j881806p91574j62779L10753
42738A534683J559421J933610j49714k046896m75225K148681R18857k747760k444477
42729B31180K420122M604804L76075m255577k998997J123471J479033j437972
42721A542139j806041J498846L601670J829077q88254j569131j094166j133068
42713A981072j262604r63509j237871k281930k126936L77409L178459L568944
42705A233034J683728k99026j240827j512077j228042K2795J791490K674007J941377
$$ plain form
42696 5066459 5390790 4359500 2752720 1363610 749507 771977 570081 -237292 -504601
42687 -504601 1119441 3669448 4278569 2118099 302829 1869023 4967804 4948611 1142174
42678 1142174 -1754432 -299950 2739600 2462277 -1348577 -4517603 -4445221 -2670690 -1709271
42669 -1709271 -2129479 -3179933 -4049461 -3813148 -1862238 921576 2718390 2948667 2786806
42660 2786806 3270764 3980612 3749510 1820848 -1462935 -4208756 -3935683 -391329 3384527
42651 3384527 4531467 3979916 4403294 5594305 4989838 2419073 728951 1168786 1703090
42642 1703090 1078896 1123522 3103284 4818522 3834114 1422606 715536 2315134 3916481
42633 3916481 3369247 612068 -2437937 -2949325 380392 5014057 6525558 3821636
$$ packed form
42696E066459L24331j031290j606780j389110o14103K2470k01896q07373k67309
42687e04601J624042K550007O09121k160470j815270J566194L098781j9193l806437
42678A142174k896606J454482L039550k77323l810854l169026P2382J774531R61419
42669a709271m20208j050454q69528K36313J950910K783814J796814K30277j61861
42660B786806M83958P09848k31102j928662l283783k745821K73073L544354L775856
42651C384527J146940n51551M23378J191011o04467k570765j690122M39835N34304
42642A703090o24194M4626J979762J715238r84408k411508p07070J599598J601347
42633C916481n47234k757179l050005n11388L329717M633665J511501k703922
$$ plain form
42625 3821636 305423 -1075759 -1127942 -1339828 -882795 825155 1688288 336676 -640152
42616 -640152 1489539 4750388 5405435 3894536 3414455 3938012 2620378 -235009 -767146
42607 -767146 2075693 4366973 3052721 207831 -596448 750235 1742155 1035370 -503055
42598 -503055 -1287270 -446892 1240885 1627179 -250230 -2222537 -1648763 422461 540518
42589 540518 -1787772 -3336621 -2272525 -518453 119799 667346 2054641 2793728 1906797
42580 1906797 1258806 2282247 2947877 1063517 -1555340 -1661225 189813 622709 -1125362
42571 -1125362 -2409961 -1764610 -776298 -634118 87829 2640372 5341263 5590348 3503594
42562 3503594 1793993 2418577 4614907 6220262 5994098 4416171 2858450 2503846 3846268
$$ packed form
42625C821636l516213j381182n2183k11886M57033J707950Q63133j351612r76828
42616f40152K129691L260849O55047j510899m80081N23557j317634k855387n32137
42607g67146K842839K291280j314252k844890q04279J346683R91920p06785j538425
42598e03055p84215Q40378J687777L86294j877409j972307N73774K071224J18057
42589E40518k328290j548849J064096J754072O38252N47547J387295P39087q86931
42580A906797o47991J023441O65630j884360k618857j05885J851038M32896j748071
42571a125362j284599O45351R88312J42180P21947K552543K700891K49085k086754
42562C503594j709601O24584K196330J605355k26164j577927j557721l54604J342422
$$ plain form
42553 3846268 6505556 9087837 9692044 7424469 3555462 562110 -193443 613952 1632231
42544 1632231 2264954 2444492 1961043 957329 608462 2098069 4648428 5586498 3375178
42535 3375178 210955 115674 3806524 6966180 5348670 574227 -1892806 -429370
42527 -429370 602882 -2231493 -6026918 -6144363 -3493638 -2914699 -5566044 -7524458 -6030872
42518 -6030872 -2855394 -531735 893595 1848740 1432707 -324510 -1182167 157039 1881770
42509 1881770 2090733 1772962 2541057 3425292 2553338 562085 -320769 355828 1282679
42500 1282679 2071169 3463709 5138683 5611423 4563359 3441044 3305765 3534280 3234587
42491 3234587 2827637 3314265 4400091 4365138 2369324 328411 1018379 3867182 4565120
$$ packed form
42553C846268K659288K582281O04207k267575l869007k993352p55553Q07395J018279
42544A632231O32723J79538m83449j003714l48867J489607K550359R38070k211320
42535C375178l164223r5281L690850L159656j617510m774443k467033J463436
42527d29370J032252k834375l795425j17445K650725N78939k651345j958414J493586
42518f030872L175478K323659J425330R55145m16033j757217q57657J339206J724731
42509A881770K08963l17771P68095Q84235q71954j991253q82854O76597R26851
42500A282679P88490J392540J674974M72740j048064j122315j35279K28515k99693
42491C234587m06950M86628J085826l4953j995814k040913O89968K848803O97938
$$ plain form
42482 4565120 616969 -4426863 -5160165 -1709072 714028 -538353 -2534906 -2306424
42474 -2306424 -1049825 -669255 -34889 2245630 4413620 4332145 3290102 3599897 4391590
42465 4391590 3378829 1245396 577952 1466334 1720995 776345 -19704 -516657 -1806911
42456 -1806911 -3343518 -3194710 -1284121 440097 1148911 1810949 2756615 3213489 3309282
42447 3309282 3987273 4941842 5150780 5273322 6773953 8825443 9096504 7648536 6851138
42438 6851138 7170754 6460025 4071919 2146232 1668632 733489 -1596799 -2939219 -1281054
42429 -1281054 1656642 3076216 2876515 2421735 1578828 -344960 -2125953 -1770893 515225
42420 515225 2586684 3058766 2113163 340087 -1499978 -2135639 -925479 901938 1518527
$$ packed form
42482D565120l948151n043832p33302L451093K423100j252381j996553K28482
42474b306424J256599L80570O34366K280519K167990q1475j042043L09795P91693
42465D391590j012761k133433o67444Q88382K54661r44650p96049m96953j290254
42456a806911j536607J48808J910589J724218P08814O62038R45666M56874R5793
42447C309282O77991R54569K08938J22542J500631K051490K71061j447968p97398
42438F851138L19616p10729k388106j925687m77600r35143k330288j342420J658165
42429a281054K937696J419574j99701m54780q42907j923788j780993L55060K286118
42420E15225K071459M72082r45603j773076j840065o35661J210160J827417O16589
$$ plain form
42411 1518527 779924 99988 373827 1170605 1779266 2011989 2022986 2081147 2410465 2740783
42401 2740783 2358541 1136777 47016 -45775 254085 -515373 -2721586 -4798442 -4527477
42392 -4527477 -1185433 3432703 6270353 5661672 2703441 -160828 -1433037 -1073968
42384 -1073968 336426 1867334 2349899 1576839 926885 1427985 1852550 585924 -1161769
42375 -1161769 -506732 2606836 4697804 3423303 635129 -514297 495711 2080382
42367 2080382 3293538 4107452 4025317 2434150 122924 -1005786 50930 2308219 3730255
42358 3730255 3058092 951588 -694513 -859709 -359812 -150010 275352 1390718 1666409
42349 1666409 -603283 -4088999 -5750573 -5210973 -4812262 -5130562 -3935124 -600063 2013229
$$ packed form
42411A518527p38603o79936K73839P96778O08661K32723J0997N8161L29318L30318
42401B740783l82242j221764j089761r2791K99860p69458k206213k076856K70965
42392d527477L342044M618136K837650o08681k958231k864269j272209L59069
42384a073968J410394J530908M82565p73060o49954N01100M24565j266626j747693
42375a161769O55037L113568K090968j274501k788174j149426J010008J584671
42367B080382J213156Q13914q2135j591167k311226j128710J056716K257289J422036
42358C730255o72163k106504j646101j65196M99897K09802M25362J115366K75691
42349A666409k269692l485716j661574N39600L98711l18300J195438L335061K613292
$$ plain form
42340 2013229 1864345 709361 608896 542137 -808407 -1728721 -271778 1760097 1224528
42331 1224528 -1388716 -2868502 -2182010 -1097403 -553078 272094 1457648 1984156 1981779
42322 1981779 2603851 3486832 2918292 840892 -718143 -649463 -46264 -78689 -577182
42313 -577182 -1129096 -1709404 -1831910 -837291 608839 949194 -52742 -1073598 -1284837
42304 -1284837 -1003863 -318654 1050525 2400408 2559650 2066984 2802657 4909275 6094431
42295 6094431 4875040 2771733 2200980 3522840 5219815 5993821 5724015 4955066 4146139
42286 4146139 3294592 2302710 1770472 2545865 3935975 3809314 1746423 359526 1392394
42277 1392394 2329123 18483 -3743481 -4339413 -1484646 415126 -439922 -580497 2252740
$$ packed form
42340B013229j48884j154984j00465o6759j350544r20314J456943K031875n35569
42331A224528k613244j479786O86492J084607N44325Q25172J185554N26508k377
42322A981779O22072Q82981n68540k077400j559035O8680O03199l2425m98493
42313e77182n51914n80308j22506R94619J446130L40355j001936j020856k11239
42304a284837K80974O85209J369179J349883J59242m92666P35673K106618J185156
42295F094431j219391k103307n70753J321860J696975P74006k69806p68949q08927
42286D146139q51547r91882n32238P75393J390110j26661k062891j386897J032868
42277A392394R36729k310640l761964n95932K854767J899772q55048j40575K833237
$$ plain form
42268 2252740 4699496 3069225 -608204 -1664566 518489 2664054 2767994 1565949
42260 1565949 2633 -1402305 -1383062 777106 3155105 3083619 802096 -1148005 -1498787
42251 -1498787 -611929 1934005 6751140 11641241 12653776 9129333 4971759 3780307
42243 3780307 5051884 6314979 6626031 6295531 5130840 3088718 1602857 2310416 4818260
42234 4818260 7044205 7464859 6091411 3791848 1790720 1424848 3037413 4988697
42226 4988697 4890301 2327007 -372124 -708056 1080145 2464893 1849083 281733 -520754
42217 -520754 -787173 -2021057 -4238974 -5618481 -5121383 -3778031 -2706329 -1524927 167342
42208 167342 1309301 954415 131484 378378 1323106 1501577 767398 7341 -691661
$$ packed form
42268B252740K446756j630271l677429j056362K183055K145565J03940j202045
42260A565949j563316j404938J9243K160168K377999p1486k281523j950101l50782
42251a498787Q86858K545934M817135M890101J012535l524443m157574j191452
42243C780307J271577J263095L11052l30500j164691k042122j485861P07559K507844
42234D818260K225945M20654j373448k299563k001128l65872J612565J951284
42226D988697r8396k563294k699131l35932J788201J384748o15810j567350q02487
42217e20754k66419j233884k217917j379507M97098J343352J071702J181402J692269
42208A67342J141959l54886q22931K46894R44728J78471p34179p60057o99002
$$ plain form
42199 -691661 -1376971 -551687 2973596 6790244 6714071 2542010 -1127516 -1039116 799335
42190 799335 1207767 875755 2308979 4773017 5011938 2464303 283647 587226 1529140
42181 1529140 435832 -2157838 -3381268 -1944128 516034 1854920 1876396 1917157 2734642
42172 2734642 3582143 3283314 1534766 -1079483 -3651750 -4966086 -3763311 -230426
42164 -230426 3133147 3678065 1789437 417747 1123767 2374983 2555752 2636999 4123227
42155 4123227 5893294 5463838 2788743 512537 446452 1785257 3075750 4054740 4898994
42146 4898994 5282661 5094343 4882403 4756975 3990099 2628006 2331148 4224931 6640479
42137 6640479 6639632 3775062 906037 789408 2908414 4471837 3898067 2248312 1263483
$$ packed form
42199f91661o85310Q25284L525283L816648p6173m172061l669526Q8400J838451
42190G99335M08432l32012J433224K464038K38921k547635k180656L03579R41914
42181A529140j093308k593670j223430J437140K460162J338886K1476M0761Q17485
42172B734642Q47501k98829j748548k614249k572267j314336J202775L532885
42164b30426L363573N44918j888628j371690P06020J251216J80769Q1247J486228
42155D123227J770067m29456k675095k276206o6085J338805J290493R78990Q44254
42146D898994L83667j88318k11940j25428p66876j362093k96858J893783K415548
42137F640479q47k864570k869025j16629K119006J563423n73770j649755r84829
$$ plain form
42128 1263483 1040015 321166 -1380509 -2825165 -2390199 94390 3123620 4956689 5183137
42119 5183137 4972894 5703900 7231150 7895053 6682407 4886749 4700979 6409067 8186260
42110 8186260 8740597 8701317 8868940 8597826 7037671 4877437 3525791 3252215 3357642
42101 3357642 3579134 4058373 4386481 3964064 3013625 2112833 1133668 -154647 -927044
42092 -927044 -236021 1177177 1588265 769062 239896 976317 2356726 3520945 4234443
42083 4234443 4180649 3036022 1694157 1786074 3302602 4189854 3118861 1289152 609348
42074 609348 1402455 2887048 4620493 6210714 6656456 5393636 3369842 1895772 999942
42065 999942 32358 -717121 -364417 852241 1535451 1014000 275177 549479 1508490
$$ packed form
42128A263483k23468p18849j701675j444656M34966K484589L029230J833069K26448
42119E183137k10243P31006J527250O63903j212646j795658j85770J708088J777193
42110H186260N54337l9280J67623k71114j560155k160234j351646k73576J05427
42101C357642K21492M79239L28108m22417r50439r00792r79165j288315p72397
42092i27044O91023J413198M11088q19203n29166P36421J380409J164219P13498
42083D234443n3794j144627j341865R1917J516528Q87252j070993j829709o79804
42074F09348P93107J484593J733445J590221M45742j262820k023794j474070q95830
42065I99942r67584p49479L52704J216658O83210n21451p38823K74302R59011
$$ plain form
42056 1508490 1474773 -463487 -2865535 -3071653 -215652 3527252 5373440 4950700 3840627
42047 3840627 2843084 1460241 -148951 -877746 -804138 -1544484 -3553225 -4947312 -4257603
42038 -4257603 -2672010 -2039142 -2072445 -1271593 440650 1812732 2355228 2699424 3196036
42029 3196036 3478558 3247424 2614236 2006708 2244450 3886077 5932689 6339956 4563737
42020 4563737 2250995 626798 -946229 -2566016 -2234579 1023256 4302132 3909973
42012 3909973 219406 -3294118 -4831585 -5039295 -3842555 -300193 4096960 5640799
42004 5640799 3207618 7754 -920897 -489126 -1078697 -2434896 -2390517 -591085 823834
41995 823834 270834 -1131352 -1087026 848014 2563663 2073737 354992 262557 2426111
$$ packed form
42056A508490l3717j938260k402048k06118K856001L742904J846188m22740j110073
42047C840627r97543j382843j609192p28795P3608p40346k008741j394087O89709
42038d257603J585593O32868l3303Q00852J712243J372082N42496L44196M96612
42029C196036K82522k31134o33188o07528K37742J641627K046612M07267j776219
42020D563737k312742j624197j573027j619787L31437L257835L278876l92159
42012C909973l690567l513524j537467k07710J196740L542362M397153J543839
42004E640799k433181l199864r28651M31771n89571j356199M4379J799432J414919
41995H23834n53000j402186M4326J935040J715649m89926j718745r2435K163554
$$ plain form
41986 2426111 3948146 2304421 -1055538 -2679204 -1323712 1698358 4927480 7075422
41978 7075422 6311769 2379059 -1366158 -1386759 960188 1283246 -1151392 -2626993 -1262530
41969 -1262530 286728 -248554 -1283784 -861024 114765 476251 1214482 2691273 2688418
41960 2688418 227821 -1662817 -352542 1904231 1537788 -629184 -1236003 -20297
41952 -20297 686165 680156 1590912 2699724 1729187 -340283 70351 3054619 4260350
41943 4260350 1342509 -2603741 -3842233 -2710938 -1426375 -312935 1188982 2201331
41935 2201331 1893303 1634516 3086117 5303241 6028579 4940918 3516592 2519957 1776216
41926 1776216 1734233 2931311 4227240 3965366 3003515 4126513 7677171 10097230 8426316
$$ packed form
41986B426111J522035j643725l359959j623666J355492L022070L229122K147942
41978G075422p63653l932710l745217k0601K346947L23058k434638j475601J364463
41969a262530J549258n35282j035230M22760R75789L61486P38231J476791k855
41960B688418k460597j890638J310275K256773l66443k166972o06819J215706
41952b0297P06462o009R10756J108812r70537k069470M10634K984268J205731
41943D260350k917841l946250j238492J131295J284563J113440J501917J012349
41935B201331l08028k58787J451601K217124P25338j087661j424326r96635p43741
41926A776216m1983J197078J295929k61874r61851J122998L550658K420059j670914
$$ plain form
41917 8426316 4600620 3154307 5436390 8388133 9078510 8123194 7575244 7369415 5906277
41908 5906277 3330591 1939739 3052732 5273853 6604727 6860695 6981053 7071287 6480716
41899 6480716 5294693 4491032 4668273 5454557 6146905 6327300 5930700 5211129 4584641
41890 4584641 4230958 4065053 4210853 4940681 5883616 6016108 4931047 3492130 2774825
41881 2774825 3037012 4100444 5734110 7022453 6537255 4242565 2311829 2822644 5313377
41872 5313377 7693923 8722321 8337244 6544567 3738683 1515108 1260586 2117958 2007704
41863 2007704 484805 -1041988 -1651911 -1631018 -1057695 221914 1165064 413172 -989040
41854 -989040 -243570 2936253 5240026 4413197 2552046 2542645 3289369 1582807 -2309419
$$ packed form
41917H426316l825696j446313K282083K951743O90377r55316n47950k05829j463138
41908E906277k575686j390852J112993K221121J330874K55968J20358R0234n90571
41899F480716j186023q03661J77241P86284O92348J80395l96600p19571o26488
41890D584641l53683j65905J45800P29828R42935J32492j085061j438917p17305
41881B774825K62187J063432J633666J288343m85198k294690j930736N10815K490733
41872E313377K380546J028398l85077j792677k805884k223575k54522Q57372j10254
41863B007704j522899j526793o09923K0893N73323J279609R43150p51892j402212
41854i89040P45470L179823K303773q26829j861151r401P46724j706562l892226
$$ plain form
41845 -2309419 -4350226 -2311688 1303870 3029012 2787316 2792405 3706747 4091257 3223667
41836 3223667 2465920 3301951 5247846 6601652 6776203 6943422 8096843 9107068 7702906
41827 7702906 3720949 340913 688939 3511991 4163867 539151 -4014886 -5274671
41819 -5274671 -3658934 -2453725 -1955268 558119 4891036 6558715 3393983 -435591
41811 -435591 -319008 2002409 1710649 -1226978 -2421379 -343096 1932577 2494299 3065003
41802 3065003 4505190 4643444 2753840 1985268 4513720 7756757 8436981 7344936 6784333
41793 6784333 6049407 3257153 -288257 -1469675 -25930 1454247 1356169 92918 -1519717
41784 -1519717 -2246682 -260474 4052526 6756650 5241487 2739952 3926035 7486897
$$ packed form
41845b309419k040807K038538L615558J725142k41696N089R14342L84510q67590
41836C223667p57747Q36031J945895J353806J74551J67219J153421J010225j404162
41827G702906l981957l380036L48026K823052O51876l624716m554037j259785
41819e274671J615737J205209M98457K513387M332917J667679l164732l829574
41811d35591J16583K321417k91760k937627j194401K078283K275673N61722N70704
41802C065003J440187J38254j889604p68572K528452L243037O80224j092045n60603
41793F784333p34926k792254l545410j181418J443745J480177r8078j263251j612635
41784a519717p26965J986208M313000K704124j515163k501535J186083L560862
$$ plain form
41776 7486897 7984346 4429243 1563946 2160104 3501142 3109911 2886217 4876081 7084572
41767 7084572 6766996 4893196 4154699 4705529 4783147 3973795 3344735 3488434 4380882
41758 4380882 6076432 8039233 9041477 8951699 9116957 9897099 9739054 7970012 6353470
41749 6353470 6272196 6557001 5976109 5632837 6628732 7509709 6773066 6070134 7778622
41740 7778622 10700144 11481668 9580170 7560724 6783830 6064700 4814145 4316574 5019235
41731 5019235 5307080 4256524 3326528 3743058 4051998 2227221 -892577 -2315404 -781302
41722 -781302 1750068 2737946 1831060 368833 -771199 -1604573 -1839948 -866305 754703
41713 754703 1380074 837531 1411115 4639582 8279149 8706520 5833051 3176101 3085055
$$ packed form
41776G486897M97449l555103k865297N96158J341038l91231k23694J989864K208491
41767G084572l17576j873800p38497N50830P7618q09352o29060J43699Q92448
41758D380882J695550J962801J002244q9778J65258P80142j58045j769042j616542
41749F353470q1274K84805n80892l43272R95895Q80977p36643p02932J708488
41740G778622K921522P81524j901498k019446p76894p19130j250555m97571P02661
41731E019235K87845j050556r29996M16530L08940j824777l119798j422827J534102
41722g81302K531370R87878r06886j462227j140032q33374k35375R73643J621008
41713G54703O25371n42543N73584L228467L639567M27371k873469k656950r1046
$$ plain form
41704 3085055 4497321 5802847 7062844 8261856 8089586 6262458 4834307 5167699
41696 5167699 5499929 3749729 1116063 383647 1833607 3443451 4394846 5697850 7492810
41687 7492810 8231087 7004398 4863811 3269441 2511496 2067602 1546509 950526 563889
41678 563889 629524 949899 1285761 2176331 4185452 6091851 5657773 3063673 1523556
41669 1523556 3044167 5661133 6749797 6794377 7281228 7134168 4838203 2427446 3075885
41660 3075885 5576525 5858789 3869102 3857313 6927904 8722472 6904097 5806221 9584521
41651 9584521 14754554 14834402 10176188 7521852 10225950 14213967 14654357 12109019 9995956
41642 9995956 9498750 9723808 10407589 11443682 11263767 8754017 6056409 6507333 9851703
$$ packed form
41704C085055J412266J305526J259997J199012j72270j827128j428151L33392
41696E167699L32230j750200k633666p32416J449960J609844R51395J303004J794960
41687G492810P38277j226689k140587j594370p57945m43894n21093n95983l86637
41678E63889O5635L20375L35862Q90570K009121J906399m34078k594100j540117
41669A523556J520611K616966J088664M4580M86851j47060k295965k410757O48439
41660C075885K500640K82264j989687j1789L070591J794568j818375j097876L778300
41651I584521N170033P9848m658214k654336K704098L988017M40390k545338k113063
41642I995956m97206K25058O83781J036093j79915k509750k697608M50924L344370
$$ plain form
41633 9851703 12313811 11908638 10916117 11866520 13611390 13454655 11372197 9626644 9255443
41624 9255443 9508671 10216500 11975808 13850650 13520355 10533142 7350549 6277120 7127832
41615 7127832 8646041 10204611 11103466 10317746 8430493 7933996 9939978 12357401 13164577
41606 13164577 13592851 15634050 18062193 18093447 16148856 15564260 17482936 19208695 18473456
41597 18473456 16710320 16810260 19588363 23768248 27906541 31023559 32587501 33323320
41589 33323320 35362338 40388943 47898385 55989643 63540834 70986872 79193649 88172501
41581 88172501 97139214 105870078 115819856 129268458 147005773 167439490 188249094
41574 188249094 207625225 222835738 229230874 223425444 207551950 188063993 169620004
$$ packed form
41633I851703K462108m05173r92521R50403J744870j56735k082458j745553l71201
41624I255443K53228P07829J759308J874842l30295k987213l182593j073429Q50712
41615G127832J518209J558570Q98855p85720j887253m96497K005982K417423Q07176
41606A3164577M28274K041199K428143L1254j944591n84596J918676J725759p35239
41597A8473456j763136R9940K778103M179885M138293L117018J563942P35819
41589C3323320K039018N026605P509442Q091258P551191P446038Q206777Q978852
41581H8172501Q966713Q730864R949778J3448602J7737315K0433717K0809604
41574A88249094J9376131J5210513O395136n805430j5873494j9487957j8443989
$$ plain form
41567 169620004 151909925 133109390 114180721 97933849 85238925 74491272 64620751
41560 64620751 56641020 51659318 48848644 46527410 44423725 43416836 43186099 41876688
41552 41876688 39006292 37181077 38962267 42632630 43429929 39316797 33303835 29180386
41544 29180386 27101425 24845394 21511205 17987323 15118570 13408637 13479055 14940325
41536 14940325 15866578 15247962 14666569 15387521 15371720 12198369 7780803 6482305 8851063
41527 8851063 10987637 10446662 8998022 8626028 8524393 7713575 7306218 7992511 8055623
41518 8055623 6337601 4934706 6364448 9715778 12025181 12138867 10994693 9321895
41510 9321895 7331424 5745128 5030315 4390310 3325360 3159811 4998683 7215161 7348912
$$ packed form
41567A69620004j7710079j8800535j8928669j6246872j2694924j0747653r870521
41560F4620751p979731m981702k810674k321234k103685j006889k30737j309411
41552D1876688k870396j825215J781190L670363P97299m113132o012962m123449
41544B9180386k078961k256031l334189l523882k868753j709933P0418J461270
41536A4940325R26253o18616n81393P20952j5801l173351m417566j298498K368758
41527H851063K136574n40975j448640l71994j01635q10818m07357O86293O3112
41518H055623j718022j402895J429742L351330K309403J13686j144174j672798
41510I321895j990471j586296p14813o40005j064950j65549J838872K216478J33751
$$ plain form
41501 7348912 5803143 5162490 6195420 7085274 6673164 5933805 5684209 5108293 3584711
41492 3584711 2252271 2540843 4175097 5539107 5361235 3669437 1921801 2358643 6027592
41483 6027592 11019106 13825548 13002022 10395993 8318786 7017766 5893448 5514663
41475 5514663 6464970 7168238 5352358 1755320 -5372 1839623 4665913 5168793 3880842
41466 3880842 3638456 4612427 4047534 1275761 -252609 2266738 6614617 8474079 7176332
41457 7176332 5604575 5214712 4550309 2999148 2636506 4778563 7300236 7563323 6271161
41448 6271161 6005392 6970871 6795606 4448453 1999775 1770070 3406678 4870025 5266795
41439 5266795 5426984 6052257 6573236 6207307 5246689 4443450 3534283 1554071 -1207589
$$ packed form
41501G348912j545769o40653J032930Q89854m12110p39359k49596n75916j523582
41492C584711j332440K88572J634254J364010j77872j691798j747636M36842L668949
41483F027592M991514K806442q23526k606029k077207j301020j124318l78785
41475E514663R50307P03268j815880l597038j760692J844995K826290N02880j287951
41466C880842k42386R73971n64893k771773j528370K519347M347879J859462j297747
41457G176332j571757l89863o64403j551161l62642K142057K521673K63087j292162
41448F271161k65769R65479j75265k347153k448678k29705J636608J463347L96770
41439E266795J60189O25273N20979l65929r60618q03239r09167j980212k761660
$$ plain form
41430 -1207589 -2846726 -2256938 -810559 -356291 -399888 963922 3708943 5531117 5083845
41421 5083845 3562809 2369114 1117060 -778150 -2098434 -1136317 1759722 4433160
41413 4433160 5316914 4488982 2840890 1390517 1127708 2344826 4020212 4623463 3589703
41404 3589703 1590154 -311297 -1167493 -256394 2352005 5318332 6912173 6676498 5850847
41395 5850847 5919686 6927500 7459349 6360257 4280618 3064472 3527312 4585543 5067836
41386 5067836 5401284 6336586 6875360 5416589 2808766 2000975 3889421 5471876 3596980
41377 3596980 -677730 -3105086 -1202791 3055569 5549617 4353867 1555472 694971
41369 694971 2486259 4000164 2832298 733180 1125311 3934797 5755254 5054946 3928890
$$ packed form
41430a207589j639137N89788J446379M54268m3597J363810K745021J822174m47272
41421E083845j521036j193695j252054j895210j320284R62117K896039K673438
41413D433160Q83754q27932j648092j450373k62809J217118J675386O03251j033760
41404C589703j999549j901451q56196R11099K608399K966327J593841k35675q25651
41395E850847O8839J007814N31849j099092k079639j216146M62840J058231M82293
41386E067836L33448R35302N38774j458771k607823q07791J888446J582455j874896
41377C596980m274710k427356J902295M258360K494048j195750k798395q60501
41369F94971J791288J513905j167866k099118L92131K809486J820457p00308j126056
$$ plain form
41360 3928890 3906568 3506647 1730760 703066 2103556 3602345 2164540 -895127 -1660793
41351 -1660793 639842 3057998 3617505 3348066 3595400 4207382 4793976 5381238 5444883
41342 5444883 4425516 3381564 3934345 5394388 5295951 3206584 1609417 2224761 3673258
41333 3673258 3867547 2861320 2152296 2651675 4397420 6956222 9126784 9446305 7975993
41324 7975993 6626532 6880314 7957254 7812433 5298570 1195830 -2053736 -1862572 1840312
41315 1840312 5566468 5618190 2541667 266788 688639 1665705 1130661 277623 916378
41306 916378 2200931 2436143 2234671 3110123 4273467 3832722 2424537 2454609 3737874
41297 3737874 3126804 -575859 -4114623 -3895719 -643890 2059745 2642945 2721739 3813801
$$ packed form
41360C928890k2322l99921j775887j027694J400490J498789j437805l059667p65666
41351a660793K300635K418156N59507k69439K47334O11982N86594N87262O3645
41342E444883j019367j043952N52781J460043r8437k089367j597167O15344J448497
41333C673258J94289j006227p09024M99379J745745K558802K170562L19521j470312
41324G975993j349461K53782J076940j44821k513863m102740l249566J91164L702884
41315A840312L726156N1722l076523k274879M21851R77066n35044q53038O38755
41306I16378J284553K35212k01472Q75452J163344m40745j408185L0072J283265
41297C737874o11070l702663l538764K18904L251829K703635N83200P8794J092062
$$ plain form
41288 3813801 5037171 4676169 2610201 282560 -934699 -528270 1313046 3572245
41280 3572245 4499075 3158324 1040315 829581 3024889 5093651 4998144 4236067 5524481
41271 5524481 8204734 8490034 4807108 628054 478111 4497633 8686760 9807075
41263 9807075 8232160 6058351 4228794 2390895 559855 -351687 244864 1555048
41255 1555048 2069596 1245935 113547 -57384 634182 974854 363274 -470472 -690095
41246 -690095 -551980 -771353 -1123057 -458483 1810010 4728617 6550709 6351603 4808720
41237 4808720 3388782 2791155 2343951 1113061 -578748 -1226455 104890 2480305 3885973
41228 3885973 3214299 1276890 -32368 592837 2848314 5063497 5381113 3125928 -471360
$$ packed form
41288C813801J223370l61002k065968k327641j217259M06429J841316K259199
41280C572245R26830j340751k118009k10734K195308K068762r5507p62077J288414
41271E524481K680253K85300l682926m179054j49943M019522M189127J120315
41263I807075j574915k173809j829557j837899j831040r11542N96551J310184
41255A555048N14548q23661j132388j70931O91566L40672o11580q33746k19623
41246f90095J38115k19373l51704O64574K268493K918607J822092j99106j542883
41237D808720j419938n97627m47204j230890j691809o47707J331345K375415J405668
41228C885973o71674j937409j309258O25205K255477K215183L17616k255185l597288
$$ plain form
41219 -471360 -2930994 -2514266 45768 2189436 2341198 1619292 2102909 3983030 5603602
41210 5603602 5992576 5737293 5179773 3571191 849241 -1337138 -1546989 -234789 1524116
41201 1524116 3503043 5213145 5082465 2746346 636071 821624 1566090 7283 -2691004
41192 -2691004 -2536600 1050428 4107004 4053087 2952052 3280765 4084357 3812006 3850641
41183 3850641 5928476 8105650 6927702 2596305 -1124620 -1711122 25288 2255472
41175 2255472 4045125 5052161 5467653 6204083 7412043 7392341 5018493 2401269 2426464
41166 2426464 4191558 4187038 2088843 1638488 4620966 7557622 6611736 3016727 954453
41157 954453 2006624 4456598 6651405 8159489 8375651 6794522 4564533 3499864
$$ packed form
41219d71360k459634M16728K560034K143668J51762p21906M83617J880121J620572
41210E603602L88974k55283n57520j608582k721950k186379k09851J312200J758905
41201A524116J978927J710102j30680k336119k110275J85553P44466j558807k698287
41192b691004J54404L587028L056576n3917j101035L28713Q03592k72351L8635
41183C850641K077835K177174j177948m331397l720925n86502J736410K230184
41175B255472J789653J007036M15492P36430J207960j9702k373848k617224K5195
41166B426464J765094m520k098195m50355K982478K936656r45886l595009k062274
41157I54453J052171K449974K194807J508084K16162j581129k229989j064669
$$ plain form
41149 3499864 3616566 3684838 3901245 5473418 7476406 7105578 4106304 2145409 3795509
41140 3795509 6385896 5617621 2038727 644557 3934282 8443020 9538390 7333337
41132 7333337 5552223 5770089 5664819 3343296 839423 1501379 5159446 8082492 7657168
41123 7657168 5182173 3440989 3247979 3699760 4559219 6405838 8692325 9581569 8328920
41114 8328920 6560309 6371916 7926122 9662683 10371957 10345622 10669220 11881165 13429911
41105 13429911 14500434 15424788 17690213 21836089 25968866 27835878 28275480 30764543
41097 30764543 36926699 44271115 49580193 53075573 57725220 65582840 76482243 89375308
41089 89375308 102931514 115182621 124410657 130352992 133207741 131996078 125689339 115562614
$$ packed form
41149C499864J16702O8272K16407J572173K002988l70828k999274j960895J650100
41140C795509K590387p68275l578894j394170L289725M508738J095370k205053
41132G333337j781114K17866j05270k321523k503873O61956L658067K923046m25324
41123G657168k474995j741184j93010M51781Q59459J846619K286487Q89244j252649
41114H328920j768611j88393J554206J736561P09274k6335L23598J211945J548746
41105A3429911J070523R24354K265425M145876M132777J867012M39602K489063
41097C0764543O162156P344416N309078L495380M649647P857620J0899403J2893065
41089H9375308J3556206J2251107R228036N942335K854749j211663o306739j0126725
$$ plain form
41081 115562614 104384001 93369825 82017880 70860442 61785111 55047272 48578112
41074 48578112 41509927 36109126 34470673 35031683 34341746 31236759 27490174 24993458
41066 24993458 23821348 22779009 20784492 17863199 15193277 13681061 12552072 10536542
41058 10536542 8326636 7847447 8742610 8190976 5426802 3733849 5812774 9456821
41050 9456821 10566416 8777020 7071487 6900665 6890976 6086989 5536851 6268226 7791273
41041 7791273 8955952 8883542 7293531 5216621 4616654 5837177 6657643 5707552 5070387
41032 5070387 6809433 8707558 7205235 3405403 1787785 3324675 4515216 3588023
41024 3588023 2774562 3228340 2610287 -82085 -1795128 -420901 1452537 1136372 624825
$$ packed form
41081A15562614j1178613j1014176j1351945j1157438r075331o737839o469160
41074D8578112p068185n400801j638453N61010o89937l104987l746585k496716
41066B4993458j172110j042339j994517k921293k669922j512216j128989k015530
41058A0536542k209906m79189Q95163n51634k764174j692953K078925L644047
41050I456821J109595j789396j705533j70822r689q03987n50138P31375J523047
41041G791273J164679p2410j590011k076910n99967J220523Q20466r50091o37165
41032E070387J739046J898125j502323l799832j617618J536890J190541r27193
41024C588023q13461M53778o18053k692372j713043J374227J873438l16165n11547
$$ plain form
41015 624825 2862100 6119674 6439763 3710703 1086406 -176539 -1155570 -1699427 -709023
41006 -709023 668604 360678 -443335 1188568 4139146 3781428 -567095 -3487211 -1118549
40997 -1118549 3045697 3270956 -470313 -3312073 -2375985 848238 4053918 6447320
40989 6447320 7454114 6182306 3097885 255712 -909142 -618734 611782 2579232
40981 2579232 4254000 4146057 2819852 3081468 6149513 9373054 9728505 8073849 7330048
40972 7330048 7507360 5911432 2233516 -287968 49294 662075 -852765 -2630340 -1973525
40963 -1973525 -330177 -890264 -2801746 -2299978 834163 2622787 1372410 302601
40955 302601 2010116 4385283 4597636 3714116 4154152 5187879 4521879 2576469 1628271
$$ packed form
41015F24825K237275L257574L20089k729060k624297j262945r79031n43857R90404
41006g09023J377627l07926q04013J631903K950578l57718m348523k920116K368662
40997a118549M164246K25259l741269k841760R36088L224223L205680K393402
40989F447320J006794j271808l084421k842173j164854K90408J230516J967450
40981B579232J674768j07943j326205K61616L068045L223541L55451j654656p43801
40972G330048J77312j595928l677916k521484L37262O12781j514840j777575O56815
40963a973525J643348n60087j911482N01768L134141J788624j250377j069809
40955C02601J707515K375167K12353q83520M40036J033727o66000j945410r48198
$$ plain form
40946 1628271 1846959 1617379 1040598 1638669 2869338 2443080 403245 -481626 769592
40937 769592 1607442 119557 -1851409 -1689403 115547 1331432 1603320 2200687 3071103
40928 3071103 2748278 1114841 -58624 145460 442074 -312851 -1038739 -197664 1359919
40919 1359919 1226969 -1008885 -2880577 -2276880 -17746 1793114 2598728 3022794 2734518
40910 2734518 899254 -1402757 -1527512 1195656 4059531 4226492 2076635 146007
40902 146007 -182850 462229 1200142 1984503 2944775 3750060 3988781 3701159 3267681 2876787
40892 2876787 2272399 1276445 506649 836401 1821069 1832263 693335 736312 3444131
40883 3444131 6407107 6293850 3898602 2820107 3510354 2833016 132919 -1002033 955570
$$ packed form
40946A628271K18688k29580n76781N98071J230669m26258k039835q84871J251218
40937G69592Q37850j487885j970966J62006J804950J215885K71888N97367Q70416
40928C071103l22825j633437j173465K04084K96614p54925p25888Q41075J557583
40919A359919j32950k235854j871692O03697K259134J810860Q05614M24066k88276
40910B734518j835264k302011j24755K723168K863875J66961k149857j930628
40902A46007l28857O45079P37913P84361R60272Q05285K38721k87622m33478l90894
40892B876787o04388r95954p69796L29752R84668J1194j138928M2977K707819
40883C444131K962976j13257k395248j078495O90247o77338k700097j134952J957603
$$ plain form
40874 955570 2041358 -912867 -4439117 -3336865 1309003 3913630 2591494 636830
40866 636830 493256 1100143 1531864 2808555 4908227 5589929 3736689 1207004 56298
40857 56298 82217 138070 -64526 -330737 -515666 -136499 1104787 2353027 2686410 2754204
40847 2754204 3433858 3653069 2182171 845881 2469660 5720295 5907264 1728100 -2586437
40838 -2586437 -3318036 -1917692 -1632181 -2652151 -3173924 -2831843 -2301630 -1132347 1447002
40829 1447002 4512477 6266015 6275919 5577336 5224914 5584704 6181597 5818860 4042381
40820 4042381 2489772 2938036 4132630 3229412 581131 -326043 1387170 2165978 -186631
40811 -186631 -2664012 -1761329 1278448 3165832 3586009 3841032 3019141 -223808 -3756900
$$ packed form
40874I55570J085788k954225l526250J102252M645868K604627j322136j954664
40866F36830j43574O06887M31721J276691K099672O81702j853240k529685j150706
40857E6298K5919N5853k02596k66211j84929L79167J241286J248240L33383O7794
40847B754204O79654K19211j470898j336290J623779L250635J86969m179164m314537
40838b586437p31599J400344K85511j019970n21773L42081N30213J169283K579349
40829A447002L065475J753538R904o98583l52422L59790N96893l62737j776479
40820D042381j552609M48264J194594r03218k648281r07174J713213P78808k352609
40811a86631k477381R02683L039777J887384M20177K55023q21891l242949l533092
$$ plain form
40802 -3756900 -4139489 -1690973 526936 1804569 3687337 5479206 4486344 1042402
40794 1042402 -1081448 -250260 934397 348420 -510552 191539 1474277 1854681 2164107
40785 2164107 3654544 5246849 5077066 3535717 2630305 3023882 3391837 2370090 41946
40776 41946 -2218556 -2862000 -1662008 -221212 -48675 -303199 918230 3063878 3250989
40767 3250989 601192 -2127046 -2693969 -2601487 -3852647 -4753284 -2325640 2224831 4265678
40758 4265678 2210602 -210239 591163 3174257 3707631 1565830 -217707 703218 3478129
40749 3478129 5849687 6593953 5864615 4635353 4311293 5598573 7149724 6558423 3476026
40740 3476026 525852 80748 1328446 1969485 1720349 2076016 3185175 3465932 2592205
$$ packed form
40802c756900l82589K448516K217909J277633J882768J791869r92862l443942
40794A042402k123850Q31188J184657n85977q58972P02091J282738L80404L09426
40785B164107J490437J592305j69783j541349r05412L93577L67955j021747k328144
40776D1946k260502o43444J199992J440796J72537k54524J221429K145648J87111
40767C250989k649797k728238n66923R2482j251160r00637K427644M550471K040847
40758D265678k055076k420841Q01402K583094N33374k141801j783537R20925K774911
40749C478129K371558P44266p29338j229262l24060J287280J551151n91301l082397
40740C476026k950174m45104J247698O41039k49136L55667J109159K80757q73727
$$ plain form
40731 2592205 2405352 3844322 5089235 4315978 2646610 2411610 3532173 3783111 2330555
40722 2330555 993202 1635975 3832583 5790638 6548603 6377724 5564314 3901189 1710902
40713 1710902 583798 1959724 4839182 6161406 4373614 1600428 919531 2388675
40705 2388675 3584789 3303198 2321844 966450 -1033827 -2124000 74686 4268905
40697 4268905 5672437 2662042 -254826 1118113 4570652 5508477 4259924 4691593
40689 4691593 7181415 8090463 6021030 3886558 3994550 5034052 5119147 4505660 3958963
40680 3958963 3168798 2051675 1389962 1295683 1136874 1421954 3337856 6046371 7168450
40671 7168450 6447322 5974058 6161049 4856026 1583564 -813974 -481513 729282 784207
$$ packed form
40731B592205j86853J438970J244913p73257j669368k35000J120563K50938j452556
40722B330555j337353O42773K196608J958055P57965j70879q13410j663125k190287
40713A710902j127104J375926K879458J322224j787792k773186o80897J469144
40705B388675J196114k81591r81354j355394k000277j090173K198686M194219
40697D268905J403532l010395k916868J372939L452539R37825j248553M31669
40689D691593K489822R09048k069433k134472J07992J039502Q5095o13487n46697
40680C958963p90165j117123o61713r4279j58809K85080J915902K708515J122079
40671G168450p21128m73264J86991j305023l272462k397538L32461J210795N4925
$$ plain form
40662 784207 537405 1047989 1052527 -72383 172573 3530064 7113463 7146678 4595156
40653 4595156 3111246 2952978 1384201 -1631041 -2817971 -1097026 486896 -424010
40645 -424010 -2208286 -2418799 -1418522 -915115 -954251 -489851 304753 289269 -506696 -518493
40635 -518493 1325001 3880885 4617490 2501806 -111264 426031 4502968 8160786 7864732
40626 7864732 4998966 3500165 4080887 3812472 1396771 -497945 528422 2754742
40618 2754742 2886860 810824 -522401 746775 3389389 5148840 5133781 3819685 1905111
40609 1905111 -108359 -1703613 -2333435 -1716638 -131601 1557489 2354926 1931226 1050357
40600 1050357 993466 2320805 4194593 5149878 4644070 3576464 3081170 3243768 3470379
$$ packed form
40662G84207k46802N10584M538j124910K44956L357491L583399L3215k551522
40653D595156j483910j58268j568777l015242j186930J720945J583922r10906
40645d24010j784276k10513J000277N03407l9136M64400P94604j5484p95965j1797
40635e18493J843494K555884P36605k115684k613070N37295M076937L657818k96054
40626G864732k865766j498801N80722k68415k415701j894716J026367K226320
40618B754742J32118k076036j333225J269176K642614J759451j5059j314096j914574
40609A905111k013470j595254o29822O16797J585037J689090P97437m23700q80869
40600A050357n6891J327339J873788R55285n05808j067606m95294J62598K26611
$$ plain form
40591 3470379 3562910 3512873 2672313 497196 -1932507 -2665352 -1441265 17814 632227
40582 632227 1068376 1622289 1243214 -38245 -9795 2356872 4457273 3558252 1092334
40573 1092334 387949 1368379 1155258 -543419 -660261 2024907 4630636 4533520 2841959
40564 2841959 1741423 1131558 124579 -317981 1201502 3859319 5682365 6297412 6530643
40555 6530643 6120908 4062326 915312 -1242365 -1350240 -401225 229926 330909 519837
40546 519837 1252164 2379739 3213406 3073393 2098793 1179852 817705 702232 772704 1635455
40536 1635455 3090265 3374640 1334418 -1358004 -1896186 -67337 1499000 1122391 342836
40527 342836 1399940 3805239 5027384 4030096 2382720 1678749 1588711 1434138 2114673
$$ packed form
40591C470379R2531n0037q40560k175117k429703p32845J224087J459079O14413
40582F32227M36149N53913l79075j281459K8450K366667K100401q99021k465918
40573A092334p04385R80430k13121j698677j16842K685168K605729r7116j691561
40564B841959j100536o09865j006979m42560J519483K657817J823046O15047K33231
40555F530643m09735k058582l147014k157677j07875R49015O31151J00983J88928
40546E19837P32327J127575Q33667j40013r74600r18941l62147j15473P0472Q62751
40536A635455J454810K84375k040222k692422n38182J828849J566337l76609p79555
40527C42836J057104K405299J222145r97288j647376p03971r0038j54573O80535
$$ plain form
40518 2114673 4491720 6648900 5432733 1152660 -1865311 -751475 2218751 3368221
40510 3368221 2812802 2999861 3747886 2601384 -312764 -1742376 -221543 1987818 2848922
40501 2848922 3054220 3212770 1992723 -792124 -2274326 -342467 3060762 5070919
40493 5070919 6027465 7555193 8687993 7454541 4933097 4064297 5073669 5429788 4051897
40484 4051897 2430737 1637046 1166257 899410 1504668 2666963 3381405 4069339 5879138
40475 5879138 7884406 7764443 5540423 3821122 3856632 4167412 3746651 3691420 4570167
40466 4570167 4909130 3698036 2100509 1405541 1442211 2042944 3591230 4964861 3812411
40457 3812411 614550 -428326 3017976 7457172 8037041 4954555 2241686 1709121
$$ packed form
40518B114673K377047K157180j216167m280073l017971J113836K970226J149470
40510C368221n55419J87059P48025j146502k914148j429612J520833K209361Q61104
40501B848922K05298J58550j220047k784847j482202J931859L403229K010157
40493E070919R56546J527728J132800j233452k521444q68800J009372L56119j377891
40484D051897j621160p93691m70789k66847O05258J162295P14442O87934J809799
40475E879138K005268j19963k224020j719301L5510L10780m20761n5231Q78747
40466D570167L38963j211094j597527o94968L6670O00733J548286J373631j152450
40457C812411l197861j042876L446302M439196N79869l082486k712869n32565
$$ plain form
40449 1709121 1607908 612008 -335881 -337105 164076 942144 2555568 4699175 5883313
40440 5883313 5481227 4608565 4300173 4032945 2753894 561968 -1213472 -1331869 -27932
40431 -27932 820258 -367834 -2357345 -1822406 2254215 6265144 5987001 1978002 -1346438
40422 -1346438 -1518526 -193914 581947 1223609 2423328 2716603 567271 -2459299 -3064869
40413 -3064869 -545098 2229671 2603111 1470179 1885187 4998927 8479650 9198290 6812978
40404 6812978 4040237 3536890 5224564 6853906 6520008 4247200 1733025 1038525 2918948
40395 2918948 5806042 6960051 5255359 2271975 88455 -1028260 -1740834 -1613887
40387 -1613887 178894 2628121 3506752 2456344 1533007 2041189 2631286 1702582 260906
$$ packed form
40449A709121j01213r95900r47889j224N01181P78068J613424K143607J184138
40440E883313m02086q72662l08392k67228j279051k191926j775440j18397J303937
40431b7932Q48190j188092j989511N34939M076621M010929k78143m008999l324440
40422a346438j72088J324612P75861O41662J199719K93275k149332l026570o05570
40413c064869K519771K774769L73440j132932M15008L113740L480723P18640k385312
40404F812978k772741n03347J687674J629342l33898k272808k514175o94500J880423
40395B918948K887094J154009j704692k983384k183520j116715p12574J26947
40387a613887J792781K449227Q78631j050408r23337N08182N90097r28704j441676
$$ plain form
40378 260906 749574 3649636 6711508 7521157 5833338 3331841 1881947 2157467 3361078
40369 3361078 4010251 3295972 1828065 880372 924542 1220966 954598 383166 388012 970356
40359 970356 898879 -632320 -2461118 -2488908 -262541 2424383 3797585 3934486 3688656
40350 3688656 2897616 1001871 -1133144 -1680008 -322108 1128245 1165923 555288 1008109
40341 1008109 2659736 3933564 3654592 2273552 866877 -172716 -960048 -1315644 -958119
40332 -958119 -249671 71891 -106628 -302333 -391935 -472541 249832 2770410 5839442 6226985
40322 6226985 3046621 -56741 496861 2956704 2865246 20646 -1353921 391518 1791736
40313 1791736 373411 -1101404 542965 3460356 3947481 2329068 1503469 1563682 403046
$$ packed form
40378B60906M88668K900062L061872Q09649j687819k501497j449894K75520J203611
40369C361078O49173p14279j467907r47693M4170K96424k66368n71432M846N82344
40359I70356p1477j531199j828798k7790K226367K686924J373202J36901k45830
40350C688656p91040j895745k135015n46864J357900J450353L7678o10635M52821
40341A008109J651627J273828k78972j381040j406675j039593p87332l55596L57525
40332i58119P08448L21562j78519j95705q9602q0606P22373K520578L069032L87543
40322F226985l180364l103362N53602K459843r1458k844600j374567J745439J400218
40313A791736j418325j474815J644369K917391M87125j618413q25599O0213j160636
$$ plain form
40304 403046 -1380888 -866667 1980072 3819590 3217025 2395236 2705827 2219960 -374943
40295 -374943 -2736033 -2089988 734525 2757037 2822792 2205967 2292613 3238432 4255082
40286 4255082 4203472 2596786 674973 587226 2846665 5378958 5616112 2959247 -907839
40277 -907839 -3465284 -3383916 -1977079 -2072250 -4414031 -6249622 -5052819 -2260569 -908774
40268 -908774 -869726 296847 2542056 3204969 1657482 179636 -269485 -1248586 -3008730
40259 -3008730 -3530867 -2662548 -3139891 -5742779 -7442783 -6496256 -5355289 -5890016 -5690831
40250 -5690831 -2437946 1549868 2806131 1806165 949885 292690 -906883 -1122033 767695
40241 767695 2153922 471785 -1868308 -1039886 1601220 1674942 -769781 -1512022 592260
$$ packed form
40304D03046j783934N14221K846739J839518o02565q21789L10591m85867k594903
40295c74943k361090O46045K824513K022512O5755o16825Q6646R45819J016650
40286D255082n1610j606686j921813q7747K259439K532293K37154k656865l867086
40277i07839k557445Q1368J406837r5171k341781j835591J196803K792250J351795
40268i08774L9048J166573K245209O62913j547487j477846m49121r79101j760144
40259c008730n22137Q68319m77343k602888j700004R46527J140967n34727J99185
40250e690831L252885L987814J256263r99966q56280o57195j199573k15150J889728
40241G67695J386227j682137k340093Q28422K641106P3722k444723p42241K104282
$$ plain form
40232 592260 2196677 1674957 1370654 2465365 2566039 379955 -1385895 -232757 2210828
40223 2210828 2892376 1613593 462466 626303 1479566 1790920 849775 -833297 -1785417
40214 -1785417 -1326017 -346035 810616 3550754 7892522 10186205 7555541 3033747
40206 3033747 1840053 3581113 3395121 582191 -18539 3463639 6159326 4063966
40198 4063966 215572 -529194 1211439 1564530 17130 -533463 1236194 3671916 4938607
40189 4938607 4685263 3662731 3301817 4486287 5740757 4678657 2226767 2434440 6399020
40180 6399020 9739585 8713664 5694203 5247795 7394454 8537388 7239951 5324198
40172 5324198 4374739 4410261 5085984 5470699 3850764 387739 -1586671 222356 3260683
$$ packed form
40232E92260J604417n21720l04303J094711J00674k186084j765850J153138K443585
40223B210828O81548j278783j151127J63837Q53263L11354r41145j683072r52120
40214a785417M59400R79982J156651K740138M341768K293683k630664m521794
40206C033747j193694J741060j85992k812930o00730L482178K695687k095360
40198D063966l848394p44766J740633L53091j547400n50593J769657K435722J266691
40189D938607k53344j022532l60914J184470J254470j062100k451890K07673L964580
40180F399020L340565j025921l019461m46408K146659J142934j297437j915753
40172E324198r49459L5522O75723L84715j619935l463025j974410J809027L038327
$$ plain form
40163 3260683 3625291 1597138 183803 -84546 -805344 -1537004 -487358 1447826 1920615
40154 1920615 1886985 4234359 7729398 7716633 3783517 1335331 3543270 6736967 6723129
40145 6723129 5230152 6149783 8714621 8961389 6189441 3645149 3333178 3802930 3331486
40136 3331486 2366665 1985723 2009093 1758451 1533474 2291010 4169315 5949815 6219449
40127 6219449 5054763 4179580 4995395 6767345 7494412 6334898 4243754 2406485 1223225
40118 1223225 870235 1572121 2909740 3819772 3678613 2785851 1822417 1537441 2593730
40109 2593730 4655350 6001979 5316136 3518720 2508156 2595816 2824402 3246092 4764238
40100 4764238 6958558 8286489 8363589 7829097 6252697 2965411 -112105 141627 3243452
$$ packed form
40163C260683L64608k028153j413335k68349p20798p31660J049646J935184M72789
40154A920615l3630K347374L495039j2765l933116k448186K207939L193697j3838
40145F723129j492977R19631K564838K46768k771948k544292l11971M69752m71444
40136C331486r64821l80942K3370k50642k24977P57536J878305J780500K69634
40127F219449j164686q75183Q15815J771950P27067j159514k091144j837269j183260
40118A223225l52990P01886J337619R10032j41159q92762r63434k84976J056289
40109B593730K061620J346629o85843j797416j010564Q7660K28586M21690J518146
40100D764238K194320J327931P7100n34492j576400l287286l077516K53732L101825
$$ plain form
40091 3243452 5192662 4423727 3964693 5968262 7988420 7416556 6126422 7166043 9540066
40082 9540066 10143216 8840586 7670440 6595083 4205565 1617125 1425165 3201366
40074 3201366 4027368 3302424 2999139 3186162 1720215 -997045 -1516711 1014895 3103358
40065 3103358 2813914 3104159 6304206 9195764 7609879 3075219 427518 644382 697993
40056 697993 -426363 -449860 1197366 1693956 -390728 -2378046 -1607314 678311 1953455
40047 1953455 2535926 4269176 6619812 7100427 5046472 2330199 353923 -1254714
40039 -1254714 -2588361 -2453151 -513712 1323947 1170828 -231751 -573558 948200 2908949
40030 2908949 3701421 3130235 2085460 1695755 2815398 5316223 7691891 8269472 7077427
$$ packed form
40091C243452J949210p68935m59034K003569K020158n71864j290134J039621K374023
40082I540066O03150j302630j170146j075357k389518k588440j91960J776201
40074C201366Q26002p24944l03285J87023j465947k717260n19666K531606K088463
40065C103358k89444K90245L200047K891558j585885m534660k647701K16864N3611
40056F97993j124356k3497J647226M96590k084684j987318P70732K285625J275144
40047A953455N82471J733250K350636M80615k053955k716273j976276j608637
40039a254714j333647J35210J939439J837659j53119j402579l41807J521758J960749
40030B908949P92472n71186j044775l89705J119643K500825K375668N77581j192045
$$ plain form
40021 7077427 5721697 5290145 5469638 6060260 7863880 10888202 12839041 11309294 7264003
40012 7264003 4504964 5177027 7315926 7750021 6171937 4910246 5333843 6202989 5786069
40003 5786069 4195659 2888291 2758121 3585637 4752210 5543442 5175125 3671748 2602030
39994 2602030 3673952 6365714 8239160 8106771 7431189 7565637 7175465 4389289 576812
39985 576812 -657465 1569878 3961495 3478019 1112433 -189293 421994 1599673 2414976
39976 2414976 2888953 2672561 1412550 137807 201666 994948 909451 572829 2403467
39967 2403467 6115334 7501834 3755911 -1982265 -4003847 -971963 3098869 4440348
39959 4440348 3404244 2212384 1363708 -28834 -1728053 -2199042 -736370 1651662
$$ packed form
40021G077427j355730m31552J79493N90622J803620L024322J950839j529747m045291
40012G264003k759039O72063K138899M34095j578084j261691M23597Q69146m16920
40003E786069j590410j307368j30170Q27516J166573P91232l68317j503377j069718
39994B602030J071922K691762J873446j32389o75582J34448l90172k786176l812477
39985E76812j234277K227343K391617m83476k365586j301726O11287J177679Q15303
39976B414976M73977k16392j260011j274743O3859P93282q5497l36622J830638
39967B403467L711867J386500l745923n738176k021582L031884M070832J341479
39959D440348j036104j191860q48676j392542j699219m70989J462672K388032
$$ plain form
39951 1651662 3640910 4815772 5209566 4641819 3249686 2035957 1940888 2634742 3194008
39942 3194008 3794861 5372639 7324342 7296861 4523708 1920906 2778155 6080229 7578689
39933 7578689 5562962 2984398 3003929 4840129 5610554 4420605 2728518 1998844 2855871
39924 2855871 5373758 8216417 8562759 5161545 733633 -970952 106765 1035880
39916 1035880 714137 833293 1898528 1754872 -625071 -2794638 -2192379 254538 1843862
39907 1843862 1852112 1732382 2721551 4808419 7089783 7953068 6127843 2726846 807112
39898 807112 1617727 2913956 2493995 1477497 1918302 2960316 2248753 83413 -906723
39889 -906723 124168 1286254 1178344 546018 430893 863147 1722114 2928503 3553850
$$ packed form
39951A651662J989248J174862L93794n67747j392133j213729r5069O93854N59266
39942C194008O00853J577778J951703k7481k773153k602802Q57249L302074J498460
39933G578689k015727k578564J9531J836200P70425j189949j692087p29674Q57027
39924B855871K517887K842659L46342l401214m427912j704585J077717R29115
39916A035880l21743J19156J065235j43656k379943k169567O02259K446917J589324
39907A843862Q250j19730R89169K086868K281364Q63285j825225l400997j919734
39898H07112Q10615J296229m19961j016498M40805J042014p11563k165340r90136
39889i06723J030891J162086j07910o32326j15125M32254Q58967J206389O25347
$$ plain form
39880 3553850 2677183 1320071 1555017 3447887 4853798 4500084 3255085 2072193 836553
39871 836553 -319657 -750341 -860455 -1653278 -2105587 394134 5785935 10005431 9706281
39862 9706281 6437955 4238834 4515449 5242509 4353545 2164278 614347 995407 2324498
39853 2324498 2099915 -501693 -2788954 -1715151 1611757 3202104 1941704 842670
39845 842670 1876673 3150245 2783820 2117458 2804390 3833902 3975290 4181900 4768741
39836 4768741 3360035 -822192 -3586823 -1049935 3967309 5567758 3196905 1375019
39828 1375019 1980838 2285938 881269 252630 2101923 4491705 5323626 5004661 4088454
39819 4088454 1734343 -1680385 -3481376 -2160481 558934 2626423 4098966 5239352
$$ packed form
39880C553850q76667j357112K34946J892870J405911l53714j244999j182892j235640
39871H36553j156210m30684j10114p92823m52309K499721N391801M219496k99150
39862I706281l268326k199121K76615P27060q88964k189267j549931L81060J329091
39853B324498k24583k601608k287261J073803L326908J590347j260400j099034
39845H42670J034003J273572l66425o66362O86932J029512J41388K06610N86841
39836D768741j408706m182227k764631K536888N017244J600449k370853j821886
39828A375019O05819L05100j404669o28639J849293K389782Q31921l18965r16207
39819D088454k354111l414728j800991J320895K719415K067489J472543J140386
$$ plain form
39811 5239352 4908491 2721138 509155 -186906 -81913 -68736 653504 2671526 4605333
39802 4605333 5042047 4494229 3935880 3194721 2184699 1781102 2072874 1790284 782178
39793 782178 691890 1754797 1768785 173090 -701 2978979 5675505 4115244 -8505
39784 -8505 -1775417 -89975 1895699 2502395 3385025 5640677 7814137 8396068 7467900
39775 7467900 5593346 3672793 3728087 6797510 10009849 9041017 4006187 -231699 -340895
39766 -340895 2027301 3978450 5190088 6290684 6453484 5018572 3447319 3348156 4029106
39757 4029106 3993505 3535436 3912807 5053545 5964165 6539373 7200925 7461742 6544381
39748 6544381 4896442 3564358 2558961 1337449 445764 1027635 2784837 3918656
$$ packed form
39811E239352l30861k187353k211983o96061J04993J3177P22240K018022J933807
39802D605333M36714n47818n58349p41159j010022m03597K91772k82590j008106
39793G82178r0288J062907J3988j595695j73791K979680K696526j560261m123749
39784h505j766912J685442J985674O06696Q82630K255652K173460N81931r28168
39775G467900j874554j920553N5294L069423L212339r68832n034830m237886j09196
39766c40895K368196J951149J211638J100596J62800j434912j571253r9163O80950
39757D029106l5601m58069L77371J140738R10620N75208O61552K60817r17361
39748F544381j647939j332084j005397j221512q91685N81871J757202J133819
$$ plain form
39740 3918656 3327326 1784282 778634 1088113 2575634 4517108 5950440 6362315 6128613
39731 6128613 5803442 5221915 4065834 3073647 3565683 5522394 7092495 6555413 4197815
39722 4197815 1785366 649235 754751 1226570 1175346 203165 -1254089 -1992197 -969505
39713 -969505 1512314 3804676 4375565 3175992 1395829 123397 -351423 -49518 1193582
39704 1193582 3325843 5502181 6477646 5774023 4290309 3530228 4093656 5025699 4973284
39695 4973284 4020002 3756319 5038178 6344215 5480877 2706645 752596 1375395 3257040
39686 3257040 4155525 3924034 4060698 5010484 5561665 4955838 4219503 4777963 6442309
39677 6442309 7487948 6735363 5156978 4895558 6469457 7693486 6364761 3444831
$$ packed form
39740C918656n91330j543044j005648L09479J487521J941474J433332M11875k33702
39731F128613l25171n81527j156081r92187M92036J956711J570101n37082k357598
39722D197815k412449j136131J05516M71819n1224r72181j457254p38108J022692
39713i69505K481819K292362N70889j199573j780163j272432m74820L01905J243100
39704A193582K132261K176338R75465p03623j483714p60081N63428R32043n2415
39695D973284r53282k63683J281859J306037q63338k774232j954049O22799J881645
39686C257040Q98485k31491J36664R49786N51181o05827p36335N58460J664346
39677F442309J045639p52585j578385k61420J573899J224029j328725k919930
$$ plain form
39669 3444831 1854615 2201754 2057422 249675 -791357 1063375 3653856 3344809 474304
39660 474304 -1217083 -39366 1989220 2988552 3546882 4498895 5184329 5022929 4528318
39651 4528318 3757016 1983269 -95554 -261781 1755568 3082342 1710435 -411439
39643 -411439 -306510 1815204 3419844 3266547 2086404 966672 1037824 3337082 6819605
39634 6819605 8014854 5220274 1660647 1524309 4038667 5002519 3533987 3157725 5686351
39625 5686351 8050827 6877800 3074947 -154704 -1392611 -997005 898042 3939474
39617 3939474 6355946 6422859 4589571 2705432 1819534 1893262 2686687 3571228 3352750
39608 3352750 1682360 -18057 -158345 1257755 3360102 5673232 7491481 7484942 5606082
$$ packed form
39669C444831j590216L47139j44332j807747j041032J854732K590481l09047k870505
39660D74304j691387J177717K028586R99332N58330R52013O85434j61400m94611
39651D528318p71302j773747k078823j66227K017349J326774j371907k121874
39643d11439J04929K121714J604640j53297j180143j119732P1152K299258L482523
39634F819605J195249k794580l559627j36338K514358R63852j468532l76262K528626
39625E686351K364476j173027l802853l229651j237907L95606J895047L041432
39617C939474K416472O6913j833288j884139q85898P3728P93425Q84541k18478
39608C352750j670390j700417j40288J416100K102347K313130J818249o539j878860
$$ plain form
39599 5606082 4050652 4397848 5103246 4062788 2281051 2068205 2655889 1291216 -1511054
39590 -1511054 -1872196 1381439 4392053 3831230 1459983 727143 1663052 2167280 2235407
39581 2235407 3443152 5339543 5692519 4088202 2577520 2735726 4293696 6537685
39573 6537685 8844832 9888870 8547107 5784492 3713264 2816042 2122981 1895418 3512062
39564 3512062 6444819 8124626 7583601 6619068 6383496 5582069 3529659 2264030 3405778
39555 3405778 5050370 4297566 1414427 -880950 -1122903 170229 2428631 5290013
39547 5290013 7487723 7658269 6083423 4134239 2553114 1567019 1512543 1700814 179907
39538 179907 -3223117 -5342015 -3989705 -2090027 -3661214 -6932661 -6324795 -1212280
$$ packed form
39599E606082j555430L47196P05398j040458j781737k12846N87684j364673k802270
39590a511054l61142L253635L010614n60823k371247p32840R35909N04228O8127
39581B235407J207745J896391L52976j604317j510682J58206J557970K243989
39573F537685K307147J044038j341763k762615k071228q97222o93061k27563J616644
39564C512062K932757J679807n41025r64533k35572q01427k052410j265629J141748
39555C405778J644592p52804k883139k295377k41953J293132K258402K861382
39547E290013K197710J70546j574846j949184j581125r86095n4476J88271j520907
39538A79907l403024k118898J352310J899678j571187l271447O07866N112515
$$ plain form
39530 -1212280 2605949 1506215 -1036738 -649332 1489021 2018583 1365450 1814918 2316244
39521 2316244 224654 -3078386 -3189737 782768 4865883 5863890 4772964 3834064 3413485
39512 3413485 2913660 2135376 666235 -1806660 -3800103 -3122387 -551762 275047 -1937421
39503 -1937421 -3672175 -1354393 3532408 6422518 5267262 1888812 -1076925 -2262913
39495 -2262913 -1415305 513024 1477721 564815 -250685 1435200 4589585 5664758 3484008
39486 3484008 772955 107632 612233 57219 -1512972 -2091029 -783355 1122635 2013566
39477 2013566 1712983 1312250 1912427 3584814 5275421 5844985 5223591 4146468 2960363
39468 2960363 1667297 1109681 2517449 5179187 6221262 4130655 1170348 413526
$$ packed form
39530a212280L818229j099734k542953L87406K138353N29562o53133M49468N01326
39521B316244k091590l303040j11351L972505M083115R98007j090926r38900m20579
39512C413485m99825p78284j469141k472895j993443O77716K570625Q26809k212468
39503a937421j734754K317782M886801K890110j155256l378450k965737j185988
39495b262913Q47608J928329R64697r12906q15500J685885L154385J075173k180750
39486C484008k711053o65323N04601n55014j570191n78057J307674J905990Q90931
39477B013566l00583m00733O00177J672387J690607N69564o21394j077123j186105
39468B960363j293066n57616J407768K661738J042075k090607k960307p56822
$$ plain form
39460 413526 1403317 1211039 -601295 -1052597 1446219 4111358 3554543 728418 -358169
39451 -358169 1805008 4341942 3956274 922241 -1809567 -2318592 -1253262 -19536 1207601
39442 1207601 2917086 4396533 3931904 1468796 -230142 1267889 4290872 4598656
39434 4598656 1094046 -2256447 -1530290 2092781 4460880 4171377 3401859 3642529 3745595
39425 3745595 2758852 1805813 1738198 1297818 -412801 -1549369 -212078 1688820 410681
39416 410681 -3811396 -6112380 -3342196 1564790 3588364 2029525 230875 111089
39408 111089 402425 405872 1818998 5151529 7355025 5794933 2549824 1506024 2474458
39399 2474458 1970716 -570534 -1615547 536033 2706019 1809640 -496950 -877031 680354
$$ packed form
39460D13526R89791j92278j812334m51302K498816K665139n56815k826125j086587
39451c58169K163177K536934l85668l034033k731808n09025J065330J233726J227137
39442A207601J709485J479447m64629k463108j698938J498031L022983L07784
39434D598656l504610l350493P26157L623071K368099k89503p69518K40670J03066
39425C745595r86743r53039o7615m40380j710619j136568J337291J900898j278139
39416D10681m222077k300984K770184M906986K023574j558839j798650j19786
39408A11089K91336L447J413126L332531K203496j560092l245109j043800R68434
39399B474458n03742k541250j045013K151580K169986q96379k306590l80081J557385
$$ plain form
39390 680354 2019179 2781014 3718926 3706113 1330619 -1387608 -897414 2290101 3697963
39381 3697963 1204318 -2069593 -2193774 1045077 5024898 7172400 6123745 2508703
39373 2508703 -587309 -418882 1484757 961273 -2498243 -4492228 -2159391 1615991
39365 1615991 2683053 1181505 -97014 -215901 65539 753079 1788975 1563696 -664362
39356 -664362 -2466582 -1432806 910282 1641933 1377490 2861734 5672630 6514828 4661185
39347 4661185 3123246 3855197 5279593 5468597 4782543 4293472 4044774 3798772 3496515
39338 3496515 2542429 714549 -163112 1958253 5604479 6688103 3847527 209592
39330 209592 -990273 24902 1248760 1555314 649669 -1244675 -2630462 -1912993 -57726
$$ packed form
39390F80354J338825P61835R37912j2813k375494k718227M90194L187515J407862
39381C697963k493645l273911j24181L238851L979821K147502j048655l615042
39373B508703l096012J68427J903639n23484l459516j993985K332837L775382
39365A615991J067062j501548j278519j18887K81440O87540J035896k25279k228058
39356f64362j802220J033776K343088P31651k64443J484244K810896Q42198j853643
39347D661185j537939P31951J424396J89004o86054m89071k48698k46002l02257
39338C496515r54086j827880q77661K121365L646226J083624k840576l637935
39330B09592j199865J015175J223858L06554r05645j894344j385787P17469J855267
$$ plain form
39321 -57726 393468 -549803 -307649 1397855 1463339 -1134531 -2711754 -345598 3482337
39312 3482337 4872557 4123452 3825320 3996936 3167022 2316437 3436528 5356495 5148107
39303 5148107 2967705 1560903 1446734 587844 -1276090 -2007358 -1158612 -813826 -1543667
39294 -1543667 -1167733 1249743 3474373 3586805 2416324 1068543 -967838 -3461676
39286 -3461676 -4088875 -1791272 816644 864310 -809300 -1541787 -992107 -639595 -386594
39277 -386594 1280328 4123801 5937512 5698769 4658298 3953050 3288525 2624228 3063133
39268 3063133 4788556 5700926 3843129 425900 -1273116 91512 2548992 3709500
39260 3709500 3545135 3340880 3127212 1911662 88740 -377155 1271259 3266046 3739140
$$ packed form
39321e7726M51194r43271K42154J705504O5484k597870j577223K366156L827935
39312C482337J390220p49105k98132J71616q29914q50585J120091J919967k08388
39303E148107k180402j406802j14169q58890j863934p31268Q48746L44786p29841
39294a543667L75934K417476K224630J12432j170481j347781k036381k493838
39286c461676o27199K297603K607916M7666j673610p32487N49680L52512K53001
39277c86594J666922K843473J813711k38743j040471p05248o64525o64297M38905
39268C063133J725423R12370j857797l417229j699016J364628K457480J160508
39260C709500j64365k04255k13668j215550j822922m65895J648414J994787M73094
$$ plain form
39251 3739140 3081375 2643784 2345999 1241879 -388857 -1322333 -1269970 -783614 231517
39242 231517 2087563 3842852 4310537 4209403 4998652 5791181 4254008 855413 -991327
39233 -991327 -40975 841306 -298200 -781410 2395663 6954054 7800456 4044636 -33347
39224 -33347 -860084 759835 2227479 2581323 2361691 2142811 2359226 3256496 4184365
39215 4184365 3956603 2390436 525764 -846438 -1671208 -1547209 227090 2892630 4000315
39206 4000315 2109425 -1054574 -2171462 191265 4207561 6715815 6263784 4356243
39198 4356243 3574962 4409102 4768026 3283630 1879405 3318592 6870098 8755362 7123420
39189 7123420 4282553 3111234 3304979 2643536 503539 -1590629 -2165323 -1167273 475138
$$ packed form
39251C739140o57765m37591k97785j104120j630736r33476N2363M86356J015131
39242B31517J856046J755289M67685j01134P89249P92529j537173l398595j846740
39233i91327R50352Q82281j139506m83210L177073M558391Q46402l755820m077983
39224c3347q26737J619919J467644L53844k19632k18880K16415Q97270R27869
39215D184365k27762j566167j864672j372202q24770J23999J774299K665540J107685
39206D000315j890890l163999j116888K362727M016296K508254m52031j907541
39198D356243p81281Q34140L58924j484396j404225J439187L551506J885264j631942
39189G123420k840867j171319J93745o61443k139997k094168n74694R98050J642411
$$ plain form
39180 475138 1749920 2359574 3009746 4199776 4672861 2583278 -1334871 -3746097 -2970805
39171 -2970805 -1201094 -829017 -820813 654360 1981624 235709 -3302879 -3975982 -583288
39162 -583288 2530109 1676249 -1304296 -2534249 -1617559 -884629 -1142189 -1273730 -1019318
39153 -1019318 -1219204 -1642612 -1118356 156851 626622 -118037 -725927 -205721 1040615
39144 1040615 2448132 3785652 4217565 2803665 456108 -498844 512097 1423186 827858
39135 827858 285139 1771136 4365678 5488259 4561422 3400677 3258988 3364970 2604004
39126 2604004 1168460 60403 -83926 685036 1776209 2324700 1930460 1255509 1352860
39117 1352860 2363303 3353530 3363298 2109756 -149895 -2755972 -4660043 -4954368 -3590860
$$ packed form
39180D75138J274782O09654O50172J190030M73085k089583l918149k411226P75292
39171b970805J769711L72077Q204J475173J327264j745915l538588o73103L392694
39162e83288L113397q53860k980545j229953R16690P32930k57560j31541K54412
39153a019318j99886m23408N24256J275207M69771p44659o07890N20206J246336
39144A040615J407517J337520M31913j413900k347557r54952J010941R11089n95328
39135H27858n42719J485997K594542J122581r26837j160745j41689J05982p60966
39126B604004j435544j108057j44329P68962J091173N48491l94240o74951R7351
39117A352860J010443R90227R768j253542k259651k606077j904071k94325J363508
$$ plain form
39108 -3590860 -1345802 802351 2074007 2126059 1344460 533528 -10948 -526111 -609441
39099 -609441 829048 3602280 5463597 4707644 2612123 1617762 1859011 1512196 123557
39090 123557 -702568 -9768 1283954 2240212 3020218 3714968 3947987 4079472 4845544
39081 4845544 5365712 3763366 514091 -1199231 384556 3327399 5040648 5292941
39073 5292941 4825207 3611433 2426680 3436812 6583130 7837830 4350800 -654296
39065 -654296 -1917887 349593 1285770 -892195 -2627748 -1209701 1077443 915379 -1099015
39056 -1099015 -1842060 -100087 2412385 3393967 2016607 -460221 -1426397 633540 3960818
39047 3960818 5091239 3020809 345824 -212413 1166759 2491493 2551241 1600680 606979
$$ packed form
39108c590860K245058K148153J271656N2052p81599q10932n44476n15163q3330
39099f09441J438489K773232J861317p55953k095521r94361K41249l46815j388639
39090A23557q26125O92800J293722R56258P80006O94750K33019J31485P66072
39081D845544N20168j602346l249275j713322J583787K942843J713249K52293
39073E292941m67734j213774j184753J010132L146318J254700l487030n005096
39065f54296j263591K267480R36177k177965j735553J418047K287144j62064k014394
39056a099015p43045J741973K512472R81582j377360k476828r66176K059937L327278
39047C960818J130421k070430k674985n58237J379172J324734N9748r50561r93701
$$ plain form
39038 606979 438813 941254 782969 -690216 -1911066 -1109380 675123 977497 -1354
39029 -1354 367045 2611980 4150919 3619360 2888424 3403649 3740663 2616072 1303296
39020 1303296 957895 424042 -973117 -1302159 612065 2347576 1374551 -1021588 -2379188
39011 -2379188 -3177209 -4812494 -5736784 -3624129 344791 3411952 5820697 9100421
39003 9100421 11317540 9215121 4444397 2263714 3797527 4858130 3261513 1955776
38995 1955776 3189115 4648505 3962406 2698654 2950811 3680454 3533182 3898002 5736396
38986 5736396 6284997 2755719 -2722500 -5579640 -4820531 -3156592 -2237153 -1194414 471026
38977 471026 1613893 1270219 -301807 -2343675 -3825191 -3584140 -1856884 -793274 -1684714
$$ packed form
39038F06979j68166N02441j58285j473185j220850Q01686J784503L02374r78851
39029a354L68399K244935J538939n31559p30936N15225L37014j124591j312776
39020A303296l45401n33853j397159l29042J914224J735511r73025k396139j357600
39011b379188p98021j635285r24290K112655L968920L067161K408745L279724
39003I100421K217119k102419m770724k180683J533813J060603j596617j305737
38995A955776J233339J459390o86099j263752K52157P29643j47272L64820J838394
38986E736396N48601l529278n478219k857140P59109J663939R19439J042739J665440
38977D71026J142867l43674j572026k041868j481516K41051J727256J063610q91440
$$ plain form
38968 -1684714 -2738545 -1671869 576036 1248631 144200 -232766 1213420 2586415
38960 2586415 2014596 122951 -1170851 -830725 703889 1937120 1422426 -399420 -1062007
38951 -1062007 704311 2510974 1289515 -1977438 -3329447 -1492318 626772 568536
38943 568536 -763675 -1941454 -3568656 -6012435 -7272944 -5737083 -3162129 -2178365
38935 -2178365 -2212119 -817464 1783874 2656952 697703 -1638354 -1853249 -295010 1454344
38926 1454344 2990885 4460136 5092437 4082552 2099573 500238 -349512 -758718 -480610
38917 -480610 669680 1497220 548327 -1505539 -2437269 -1696989 -1174728 -2053282 -2899018
$$ packed form
38968a684714j053831J066676K247905O72595j104431l76966J446186J372995
38960B586415n71819j891645j293802L40126J534614J233231n14694j821846o62587
38951a062007J766318J806663j221459l266953j352009J837129K119090n8236
38943E68536j332211j177779j627202k443779j260509J535861K574954R83764
38935b178365l3754J394655K601338Q73078j959249k336057k14895J558239J749354
38926A454344J536541J469251O32301j009885j982979j599335q49750m09206K78108
38917d80610J150290Q27540r48893k053866r31730P40280N22261q78554q45736
$$ [...]
##END NTUPLES=NMR SPECTRUM
##END=
