##TITLE=31Pdec_1ABPA2604
 , 24 sc
 26.04.2021
##JCAMPDX= 6.0         $$ Bruker NMR JCAMP-DX V2.0
##DATA TYPE= NMR SPECTRUM
##DATA CLASS= NTUPLES
##ORIGIN= UXNMR, Bruker Analytische Messtechnik GmbH
##OWNER= root
$$ XWIN-NMR		Version 3.5
$$ Mon Apr 26 16:19:03 2021 Russian Standard Time (UT+4h)  she@DPX200
##.OBSERVE FREQUENCY= 81.013821
##.OBSERVE NUCLEUS= ^31P
##.ACQUISITION MODE= SIMULTANEOUS
##.ACQUISITION SCHEME= undefined
##.AVERAGES= 24
##.DIGITISER RES= 16
##SPECTROMETER/DATA SYSTEM= spect
##.PULSE SEQUENCE= zgpg30
##.SOLVENT NAME= D2O
##.SHIFT REFERENCE= (INTERNAL, D2O, 0, 248.564)
##AUDIT TRAIL= $$ (NUMBER, WHEN, WHO, WHERE, WHAT)
$$ ##TITLE= Audit trail, XWIN-NMR		Version 3.5
$$ ##JCAMPDX= 5.01
$$ ##ORIGIN= Bruker BioSpin GmbH
$$ ##OWNER= she
$$ F:/spectra/data/she/nmr/P31/1/pdata/1/auditp.txt
$$ ##AUDIT TRAIL=  $$ (NUMBER, WHEN, WHO, WHERE, WHAT)
(   1,<2021-04-26 16:17:53.73 +0400>,<she>,<DPX200>,
      <created by zg, POWCHK disabled, PULCHK disabled
       configuration hash MD5:
       00 E9 B6 7A A2 85 ED C7 34 08 36 98 17 FE 4E 26
       data hash MD5: 32K
       0A E2 31 D5 F9 64 76 F1 E0 9F A6 9C 28 A0 CE FD>)
(   2,<2021-04-26 16:17:56.34 +0400>,<she>,<DPX200>,
      <Start of raw data processing
       efp BC_mod = 2 LB = 1 FT_mod = 6 PKNL = 1 PHC0 = -5480.323 PHC1 = 18.60147 SI = 64K 
       data hash MD5: 64K
       03 C3 41 19 2B C0 38 56 35 48 68 1F 5B 7F F9 51>)
(   3,<2021-04-26 16:18:26.00 +0400>,<she>,<DPX200>,
      <pk PHC0 = -66.75233 PHC1 = 179.2001 
       data hash MD5: 64K
       53 6F 7B C2 65 B4 BF 03 0C 31 E7 C5 45 6F EA DB>)
(   4,<2021-04-26 16:18:29.78 +0400>,<she>,<DPX200>,
      <abs ABSG = 5 
       data hash MD5: 64K
       74 20 4E 88 30 AB FD A3 33 AC CB 9C CB E6 AA 3E>)
$$ ##END=
$$ 
$$ hash MD5
$$ 60 F6 5C 7E C7 45 0B AD 4D 35 88 7A 41 36 13 97
##$RELAX= 
##$RELAX= 
##$RELAX= 
##$RELAX= 
##$RELAX= 
##$RELAX= 
##$RELAX= 
##$RELAX= 
$$ Bruker specific parameters
$$ --------------------------
##$DU= <F:/spectra>
##$EXPNO= 1
##$NAME= <P31>
##$PROCNO= 1
##$TYPE= <nmr>
##$USER= <she>
##$AMP= (0..31)
100 100 100 100 100 100 100 100 100 100 100 100 100 100 100 100 100 100 
100 100 100 100 100 100 100 100 100 100 100 100 100 100 
##$AQSEQ= 0
##$AQ_mod= 1
##$AUNM= <au_zg>
##$AUTOPOS= <>
##$BF1= 81.014009
##$BF2= 200.13
##$BF3= 200.13
##$BF4= 200.13
##$BF5= 200.13
##$BF6= 200.13
##$BF7= 200.13
##$BF8= 200.13
##$BYTORDA= 1
##$CFDGTYP= 0
##$CFRGTYP= 5
##$CHEMSTR= <none>
##$CNST= (0..31)
1 1 145 1 1 1 1 1 1 1 1 1 1 1 1 1 1 1 1 1 1 1 1 1 1 1 1 1 1 1 1 1 
##$CPDPRG= <waltz16>
##$CPDPRG1= <>
##$CPDPRG2= <waltz16>
##$CPDPRG3= <>
##$CPDPRG4= <mlev>
##$CPDPRG5= <mlev>
##$CPDPRG6= <mlev>
##$CPDPRG7= <mlev>
##$CPDPRG8= <mlev>
##$CPDPRGB= <>
##$CPDPRGT= <>
##$D= (0..31)
0 1 0 0 0 0 0 0 0 0 0 0.03 2e-05 3e-06 0 0 0 0 0 0 0 0 0 0 0 0 0 0 0 0 
0 0 
##$DATE= 1619439473
##$DBL= (0..7)
120 120 120 11 120 120 24 19 
##$DBP= (0..7)
150 150 150 150 150 150 150 150 
##$DBP07= 0
##$DBPNAM0= <>
##$DBPNAM1= <>
##$DBPNAM2= <>
$$ [...]
##$SUBNAM3= <"">
##$SUBNAM4= <"">
##$SUBNAM5= <"">
##$SUBNAM6= <"">
##$SUBNAM7= <"">
##$SUBNAM8= <"">
##$SUBNAM9= <"">
##$SW= 501.771253377433
##$SWIBOX= (0..15)
0 1 3 0 0 0 0 0 0 0 0 0 0 0 0 0 
##$SW_h= 40650.406504065
##$TD= 32768
##$TD0= 1
##$TE= 0
##$TE2= 300
##$TE3= 300
##$TEG= 300
##$TL= (0..7)
0 120 53 12 22 120 120 120 
##$TP= (0..7)
150 150 150 150 150 150 150 150 
##$TP07= 0
##$TPNAME0= <>
##$TPNAME1= <>
##$TPNAME2= <>
##$TPNAME3= <>
##$TPNAME4= <>
##$TPNAME5= <>
##$TPNAME6= <>
##$TPNAME7= <>
##$TPOAL= (0..7)
0.5 0.5 0.5 0.5 0.5 0.5 0.5 0.5 
##$TPOFFS= (0..7)
0 0 0 0 0 0 0 0 
##$TUNHIN= 0
##$TUNHOUT= 0
##$TUNXOUT= 0
##$USERA1= <user>
##$USERA2= <user>
##$USERA3= <user>
##$USERA4= <user>
##$USERA5= <user>
##$V9= 5
##$VALIST= <valist>
##$VCLIST= <CCCCCCCCCCCCCCC>
##$VD= 0
##$VDLIST= <DDDDDDDDDDDDDDD>
##$VPLIST= <PPPPPPPPPPPPPPP>
##$VTLIST= <TTTTTTTTTTTTTTT>
##$WBST= 1024
##$WBSW= 4
##$XGAIN= (0..3)
0 0 0 0 
##$XL= 0
##$YL= 0
##$YMAX_a= 7531
##$YMIN_a= -11217
##$ZGOPTNS= <>
##$ZL1= 120
##$ZL2= 120
##$ZL3= 120
##$ZL4= 120
##$ABSF1= 248.5645
##$ABSF2= -253.2056
##$ABSG= 5
##$ABSL= 3
##$ALPHA= 0
##$AQORDER= 0
##$ASSFAC= 0
##$ASSFACI= 0
##$ASSFACX= 0
##$ASSWID= 0
##$AUNMP= <proc_1d>
##$AZFE= 0.1
##$AZFW= 0.5
##$BCFW= 0
##$BC_mod= 2
##$BYTORDP= 0
##$COROFFS= 0
##$CY= -3
##$DATMOD= 1
##$DC= 0
##$DFILT= <>
##$DTYPP= 0
##$F1P= 0
##$F2P= 0
##$FCOR= 1
##$FTSIZE= 65536
##$FT_mod= 6
##$GAMMA= 0
##$GB= 0
##$INTBC= 1
##$INTSCL= 5.30512e-09
##$ISEN= 30
##$LB= 1
##$LEV0= 0
##$LPBIN= 0
##$MAXI= 10000
##$MC2= 0
##$MEAN= 0
##$ME_mod= 0
##$MI= 50
##$NCOEF= 0
##$NC_proc= -6
##$NLEV= 6
##$NOISF1= 182.463
##$NOISF2= 159.3651
##$NSP= 0
##$NTH_PI= 0
##$NZP= 0
##$OFFSET= 248.5645
##$PC= 4
##$PHC0= -5547.076
##$PHC1= 197.8016
##$PH_mod= 1
##$PKNL= yes
##$PPARMOD= 0
##$PSCAL= 0
##$PSIGN= 0
##$REVERSE= no
##$SF= 81.014009
##$SI= 65536
##$SIGF1= 159.3651
##$SIGF2= -187.1042
##$SINO= 113.3802
##$SIOLD= 16384
##$SREGLST= <1H.CDCl3>
##$SSB= 0
##$STSI= 65536
##$STSR= 0
##$SW_p= 40650.406504065
##$SYMM= 0
##$S_DEV= 0
##$TDeff= 32768
##$TDoff= 0
##$TI= <>
##$TILT= no
##$TM1= 0
##$TM2= 0
##$TOPLEV= 0
##$USERP1= <user>
##$USERP2= <user>
##$USERP3= <user>
##$USERP4= <user>
##$USERP5= <user>
##$WDW= 1
##$XDIM= 65536
##$YMAX_p= 400137489
##$YMIN_p= -32231033
$$ End of Bruker specific parameters
$$ ---------------------------------
##NTUPLES= NMR SPECTRUM
##VAR_NAME=  FREQUENCY,     SPECTRUM/REAL,   SPECTRUM/IMAG
##SYMBOL=    X,             R,               I
##VAR_TYPE=  INDEPENDENT,   DEPENDENT,       DEPENDENT
##VAR_FORM=  AFFN,          ASDF,            ASDF
##VAR_DIM=   65536,         65536,           65536
##UNITS=     HZ,            ARBITRARY UNITS, ARBITRARY UNITS
##FACTOR=    0.620285442955139, 1,           1
##FIRST=     20137.2065510759, 0,            0
##LAST=      -20513.1999529892, 0,           0
##MIN=       -20513.1999529892, -32231033,   0
##MAX=       20137.2065510759, 400137489,    0
$$ Real data points
##PAGE= N=1
##DATA TABLE= (X++(R..R)), XYDATA
$$ [...]
44284b92645L31432j093529j190868P08308K185448J589442n840j352032k410418
$$ -292645 38787 -1054742 -2245610 -1537302 648146 2237588 2231748 879716 -1530702
44275a530702k416233M1489L651250M447998J215960k233675k486343j193026
$$ -1530702 -3946935 -3905446 -254196 4193802 5409762 3176087 689744 -503282
44267e03282j386914k082021o06712J746860J281651j588260k355664M56460K846472
$$ -503282 -1890196 -3972217 -4578929 -2832069 -1550418 -3138678 -5494342 -5037882 -2191410
44258b191410J663408p24936o57559J227581J834327P39241J4094K07735j44260
$$ -2191410 -528002 -1252938 -1910497 -682916 1151411 1890652 1904746 2112481 1968221
44249A968221j407031k112681j407634L5229J565655K924008L127882J276065
$$ 1968221 561190 -1551491 -2959125 -2923896 -1358241 1565767 4693649 5969714
44241E969714j294173j949757m50882N02767o79737k030616j079086J366168K386402
$$ 5969714 4675541 2725784 2274902 2777669 2097932 67316 -1011770 354398 2740800
44232B740800R63035j015852j488744m93677M77398M78414M2069K56418J046896
$$ 2740800 3703835 2687983 1199239 705562 1182960 1661374 1703443 1959861 3006757
44223C006757Q83714j101665l195122k785436q6262J636546L99108j665404j308031
$$ 3006757 3890471 2788806 -406316 -3191752 -3278014 -1641468 -1242360 -2907764 -4215795
44214d215795J309312L050407K129650k9775j245818j058238l21612J90501O8098
$$ -4215795 -2906483 143924 2273574 2243799 997981 -60257 -381869 -191368 -123270
44205a23270p29337j391255p14375J091911J903581K13243k312007k379252N94794
$$ -123270 -852607 -2243862 -2958237 -1866326 37255 250498 -2061509 -4440761 -3845967
44196c845967L307039K762259L24731k83475J565027K446272J2020l337931l727721
$$ -3845967 -538928 2223331 2548062 2264587 3829614 6275886 6287906 2949975 -777746
44187g77746j119092J047616P79776m45246o59954m4869K30636P1833K48511J029521
$$ -777746 -1896838 -849222 -69446 -514692 -1174646 -1219515 -988879 -917046 -668535 360986
44177C60986J755079J317843q75655l692153m560228k314682Q09266J820300J030152
$$ 360986 2116065 3433908 2558253 -1133900 -5694128 -8008810 -7199544 -5379244 -4349092
44168d349092J060944K195158J963780j85417j425627k16014J009018L5442j375869
$$ -4349092 -3288148 -1092990 870790 685373 -740254 -956268 52750 88192 -1287677
44159a287677q01911M99793P1982j004965J18453K698251K933489k53423l620829
$$ -1287677 -2089588 -1589795 -1517813 -2522778 -2404325 293926 3227415 2973992 -646837
44150f46837m214337k457117o2238K216994L762847L505092J499959n34448j259225
$$ -646837 -4861174 -7318291 -7380529 -5163535 -1400688 2104404 3604363 3069915 1810690
44141A810690j084178r83092j155245j233245p97245L48795J508465J282762l31618
$$ 1810690 726512 -256580 -1411825 -2645070 -3442315 -3093520 -1585055 -302293 -633911
44132f33911j079294M33449J962949O79806j955540j870591J284110L377600K035718
$$ -633911 -1713205 -1279756 683193 1362999 -592541 -2463132 -1179022 2198578 4234296
44123D234296k61802p38684k47422m80207n77190O74516J849031J114027m79400
$$ 4234296 3972494 3233810 2986388 2506181 1928991 2603507 4452538 5566565 5087165
44114E087165q57244m48602r28461j846645j593029o39677o22817j001810n4476
$$ 5087165 4229921 3781319 2852858 1006213 -586816 -1226493 -1849310 -2851120 -2905596
44105b905596J274279L83598j863905j239495L134962O130952L488907j721836
$$ -2905596 -1631317 -1247719 -3111624 -4351119 -1216157 4914795 8403702 6681866
44097F681866l286948o16323J089653r18351l166873j914391J081030J754873
$$ 6681866 3394918 2778595 3868248 2949897 -216976 -2131367 -1050337 704536
44089G04536P0087o56414M26745O52297j162055k506456j411035K99588J48068
$$ 704536 774623 118209 544954 1197251 35196 -2471260 -3882295 -3582707 -3434639
44080c434639j060995r92798L55702J256594J399326J674213J745124O43826q12826
$$ -3434639 -4495634 -5488432 -5132730 -3876136 -2476810 -802597 942527 1586353 773527
44071G73527r74969l13099o06556j506900j003838O77360R76551o76985j750166
$$ 773527 -201442 -514541 -1121097 -2627997 -3631835 -2954475 -1977924 -2654909 -4405075
44062d405075p83358N21628P02807Q60209J795150J837930j07614j858204r80017
$$ -4405075 -5188433 -4666805 -3963998 -3103789 -1308639 529291 421677 -1436527 -2416544
44053b416544J332515K050578O00349j085591j660856j192349J38337J891702
$$ -2416544 -1084029 966549 1566898 481307 -1179549 -2371898 -2233561 -341859
44045c41859K606270J245491j014749k078491j486669l60356L54419K39039r22940
$$ -341859 2264411 3509902 2495153 416662 -1070007 -1430363 -1075944 -836905 -1759845
44036a759845k335897k215162j96080J561008J383636P04452J550597K946462
$$ -1759845 -4095742 -6310904 -6506984 -4945976 -3562340 -2857888 -1307291 1639171
44028A639171K519971N57918n84420m89191q99462k031813j889875J34625J832741
$$ 1639171 4159142 4717060 4132640 3643449 2743987 712174 -1177701 -1043076 789665
44019G89665J421863p1808q31448p16908m74403j07578N67810R03994L44488l25413
$$ 789665 2211528 2139720 1308272 591364 116961 9383 577193 1481187 1825675 1500262
44009A500262P4261J149776J024589j199775l665530l375288P8037L371536L267703
$$ 1500262 1574523 2724299 3748888 2549113 -1116417 -4491705 -4413668 -1042132 2225571
44000B225571Q52662r0563J271640J697673p65823l488598l372998j431826m30882
$$ 2225571 3078233 2987670 4259310 5956983 5191160 1702562 -1670436 -3102262 -3533144
43991c533144l41697M61976J372815P69093k77572L72339J490738J14625k760421
$$ -3533144 -3874841 -3412865 -2040050 -1270957 -1548529 -1176190 314548 429173 -2331248
43982b331248k956452l5863J533456m47255k375454q83304J861160K096714L16207
$$ -2331248 -5287700 -5323563 -3790107 -4237362 -6612816 -7496120 -5634960 -3538246 -3222039
43973c222039m84869J7308j73603j251697j311201L36044K217150K872449K110892
$$ -3222039 -3706908 -3689600 -3863203 -5114900 -6426101 -6090057 -3872907 -1000458 1110434
43964A110434N10266q89934j074325l97126l95946j247883j079142Q01607K046944
$$ 1110434 1620700 730766 -343559 -740685 -1136631 -2384514 -3463656 -2662049 -615105
43955f15105P34571j290412j214323K76741M79818o20450p04119M65732Q09217
$$ -615105 119466 -1170946 -2385269 -2108528 -1628710 -2249160 -2953279 -2487547 -1678330
43946a678330J63034P66609K665230K633128m38443k735301r98720K101346J807626
$$ -1678330 -1515296 -748687 1916543 4549671 4111228 1375927 377207 2478553 4286179
43937D286179j389074k622814l28348J584536L04088j425475o9633K746226K826071
$$ 4286179 2897105 274291 -54057 1530479 1834567 409092 339459 3085685 5911756
43928E911756M6582j874252j631085j777131l193681k760155J089419M440260
$$ 5911756 5958338 4084086 2453001 675870 -2517811 -5277966 -4188547 251713
43920B51713L170707o32918j791883J92520J179437m69832j760054p41376L56297
$$ 251713 3422420 2789502 997619 1190139 2369576 1899744 139690 -601686 -245389
43911b45389m67908j344732L5214K195648K016116o25162k901121k700303m09337
$$ -245389 -713297 -2058029 -2022815 172833 2188949 1563787 -1337334 -4037637 -4446974
43902d446974J990949K295445j82158l071537k756506J008270M127704L297955
$$ -4446974 -2456025 -160580 -342738 -3414275 -6170781 -5162511 -1034807 2263148
43894B263148J02460j831895j646326q47469o637J201546J886626Q43272j037482
$$ 2263148 2365608 533713 -1112613 -1960082 -1966719 -765173 1121453 1964725 927243
43885I27243j806181j357209r47749n41956P31204J956125J139238j323598k468322
$$ 927243 -878938 -2236147 -3183896 -3725852 -2994648 -1038523 100715 -1222883 -3691205
43876c691205o42723K350459L525333J794958j301739k867456j125531K210930
$$ -3691205 -4333928 -1983469 1541864 3336822 2035083 -832373 -1957904 253026
43868B53026L080818P5315l217475k977765m44427N97938r9377K02921J610206
$$ 253026 3333844 3409159 191684 -2786081 -3230508 -2632570 -2731947 -2529026 -918820
43859i18820J414513l72636m68181J533844J619365j767647m173085j857929K061438
$$ -918820 495693 123057 -345124 1188720 2808085 1040438 -3132647 -4990576 -2929138
43850b929138K425750k30040j523257n42771j05118p81465m8704K295746K848109
$$ -2929138 -503388 -733428 -2256685 -2799456 -2904574 -3686039 -3734743 -1438997 1409112
43841A409112J95782k354741j804637J70295N18895k69148J89364J417505P18485
$$ 1409112 1604894 -749847 -2554484 -2384189 -1865294 -2134442 -1945078 -527573 190912
43832A90912j921144l209601j527190O25634P16127N8217J143975K965365K283899
$$ 190912 -1730232 -4939833 -6467023 -5841389 -5125262 -5067045 -3923070 -957705 1326194
43823A326194r68869k965510j371302J472223K212239R06634j68907j76682J53625
$$ 1326194 357325 -2608185 -3979487 -2507264 -295025 611609 442702 266020 419645
43814D19645O22337J281878J048440q36794k611760j907866M63814J338821j69525
$$ 419645 1041982 2323860 3372300 2535506 -76254 -1984120 -1520306 -181485 -351010
43805c51010j556328q30650J006841K069186J903556R49344l11984j002265m97127
$$ -351010 -1907338 -2737988 -1731147 338039 2241595 3190939 2878955 1876690 1379563
43796A379563J95471l11462j114146j68899J756181J524367j220405k870646j303537
$$ 1379563 1575034 1263572 149426 -19473 1736708 3261075 2040670 -829976 -2133513
43787b133513R35925R61517k05828l11226J32940m41833j309664r54879n6274
$$ -2133513 -1197588 -236071 -441899 -753125 -620185 -1062018 -2371682 -3326561 -3382835
43778c382835p052j50777O81658J547848J027945k80947j451368l079292m586411
$$ -3382835 -3389887 -3540664 -2859006 -1311158 -283213 -564160 -2015528 -5094820 -9681231
43769i681231k723439L159361P327834M487731j805018l648119k78466J796519
$$ -9681231 -12404670 -9245309 -1917475 2570256 765238 -2882881 -3161347 -1364828
43761a364828k22035j872399j70119J568726N76587l80188J136115K199553P2433
$$ -1364828 -1586863 -3459262 -3629381 -2060655 -1484068 -1864256 -728141 1471412 1543845
43752A543845k193469j000512J138464j2163k718463k245761Q47901J968492O96552
$$ 1543845 -649624 -1650136 -511672 -523835 -3242298 -5488059 -4640158 -2671666 -1975114
43743a975114R23112K924415K231665k142251m720040j711652K956796L418570
$$ -1975114 -1052002 1872413 4104078 1961827 -2758213 -4469865 -1513069 1905501
43735A905501j29500l040409l022150j395369N34946K397793K978313J176857
$$ 1905501 1776001 -1264408 -4286558 -5681927 -5146981 -2749188 229125 1405982
43727A405982j401871j890057k86781O70009j3718k71706R97623J710696K88633
$$ 1405982 4111 -1885946 -2172727 -1502718 -1516436 -1788142 -790519 920177 1208810
43718A208810j095243K07336K564337K066700j319685l303301j573376R48033
$$ 1208810 113567 320903 2885240 4951940 3632255 328954 -1244422 -296389
43710b96389Q60419p13735n42162J424495K386270J255926k92169r99590j275982
$$ -296389 564030 -149705 -691867 732628 3118898 4374824 4082655 3083065 1807083
43701A807083j182665l4325J465453J357826m80530j787053j326883m56587k88981
$$ 1807083 624418 590093 2055546 3413372 2932842 1145789 -181094 -637681 -926662
43692i26662J14690J266039J491414l35629k353653k183911k32856J496227K311608
$$ -926662 -811972 454067 1945481 1609852 -743801 -2927712 -3160568 -1664341 647267
43683F47267K449198J370494j081368l011888k503093n26875M90569K69968M76877
$$ 647267 3096465 4466959 3385591 373703 -2129390 -2656265 -2165696 -1895728 -1418851
43674a418851J504866J914208R23698o34727j756135j929036p75522J184406J967085
$$ -1418851 86015 2000223 2923921 2289194 533059 -1395977 -2171499 -987093 979992
43665I79992K94413k148672k595610q45171R39767J457685J142546M22206n80515
$$ 979992 1274405 -874267 -3469877 -4315048 -3375281 -1917596 -775050 -352844 -933359
43656i33359j077320n78887k03352p72064p13514J248616K616961K72455l611339
$$ -933359 -2010679 -2589566 -2792918 -3564982 -4278496 -3029880 -412919 -140464 -3751803
43647c751803l527104J139241M729577L503782M36872m24249J20648n11224j417971
$$ -3751803 -7278907 -6139666 -1410089 2093693 2530565 2106316 2226964 1715740 297769
43638B97769k19310J973709J848868q27175k825639k132733j80780P38907J82654
$$ 297769 78459 2052168 3901036 3073861 248222 -1884511 -2065291 -1326384 -1143730
43629a143730o69207o59191J59286N75413j48821q23406J87012K102586K414518
$$ -1143730 -1812937 -2472128 -2312842 -1737429 -1886250 -2709656 -2522644 -420058 1994460
43620A994460P04277p80768j005335j529878k775353k360656O38168L061238K223472
$$ 1994460 2698737 1917969 912634 -617244 -3392597 -5753253 -5115085 -2053847 169625
43611A69625K01029J90206J230982N48089j004535m45106J654497J782370n39980
$$ 169625 370654 560860 1791842 2339931 1335396 890290 2544787 4327157 3787177
43602C787177k001150j132764l79424j401444k147631m75771K192882K917304
$$ 3787177 1786027 653263 273839 -1127605 -3275236 -3751007 -1558125 1359179
43594A359179J118556j230740k118236j137686M72610R25448k05735j295411q46649
$$ 1359179 2477735 1246995 -871241 -2008927 -1536317 -610869 -816604 -2112015 -2958664
43585b958664L02205M21767l10809m38321J35029M54353P61759J759958K209506
$$ -2958664 -2656459 -2234692 -2545501 -2983822 -2848793 -2394440 -1632681 127277 2336783
43576B336783L67909k390379k777631o25094Q13041J76566j28196J397412K534605
$$ 2336783 2704692 314313 -2463318 -3088412 -2275371 -2098805 -2227001 -829589 1705016
43567A705016J225238r70267j681643j266116j039254m55266J158251K148948
$$ 1705016 2930254 1959987 278344 -987772 -2027026 -2482292 -1324041 824907
43559H24907Q61862j151468j302864j73257l94377k007519k193878K36289K953060
$$ 824907 1686769 535301 -767563 -940820 -1335197 -3342716 -5536594 -5300305 -2347245
43550b347245L416146J867721J40465q12363j207356j431787j679472j941932
$$ -2347245 1068901 2936622 3077087 2264724 1057368 -374419 -2053891 -3995823
43542c995823j835203r35147M94078J671414K294359K686587K840823K144826
$$ -3995823 -5831026 -6766173 -6272095 -4600681 -2306322 380265 3221088 5365914
43534E365914M64127j202478j786505j456494j163338j112479o11440L63203N00792
$$ 5365914 5830041 4627563 2841058 1384564 221226 -891253 -1502693 -1139490 -638698
43525f38698j011967k649001j954666J156970L878520L750870J267618j281919
$$ -638698 -1650665 -4299666 -6254332 -5097362 -1218842 2532028 3799646 2517727
43517B517727k310341j551271M31182K243050K377871J115975M88790J154513
$$ 2517727 207386 -1343885 -912703 1330347 3708218 4824193 5312983 6467496
43509F467496R44244j661716m261223l363242M84182L231816K625241K91737j353825
$$ 6467496 7411740 5750024 1488801 -1874441 -1390259 1841557 4466798 4758535 3404710
43500C404710j653533r53253K39113Q91110K81653n63006k00783N67987l23410
$$ 3404710 1751177 797924 1037037 1928147 2209800 1646794 1446011 2013998 1690588
43491A690588k568199l375509j409589J461978K807572K003399j40639k029934
$$ 1690588 -877611 -4253120 -5662709 -4200731 -1393159 610240 469601 -1560333
43483a560333j729317R23814L037693K061585l15499q46584k09828j429015l504498
$$ -1560333 -3289650 -2365836 671857 2733442 2417943 1571359 1361531 -67484 -3571982
43474c571982k202826K247214M260297J505169j464288r04809N31490m17250j666580
$$ -3571982 -5774808 -3527594 732703 2237872 773584 -131225 400265 -16985 -1683565
43465a683565k98459J609314R56748l91435Q13985K782207J716880j134221j514293
$$ -1683565 -1982024 -372710 584038 192603 1006588 3788795 5505675 4371454 2857161
43456B857161L83027N44653j607239k479377p87010O54405J63341n69132l08215
$$ 2857161 3240188 3784841 2177602 -301775 -1088785 -434380 -271039 -840171 -1148386
43447a148386j75541p76988r36001q6339R24020J610115J839647O84278j773048
$$ -1148386 -1323927 -2100915 -3036916 -3123255 -2199235 -589120 1250527 1934805 161757
43438A61757k688028j60686K679141J693688j441874j684396R82695J709376o31025
$$ 161757 -2526271 -2686957 -7816 1685872 243998 -1440398 -457703 1251673 620648
43429F20648j674236L47191J463161n58932j904415M83088L286807K408190l52435
$$ 620648 -1053588 -706397 756764 197832 -1706583 -1223495 2063312 4471502 4119067
43420D119067r92083o0027o71304k383883k129841K06410J662815R49301l76049
$$ 4119067 3126984 3066957 2395653 11770 -2118071 -1911661 -248846 700455 324406
43411C24406r86501r57605l58315O72847J027750J23527n23664N57607K114126
$$ 324406 -662095 -1619700 -1978015 -1305168 -277418 -153891 -677555 -119948 1994178
43402A994178J974860M68240m44374m39827o05027p85324N7943J337700J378386
$$ 1994178 3969038 4437278 3992904 3553077 2948050 2162726 2220669 3558369 4936755
43393D936755K28769n10533m37167n30667q33551m59379J74388k77813j346180
$$ 4936755 5165524 4654991 4217824 3687157 2853606 2394227 2568615 2290802 944622
43384I44622j038562P02976J536085M83916n37885j93131n8359j567307k937286
$$ 944622 -93940 609036 2145121 2629037 2091152 1898021 1839662 272355 -2664931
43375b664931j795460O46247J092179p31117j589538K43137K388586K098499K22883
$$ -2664931 -4460391 -3814144 -2721965 -3453082 -5042620 -4799483 -2410897 -312398 -89515
43366h9515n55587J99393P70418N24987M54604P10936K16231r12873j058705N757
$$ -89515 -645102 -445709 324709 849696 1304300 2015236 2231467 1318594 259889 265646
43356B65646L55703q09980j569644n47833O12596J48337p08053j29817P93176
$$ 265646 621349 -188631 -1758275 -2306108 -1693512 -1545175 -2253228 -2383045 -1589869
43347a589869Q1088j210854o45550J142768J453437K71788l0052N95157q1343
$$ -1589869 -1508781 -2719635 -3365185 -2222417 -768980 -497192 -527244 67913 -13430
43338a3430j538429m27704L153678M194716R6267m740549m912707j250069J494798
$$ -13430 -1551859 -1979563 1174115 5368831 5465098 724549 -4188158 -5438227 -3943429
43329c943429J486347N20686j16999n47300j43878J823841L796370L294682N46653
$$ -3943429 -2457082 -1936396 -2053395 -2600695 -2744573 -920732 2875638 6170320 6716973
43320F716973j852060k612524k545639j996479k92476K003160K859179J505098
$$ 6716973 4864913 2252389 -293250 -2289729 -2582205 -579045 2280134 3785232
43312C785232n32080j654502j753798j219741k49506L59971l71637j653398j282407
$$ 3785232 3253152 1598650 -155148 -1374889 -1624395 -1264424 -1636061 -3289459 -4571866
43303d571866R40749K051849l3087k802647k020915K176895M905483K982702q52985
$$ -4571866 -3631117 -1579268 -1612355 -4415002 -6435917 -4259022 646461 3629163 2776178
43294B776178k052335n49760J9680j522564k231277k24649K030068J733509K41668
$$ 2776178 723843 174083 193763 -1328801 -3560078 -3784727 -1754659 -21150 220518
43285B20518N16691J960661J359916j695556l800525k469045Q63231L188407L139125
$$ 220518 737209 2697870 4057786 2362230 -1438295 -3907340 -3044109 144298 3283423
43276C283423J331734o72981j317718m15765L79246k48001j237474r50424J0757
$$ 3283423 4615157 3942176 2624458 2208693 2587939 2339938 1102464 152040 162797
43267A62797M7896m13057O7749Q49748L23464o97445k73502P06002n8998j496533
$$ 162797 210693 -202364 -134615 715133 1038597 341152 67650 773652 714654 -781879
43257g81879n38295J893968J670350j235978k058276P24980K688882J110860p00908
$$ -781879 -1320174 573794 2244144 1008166 -1050110 -325130 2363752 3474612 2773704
43248B773704Q5868Q56593q42721k202495m92714J404947J84426j571806j57731
$$ 2773704 2859572 3716165 2873444 670949 178235 1583182 1767608 195802 38071
43239C8071K056816O67192k617077k729768K1334R68398m75182l67801K117609
$$ 38071 2094887 2762079 145002 -2584766 -2563432 -1595034 -2070216 -2438017 -320408
43230c20408L256825J470894m89961q69897j011959j272154l7914K051035J878126
$$ -320408 2936417 4407311 3917350 3047453 2035494 763340 725426 2776461 4654587
43221D654587p24508j949098o3436J771639O18221k050555l220755k260353l19796
$$ 4654587 3930079 1980981 1917545 3689184 4307405 2256850 -963905 -3224258 -3544054
43212c544054J434248J767713K13000j255693j75379K328356K640873K85358j248483
$$ -3544054 -2109806 -342093 -129093 -1384786 -1560165 768191 3409064 3694422 2445939
43203B445939j63793J037513O5531j644084j773476m64861Q88813J565843R74853
$$ 2445939 2282146 3319659 3385190 1741106 -32370 -497231 391582 1957425 2932278
43194B932278j082192k668376j331064J647302K177180l79523j978417n68496
$$ 2932278 1850086 -818290 -2149354 -502052 1675128 1295605 -682812 -1251308
43186a251308N36653j330011l220256j498844J837225K388819M53522K1112J969040
$$ -1251308 -714655 -2044666 -5264922 -6763766 -4926541 -2537722 -2084200 -2063088 -94048
43177i4048L017979J323753j072534k024919k067478k271801k027265n26580J273117
$$ -94048 2923931 4247684 3175150 1150231 -917247 -3189048 -5216313 -5742893 -4469776
43168d469776J740563P66663k98253m88652j03122J78871K94917N18394O13451
$$ -4469776 -2729213 -1962550 -2260803 -2749455 -2852577 -2673706 -2378789 -1860395 -1246944
43159a246944N4764q54406r90662J7369J112732J333410J026230P44883J53540
$$ -1246944 -1192180 -2046586 -3037248 -3019879 -1907147 -573737 452493 1197376 1350916
43150A350916q22298j112288l54830k44298j938798l378964j842286J593545L049167
$$ 1350916 528618 -583670 -938500 -1182798 -3121596 -6500560 -8342846 -6749301 -3700134
43141c700134J153226j395151j802913k61535J377358J896013J201903J47556
$$ -3700134 -2546908 -3942059 -5744972 -6006507 -4629149 -2733136 -1531233 -1383677
43133a383677L1498J036753J655711R24573L013j19635n99920k016646j997025
$$ -1383677 -1352179 -315426 1340285 2264858 2267871 2148236 1548316 -468330 -2465355
43124b465355R22838L295714J221150k878289l361812k98436Q23683j619890k933727
$$ -2465355 -1542517 1753197 2974347 96058 -3265754 -3564190 -2740507 -4360397 -7294124
43115g294124l49475K537202K148859K86636k3009O01014M68691K90705Q65336
$$ -7294124 -7643599 -5106397 -2957538 -2670902 -2693911 -2092897 -1624206 -1333501 -468165
43106d68165P73278o69443j423460l65202M16607m45661q57088Q04357K516262
$$ -468165 305113 -364330 -1787790 -2152992 -1736385 -2182046 -3039134 -2234777 281485
43097B81485K272597J425847J350875L89193k425227m084148k016432J160828
$$ 281485 2554082 3979929 5330804 5719997 3294770 -789378 -2805810 -1644982
43089a644982J401433o61545j376436J00549J446125J193207j25450j593936k168808
$$ -1644982 -243549 -905094 -2281530 -2180981 -734856 458351 332901 -1261035 -3429843
43080c429843q70770J334636J960110Q48137N89581J554127O77706k483509l462706
$$ -3429843 -4300613 -2965977 -1005867 -157730 431851 1985978 2663684 180175 -3282531
43071c282531j66503K673270R77587j732564o11112J894416O31788k737763k624493
$$ -3282531 -3449034 -775764 201823 -1530741 -2141853 -247437 384351 -2353412 -4977905
43062d977905N07415J208847j106136j619254O25732J066804j533264k289807
$$ -4977905 -4470490 -3261643 -4367779 -5987033 -5361301 -4294497 -5827761 -8117568
43054h117568J258000M539204L275435q4698j038884J77147M16771q18367j429347
$$ -8117568 -6859568 -2320364 955071 870373 -168511 8636 425407 -392960 -1822307
43045a822307o13352L09343K30834m34035m39587R52173K859686L259729J426103
$$ -1822307 -2435659 -2126316 -1895482 -2329517 -2769104 -1816931 1042755 4302484 5728587
43036E728587r44089k167215k605399k633493q69502K778385M630403J709119
$$ 5728587 4784498 2617283 11884 -2621609 -3491111 -712726 3917677 5626796
43028E626796k998852m124852j554446K20258m31125o94936P09759J290977k73840
$$ 5626796 2627944 -1496908 -3051354 -2831096 -3262221 -3957157 -3247398 -1956421 -2230261
43019b230261j557317n17904J389512J906364R37471l75003j156101p76610M95554
$$ -2230261 -3787578 -4305482 -2915970 -1009606 -72135 -447138 -1603239 -2379849 -1884295
43010a884295R44087k60038j132975k7003R82894m28120j957070j61364K895169
$$ -1884295 -940208 -1200246 -2333221 -2360224 -1377330 -1805450 -3762520 -3923884 -1028715
43001a028715K412707q16790j524062R44817J905114J73339j52831J724443J074536
$$ -1028715 1383992 567202 -956860 -12043 1893071 2066410 1913579 3638022 4712558
42992D712558l155180m925443j079289K728461J293824j716867p56315K101237
$$ 4712558 1557378 -3368065 -4447354 -1718893 -425069 -2141936 -2898251 -797014
42984g97014J647282j118268j515008K85657N55757m66588N15713K750154K068734
$$ -797014 850268 -268000 -1783008 -1497351 -941594 -1408182 -892469 1857685 3926419
42975C926419j656698l815950k216331L28287J220647J243408J569197J582275
$$ 3926419 2269721 -1546229 -3762560 -3434273 -2213626 -970218 598979 2181254
42967B181254Q37995J55752j15158n82966j260262j520288j355893q74034N01495
$$ 2181254 3019249 3175001 3059843 2476877 1216615 -303673 -1659566 -2533600 -2032105
42958b032105K305719K136588q07647l081714j317206K358351L169415P31275
$$ -2032105 273614 2410202 1602555 -1479159 -2796365 -438014 2731401 3462676
42950C462676j167484j035551j009015j681665p87083J797019K577882Q1809k179147
$$ 3462676 2295192 1259641 250626 -1431039 -2218122 -421103 2156779 2238588 59441
42941E9441j046681J372822J233980j143104k234992p03805J327165J851256J203630
$$ 59441 -987240 385582 1619562 476458 -1758534 -2462339 -1135174 716082 1919712
42932A919712N51934R1135o12889j443909j531271k13607J772959K419016N42573
$$ 1919712 2471646 2562781 1949892 505983 -1025288 -1238895 534064 2953080 3495653
42923C495653k302005l131642j070572J533386K079226O82131o94520j043133
$$ 3495653 1193648 -1937994 -3008566 -1475180 604046 1286177 591657 -451476
42915d51476q79727n40911L95088J672364J847154K73028j370446j033445O28109
$$ -451476 -1331203 -1872114 -1477026 195338 2042492 2315520 945074 -88371 539738
42906E39738R81803n42007j320980L44637K127107R87591j935536k866997j185911
$$ 539738 1521541 979534 -341446 3191 2130298 3117889 1182353 -1684644 -2870555
42897b870555j01015j124070j580297P03013L424932L164232N36328r39864M8259
$$ -2870555 -2971570 -4095640 -5675937 -4972924 -1547992 1616240 2152568 1212704 1260963
42888A260963J409101J137427l75758j653040j986467j617038j122469q57837
$$ 1260963 2670064 3807491 3431733 1778693 -207774 -1824812 -2947281 -3805118
42880c805118n46994K95304J282199J319334K80197n66499m11444M4692J21028
$$ -3805118 -4352112 -4056808 -2774609 -1455275 -1175078 -1741577 -2153021 -2108329 -1987301
42871a987301K96307Q41449Q71890O8024k08339Q54138J616590L11583j882412
$$ -1987301 -1690994 -849545 22345 90369 -117970 736168 2352758 2664341 781929
42862G81929k320569p31128O86845O69821J65161J26045J26472k69477m62004
$$ 781929 -1538640 -2269768 -1582923 -913102 -747941 -621896 -495424 -764901 -1226905
42853a226905k0756K55274m61573j377108p60791J552879L240293K043653r62057
$$ -1226905 -1247661 -992387 -1453960 -2831068 -3591859 -2038980 1201313 3244966 2282909
42844B282909k174368k32193J780380O67542j969655k096220M08578J599451j18414
$$ 2282909 108541 -123652 1656728 2324270 354615 -1741605 -1333027 266424 148010
42835A48010j597614m08993J327309J057700J87745R87757J905226K1232l457895
$$ 148010 -1449604 -1858597 -531288 526412 714157 1701914 3607140 3628372 170477
42826A70477m302346j361933J990620K659469J207673M7033M48056J787667K322215
$$ 170477 -4131869 -5493802 -3503182 -843713 363960 410993 859049 2646716 4968931
42817D968931P27195k080757l354082j885024K43153P27049K68075O91631J486222
$$ 4968931 5696126 3615369 261287 -1623737 -1380584 -653535 -385460 306171 1792393
42808A792393R35550m64707o91956L41821Q39262K30157m11672o91885j039090
$$ 1792393 2727943 2263236 1571280 1913101 2752363 2982520 2570848 1878963 839873
42799H39873r30840L39561J518716Q69314n39835j46506J619260J634031p21367
$$ 839873 -90967 248594 1767310 2636624 2096789 1950283 3569543 5203574 4482207
42790D482207k265526j039875P34654M58017r54690j121211O0487R62790R98283
$$ 4482207 2216681 1176806 1911460 2369477 1414787 293576 354063 1316853 2315136
42781B315136P78107N46980J78972o4484j09675n34634j287490j051408O58875
$$ 2315136 3093243 3640223 3819195 3754711 3645036 3110402 1822912 771504 1430379
42772A430379J845629M17832k326322k835681j93120K257259J331475j558269
$$ 1430379 3276008 3693840 1367518 -1468163 -1661283 595976 1927451 369182
42764C69182k327560J47597K719973K652734J132021N91703O98555l72974k023424
$$ 369182 -1958378 -1810781 909192 3561926 4693947 5285650 5984205 5611231 3587807
42755C587807j920586k79353O9992j571245k421630q39386J024157R82389J49352
$$ 3587807 1667221 1387868 1457860 -113385 -2535015 -3374401 -2350244 -1367855 -1218503
42746a218503K99235P19498K56008r3665N47097M71872j704787l834579l177134
$$ -1218503 -919268 -199770 56238 -37427 509670 981542 -723245 -4557824 -7734958
42737g734958n97534J419530K769067M058043L318974q72321m714293l081649
$$ -7734958 -8332492 -6912962 -4143895 -85852 3233122 2360801 -2353492 -5435141
42729e435141K457629M970929J810643k260006k549015j22163J640779J821874
$$ -5435141 -2977512 1993417 3804060 1544054 -1004961 -1127124 513655 2335529
42721B335529J159308l4661j057013o83100N92884P73017k14411k90171P14298
$$ 2335529 3494837 3460176 2403163 1720063 2312947 3085964 2871553 2581382 3295680
42712C295680L16452k007262l226972j631251L46307M56768K91365J801598L311712
$$ 3295680 3612132 1604870 -1622102 -3253353 -2907046 -2450278 -2158913 -357315 2954397
42703B954397K340738j684q61508j32271J49562m15635n44644j60832m39446j344932
$$ 2954397 5295135 5293451 4431943 4299672 4449234 4033599 3488955 3328123 2888677 1543745
42693A543745j560422p45972P2544K61703J59024K0752l53235j030722j742232
$$ 1543745 -16677 -762649 -690105 -428402 -269378 -248626 -601861 -1632583 -3374815
42684c374815j967638r85448J235996L014625K366197l8809j146083L84997K265224
$$ -3374815 -5342453 -6327901 -5091905 -2077280 288917 250108 -895975 -510978 1754246
42675A754246J923575j60773j920152k584099k350038r62452J276532K514588
$$ 1754246 3677821 3517048 1596896 -987203 -3337241 -4299693 -3023161 -508573
42667e08573J569267J5611p0013O49799J51649j218943j153242O47274J612938
$$ -508573 1060694 1076305 1006292 1656091 1807740 588797 -564445 82829 1695767
42658A695767Q1985k199232k493224o19286J171741J229855K64114J665Q62103
$$ 1695767 1777752 -421480 -2914704 -3533990 -2362249 -1132394 -868280 -866615 -4512
42649d512J629034J346869O62058O44219J000885O22677m73090j147104j034619
$$ -4512 1624522 2971391 3633449 4277668 5278553 5901230 5428140 4281036 3246417
42640C246417r58637j244502j113091k06749O35641O74196J56101n21187j328382
$$ 3246417 2287780 1043278 -69813 -276562 359079 1033275 1189376 668189 -660193
42631f60193j915152j678930q74975l27981J95623J681174L537676L514804Q82081
$$ -660193 -2575345 -4254275 -5129250 -5457231 -5261608 -3580434 -42758 3472046 4354127
42622D354127k000054k481681p15346J127336J607036R61497J95032O2782L41766
$$ 4354127 2354073 -127608 -842954 284382 1891418 2852915 3047947 3110729 3452495
42613C452495j21027j725581k684346r20076K541762M148035K354887m47926j414997
$$ 3452495 3331468 1605887 -1078459 -1998535 543227 4691262 7046149 6598223 5183226
42604E183226o89511k11947p79867j631165j789927q47407O42854J175595p077
$$ 5183226 4493715 4281768 3501901 1870736 80809 -766598 -123744 1051851 1044774
42595A044774j211972k15475K028687K156803n51174k754322j923851J76329O92338
$$ 1044774 -167198 -382673 1646014 3802817 3251643 497321 -1426530 -1250201 -557863
42586e57863j49420l36428M43943J040861J194098J403094J376581N38837n63811
$$ -557863 -707283 -1043711 -599768 441093 1635191 3038285 4414866 4953703 4389892
42577D389892q68424k88286M02392N62854K1384p25915n48228P82837J353952
$$ 4389892 3521468 3233182 3635574 4198428 4219812 3493897 2945669 3728506 5082458
42568E082458n25080k977524k473616P35211K564783J256662k70505K60187Q72350
$$ 5082458 4557378 1579854 -893762 -158551 2406232 3662894 3392389 3652576 4524926
42559D524926m97959j994042j226469M34621M67346m61465l61662O4222r73924
$$ 4524926 4026967 2032925 806456 1241077 1708423 1246958 885296 949518 -24406
42550b4406k433485j907662J09345R36659m4080r69149p86584k48525k3093p232
$$ -24406 -2457891 -4365553 -4256208 -3319549 -3363629 -4332778 -5119362 -5367887 -5390980 -5398212
42540e398212o845M64314J954840L365262K425247n65989k062376m20771J237104
$$ -5398212 -5405057 -4940743 -2985903 379359 2804606 2238617 176241 -244530 992574
42531I92574L1736j988673j678975k21636m24774j272402p0232K020969J802368
$$ 992574 1024310 -964363 -2643338 -2864974 -3289748 -4562150 -4632382 -2611413 -809045
42522h09045n4642j88733J359252J570358L44435M89592J930676J479613j106990
$$ -809045 -863687 -1052420 306832 1877190 2221625 2711217 4641893 6121506 5014516
42513E014516k229672o05051P91500K51820j77855N63577K02690k151187l386963
$$ 5014516 2784844 2179793 2971293 3223113 3045258 3608835 3811525 1660338 -1726625
42504a726625j365721J226126J124468m50670k66720J587663K101682j3168k652469
$$ -1726625 -3092346 -1866220 -741752 -1192422 -1459142 128521 2230203 2217035 -435434
42495d35434l024398o53322K137192K465535J84728j621246o39925J365433J415432
$$ -435434 -3459832 -4113154 -1975962 489573 674301 -946945 -1586870 -221437 1193995
42486A193995L9844j42308N74575l25465k272713j870996R78808K260853N41674
$$ 1193995 1233839 1091531 1666106 1340641 -932072 -2803068 -1824260 436593 978267
42477I78267n87024J007518K072097j94738k847292j962439P84186J082229q33416
$$ 978267 391243 1398761 3470858 3276120 428828 -1533611 -749425 332804 -500612
42468e00612r72881J488906K867952Q92974j879377j914666M30249J516342q83186
$$ -500612 -1473493 15413 2883365 3776339 1896962 -17704 412545 1928887 1045701
42459A045701m564359n084903j178116L082329L195122M16824p1290K772925L853283
$$ 1045701 -3518658 -8603561 -9781677 -6699348 -3504226 -3087402 -3158692 -385767 3467516
42450C467516r0316m651819l695342J662792M671605K389079j184020j703783
$$ 3467516 3377200 -1274619 -4969961 -3307169 1364436 3753515 2569495 865712
42442H65712K8846Q03873K4555n23803k00589j50342p62954p21878P08140J935880
$$ 865712 894558 1698431 1722986 1199183 998594 848252 85298 -636580 71560 2007440
42432B007440R62079j552856k737710j201083J257900K277136J736860Q34798
$$ 2007440 2969519 1416663 -1321047 -2522130 -1264230 1012906 2749766 3584564
42424C584564r5968j149493j486910m69578P41107P84376L83700P50340P93773
$$ 3584564 3488596 2339103 852193 382615 1123722 1908098 2291798 3042138 3835911
42415C835911j089778l210948k230957J338079L116210J197556j213330j079819
$$ 3835911 2746133 -464815 -2695772 -1357693 1758517 2956073 1742743 662924
42407F62924L4903p42654k583072k303934O07288L125291K695770K66456j127351
$$ 662924 697827 -44827 -2627899 -4931833 -4324545 -1199254 1496516 1762972 635621
42398F35621o7094J581190J213959o27962p84868J397132K255847n46761l487164
$$ 635621 568527 2149717 3363676 2735714 1950846 3347978 5603825 5057064 1569900
42389A569900k226645J163163J284541j667994k344623M52786J703134j053842
$$ 1569900 -656745 506418 1790959 122965 -2221658 -1768872 -65738 -1119580
42381a119580l477096j846076J166095J767329Q77901O60027K9973j839666j912525
$$ -1119580 -4596676 -6442752 -5276657 -3509328 -2631427 -1971400 -1941427 -3781093 -5693618
42372e693618J727567N007162L450078l94049q66687J761575K265538p37558l026699
$$ -5693618 -3966051 1041111 4491189 4097140 3230453 4992028 7257566 6520008 3493309
42363C493309j910075K02475M35104m80069l04518J225950K355199J459471j090601
$$ 3493309 1583234 1785709 2220813 1740744 1436226 2662176 5017375 6476846 5386245
42354E386245k779950j685405L95468k101k248866j830496J983976L653106J4516
$$ 5386245 2606295 920890 1316358 1314257 -934609 -2765105 -781129 2871977 2886493
42345B886493l695821j740923K700822K723808j124062k590405n85459M5339j904250
$$ 2886493 -809328 -2550251 150571 2874379 1750317 -840088 -1425547 -1380208 -3284458
42336c284458k089166P13371K008300r8189j248308J338598L781043K106272j425108
$$ -3284458 -5373624 -4660253 -2651953 -2750142 -3998450 -2659852 1121191 3227463 1802355
42327A802355k579220j322752J00105J361168K577574K154358k43495j728684
$$ 1802355 -776865 -2099617 -1999512 -638344 1939230 4093588 3850093 2121409
42319B121409o38325K95409j191676k279057K89920L836239L202939j078749l345319
$$ 2121409 1483084 1778493 586817 -1692240 -1402320 2433919 5636858 4558109 1212790
42310A212790j127811J880739J840196k63247j173775j24083Q43102P8673j527322
$$ 1212790 84979 1965718 3805914 3542667 2368892 2244809 3087911 3166584 1639262
42301A639262j619490N42434K501740J337373j987641l169110l85079K924762
$$ 1639262 19772 562206 3063946 4401319 2413678 -755432 -1140511 1784251
42293A784251K978738R06872K54805J193365R15113j081151k090452r20571J07694
$$ 1784251 4762989 5669861 5924666 7118031 8033144 6951993 4861541 3940970 4048664
42284D048664q37137k014839r68798J526091K574718J239159n27623q54310j91817
$$ 4048664 3211527 1196688 227890 1753981 4328699 5567858 5040235 4185925 3994108
42275C994108n6974o21719o61759K28892N99534p71543k511843k056146M87800
$$ 3994108 3937134 3315415 2653656 2882548 3482082 2710539 198696 -1857450 -1369650
42266a369650J859804J08635k294454j793451J046581K355843O69891j186225
$$ -1369650 490154 598789 -1695665 -3489116 -2442535 -86692 583199 -603026
42258f03026p61978L38929m80104k152424j379303K010067M310081L070257J92928
$$ -603026 -1365004 -1026075 -1506179 -3658603 -5037906 -3027839 1282242 4352499 4545427
42249D545427j370222j513178j519844r04354J202307K806997J056855k523835
$$ 4545427 3175205 1662027 142183 -762171 440136 3247133 4303988 1780153
42241A780153k902114J041437L927590J413233l050266l042624J285881L392463
$$ 1780153 -1121961 -80524 3847066 5260299 2210033 -832591 453290 3845753
42233C845753j09169m793568m895521q36686K302076J721551m72122r53752P45563
$$ 3845753 3736584 -1056984 -5952505 -6789191 -4487115 -2765564 -3237686 -4191438 -3445875
42224c445875K343609J933523J76034q09151k67988N36400O99065J037264J922335
$$ -3445875 -1102266 831257 1007291 198140 -69848 466552 1165617 2202881 4125216
42215D125216J611459r73815l306124k295519N27725P52471j891334k657005O57722
$$ 4125216 5736675 4762860 1456736 -838783 -311058 441413 -1449921 -4106926 -3449204
42206c449204L700112K070001j777001k253779R78070K961883J047686j880241
$$ -3449204 250908 2320909 543908 -1709871 -731801 2230082 3277768 1397527
42198A397527k387034j023716l34404q70967j068976J90760K270990L440605K375904
$$ 1397527 -989507 -2013223 -2347627 -3218594 -4287570 -4096810 -1825820 1614785 3990689
42189C990689k73128j906108q14496J235251J186929n55995l80108K529784L714893
$$ 3990689 3717561 1811453 996957 2232208 3419137 2863142 2483034 5012818 8727711
42180H727711k79704n725988n990597r61175K604557Q17276k143606j088716K194850
$$ 8727711 8448007 2722019 -3268578 -4229753 -1625196 -807920 -2951526 -4040242 -1845392
42171a845392K368721p19585k114894O8147J934692M30513j978937j630398Q79902
$$ -1845392 523329 -196256 -2311150 -2243003 -308311 122202 -1856735 -3487133 -2607231
42162b607231K451937K144592J166947J29649q59345q69886L66084R76556m00058
$$ -2607231 -155294 1989298 3156245 3285894 2426549 1556663 1922747 2899303 2499245
42153B499245j848284r17851J185071J417145j15155o39567L29241M05552j168020
$$ 2499245 650961 -266890 918181 2335326 2220171 1580604 1909845 2315397 1147377
42144A147377k256474j724916r81617o54958P26238L305646M471078K697945j3059
$$ 1147377 -1109097 -2834013 -3815630 -4470588 -3744350 -438704 4032374 6730319 6717260
42135F717260j368136j750439k083290j518887M05164J798576J212009K64148
$$ 6717260 5349124 3598685 1515395 -3492 401672 2200248 3412257 3676405
42127C676405Q02992J426905j92143l123979m456306l575931k052565k13635K740602
$$ 3676405 4479397 5906302 5714159 2590180 -1866126 -5442057 -7494622 -7708257 -4967655
42118d967655N549800N321959J727319k021557l161924k100203n31900Q39391
$$ -4967655 582145 5904104 7631423 5609866 2447942 347739 -184161 655230
42110F55230J722120J436991R9253p76469j64469Q89375O63233q94824k131317
$$ 655230 2377350 3814341 3913594 3137125 2972656 3862031 4525264 3630440 1499123
42101A499123j663651J93472J764595J544027l02593j923496j687886m1103J095637
$$ 1499123 -164528 28944 1793539 3337566 3034973 1111477 -576409 -617512 478125
42092D78125O61457n30765j099202o12790L49709R58572P32125n9654m59045J43042
$$ 478125 1139582 608817 -490385 -1103175 -753466 205106 937231 877577 418532 561574
42082E61574R78849O54980q41251j705259m71903J942121L103330J785532q29693
$$ 561574 1540423 2195403 1354152 -351107 -823010 1119111 4222441 6007973 5178280
42073E178280k654348k712746j448455K33943J517403J700362P11417l53287k07126
$$ 5178280 2523932 -188814 -1637269 -1403326 114077 1814439 2525856 2172569 1965443
42064A965443Q45018J166046K68645k97056N26365J305591K57883j718489k235066
$$ 1965443 2810461 3976507 4245152 3948096 4474461 5780052 6037935 4319446 2084380
42055B084380r93930J07453J86964K49690P51514Q64410O62404J387957K655600
$$ 2084380 1090450 1197903 1384867 1634557 2386071 3250481 3912885 5300842 7956442
42046G956442K130982n91673k463345j298849P61282N15228j577069k681464k038928
$$ 7956442 10087424 9495751 7032406 5733557 6494839 7010067 5432998 2751534 712606
42037G12606j123245l76227J071276K747660K819951R54199j085924j889452j558649
$$ 712606 -410639 -786866 284410 3032070 5852021 6806220 5720296 3830844 2272195
42028B272195o04570L08776j12100k172376l411525j218192K753850L905275J038163
$$ 2272195 1667625 1976401 1864301 -308075 -3719600 -4937792 -2183942 1721333 2759496
42019B759496j853823j418682O18063R32761k72847m95962O20519J232687P48506
$$ 2759496 905673 -513009 105054 1037815 764968 269006 889525 2122212 2870718
42010B870718L59790M12251o2416j023497j077613m8485K54422j149812k516330
$$ 2870718 3230508 3642759 3580343 2556846 1479233 1430748 1685170 535358 -1980972
42001a980972j618180J136423L099583K432823j34091k290349k257370k02670
$$ -1980972 -3599152 -2462729 636854 3069677 2935586 645237 -1612133 -1814803
41993a814803J953031K364321J150128N6889J33004N88208L89941j09602j47415
$$ -1814803 138228 2502549 3652677 3709566 3842570 4430778 4820719 4711117 4563702
41984D563702j81958j019291j875904j213126N16459J043605k08078r18792N15974
$$ 4563702 4381744 3362453 1486549 273423 789882 1833487 1625409 706617 1222591
41975A222591K120806J200995j260421j753558N66137K553582J490464j460258
$$ 1222591 3343397 4544392 3283971 1530413 2096550 4650132 6140596 4680338
41967D680338l255046k601834l57838K112643L413118K207270j188909l866382
$$ 4680338 1425292 -1176542 -1534380 578263 3991381 6198651 5009742 1143360
41959A143360k969006N96465K781376J244439j849653k795202r71730R54304J008917
$$ 1143360 -1825646 -1229181 1552195 2796634 946981 -1848221 -2819951 -1865647 -856730
41950h56730L01962Q07864K209141K488167J093493k86923l44421J46955J8907
$$ -856730 -554768 253096 2462237 4950404 6043897 5756974 5412553 5559508 5578415
41941E578415l90026k15473K39191J86172k09994m87917j009267j846866j661647
$$ 5578415 5188389 4972916 5212107 5398279 5188285 4700368 3691101 1844235 182588
41932A82588K72050J952334J122874r14093j046734M54500K09136k342084l361863
$$ 182588 454638 2406972 3529846 2615753 1569019 2023519 2232655 -109429 -3471292
41923c471292o39796K611833K647190P03079K73613J283913Q98659j180727k212115
$$ -3471292 -4111088 -1499255 1147935 1851014 2124627 3408540 4307199 3126472 914357
41914I14357r88392N30763N79243k11150n94017m12350J38088J010143J455200
$$ 914357 -74035 456728 1035971 824821 230804 -181546 -43458 966685 2421885
41905B421885M37098j440910k024544m06412J684009K080301P16805p56286j036660
$$ 2421885 2858983 1418073 -606471 -1012883 671126 2751427 3468232 2711946 1675286
41896A675286j74880Q36900R06383k57077j630293j641197J05036K031462J990797
$$ 1675286 1500406 2337306 3243689 2986612 1356319 -284878 -179842 1851620 3842417
41887C842417k76364k369746j702285J063006K333411L69255j850161q31022J730404
$$ 3842417 3566053 1196307 -505978 557028 2890439 3259694 1409533 578511 2308915
41878B308915J209140k266120l275305K48151L028876O09339l116433j823311
$$ 2308915 3518055 1251935 -2023370 -1775219 1253657 1862996 -1253437 -3076748
41870c076748L042088M473269R22461j747207J80979L189171L006327P16310n64065
$$ -3076748 -34660 4438609 5361070 3613863 3794842 6984013 9990340 10706650 10142585
41861A0142585p47583j126768j026608L64656J283987o8130j987170j377318J716898
$$ 10142585 9395002 8268234 7241626 7606282 8890269 8822139 6834969 5457651 7174549
41852G174549M329341M531551L069854J770811J945750L564616M861716L984557
$$ 7174549 11503890 16035441 19105295 20876106 22821856 26386472 31248188 35232745
41844C5232745J860043J413672K920951K982310k4754k730233k001957l22063
$$ 35232745 37092788 38506460 41427411 44409721 44384967 41654734 39652777 39330714
41836C9330714j834135n389513o426420m339258k638775k337261r58931J298693
$$ 39330714 37496579 32107066 25680646 21341388 18702613 16365352 15406421 16705114
41828A6705114N03147l797387n972888k467930K177692J980855j555346k550727
$$ 16705114 17208261 13410874 7437986 4970056 7147748 9128603 7573257 5022530
41820E022530k69362O36451j344414k153678M35511K580548N46778k997457k882482
$$ 5022530 4753168 5389619 4045205 1891527 2327038 4907586 5454364 2456907 -425575
41811d25575P28892K683405L69315k930630k962485J12116K825338L117870K023761
$$ -425575 303317 2986722 3356037 425407 -2537078 -2424962 400376 3518246 5542007
41802E542007J282530J057027M43024q02504j871807j965168j087438K05933J294216
$$ 5542007 6824537 7881564 8324588 7522084 5650277 3685109 2597671 2803604 4097820
41793D097820J631917J062783K69982J64593L85736n61885k764096l724141j528008
$$ 4097820 5729737 6792520 7062502 7227095 7612831 7050946 4286850 562709 -965299
41784i65299J660429J794381j405091l791501k503132N64358K425713L126205
$$ -965299 695130 2489511 1084420 -2707081 -5210213 -4645855 -2220142 906063
41776I06063L715143K847871q49179m603221l972697O68750M043118K975354n444
$$ 906063 4621206 7469077 6619898 2016677 -1956020 -1287270 2755848 5731202 5725758
41767E725758j151383l47125K27747k93115j161047j569273r67989O99646K057310
$$ 5725758 4574375 4227250 4454997 4161882 3000835 1431562 463573 1163219 3220529
41758C220529J361852o19246j017259P53853J642299l20561k632523k085980L53247
$$ 3220529 4582381 3963135 2945876 3699729 5342028 5021467 2388944 302964 656211
41749F56211J327776J00640j175197j067950J8787J448946K507186J847101o60432
$$ 656211 1983987 2084627 909430 -158520 -139733 1309213 3816399 5663500 5003068
41740E003068k451721j324670R44254R79342r84045j611226J16878J550789Q49356
$$ 5003068 2551347 1226677 2170931 3150273 2166228 555002 671880 2222669 3072025
41731C072025m75813m37296P30986J787171K118414J324268o82681k432322j927997
$$ 3072025 2596212 2158916 2889902 4677073 6795487 8119755 7437074 5004752 3076755
41722C076755L17714J445515K76860j006976k56244J625577K353344J360615p235
$$ 3076755 3394469 4839984 5116844 4109868 3853624 5479201 7832545 9193160 9185925
41713I185925l18580O57520J617254P19738j848536k998783n66157K751359K406861
$$ 9185925 8867345 9524865 11142119 11861857 10013321 7014538 6448381 9199740 11606601
41704A1606601j300320l361736j391279J405664J964802J622880K177252J917155
$$ 11606601 10306281 6944545 5553266 6958930 8923732 10546612 12723864 14641019
41696A4641019p93642l369609k680803m15828l57237k080464j980599M35768J957483
$$ 14641019 13847377 10477768 7796965 7381137 7023900 4943436 2962837 3398605 5356088
41687E356088J190062K72428O08448R13398M77048P23449K114191K632782J010145
$$ 5356088 6546150 6818578 7427026 8340424 8817472 9540921 11655112 14287894 15298039
41678A5298039j107975j808380j471759j193362q04732n5981K46567l4379N99878
$$ 15298039 14190064 12381684 10909925 9716563 8911831 8855850 9102417 9068038 9667916
41669I667916K721181M242100L270000J086885P2898J21865l40958r71424j11692
$$ 9667916 12389097 16631197 19901197 20988082 21060980 21182845 20841887 19870463 19758771
41660A9758771J793255K481066J636143J390470K583044L510290L416253M221120
$$ 19758771 21552026 24033092 25669235 27059705 29642749 33153039 36569292 40790412
41652D0790412O974666R254016Q631554O766544P122519R887485J2294685J3385312
$$ 40790412 47765078 57019094 65650648 72417192 79539711 89427196 101721881 115107193
41644A15107193J5160968J8739814K2373895K4138618K3972300K1887850J6683187
$$ 115107193 130268161 149007975 171381870 195520488 219492788 241380638 258063825
41637B58063825Q304192l65074o310264j0051072j4503995k0531733k5316236
$$ 258063825 266368017 266002943 259692679 249641607 235137612 214605879 189289643
41630A89289643k5456307k0832922j5086528j2330515j3226369j4549773j3120563
$$ 189289643 163833336 143000414 127913886 115583371 102357002 87807229 74686666
41623G4686666r452159o328477m727290l443575k309229k727368m514697n338447
$$ 74686666 65234507 58906030 54178740 50735165 48425936 45698568 41183871 35845424
41615C5845424m393252l607839l881671l460357j836044j531711l358898l741249
$$ 35845424 31452172 27844333 23962662 20502305 18666261 17134550 13775652 10034403
41607A0034403m45071K617198J044039k560492k409287J107892K182301r18425
$$ 10034403 9589332 12206530 13250569 10690077 8280790 9388682 11570983 10652558
41599A0652558l485091k231966K84435P72789k23945r00779j141613q81254P73786
$$ 10652558 7167467 4935501 5219936 5992725 5768780 4868001 3726388 2845134 3618920
41590C618920K917548K833649L66969j149351o3095J080316J50051j062162l91896
$$ 3618920 6536468 9370117 9737086 8587735 8524640 9604956 9755007 8692845 8300949
41581H300949Q82358N00534j107571k106177j969161q95594J104094K695375J446768
$$ 8300949 9183307 9683841 8576270 6470093 4500932 3605338 4709432 7404807 8851575
41572H851575k379257m819470l093927Q36228L359576L338225J579905q61116
$$ 8851575 6472318 1652848 -1441079 -604851 2754725 6092950 7672855 6811739
41564F811739k154704o69150J748683J047887k543454l563537M61864M418380
$$ 6811739 4657035 3987885 5736568 6784455 4241001 677464 1139328 5557708
41556E557708L019184j382606k982299r72310J188508K042294K474938K031299
$$ 5557708 8576892 7194286 4211987 3239677 4428185 6470479 8945417 10976716
41548A0976716l0223j727963j053337J09386p75146j944539n69875J391368K96517
$$ 10976716 10946493 9218530 8165193 8274579 7499433 5554894 4985019 6376387 6672904
41539F672904k138753j274986K117657K706077m05103k227896k00127K321061
$$ 6672904 4534151 3259165 5376822 8082899 7677796 5449900 5249773 7570834
41531G570834K242037P62600l40539j285678j649447j65865J475257j62279l801937
$$ 7570834 9812871 10575471 10234932 8949254 7299807 7133942 8609199 8446920 4644983
41522D644983l881803N17569L205816M56447k863963j141680L102887L630521
$$ 4644983 763180 1280749 4486565 4943012 2079049 937369 4040256 7670777
41514G670777J09145k481356j901561n73410l64663l50579J47350K19060l61945
$$ 7670777 7779922 5298566 3397005 2823595 2458932 2108353 2255703 2474763 2112818
41505B112818m13581N26512J439153J516489R99675K78228m62108q07345n48719
$$ 2112818 1699237 2225749 3664902 5181391 6181066 6459294 5997186 5189841 4641122
41496D641122l25776p56791j248602p33188O59468J645171J450403P16718O00724
$$ 4641122 4315346 3558555 2309953 1576765 2236233 3881404 5331807 6048525 6649249
41487F649249J239624J361437j40246k217083k368145p3576J842137P68661k030773
$$ 6649249 7888873 9250310 9110064 6892981 4524836 4451260 6293397 7062058 5031285
41478E031285l319513k320340p86216M20244J848981L030411K661626J184881
$$ 5031285 1711772 -608568 -1394784 -974540 874441 3904852 6566478 7751359
41470G751359K01142n48400k361087l918812k391179J387819L054961J124633
$$ 7751359 7952501 7404101 5043014 1124202 -1266977 120842 3175803 4300436
41462D300436r02931l96986O66789N2564p06237L85333J844435J408645o853l16675
$$ 4300436 3397505 3000519 3667308 3719872 3013635 3398968 5243403 6652048 6645195 6328520
41452F328520k639o92366j891919k138962j781137j814543j516747O5659J772781
$$ 6328520 6325881 5633515 3741596 1602634 -178503 -1993046 -3509793 -3444134 -1671353
41443a671353K093595J759417J954911J551576q89567l643619l577957p93058
$$ -1671353 422242 2181659 4136570 5688146 4798579 1154960 -2422997 -3216055
41435c216055J383260R08188p78665j090719Q01036L252016L439087K53861l477556
$$ -3216055 -1832795 -924607 -1703272 -2793991 -1992955 1259061 4698148 4952009 1474453
41426A474453l501932J83143K736991J193625j319704p77984J422759J273227
$$ 1474453 -2027479 -1844336 892655 2086280 766576 -11408 1411351 2684578
41418B684578j043404j852712l09323Q13185M39696N96948J822252J568412j183875
$$ 2684578 1641174 -211538 -520861 292324 732020 1328968 3151220 4719632 3535757
41409C535757l379145k218599O16117J525152M0846j122763k55129J312359J497737
$$ 3535757 156612 -2061987 -1445870 79282 120128 -1002635 -1257764 54595 1552332
41400A552332K83957n68665n8385Q34014P94297J39501N5935M77495L71290n6551
$$ 1552332 1836289 1267624 1209239 2043253 2837550 2977051 3032986 3510481 3881771 3825220
41390C825220M88657J737723J664148k29600j736965j268919j40008j00359p36279
$$ 3825220 4313877 6051600 7715748 7486148 5749183 4480264 4340256 4239897 3503618
41381C503618r29840q08457n93856L08169J404426P96658j323501j695008J065482
$$ 3503618 2573778 1765321 1171465 1479634 2884060 3680718 2357217 662209 1727691
41372A727691L497550K295587o41871j717649j305029j615848j539941J140102
$$ 1727691 5225241 7520828 6878957 5161308 3856279 2240431 700490 1840592
41364A840592M137008L029587j368253l634592j865041K76772L14278K55257J494726
$$ 1840592 5977600 9007187 7638934 4004342 2139301 2416073 2730351 2985608 4480334
41355D480334J602132j033517l445139k277011J033455K410463P85490j092059
$$ 4480334 6082466 5048949 1603810 -673201 360254 2770717 3556207 2464148
41347B464148o94193J365881K386265Q17812j651793j882744M08626J812008J49937
$$ 2464148 1769955 3135836 5522101 6339913 4688120 2805376 3214002 5026010 5175947
41338E175947k024284j537875J62029j59247j444711k40807K457798K240655q15668
$$ 5175947 3151663 1613788 1775817 1616570 171859 -68948 2388850 4629505 3813837
41329C813837j660955J089661K520680r8811k467280o80337K053613J017270k121996
$$ 3813837 2152882 3242543 5763223 5664412 3197132 2516795 4570408 5587678 3465682
41320C465682k547016k67409Q57885J48589N29581K597878L346066J269584j222411
$$ 3465682 918666 651257 1509142 1657731 2187312 4785190 8131256 9400840 8178429
41311H178429j441013K87467J716478J213920j036621l021414k494225J84646
$$ 8178429 6737416 7024883 8741361 9955281 8918660 5897246 3403021 3587667
41303C587667J833533N19843j629979j625823M731N90760k81035p81801m75017
$$ 3587667 5421200 5941043 4311064 2685241 2689972 3280732 2999697 2217896 1742879
41294A742879p19897j538362j119935J010834K822646K547259P23887j132772
$$ 1742879 1022982 -515380 -1635315 -624481 2198165 4745424 5469311 4336539
41286D336539k202261k102296n77572J668133K917024K089578M153j400514q85173
$$ 4336539 2134278 31982 -545590 1122543 4039567 6129145 6133298 4732784 3847611
41277C847611R50282K093939J060297j355244k898089k601054j589945q17993
$$ 3847611 4797893 6891832 7952129 6596885 3698796 1097742 -492203 -1310196
41269a310196K81903J869026K305931N62440j409082r89112J237098K256128R09606
$$ -1310196 -1028293 840733 3146664 3709104 2300022 1310910 2548008 4804136 5713742
41260E713742q78519j206969m04886L18065O24491O81089L38395m58037j149564
$$ 5713742 4835223 3628254 3223368 3541433 4165924 4847013 5185408 4727371 3577807
41251C577807j075559k02752Q22594J141110M04203o66305q30810K10905J444341
$$ 3577807 2502248 2299496 3122090 4263200 4667403 4001098 3170288 3381193 4825534
41242D825534J918533J669685Q80078o65662k457703k894779j345194M66804O19230
$$ 4825534 6744067 8413752 9293830 8628168 6170465 3275686 1930492 2397296 3016526
41233C016526l09898l09917R77844K016567J846845J016144J03680r54853j795810
$$ 3016526 2706628 2396711 3374555 5391122 7237967 8254111 8357791 7402938 5607128
41224E607128j421146K78702J815568J653043L4529j206187o34526J055927J557840
$$ 5607128 4185982 4464684 6280252 7933295 7967824 6761637 6127111 7183038 8740878
41215H740878l14444k710215k725267l15975J452243O90673o85767J3648K314054
$$ 8740878 8426434 5716219 2990952 2674977 4127220 4817893 4132126 4145774 6459828
41206F459828L648113L163299K158525J344115P2193j609061k227025q72232J413107
$$ 6459828 10107941 13271240 15429765 16773880 16846073 15237012 13009987 12137755 13550862
41197A3550862K822752K572065J284264K87186O03068K097359L655879M430692
$$ 13550862 16373614 18945679 20229943 20517129 21120197 23217556 26873435 31304127
41189C1304127M484040M105424L486861L416548M934745P582555R452326R881054
$$ 31304127 35788167 39893591 43380452 46797000 51731745 59314300 68766626 78647680
41181G8647680J0400399J1842488J2577294J1475332J0466266J1387139J1931916
$$ 78647680 89048079 100890567 113467861 124943193 135409459 146796598 158728514
41174A58728514Q169405M24939o692064j0081622j0922677j1465177j2110647
$$ 158728514 166897919 167322858 160630794 150549172 139626495 128161318 116050671
41167A16050671j2427867j2418201j1756540r886708p633678o637924o540304
$$ 116050671 103622804 91204603 79448063 69561355 61927677 55289753 48749449
41160D8749449n072845j916413m5303j676400m882566o094823m504498k110926
$$ 48749449 43676604 41760191 41714888 40038488 35155922 29061099 24556601 22445675
41152B2445675n50741N0537l42045k060491m318875m996957k886764M27130J995085
$$ 22445675 21894934 21945471 21603426 19542935 15224060 10227103 7340339 7767469 9762554
41143I762554R76381k69534N50715K075749Q53115l344230o148794m027289Q56352
$$ 9762554 10738935 10469401 11020116 13095865 13948980 10604750 4455956 428667 1285019
41134A285019L427778K023488o38870j946211j882957j129771L22020J835821
$$ 1285019 4712797 6736285 6097415 4151204 2268247 1138476 1460496 3296317
41126C296317J835842J11675j262997n40602J327134K008523P91783o15940k11982
$$ 3296317 5132159 5243834 3980837 3440235 4767369 6775892 7567675 6951735 6739753
41117F739753J655178K187829m40700l849120l752376j28715J881595p38368l895022
$$ 6739753 8394931 10582760 10142060 6292940 2540564 2411849 4293444 3555076 -339946
41108c39946k318155K155308L273230k5650k478024j090053R85661O64364l96166
$$ -339946 -2658101 -502793 2770437 2744787 266763 -823290 162371 826735 430569
41099D30569O7015P02881l08898j550159j136961k20335m81052p48183O20333
$$ 430569 497584 1200465 891567 -658592 -1795553 -2015888 -2496940 -3245123 -2624790
41090b624790K240394J850807J13396p82451o25537m08577K18337J708617K425730
$$ -2624790 -384396 1466411 1579807 797356 171819 -236758 -18421 1690196 4115926
41081D115926Q15380j552919k153095j432290j463156j910136p89489J519013
$$ 4115926 4931306 3378387 1225292 -206998 -1670154 -3580290 -4369779 -2850766
41073b850766K492519J443321J77268k06878l50180n92739n61878o18158j192982
$$ -2850766 -358247 1085074 1262342 1055464 705284 112545 -449333 -1067491 -2260473
41064b260473j127519O29524K313705J521541m44418j87783J904514J784358j346372
$$ -2260473 -3387992 -2758468 -444763 1076778 632360 444577 2349091 4133449 2787077
41055B787077k866153J93814L929048K967320j629119l971212j605883J860629
$$ 2787077 -79076 114738 4043786 7011106 5381987 1410775 -195108 1665521
41047A665521K517798J013730L34212J215446J898733J350745N42376M38801M79767
$$ 1665521 4183319 5197049 5531261 6746707 8645440 9996185 10538561 10977362 11457129
41038A1457129j12226p87223p06020m21561q63227j242346j46669J389981O18619
$$ 11457129 11344903 10557680 9851660 9430099 8566872 7324526 7177857 8567838 9186457
41029I186457k397330l868438j553451J712607K155029M14655k65284O25774R97759
$$ 9186457 6789127 2920689 1367238 3079845 5234874 5649529 5384245 6010019 7007778
41020G007778N76026J174152K609733K253792n06411k779164k502271j331883
$$ 7007778 7583804 8757956 11367689 13621481 13115070 10335906 7833635 6501752
41012F501752j469294k087854j132793R83743J836439M76896j411816j854827
$$ 6501752 5032458 2944604 1811811 2795554 4631993 5108889 3697073 1842246
41004A842246q69244n4037l94205j011269n05261P63505R76241k09864p90074
$$ 1842246 973002 918965 524760 -486509 -991770 -228265 747976 538112 -251962
40995b51962L08829J010233o58881k745426j848189J499197L328789J922801m21225
$$ -251962 56867 1067100 408219 -2337207 -4185396 -2686199 642590 2565391 2144166
40986B144166j549775j827418j557816L03464L161252L718835L22939l861910
$$ 2144166 594391 -1233027 -2790843 -2487379 673873 4392708 4715647 853737
40978H53737m431632j066086K623974L383228R50600k395739l660155j665115
$$ 853737 -3577895 -4643981 -2020007 1363221 2313821 -81918 -3742073 -5407188
40970e407188J284048J647889p19254k076535J03280L698594N009381L211477
$$ -5407188 -4123140 -2475251 -3194505 -5271040 -5167760 -1469166 3540215 6751692
40962F751692J40709k377176l185344j710643P66505J461351l27796j743625n20224
$$ 6751692 6892401 4515225 1329881 -380762 385743 1847094 1519298 -224327 -744551
40953g44551J429519J175365m26762l80916J334138J915606M22386j231153j905534
$$ -744551 684968 1860333 1433571 1052655 2386793 4302399 4724785 3493632 1588098
40944A588098k408865k647899j072127J896744L011279O54997k226266j913692
$$ 1588098 -820767 -3468666 -4540793 -2644049 367230 1022227 -1204039 -3117731
40936c117731R13631K212219J45212k660025k777411k48086J879439J580484J39000
$$ -3117731 -2204100 8119 153331 -2506694 -5284105 -5532191 -3652752 -2072268 -1933268
40927a933268N1196J592874K600705J481213q28500k274981j960941m08812J418927
$$ -1933268 -1882072 -289198 2311507 3792720 2964220 689239 -1271702 -1680514 -261587
40918b61587K547718K290477R99477j23157n93035j135982j963820j825813K3464
$$ -261587 2286131 4576608 5576085 5452928 4859893 3723911 1760091 -65722 -42258
40909d2258K010140J966645M6807j565951j474447k50281R06341J402851J227091
$$ -42258 1967882 3934527 3981334 2415383 940936 690655 1596996 2999847 4226938
40900D226938P01968K77864J2450m07093p51937k17739J056336J497356J07492
$$ 4226938 4928906 5206770 5219220 4812127 4060190 3842451 4898787 6396143 6503635
40891F503635j976071k924953k271261o22559J386031K730778K126440O3566q33815
$$ 6503635 4527564 1602611 -668650 -1291209 94822 2825600 4952040 5015606 4181791
40882D181791N97670J689649l67373l833187m528420j926449K98916n7838r47605
$$ 4181791 4779461 6469110 6101737 2268550 -2259870 -4186319 -3887403 -3945241 -4892846
40873d892846r477J676716J680366Q9956q73200k36599O30695L44243m14024M0626
$$ -4892846 -4902323 -3225607 -1545241 -1455285 -2328485 -2565084 -1934389 -1590146 -2004170 -1963544
40863a963544J626330K052329P1844j906391o77131K559793L027149n83805l438530
$$ -1963544 -337214 1715115 1786959 -119432 -796563 1763230 4790379 4206574 768044
40854G68044j421190K548168K816313p26728l187942k206801j85987P06676J095870
$$ 768044 -653146 1895022 4711335 3984607 796665 -1410136 -1596123 -889447 206423
40845B06423J447335Q24235m39770o08714k7053r73829l019475k574600J301401
$$ 206423 1653758 2477993 2038223 1429509 1402456 428627 -2590848 -5165448 -3864047
40836c864047M549048L747989O76806j104906j079516o55541q9345P63833R55403
$$ -3864047 685001 4432990 5109796 4004890 2925374 2269833 2180488 2944321 3899724
40827C899724J59429k28986K84297N0559j375047j655912J09416Q89514j346504
$$ 3899724 4059153 3830167 4114464 4165023 2789976 1134064 1243480 2132994 786490
40818G86490l384254j474068K365052L304367J001204q61865r38953j045315j295153
$$ 786490 -2597764 -4071832 -1706780 1597587 2598791 1736926 797973 -247342 -1542495
40809a542495K95354K974299K997501n23826l708374l398107r74677Q81613J832690
$$ -1542495 -1247141 1727158 4724659 4200833 492459 -2905648 -3880325 -2998712 -1166022
40800a166022K388321J841637J0181j270943o20459O52186O29382m56571j184880
$$ -1166022 1222299 3063936 3074117 1803174 1182715 1834901 2464283 2007712 822832
40791H22832j158912o96386K50315J337780J385088K04345m85093M63153J599098
$$ 822832 -336080 -1032466 -782151 555629 1940717 2145062 1659969 2123122 3722220
40782C722220J056616n66300j470691j597037j992162k140927o51824J638880
$$ 3722220 4778836 4212536 2741845 1144808 -847354 -2988281 -3640105 -2001225
40774b001225K095341L29088q28525M55186K170955J600146n87809j664690j032200
$$ -2001225 94116 423204 -405321 49865 2220820 3820966 3233157 1568467 536267
40765E36267m12686l85477K80535J449267Q57089j954050l617095j354257K434279
$$ 536267 123581 -261896 18639 1467906 2324995 370945 -3246150 -4600407 -2166128
40756b166128L070407J76518j955236o03656K005213K491817P25467j091228j669517
$$ -2166128 904279 1080797 -874439 -1478095 527118 3018935 3744402 2653174 983657
40747I83657j314698p99680q84296j738785k012133r9560K870658L499554Q39250
$$ 983657 -331041 -1130721 -2015017 -3753802 -5765935 -5865495 -2994837 504717 1343967
40738A343967j755857j362204L54241K46311j233634j288512M11288J677464J698152
$$ 1343967 -411890 -1774094 -1419853 -1173542 -2407176 -3695688 -3284400 -1606936 91216
40729I1216J496949R76503q89639k858137k052001J431156L777997K487972o17629
$$ 91216 1588165 2564668 1675029 -1183108 -3235109 -1803953 1974044 4462016 3844387
40720C844387k626666l128084l019673k084026J80678K712461L647362K283727
$$ 3844387 1217721 -1910363 -4930036 -7014062 -6833384 -4120923 -473561 1810166
40712A810166n02387k877995k814567J64086L469599L534897K62184k452296j679371
$$ 1810166 1307779 -1570216 -4384783 -4220697 -751098 2783799 3045983 593687 -1085684
40703a085684R49950J999357P79841p17007j138175r18845o65912k54036L78951
$$ -1085684 -135734 1863623 2643464 1926457 788282 -130563 -796475 -1050511 -671560
40694f71560P43412M02353m22879r52843n75347L04596N29716q0842k2099J606762
$$ -671560 71852 474205 51326 -901517 -1476864 -1172268 -642552 -723394 -745493 861269
40684H61269K972363J773995q87638j682626j79560M01929j548681l329420k203252
$$ 861269 3833632 5607627 4719989 3037363 2857803 3259732 1711051 -1618369 -3821621
40675c821621O44574K653388L576333L914863K376415j536320m448238k815573
$$ -3821621 -3177047 -523659 3052674 6967537 9343952 7807632 3359394 543821
40667E43821J326384K570575j66004k426566j237273Q95501O34208j210624j848711
$$ 543821 1870205 4440780 4274776 1848210 610937 1506438 2140646 930022 -918689
40658i18689r81577k69722n9102N35956J253535J048114M33368R89649K441943
$$ -918689 -1900266 -2169988 -2229090 -1693134 -439599 608515 1041883 2031532 4473475
40649D473475K524376L74270j910718k117520p25644L56018M74832J20138o75415
$$ 4473475 6997851 7372121 5461403 3343883 2618239 2974257 3449089 3569227 2893812
40640B893812j806762j813884L39657K491424J309213k376907l639826m27731
$$ 2893812 1087050 -726834 -387177 2104247 3413460 1036553 -2603273 -3031004
40632c031004K956648K095415r92063j516922L62731O57368r56961p50829J753835
$$ -3031004 -74356 2021059 1028996 -487926 -125195 532173 -424788 -1175617 578218
40623E78218K326424m10172j961372M72753K922696J284499j804880j806482O4934
$$ 578218 2904642 2494470 533098 1005851 3928547 5213046 3408166 1601684 1666618
40614A666618p3299j211322L06522K943184J673864k881458m302092m08978L277756
$$ 1666618 1593319 381997 688519 3631703 5305567 2424109 -1877983 -2286961 990795
40605I90795K283653o88047j369205l12270P4139M04568J967293K868130Q51774
$$ 990795 3274448 2586401 1217196 904926 979065 1383633 3350926 6219056 7070830
40596G070830k361414l416597k122953n43298P29021J936836J760718o35009k677148
$$ 7070830 4709416 1292819 -830134 -1373432 -644411 1292425 3053143 2418134 -259014
40587b59014j430376J519732K136263P6620j248984l54098O96174M65809j8080
$$ -259014 -1689390 -169658 1966605 2043225 794241 440143 1136317 1602126 1584046
40578A584046j93081r91332k066003j498910O46356J805749J067818M59333Q52976
$$ 1584046 1390965 399633 -1666370 -3165280 -2518924 -713175 354643 813976 1666952
40569A666952L38129j524665j788222Q22490K668273O25277k434947j985977P74999
$$ 1666952 2005081 480416 -1307806 -485316 2182957 2808234 373287 -1612690 -837691
40560h37691R98394j706376k772956l66124J837479R90330n62050K48044K145833
$$ -837691 160703 -1545673 -4318629 -4684753 -2847274 -1856944 -2418994 -2170950 -25117
40551b5117K051736O3427j334418j373898j264212j324143o70257N77893J151214
$$ -25117 2026619 2090046 755628 -618270 -1882482 -3206625 -3876882 -3298989 -2147775
40542b147775P15276K49125K63819K01630k41163m87952k1532R00879J520432
$$ -2147775 -1432499 -1183374 -919555 -717925 -959088 -1447040 -1468572 -567693 952739
40533I52739J075513n22795j994689j553723P23185K479775K135773J072574J238684
$$ 952739 2028252 1505457 -489232 -2042955 -1319770 1160005 3295778 4368352 5607036
40524E607036J961630J324556l71816j172879q72366r81177j512312q83687O68339
$$ 5607036 7568666 8893222 8521406 7348527 6476161 5494984 3982672 3098985 3767324
40515C767324P51665j212497k656467j774918k5409P36239R22115J270544Q94583
$$ 3767324 4518989 3306492 650025 -1124893 -1150302 -414063 508052 1778596 2673179
40506B673179n90824j435510o24740m4746j140144j802078J36903K457399J618372
$$ 2673179 2082355 646845 22105 -22641 -1162785 -2964863 -2827960 -370561 1247811
40497A247811j200541j622144R24722K375547N93992j691845j717281m09591M70358
$$ 1247811 47270 -1574874 -650152 1725395 2319387 627542 -1089739 -1499330 -1028972
40488a028972J278483K294038J729181j236226l752067k613331J140163L514584
$$ -1028972 249511 2543549 4272730 3036504 -715563 -3328894 -2188731 1325853
40480A325853K476633m84583k688702k294820Q20812M268144M448221P73494k664700
$$ 1325853 3802486 3317903 629201 -1665619 -844807 3423337 7871558 8645052 5980352
40471E980352k058779P73185J095812j592773l047172j181271P46950k81563j963079
$$ 5980352 3921573 4694758 5790570 4197797 1150625 -30646 716304 434741 -1528338
40462a528338n06160K769453K896101j109918m254702k571437J252559K008659
$$ -1528338 -2034498 734955 3631056 2521138 -1733564 -4305001 -3052442 -1043783
40454a043783m01303j241518J526932M068229K620800p58079j487577O23995J674385
$$ -1043783 -1445086 -2686604 -1159672 2908557 5529357 4771278 3283701 3907696 5582081
40445E582081J11431j361862r38278o41938k213462l572908k221512M71040J617270
$$ 5582081 5693512 4331650 3393372 2751434 537972 -3034936 -5256448 -4785408 -3168138
40436c168138J432082J905594K341490M16898k767414l133756R6785K636770J348539
$$ -3168138 -1736056 169538 2511028 2927926 160512 -2973244 -2876459 -239689 1108850
40427A108850j291902j409665M85871J184153L59567O62579K634421L230147N50585
$$ 1108850 -183052 -1592717 -1106846 77307 436874 1099453 3733874 6964021 7514606
40418G514606k721502k748566N1534J505549n65261l501438l770739j811317p17464
$$ 7514606 4793104 2044538 2096072 3601621 3036360 -465078 -4235817 -6047134 -6764598
40409f764598j181836q39935J119696K138665P59349k79113J629114M066308L002302
$$ -6764598 -7946434 -8786369 -7666673 -5528008 -4768659 -5047772 -3418658 647650 3649952
40400C649952n20077j815267j32641M16784j724260k633668K53149L282171K270318
$$ 3649952 3129875 1314608 1181967 1598751 -125509 -2759177 -2506028 776143 3046461
40391C046461p51081r96507J422974K164454k44184k595768k246091l15945Q63712
$$ 3046461 2295380 1298873 2721847 4886301 4642117 2046349 -199742 -515687 348025
40382C48025N31156q12090k129606j989546Q757K009940K008159P12184K32992
$$ 348025 879181 67091 -2062515 -4052061 -4043304 -2033364 -25205 686979 919971
40373I19971P05624P47161M31778P55932P97104j034802l142697k108279J612926
$$ 919971 1625595 2372756 2804534 3560466 4357570 3322768 180071 -1928208 -315282
40364c15282L397270J062669j989908j979676K81478J720389J399740K77309j053008
$$ -315282 3081988 4144657 2154749 175073 456551 2176940 3576680 3853989 2800981
40355B800981k093170j802755k48609P02941l4033j078920p91251N38820J781796
$$ 2800981 707811 -1094944 -1343553 -640612 -674645 -1753565 -2544816 -2005996 -224200
40346b24200K363731J725553l92289k399350k183033n81850l76141j303868k52924
$$ -224200 2139531 3865084 3472795 1073445 -1109588 -1691438 -2067579 -3371447 -3624371
40337c624371K553332K730737p21491k654743l3305K667479J103013j295478M68266
$$ -3624371 -1071039 1659698 938207 -1716536 -1749841 917638 2020651 725173 1193439
40328A193439L701150K444264k083750l526461j033516K58266j335665k139880
$$ 1193439 4894589 7338853 5255103 1728642 695126 953392 -382273 -2522153
40320b522153q79044n71302j648541o67940K444426L097779K54976j041945J699005
$$ -2522153 -3401197 -3972499 -5621040 -6288980 -3844554 -746775 -491799 -1533744 165261
40311A65261L905366J697012j884096k564227j441396j443204j742179k76006
$$ 165261 4070627 5767639 3883543 1319316 -122080 -1565284 -3307463 -3583469
40303c583469J814080K383524J783210Q57661j083558l291847k621650J155141
$$ -3583469 -1769389 614135 2397345 3255006 2171448 -1120399 -3742049 -2586908
40295b586908L363237J370457r93476l3490J571452P0387k368801j764384M56106
$$ -2586908 776329 2146786 1153310 1119820 2691272 2761659 392858 -1371526 -915420
40286i15420N64680l46329J155392L759366L382716M44278j083136m69409j82537
$$ -915420 -350740 -697069 458323 4217689 7600405 8044683 6961547 6492138 6309601
40277F309601m95813O2540M27035r81292j779798N69634K599828l15741m897191
$$ 6309601 5813788 5876328 6303363 5322071 3542273 4111907 6711735 6395994 1498803
40268A498803m093945Q80419K034795j781472k903489J620260M806524J918311
$$ 1498803 -2595142 -1714723 320072 -1461400 -4364889 -2744629 2061895 3980206
40260C980206j704606m72125K214243J145151j375399p37281J166364M7817k266072
$$ 3980206 2275600 1803475 4017718 5162869 3787470 3050189 4216553 4264370 1998298
40251A998298j244725J647360J425871j345823j574205J257258K278083k77200
$$ 1998298 753573 2400933 3826804 2480981 906776 2164034 4442117 4164917
40243D164917k355143j048420J297884J720278Q72271N77051O06237j1497q43386
$$ 4164917 1809774 761354 2059238 3779516 4651787 5228838 5835075 5823578 4980192
40234D980192r26003k84076M08792O03238N2158p66239p18508L74259R63972k9310
$$ 4980192 4054189 3770113 4178905 4782143 4834301 4068062 3349554 3723813 4687785 4658475
40224D658475j302731j111009M2723N71480M63223O32342P70952J63906m29363
$$ 4658475 3355744 2244735 2287458 2858938 3322161 3954503 4725455 4889361 4459998
40215D459998r4228J53831q69377j860563r60112P80539R86844N0614K12327J283949
$$ 4459998 4365770 4519601 3650224 1789661 829549 1610088 2596932 2647546 2859873 4143822
40205D143822J009367o33000j343441p39966p37284j374537m68777J694600J677814
$$ 4143822 5153189 4520189 3176748 2436782 1699498 324961 -143816 1550784 3228598
40196C228598j428090l713030k162814R18169J894852J041833P37819J104808
$$ 3228598 1800508 -1912522 -4075336 -3157167 -1262315 -220482 517337 1622145
40188A622145Q18063K42320M10513M53446o98162j447805K07765K646934K499124
$$ 1622145 2440208 2682528 3093041 3546487 2848325 1400520 1608285 4255219 6754343
40179F754343o0548j640737j084612o54686j324293r86540J230024K665358J403419
$$ 6754343 6693795 5053058 3968446 3313760 1989467 1002927 2232951 4898309 6301728
40170F301728l35456J67833J710543J545337J18445j52467N35632p7805j721387
$$ 6301728 5966272 6134105 7844648 9389985 9508430 9355963 9891595 9813790 8092403
40161H092403j592908O76789J947726O19497q01273J0547J496486J166643l79197
$$ 8092403 6499495 7176284 9124010 9743507 8942234 8952781 10449267 11615910 11236713
40152A1236713j127106j231920j922433k447856j323564M57416O89097k60133
$$ 11236713 10109607 8877687 6955254 4507398 3183834 3641250 4330347 4070214
40144D070214j72453R08654P29297r27217j579900l65411L60637r42567k365949
$$ 4070214 3897761 4806415 5535712 4608495 3028595 2663184 3023821 2081254 -284695
40135b84695j715012J46423J052827P12238K62371K00378M32314J049092J590041
$$ -284695 -1999707 -1853284 -800457 -88219 174152 374530 806844 1855936 3445977
40126C445977Q50201j207029k658250k070428m66448L80468K46664j43070m83922
$$ 3445977 4296178 3089149 430899 -1639529 -2105977 -1725509 -1478845 -1621915 -2105837
40117b105837l54362J008129K849230K580949o97234l882855l366470K08092K916558
$$ -2105837 -2460199 -1452070 1397160 3978109 3280875 -601980 -3968450 -3760358 -843800
40108h43800K521522L27220j347994j434489j21971J487159J779482K04117j656206
$$ -843800 1677722 2004942 656948 -777541 -899512 587647 2367129 2571246 915040
40099I15040j836924n12191M61830J58264n27910m13984N48533J319907Q50379
$$ 915040 -921884 -1434075 -972245 -813981 -1341891 -1755875 -1207342 112565 962944
40090I62944m28322l51512K292103M900156L422301j639919m714845k546458J058213
$$ 962944 534622 183110 2475213 7375369 10797670 9157751 4442906 1896448 2954661
40081B954661R06937j931201k340132P23883L158849K421206N86259j32986p07278
$$ 2954661 3861598 1930397 -409735 314148 3472997 5894203 6480462 6347476 5640198
40072E640198k288962l215352j571946J228576J963444l7205j971513j135318
$$ 5640198 3351236 135884 -1436062 -207486 1755958 1718753 -252760 -1388078
40064a388078J665567K974013J011692j688934j377510J475067K359911p27263
$$ -1388078 277489 3251502 4263194 2574260 1196750 2671817 5031728 4304465
40056D304465l952800l223295l12027K33424j677074k071179K37565K004329J234342
$$ 4304465 351665 -2871630 -3183657 -2950233 -4627307 -6698486 -6460921 -4456592 -3222250
40047c222250N2875N07999J326174P94190k04394j68707L97403L81783J77256
$$ -3222250 -3169375 -2661376 -1335202 -541012 -745406 -914113 -516710 -134927 42329
40038D2329N32827Q30125J80952r17689j320943o90518N22012J464858R82842
$$ 42329 575156 1405281 1586233 668544 -652399 -1342917 -820905 643953 1626795
40029A626795j134162k818085j634071J606339L393090K246861M19157J2136J25580
$$ 1626795 492633 -2325452 -3959523 -2353184 1039906 3286767 3705924 3718060 3843640
40020C843640o73979j610109j400015o59250n47556o28122J2446R20459J284058
$$ 3843640 3169661 1559552 159537 -499713 -1047269 -1675391 -1662945 -742486 541572
40011E41572J400203J531944Q52287p32574j362546Q9556J615083P41706j587203
$$ 541572 1941775 3473719 4326006 3593432 2230886 2320442 3935525 4677231 3090028
40002C090028k391044j076304K45749M56390N93499J113891P57992r06713k069374
$$ 3090028 698984 -377320 -131571 324819 918318 2032209 2790201 1883488 -185886
39993a85886j209494N60211J203806O51527L15311M69950P2965q42430o32869
$$ -185886 -1395380 -835169 368637 1020164 1335475 1805425 1878390 1035960 403091
39984D03091J250620K729928J834968j95604o12659O18258P54309j372890l504846
$$ 403091 1653711 4383639 6218607 6023003 5410344 6028602 6782911 5410021 1905175
39975A905175l366280j561817K47722J767168K937766K594168M48905j432513
$$ 1905175 -1461105 -3022922 -2775200 -1008032 1929734 4523902 4972807 3540294
39967C540294j393204o24080o28102m98614N21805L41648k420675m580863k657884
$$ 3540294 2147090 1523010 894908 396294 918099 1259747 -1160928 -5741791 -8399675
39958h399675R82384J545351j77810N81289L669242L793420j26677k703321j199051
$$ -8399675 -7417291 -5871940 -6049750 -5468461 -1799219 1994201 1867524 -835797 -2034848
39949b034848K71393j164445j855780J013291L246905P54237k515696p40697L617205
$$ -2034848 -1763455 -2927900 -4783680 -3770389 -523484 230753 -2284943 -3025640 591565
39940E91565L499721j140008l276471L383L561219K728853l84253j511137m98477
$$ 591565 4091286 2951278 -325193 -321810 3239409 5968262 5584009 4072872 3574395
39931C574395p618r34749j883471j683732n58309M79907N43816k03897m59636
$$ 3574395 3566777 2632028 748557 -935175 -1493484 -1013577 -469761 -673658 -1133294
39922a133294N73853J759493J330469o90967k436643k272183k17758K114926K520982
$$ -1133294 -559441 1200052 2530521 1839554 -597089 -2869272 -3087030 -972104 1548878
39913A548878K23622k602646k817008l60481J587575J099516l20595r18855j033134
$$ 1548878 1772500 -830146 -3647154 -4007635 -2420060 -1320544 -1641139 -2559994 -3593128
39904c593128q77670N82547K537783J805799j890345l905293j345569K063173
$$ -3593128 -4470798 -3888251 -1350468 455331 -1435014 -5340307 -6685876 -4622703
39896d622703J964219L68594J358949L240021J566840k212821k406753J357976
$$ -4622703 -2658484 -2289890 -930941 2309080 3875920 1663099 -743654 614322
39888F14322L389750J185748j391514j503619j399253k796586l062361k08412
$$ 614322 4004072 5189820 3798306 2294687 895434 -1901152 -4963513 -5171925
39880e171925K959753L094183J121834k34786o49098r93018o37952J100311K756913
$$ -5171925 -2212172 882011 2003845 1769059 1119961 126943 -511009 589302 3346215
39871C346215K510097Q35031m61106o23957r5056M59079L82491m54383j015367
$$ 3346215 5856312 6691343 6230237 5606280 5511224 5970303 6352794 5898411 4883044
39862D883044l73696N65301M06619k87251k28529j73105j401078k376110p64374
$$ 4883044 4509348 5074649 5481268 5194017 4965488 4792383 3391305 1015195 250821
39853B50821J859674J764400p40998j761305n68671m16555j898157j522360J403914
$$ 250821 2110495 3874895 3133897 1372592 803921 387366 -1510791 -3033151 -1629237
39844a629237K638419L59459j365908J42447J300747j081514l731865k567088
$$ -1629237 1009182 1368641 2733 145180 1445927 364413 -3367452 -5934540
39836e934540L68149J141969Q71332K404248L742730J408438k335190k495397
$$ -5934540 -5566391 -4424422 -3553090 -1148842 2593888 4002326 1667136 -828261
39828h28261J79787N99255j778278k350519L05637K177978R48774n97585m7305
$$ -828261 -648474 -49219 -1827497 -4178016 -3872379 -1694401 -745627 -1343212 -1390517
39819a390517R51919O09559J45490O59100O21934r76362k042742n33613K035902
$$ -1390517 -438598 170961 316451 975551 1597485 621123 -1421619 -1955232 80670
39810H0670K596473O00730j691313k058330l61484J509321J340262r63500k892802
$$ 80670 2677143 3277873 1586560 -471770 -833254 676067 2016329 1052829 -1839973
39801a839973k348703l44323Q28298R42995J157090J252574M41658j06662J092848
$$ -1839973 -4188676 -4532999 -3704701 -2761706 -1604616 -352042 89616 -17046 1075802
39792A075802K464667J457128n14501L23869L400005L670392n39794m461261l923728
$$ 1075802 3540469 4997597 4483096 4806965 8206970 11877362 11337568 6876307 2952579
39783B952579j074773n6808p90999p41406N3802k81609j527779j831617r65151
$$ 2952579 1877806 1820998 1029999 288593 342395 60786 -1466993 -3298610 -4263761
39774d263761q0264P15291J761738J995218N47364q88977k89279J055230L82040
$$ -4263761 -4344025 -3628734 -1866996 128222 675586 -213391 -502670 552560 934600
39765I34600j691812j788019P08584K434835J250890p15747q19024J63831O226
$$ 934600 -757212 -2545231 -1836647 598188 1849078 1133331 314307 478138 484364
39756D84364j153982j456292n47768K41408M49639J046831K347453L102155K202531
$$ 484364 -669618 -2125910 -2673678 -2432270 -1982631 -935800 1411653 4513808 6716339
39747F716339J67677j600775k312813k141250j654058j266634r17844j53083J116621
$$ 6716339 6884016 5283241 2970428 829178 -824880 -2091514 -3009358 -3162441 -2045820
39738b045820K022110J564250Q6237r15393p22673k27975l47609o31237l31159
$$ -2045820 -23710 1540540 1626777 711384 -11289 -239264 -586873 -1218110 -1549269
39729a549269J15354l7587k51496L77920J121335N69384n06890K80398K800750
$$ -1549269 -1433915 -1471502 -1722998 -1345078 -223743 345641 -161249 119149 2919899
39720B919899L431461J4037m270235m564978p70562K523522K306713M46323o4928
$$ 2919899 6351360 6365397 2095162 -2469816 -3240378 -716856 1589857 2036180 1971252
39711A971252M75772j73476j947853k247889j13921J697852L71828k495509k474096
$$ 1971252 2447024 2273548 325695 -1922194 -2036115 -338263 33565 -2461944 -4936040
39702d936040J474245M867442L405480j189233l691119k531653r67418j193326
$$ -4936040 -3461795 1405647 4811127 3621894 -69225 -2600878 -3568296 -4761622
39694d761622j239851Q74301L430728L848911K540898J301437J29886j508471
$$ -4761622 -6001473 -5127172 -1696444 2152467 4693365 5994802 6124688 4616217
39686D616217k299475j121467K32674l05049j267896j14353J920663J625893n06175
$$ 4616217 2316742 1195275 1427949 1122900 -144996 -259349 1661314 3287207 2781032
39677B781032j069512J38601j51514k385601k886991k81276J869541J098825o9322
$$ 2781032 1711520 1850121 1698607 -686994 -3573985 -3855261 -1985720 -886895 -956217
39668i56217Q14919J600785k17956k502125j948106L78330J326274J038570J563878
$$ -956217 -141298 1459487 1241531 -1260594 -3208700 -2830370 -1504096 -465526 1098352
39659A098352K146832P51673j129889l01545K145958J825733j788182m209231
$$ 1098352 3245184 3996857 2866968 2565423 4711381 6537114 4748932 539701
39651E39701k873987m99413R1421P4014J170588J916592M81799j543889j427396
$$ 539701 -2334286 -2833699 -2742278 -2668264 -1497676 418916 900715 -643174 -2070570
39642b070570M45144J511497R64543P9130m48393r50896j135417l34696P39080
$$ -2070570 -1625426 -113929 850614 929744 481351 -469545 -1604962 -1939658 -1200578
39633a200578N25119r89475k059798j569466k70828N58998N27469m4893o95123
$$ -1200578 -675459 -1664934 -3724732 -5294198 -5565026 -5006028 -4478559 -4523452 -5218575
39624e218575q87673k52733R10318J765632J721578R34642K19337N06506J813180
$$ -5218575 -6106248 -6358981 -5448663 -3683031 -1961453 -1026811 -807474 -300968 1512212
39615A512212K618929J268147j547659l012568j837896k04048m11446j067239
$$ 1512212 4131141 5399288 3851629 839061 -998835 -1202883 -1614329 -2681568
39607b681568O89028L875619M095151K3645l878437l193292M68702K108244K95141
$$ -2681568 -1992540 1883079 5978230 6001875 2123438 -1069854 -601152 1507092 1802233
39598A802233j809396j776064p88339o14111p65043j95322M86984M55469O05004
$$ 1802233 -7163 -1783227 -2571566 -3185677 -3950720 -4146042 -3659058 -3203589 -2598585
39589b598585J819252K491865M41696l019150l719635j03268M189945M679182
$$ -2598585 -779333 1712532 2154228 -864922 -4584557 -4687825 -497880 4181302
39581D181302J453826j527382j635796o2346P70550K83158n79021j256597j722654
$$ 4181302 5635128 4107746 2471950 2409604 3180154 3463312 2884291 1627694 -94960
39572i4960j372320N66067L258064M300154K431329o46287k247198j933878j433836
$$ -94960 -1467280 -901213 2356851 6657005 9088334 8442047 6194849 4260971 2827135
39563B827135j635369j461093j65886J066684R86142K74802J66564K78845l13272
$$ 2827135 1191766 -269327 -435213 631471 1617613 1892415 2058979 2337824 2024552
39554B024552q45266m0600J100253M66848j279528j166013J080515J936699l47262
$$ 2024552 1179286 1138686 2238939 2705787 1426259 260246 1340761 3277460 2930198
39545B930198k527107j475945O00270N899j752000k63097L705407M263102m38115
$$ 2930198 403091 -1072854 -472584 -466685 -2218685 -2481782 1223625 5486727 5048612
39536E048612m651432l348363O23692J605909l40258r10609P08364J130038p32434
$$ 5048612 397180 -2951183 -2327491 -721582 -1061840 -1972449 -1264085 -134047 -866481
39527h66481j762450j59182J637470J252016j05378m96591m51244r12208p30367
$$ -866481 -2628931 -2788113 -1150643 101373 -4005 -500596 -951840 -1864048 -2594415
39518b594415J046419K581946J838857o629o49923n29597j362502k191720p44103
$$ -2594415 -1547996 1033950 2872807 2866178 2216255 1686658 324156 -1867564 -2611667
39509b611667J913490K223835j04536j277165N96996K538335J513923j140878
$$ -2611667 -698177 1525658 1421122 143957 740953 3279288 4793211 3652333
39501C652333k427283k000989j207741j83733J231513J594517r3713j837142j180496
$$ 3652333 1225050 -775939 -1983680 -2167413 -935900 658617 564904 -1272238 -2452734
39492b452734P71202R92379n50638r84740O01745J744477O94224j012354j219461
$$ -2452734 -1681532 -689153 -1239791 -2224531 -1622786 121691 815915 -196439 -1415900
39483a415900j10707P65229P47596K28979k28694k42044m6421o35027k129710
$$ -1415900 -1526607 -761378 -13782 215197 -13497 -255541 -301962 -936989 -3066699
39474c066699k413421L74063M002992L763816j071158n235608l879850J150299
$$ -3066699 -5480120 -5106057 -1103065 2660751 1589593 -3646015 -7525865 -6375566
39466f375566L890780J853112j517587j778635J175703L446555J994163j660730
$$ -6375566 -2484786 -631674 -2149261 -3927896 -2752193 694362 2688525 1027795
39458A027795l195535r69521J705851J165566j303033j597851O46254J625351
$$ 1027795 -2167740 -3137261 -1431410 -265844 -1568877 -3166728 -2520474 -895123
39450h95123j52540j428695O683J450401K37464j305675Q9807K655355K384653
$$ -895123 -1047663 -2476358 -2469675 -1019274 -781810 -2087485 -1997678 657677 3042330
39441C042330k45899j409984n94259q55745k664649k783839j10877K188263J865789
$$ 3042330 2796431 1386447 792188 -63557 -2728206 -5512045 -5622922 -3434659 -1568870
39432a568870O44779L34330p1455j253960j350508M33750J430058j15124j314973
$$ -1568870 -924091 -589761 -661216 -1915176 -3265684 -2831934 -1401876 -1517000 -2831973
39423b831973R04041L984237K845220k227340n269749k596864K577321M670222
$$ -2831973 -1927932 2056305 4901525 2674185 -2595564 -5192428 -2615107 2055115
39415B055115K257487j416061k761039j177027J202418K022507R51679m18488
$$ 2055115 4312602 2896541 135502 -1041525 160893 2183400 3135079 2716591
39407B716591q21398p34676j022343j164991j54890J428187J855111P41894l89635
$$ 2716591 1895193 1160517 138174 -1026817 -1181707 246480 2101591 2843485 2453850
39398B453850l81051M7562k78910j054838r64427L12411J493339J250847j74497
$$ 2453850 2072799 2120361 1841451 786613 -177814 134597 1627936 2878783 2704286
39389B704286j291005j024789L93338K048363L064117K563222M5078l343840m890469
$$ 2704286 1413281 388492 781830 2830193 5894310 8457532 8502610 5158770 268301
39380B68301l026822N35360K655407K227572M90882j231628k178641j405865R78723
$$ 268301 -2758521 -2223161 432246 2659818 3150700 1919072 -259569 -1665434 -686711
39371f86711K338484L88977k599968k188585J317496K786039L35091j598685Q5338
$$ -686711 1651773 2040750 -559218 -2747803 -1430307 1355732 1690823 92138 177476
39362A77476J749938k95740k551717l5069M272493L326578k197389m273381k10314
$$ 177476 1927414 1631674 -920043 -955112 3317381 6643959 4446570 173189 -37125
39353c7125L180677O74006l502091l225644Q7776J128984n27490j268746l79649
$$ -37125 3143552 3817558 315467 -2910177 -2822401 -1693417 -2220907 -3489653 -3869302
39344c869302k18264q07273J87275K375779K630117O40582j56556J552633K372356
$$ -3869302 -4087566 -4894839 -4707564 -2331785 298332 938914 782358 2334991 4707347
39335D707347l46778l810025l493535M16719L349506K435977l57177j499658l18635
$$ 4707347 4360569 550544 -2942991 -2526272 823234 3259211 2902034 1402376 1083741
39326A083741R87255P79439p6908P9933J214771J804427J011106n54913k037411
$$ 1083741 2070996 2850435 2773527 2853460 4068231 5872658 6883764 6328851 4291440
39317D291440k901263k330226Q8972K577994K182986j165385l592727k133199
$$ 4291440 1390177 -940049 -851077 1726917 3909903 2744518 -848209 -2981408
39309b981408J076903J830765k71793j894635j236084J0555K06370J71221R52056
$$ -2981408 -1904505 -73740 -345533 -2240168 -3476252 -3465697 -3259327 -3088106 -2136050
39300b136050J712607J371758M96972N9546j99824p03353p09057L04355J029358
$$ -2136050 -423443 948315 1445287 1504833 1305009 601656 -107401 196954 1226312
39291A226312m6759k051662k594676j005039R68958J732983J499825J003909J26573
$$ 1226312 1179553 -872109 -3466785 -4471824 -3502866 -1769883 -270058 733851 860424
39282H60424j276752k293825j937955p03742K7606l2884J50705J059609J708510
$$ 860424 -416328 -2710153 -4648108 -5351850 -5324244 -5357128 -5206423 -4146814 -2438304
39273b438304J214452K26967k24888m85970j404303k117643o43471K840598N105233
$$ -2438304 -1223852 -996885 -1221773 -1707743 -3112046 -5229689 -5873160 -3032562 2072671
39264B072671L525860n06327l255249k997193j199425K15664R72444J474503J322741
$$ 2072671 5598531 5092204 1836955 -1160238 -2359663 -2143999 -1171555 302948 1625689
39255A625689p0587k013895k778666j487084P50781J948071J384823K46815k4752
$$ 1625689 1555102 -458793 -3237459 -4724543 -3973762 -2025691 -640868 -394053 -418805
39246d18805N04133P18973K16904l78496o70024q38183o80719L02663J525868
$$ -418805 85328 804301 1021205 642709 -27315 -865498 -1546217 -1243554 282314
39237B82314J528002K03066p16629k46822L96583K710p40088r91006j522080k756757
$$ 282314 1810316 2013382 1296753 1049931 1446514 1449224 709136 -281870 -1803950 -4560707
39227d560707k840245l03138K682778K734458J84288j506551q60932K70680M12643
$$ -4560707 -7400952 -7704090 -5021312 -2286854 -2102566 -3609117 -4470049 -4199369 -3786726
39218c786726J83321n8107r36112j684079m31112K005332K113613q09040k641691
$$ -3786726 -3603405 -3661512 -4597624 -6281703 -6712815 -4707483 -2593870 -3402910 -6044601
39209f044601m00394K998019L183216R10480K30243J749044K091325k74955k767661
$$ -6044601 -6444995 -3446976 -263760 646720 876963 2626007 4717332 4442377 1674716
39200A674716k938836j638100p01349j75624N50053Q61348O663j118554r52509
$$ 1674716 -1264120 -2902220 -3603569 -3779193 -3229140 -2367792 -2361129 -3479683 -4432192
39191d432192N18453J804748J888274J124228K74474m23615r68174j046402l85751
$$ -4432192 -3913739 -2108991 -220717 903511 1177985 754370 -213804 -1260206 -1645957
39182a645957N00786N80263l61362j136713n46541R28494J651032R67293j43151
$$ -1645957 -1145171 -564908 -926270 -2062983 -2609524 -1681030 -29998 937295 794144
39173G94144o98232q84105j095144q82953J89513J322619J225094m1412q55055
$$ 794144 95912 -788193 -1883337 -2766290 -2576777 -1254158 -29064 -70476 -925531
39164i25531N0984J899054K536553R16408j456144k216065j157909l32366p33293
$$ -925531 -874547 1024507 3561060 4477468 3021324 805259 -352650 -685016 -1418309
39155a418309o74151J130184K690468J477128j194267j738991J73226J254094
$$ -1418309 -2092460 -962276 1728192 3205320 2011053 272062 445288 1699382
39147A699382P2557r12060J0998Q56177k89187j772573j272338L82410J009356
$$ 1699382 1771939 859879 870877 1727054 1437867 -334706 -1607044 -1224634 -215278
39138b15278N79296K96429R3098l97865k58938P70450P77236j188311k633160
$$ -215278 364018 660447 753545 355680 96742 867192 1644428 456117 -2177043
39129b177043j354920O07945L53551p96462J06465J885446J158427j204157j141591
$$ -2177043 -3531963 -2924018 -2570467 -3366929 -3260464 -1375018 -216591 -1420748 -2562339
39120b562339J371315J981940m87358j952566j88937J499531L30937j232602k35696
$$ -2562339 -1191024 790916 303558 -1649008 -1837945 -338414 -7477 -1240079 -1475775
39111a475775J483828P53842j347040j519569K98371J436954J052526O09010O27979
$$ -1475775 8053 761895 -585145 -2104714 -1806343 -369389 683137 1292147 1920126
39102A920126Q5701j252271k274445k097377o67745J436193K586001J037515k108087
$$ 1920126 2005827 753556 -1520889 -3618266 -4286011 -2849818 -263817 773698 -1334389
39093a334389k835830N95331M295158L544459n28681k598638o99208J731656J593754
$$ -1334389 -4170219 -3574888 720270 4264729 3736048 1137410 438202 2169858 3763612
39084C763612J01761l75789l05723j440123l146691k975747m76434J728418J253380
$$ 3763612 3865373 3489584 3183861 1743738 -1402953 -4378700 -4855134 -3126716 -1873336
39075a873336r69665j913619k34395K293062L234748K255882O98095n73031j557697
$$ -1873336 -2843001 -4756620 -4991015 -2697953 536795 2792677 3490772 2917741 1360044
39066A360044j959114j281193k4435O78169O32538M79003K93578j56992k70341
$$ 1360044 -599070 -1880263 -1904698 -1226529 -593991 -114988 178590 21598 -248743
39057b48743K86956J7187k137527l603246j044822L522269M166579j46493l228753
$$ -248743 38213 55400 -2082127 -5685373 -6730195 -3207926 958653 812160 -2416593
39048b416593q10928K954655K256664j403664k398224o2986J488627R41699Q84801
$$ -2416593 -3227521 -272866 1983798 580134 -1818090 -1881076 -392449 549250 1434051
39039A434051J747304P37115k361517l774371j671105J103363J907713J659435
$$ 1434051 3181355 3918470 1556953 -2217418 -3888523 -2785160 -877447 781988
39031G81988J510557M23741j541991j494686J653734M072092K021629k401257
$$ 781988 2292545 2716286 1174295 -320391 1333343 5405435 7427064 5025807
39023E025807m046207j602460J600375K595811J470340l75781j828057j974681
$$ 5025807 979600 -622860 977515 3573326 5043666 4667885 2839828 865147
39015H65147o82389O29717M60982o74078j125895o78492n07065q60484p16514
$$ 865147 182758 812475 1273457 599379 -526516 -1205008 -1712073 -2572557 -3289071
39006c289071J47161O15642K57638J78999R88131J365412J7468j853459j745988
$$ -3289071 -3141910 -2526268 -2268630 -2089631 -1101500 263912 281380 -1572079 -3318067
38997c318067N62695K332807J489009m65931o38695R95462J599042k40190k487871
$$ -3318067 -2755372 -422565 1066444 600513 -38182 957280 2556322 2316132 -171739
$$ [...]
##END NTUPLES=NMR SPECTRUM
##END=
