##TITLE=31Pdec_17BFPH2506
 CDCl3, 24 sc
 26.6.2019
##JCAMPDX= 6.0         $$ Bruker NMR JCAMP-DX V2.0
##DATA TYPE= NMR SPECTRUM
##DATA CLASS= NTUPLES
##ORIGIN= UXNMR, Bruker Analytische Messtechnik GmbH
##OWNER= root
$$ XWIN-NMR		Version 3.5
$$ Wed Jun 26 15:54:09 2019 Russian Standard Time (UT+4h)  she@DPX200
##.OBSERVE FREQUENCY= 81.013821
##.OBSERVE NUCLEUS= ^31P
##.ACQUISITION MODE= SIMULTANEOUS
##.ACQUISITION SCHEME= undefined
##.AVERAGES= 24
##.DIGITISER RES= 17
##SPECTROMETER/DATA SYSTEM= spect
##.PULSE SEQUENCE= zgpg30
##.SOLVENT NAME= CDCl3
##.SHIFT REFERENCE= (INTERNAL, CDCl3, 0, 182.463)
##AUDIT TRAIL= $$ (NUMBER, WHEN, WHO, WHERE, WHAT)
$$ ##TITLE= Audit trail, XWIN-NMR		Version 3.5
$$ ##JCAMPDX= 5.01
$$ ##ORIGIN= Bruker BioSpin GmbH
$$ ##OWNER= she
$$ F:/spectra/data/she/nmr/P31/1/pdata/1/auditp.txt
$$ ##AUDIT TRAIL=  $$ (NUMBER, WHEN, WHO, WHERE, WHAT)
(   1,<2019-06-26 15:53:14.14 +0400>,<she>,<DPX200>,
      <created by zg, POWCHK disabled, PULCHK disabled
       configuration hash MD5:
       00 E9 B6 7A A2 85 ED C7 34 08 36 98 17 FE 4E 26
       data hash MD5: 32K
       B8 79 1F C3 55 C4 3B 1E F0 75 2B 44 87 CA DA FE>)
(   2,<2019-06-26 15:53:17.95 +0400>,<she>,<DPX200>,
      <Start of raw data processing
       efp BC_mod = 2 LB = 1 FT_mod = 6 PKNL = 1 PHC0 = -2500.745 PHC1 = -84.6004 SI = 64K 
       data hash MD5: 64K
       2A 73 E4 7F 70 B9 BE B0 E2 5A DE 51 0F 31 78 B0>)
(   3,<2019-06-26 15:53:29.34 +0400>,<she>,<DPX200>,
      <pk PHC0 = 25.39116 PHC1 = 0 
       data hash MD5: 64K
       CB 37 40 02 D5 33 CF 44 F5 71 20 13 65 3A C8 83>)
(   4,<2019-06-26 15:53:32.57 +0400>,<she>,<DPX200>,
      <abs ABSG = 5 
       data hash MD5: 64K
       74 F3 E5 2C 8B 34 C2 94 18 A8 2A 7E B3 0E 9E FA>)
$$ ##END=
$$ 
$$ hash MD5
$$ 9E A4 13 28 4E 6A 6B D3 84 EC 0E AE 8A 40 A5 2C
##$RELAX= 
##$RELAX= 
##$RELAX= 
##$RELAX= 
##$RELAX= 
##$RELAX= 
##$RELAX= 
##$RELAX= 
$$ Bruker specific parameters
$$ --------------------------
##$DU= <F:/spectra>
##$EXPNO= 1
##$NAME= <P31>
##$PROCNO= 1
##$TYPE= <nmr>
##$USER= <she>
##$AMP= (0..31)
100 100 100 100 100 100 100 100 100 100 100 100 100 100 100 100 100 100 
100 100 100 100 100 100 100 100 100 100 100 100 100 100 
##$AQSEQ= 0
##$AQ_mod= 1
##$AUNM= <au_zg>
##$AUTOPOS= <>
##$BF1= 81.014009
##$BF2= 200.13
##$BF3= 200.13
##$BF4= 200.13
##$BF5= 200.13
##$BF6= 200.13
##$BF7= 200.13
##$BF8= 200.13
##$BYTORDA= 1
##$CFDGTYP= 0
##$CFRGTYP= 5
##$CHEMSTR= <none>
##$CNST= (0..31)
1 1 145 1 1 1 1 1 1 1 1 1 1 1 1 1 1 1 1 1 1 1 1 1 1 1 1 1 1 1 1 1 
##$CPDPRG= <waltz16>
##$CPDPRG1= <>
##$CPDPRG2= <waltz16>
##$CPDPRG3= <>
##$CPDPRG4= <mlev>
##$CPDPRG5= <mlev>
##$CPDPRG6= <mlev>
##$CPDPRG7= <mlev>
##$CPDPRG8= <mlev>
##$CPDPRGB= <>
##$CPDPRGT= <>
##$D= (0..31)
0 1 0 0 0 0 0 0 0 0 0 0.03 2e-05 3e-06 0 0 0 0 0 0 0 0 0 0 0 0 0 0 0 0 
0 0 
##$DATE= 1561549993
##$DBL= (0..7)
120 120 120 11 120 120 24 19 
##$DBP= (0..7)
150 150 150 150 150 150 150 150 
##$DBP07= 0
##$DBPNAM0= <>
##$DBPNAM1= <>
##$DBPNAM2= <>
$$ [...]
##$SUBNAM3= <"">
##$SUBNAM4= <"">
##$SUBNAM5= <"">
##$SUBNAM6= <"">
##$SUBNAM7= <"">
##$SUBNAM8= <"">
##$SUBNAM9= <"">
##$SW= 369.568048894756
##$SWIBOX= (0..15)
0 1 3 0 0 0 0 0 0 0 0 0 0 0 0 0 
##$SW_h= 29940.119760479
##$TD= 32768
##$TD0= 1
##$TE= 0
##$TE2= 300
##$TE3= 300
##$TEG= 300
##$TL= (0..7)
0 120 53 12 22 120 120 120 
##$TP= (0..7)
150 150 150 150 150 150 150 150 
##$TP07= 0
##$TPNAME0= <>
##$TPNAME1= <>
##$TPNAME2= <>
##$TPNAME3= <>
##$TPNAME4= <>
##$TPNAME5= <>
##$TPNAME6= <>
##$TPNAME7= <>
##$TPOAL= (0..7)
0.5 0.5 0.5 0.5 0.5 0.5 0.5 0.5 
##$TPOFFS= (0..7)
0 0 0 0 0 0 0 0 
##$TUNHIN= 0
##$TUNHOUT= 0
##$TUNXOUT= 0
##$USERA1= <user>
##$USERA2= <user>
##$USERA3= <user>
##$USERA4= <user>
##$USERA5= <user>
##$V9= 5
##$VALIST= <valist>
##$VCLIST= <CCCCCCCCCCCCCCC>
##$VD= 0
##$VDLIST= <DDDDDDDDDDDDDDD>
##$VPLIST= <PPPPPPPPPPPPPPP>
##$VTLIST= <TTTTTTTTTTTTTTT>
##$WBST= 1024
##$WBSW= 4
##$XGAIN= (0..3)
0 0 0 0 
##$XL= 0
##$YL= 0
##$YMAX_a= 8092
##$YMIN_a= -8948
##$ZGOPTNS= <>
##$ZL1= 120
##$ZL2= 120
##$ZL3= 120
##$ZL4= 120
##$ABSF1= 182.463
##$ABSF2= -187.1042
##$ABSG= 5
##$ABSL= 3
##$ALPHA= 0
##$AQORDER= 0
##$ASSFAC= 0
##$ASSFACI= 0
##$ASSFACX= 0
##$ASSWID= 0
##$AUNMP= <proc_1d>
##$AZFE= 0.1
##$AZFW= 0.5
##$BCFW= 0
##$BC_mod= 2
##$BYTORDP= 0
##$COROFFS= 0
##$CY= -3
##$DATMOD= 1
##$DC= 0
##$DFILT= <>
##$DTYPP= 0
##$F1P= 0
##$F2P= 0
##$FCOR= 1
##$FTSIZE= 65536
##$FT_mod= 6
##$GAMMA= 0
##$GB= 0
##$INTBC= 1
##$INTSCL= 5.30512e-09
##$ISEN= 30
##$LB= 1
##$LEV0= 0
##$LPBIN= 0
##$MAXI= 10000
##$MC2= 0
##$MEAN= 0
##$ME_mod= 0
##$MI= 50
##$NCOEF= 0
##$NC_proc= -7
##$NLEV= 6
##$NOISF1= 182.463
##$NOISF2= 159.3651
##$NSP= 0
##$NTH_PI= 0
##$NZP= 0
##$OFFSET= 182.463
##$PC= 4
##$PHC0= -2475.354
##$PHC1= -84.6004
##$PH_mod= 1
##$PKNL= yes
##$PPARMOD= 0
##$PSCAL= 0
##$PSIGN= 0
##$REVERSE= no
##$SF= 81.0140089999434
##$SI= 65536
##$SIGF1= 159.3651
##$SIGF2= -187.1042
##$SINO= 113.3802
##$SIOLD= 16384
##$SREGLST= <1H.CDCl3>
##$SSB= 0
##$STSI= 65536
##$STSR= 0
##$SW_p= 29940.119760479
##$SYMM= 0
##$S_DEV= 0
##$TDeff= 32768
##$TDoff= 0
##$TI= <>
##$TILT= no
##$TM1= 0
##$TM2= 0
##$TOPLEV= 0
##$USERP1= <user>
##$USERP2= <user>
##$USERP3= <user>
##$USERP4= <user>
##$USERP5= <user>
##$WDW= 1
##$XDIM= 65536
##$YMAX_p= 446029766
##$YMIN_p= -19092619
$$ End of Bruker specific parameters
$$ ---------------------------------
##NTUPLES= NMR SPECTRUM
##VAR_NAME=  FREQUENCY,     SPECTRUM/REAL,   SPECTRUM/IMAG
##SYMBOL=    X,             R,               I
##VAR_TYPE=  INDEPENDENT,   DEPENDENT,       DEPENDENT
##VAR_FORM=  AFFN,          ASDF,            ASDF
##VAR_DIM=   65536,         65536,           65536
##UNITS=     HZ,            ARBITRARY UNITS, ARBITRARY UNITS
##FACTOR=    0.456856943014862, 1,           1
##FIRST=     14782.0589164792, 0,            0
##LAST=      -15158.0608439998, 0,           0
##MIN=       -15158.0608439998, -19092619,   0
##MAX=       14782.0589164792, 446029766,    0
$$ Real data points
##PAGE= N=1
##DATA TABLE= (X++(R..R)), XYDATA
$$ [...]
44020 -174223 1799033 2649333 1002724 -2768021 -6601279 -9231981 -11074580 -11974699 -10327465
44011 -10327465 -5962673 -1900958 -1059762 -2448628 -2789184 -1127602 327603 -287430
44003 -287430 -2166393 -3374756 -3176538 -2042150 -252928 2444172 5784931 8353050
43995 8353050 8709810 7100671 5223500 3990170 2522831 139986 -1827328 -1712475
43987 -1712475 -212984 493912 -4841 -70728 972941 1707521 1064641 11834 67100
43978 67100 1749299 4964461 8920901 10988234 8169857 1379938 -3848171 -3166634 1432553
43969 1432553 4440181 3639831 1566187 792077 696302 -416817 -2250082 -3029611 -2051851
43960 -2051851 -424340 505943 629660 796122 1471469 2204958 2641320 3500124 5650159
43951 5650159 8284368 9130332 6963697 3126271 46733 -1048018 -473118 1027719
43943 1027719 2810149 3939470 3022633 -924692 -6810191 -10798034 -9019213 -2301094
43935 -2301094 3347157 3315425 247698 48541 2839523 2642795 -2971405 -8148368 -6815226
43926 -6815226 -1302538 1487311 -332923 -2792954 -3141072 -2643764 -2712113 -2971426 -3697282
43917 -3697282 -6118360 -9426791 -10935754 -9987809 -8454426 -6808712 -3446437 1038592
43909 1038592 2915757 682300 -2088377 -1753293 443576 1130530 17428 -718804 -414992
43900 -414992 -124420 44254 854170 1782754 1506126 322584 -35624 1054843 2470200
43891 2470200 3158912 3176954 3021935 3028589 3116579 2318391 -613131 -4999468 -7600851 -5777641
43881 -5777641 -832485 3138867 3374763 403336 -3443015 -6158839 -7097848 -7008624 -6913233
43872 -6913233 -6539598 -4642781 -1275815 1583327 2418949 1772557 688221 -604437 -1400456
43863 -1400456 -178238 2714286 4261174 2878209 1122502 1615803 2459618 233968
43855 233968 -4084745 -6253422 -4932888 -2634312 -917867 1043047 2850814 2216569
43847 2216569 -914591 -3318717 -3047975 -1782715 -1182842 -85408 2784962 5967067
43839 5967067 7060215 5422877 1860956 -2269965 -4850809 -4489415 -3005923 -3391397
43831 -3391397 -4527696 -1904735 4825040 9493075 7484321 2082737 -847929 -752037
43823 -752037 -605991 -705251 347472 868041 -1628279 -4530842 -2753877 2657964 4611547
43814 4611547 -42005 -6065069 -7557769 -5328445 -3659115 -3772697 -4176511 -4685893 -6206738
43805 -6206738 -7893365 -7770687 -5643596 -3166690 -1662154 -1602151 -3233618 -5763781 -6830077
43796 -6830077 -4904442 -1715197 -338077 -1267433 -2255768 -1692320 -52058 1941273 4264954
43787 4264954 6171369 6111378 4352045 3714230 5772504 7771892 5958028 1400783 -665210
43778 -665210 1970754 5137928 4213051 720311 -453140 1185691 1324690 -1709119 -3947695
43769 -3947695 -2183598 846582 948299 -1128645 -1851184 -1123289 -1597974 -2990325 -2214178
43760 -2214178 702779 1858854 -106980 -1412559 830063 3884914 3737227 1229786
43752 1229786 357828 2187984 3891273 3176303 903002 -675688 -326744 1526630 3270911
43743 3270911 3348188 1800713 -17566 -1666741 -4079220 -6980954 -7929971 -5742812 -3112605
43734 -3112605 -3390484 -5914353 -7089565 -5406614 -2791474 -1235510 -603027 6630 876913
43725 876913 2052909 3364958 3840036 2728700 1235933 1504331 3672387 5635561 5931166
43716 5931166 5097980 3940364 2463424 1196912 1648340 4280033 7309624 8481819
43708 8481819 7143114 4192984 1214729 -100404 702673 1685549 640247 -1081029
43700 -1081029 576592 6239457 10513486 8236017 1533886 -2624601 -1090280 2700068
43692 2700068 4616746 4782099 5166086 5346482 3490655 171803 -1645667 -466374 1875152
43683 1875152 2676527 1332946 -683569 -1732425 -1219157 338036 1756442 2185823 2171396
43674 2171396 3151543 5360206 7054142 6793786 5655735 5605274 6193171 5080818 2080015
43665 2080015 115064 917040 2193612 1298624 -295554 640064 3402574 3892754 1009843
43656 1009843 -1385455 -307693 2009975 1972451 40380 -793200 640 606933 1055021
43647 1055021 3455467 7723747 10495613 9603687 6994062 5479218 4660492 2236390
43639 2236390 -1923674 -5400381 -6591700 -6321646 -5676353 -4052999 -647763 3060293
43631 3060293 4098319 1628030 -1582020 -2428106 -1345990 -1224887 -2793977 -3500132 -1777017
43622 -1777017 116961 -441886 -2228284 -2374132 -1361022 -1984671 -3733627 -2673433 1931493
43613 1931493 5269211 3862684 1144155 2438552 6977485 9350610 7585969 5072407
43605 5072407 4465673 4284285 2850927 1627882 2251914 3110313 1703351 -1271940 -2902628
43596 -2902628 -2254774 -1194327 -1340095 -2316649 -3199020 -3852396 -4127749 -3071091 -137514
43587 -137514 3300873 4949155 4481323 4401288 6821381 9942916 9808823 6044742 3319790
43578 3319790 5145496 8466995 7729628 2994894 -256539 656723 2375500 1898316 1414429
43569 1414429 3566969 5760087 3598925 -2282443 -7241458 -9007778 -8660700 -6333661
43561 -6333661 -1037580 4989792 6771415 3043851 -1729855 -3564732 -3489162 -3828778 -3827101
43552 -3827101 -2230683 -1112901 -2887609 -5278300 -3743284 1530322 5305834 4609037
43544 4609037 2530031 3026333 5045292 4518605 399980 -4281462 -6833080 -7555739 -7599417
43535 -7599417 -6732857 -4727765 -3137241 -3460165 -4325433 -2968181 360274 1909866 -607638
43526 -607638 -4619859 -5864358 -3429707 146523 2413416 2427940 -167475 -4540469 -7427881
43517 -7427881 -5610443 -377810 2998460 1355756 -2816962 -5028674 -4077970 -2315038
43509 -2315038 -2120634 -3619260 -5025289 -4268529 -1034750 2364499 3256377 1917795 1033900
43500 1033900 1741374 2494427 2336394 2366474 2655341 882429 -3612923 -7265906 -6886398
43491 -6886398 -4560395 -4343983 -5773828 -4853607 -747619 2852213 3331626 2199555 1657891
43482 1657891 1687745 1897509 3022309 4666793 4238498 463132 -3910457 -5205776 -3345485
43473 -3345485 -1209994 -451040 -101233 966074 2097151 1779963 -469203 -3440000 -5100665
43464 -5100665 -4332428 -2144686 -842275 -1665483 -3593411 -4620701 -3651869 -990845 2212653
43455 2212653 4506536 4774568 3011453 349045 -1860061 -2844059 -2596160 -1873122 -1792150
43446 -1792150 -2647634 -3298012 -2576619 -1042423 -251589 -577469 -1135907 -1671064 -2723882
43437 -2723882 -3754598 -3141576 -802354 1105587 1242267 1091337 2446142 4493258 5330064
43428 5330064 5174439 5694541 6646108 5731924 2312009 -853560 -847039 1583230 2867181
43419 2867181 1004724 -2042781 -2741402 -134586 3173403 4217489 2994975 1845702
43411 1845702 2084573 2596807 1946758 473528 -596347 -1136746 -1977668 -3172171 -3639890
43402 -3639890 -2706032 -1158984 -385668 -821165 -1515010 -1091079 961011 3843574 6157242
43393 6157242 6918920 5912672 3488531 500566 -1817566 -2692400 -2706813 -3292646 -5043287
43384 -5043287 -6866151 -7010689 -4796962 -1447747 586301 -384374 -3318669 -4914971
43376 -4914971 -3027597 696621 2793205 2342351 1673790 2465766 3188377 1754792 -807372
43367 -807372 -1419303 673297 2541731 1219856 -2559297 -5427984 -5747581 -5477958 -6991334
43358 -6991334 -9157098 -8524726 -4508936 -1067324 -1651323 -4334680 -4577921 -1874301 -370723
43349 -370723 -2605239 -5901590 -6460830 -4423664 -2722369 -2703793 -3335808 -3828045 -4638316
43340 -4638316 -5870867 -6405490 -5068536 -1900327 1804777 4319074 4691022 3508295
43332 3508295 1977330 188977 -2580036 -5554273 -6169177 -3323817 367106 1186293
43324 1186293 -1452029 -4707407 -5775300 -4468667 -2655756 -2065056 -2554778 -2355122 -638163
43315 -638163 459753 -1773202 -5941211 -6958010 -2694468 2431680 3107156 200231
43307 200231 -1237813 372066 1623434 148926 -1984662 -2111840 -841639 -206475 -380700
43298 -380700 -306139 116804 452094 1141184 2614883 3789549 3249206 1596862 1058981
43289 1058981 2676382 5068866 6249764 5810405 4901856 4569514 4621793 4093279 2457139
43280 2457139 139183 -1947377 -2865419 -1712247 1815511 6232901 8401392 6141091
43272 6141091 815574 -3588209 -4296304 -2170933 -155996 77062 -603196 -655934 -189327
43263 -189327 -610099 -2069347 -2620537 -980920 965628 386023 -2184089 -3177148 -1044007
43254 -1044007 1598733 1989592 866276 237288 -267588 -2291238 -5472004 -7839698 -8493273
43245 -8493273 -7606215 -4948188 -1002147 1605389 950329 -617468 763873 4317689
43237 4317689 5040689 888833 -4244316 -6211890 -5753106 -5592809 -5337697 -2597624 2261278
43228 2261278 5797624 5847623 3796296 2171107 1856226 2435125 3846787 6259244 8608212
43219 8608212 8740444 5911105 2382980 1101889 1904648 1825215 -381324 -2231763 -1429178
43210 -1429178 401024 343118 -978429 -316964 2959849 5621480 4922664 1797780 -820232
43201 -820232 -1075341 614076 1860139 107782 -4121516 -6536051 -3965655 822938
43193 822938 2151719 -1189780 -4959469 -5813164 -4936611 -4703727 -5348701 -6198956 -7049956
43184 -7049956 -7000377 -4792381 -1463677 178332 -352231 -769838 -448492 -1504198 -4099481
43175 -4099481 -4778965 -1700596 2153047 3382855 2340050 631324 -1697384 -3805682
43167 -3805682 -2958672 873626 3238787 1743829 320567 2550764 4927485 2501528
43159 2501528 -2232210 -2894328 511960 2085274 -143735 -2133339 -1884745 -2449156 -5194608
43150 -5194608 -6444822 -3625794 320880 1653829 760783 -548447 -2846528 -6798491
43142 -6798491 -10003653 -9694157 -6868911 -4781602 -4423372 -3911092 -1699547 1418069 3266853
43133 3266853 2424237 -107769 -1283944 761780 3898767 4001958 -164443 -5797919
43125 -5797919 -9696717 -10881833 -9531488 -5924609 -1275189 2432447 4220807 4261114
43117 4261114 2465568 -847736 -3300726 -2561558 -185145 108901 -1568509 -991962 3260711
43108 3260711 6875097 6132847 3323305 2603155 3570427 2820704 -156358 -2621953 -3109307
43099 -3109307 -2659058 -1825154 260922 3281934 4709847 2612183 -1644049 -4444991
43091 -4444991 -3631855 -958210 -329804 -2976069 -5291348 -3230762 1867433 4628864
43083 4628864 2814534 -216821 -1091704 -822256 -1707779 -3244491 -3917684 -4322049 -5329856
43074 -5329856 -5355407 -2849779 132092 364545 -1590197 -2161452 108481 3174400 4725035
43065 4725035 4094537 1437962 -2328460 -5064950 -5213182 -3615997 -1579941 1562662
43057 1562662 6246905 9540651 8057333 3448453 1031356 2837359 5826104 7300463
43049 7300463 7894891 8117830 6243368 1928861 -1517576 -1249126 1216550 2739045 3012595
43040 3012595 3667662 4826293 5474783 6032408 7691000 9827079 10541947 9344051 7106561
43031 7106561 3939576 -374570 -4076867 -4450753 -1829026 -58796 -1638892 -4346054
43023 -4346054 -4392887 -1500018 1260788 1998102 2141850 3777142 6677789 8962231 9541156
43014 9541156 8715131 6956775 4437809 1830178 474331 1073219 2504764 2442546 -502852
43005 -502852 -4985518 -7411807 -5026175 1016318 6324923 7673746 6073776 4731584
42997 4731584 4999824 5835580 6417155 7022805 7262974 5747237 2413055 -442492 -467497
42988 -467497 2353034 5932983 7595477 5573028 924296 -2083506 -27751 4836458
42980 4836458 6690853 3891676 1146725 2345746 4989174 4616455 1408951 -1382812
42972 -1382812 -2852690 -3896896 -3331170 503591 5295293 6840228 5257714 4444168
42964 4444168 5384168 4952176 1972514 -557729 -706993 -396425 -1102708 -1209622 108623
42955 108623 638183 -555250 -673788 1769891 3439515 1608841 -492068 1473347 5460663
42946 5460663 5698980 1305459 -2959328 -3877346 -2721204 -1097192 1137233 2933923
42938 2933923 1689345 -2389117 -5305122 -4683447 -2978428 -3147526 -4116337 -3341699 -1620377
42929 -1620377 -2004723 -4862769 -7033002 -6025900 -2909702 -448155 293808 796899 3036995
42920 3036995 6898706 9632483 8236475 2621224 -3948660 -7744394 -7554139 -4936860
42912 -4936860 -2397322 -1525215 -2083140 -2523664 -1928796 -1343117 -2225744 -3802391 -3667296
42903 -3667296 -1411467 305682 -578521 -2566252 -2936526 -1583717 -481502 -411042 -640464
42894 -640464 -1256130 -3028240 -4755567 -3552038 1051844 5441651 5890189 2732037 -802960
42885 -802960 -2552302 -2679012 -2229830 -2358397 -4183845 -7358714 -9136860 -7011171 -2450718
42876 -2450718 26360 -1794760 -5073340 -5491858 -2235569 1868237 4273380 5237010
42868 5237010 6473698 8464243 9769520 8905124 6467017 4764374 5014372 5607148 4097655
42859 4097655 457619 -2960035 -4531060 -4885347 -5129219 -5191893 -4541936 -3062093 -530451
42850 -530451 3229302 6906687 8194598 6856234 5436354 5418826 4737687 1339531 -2697249
42841 -2697249 -3684349 -1729853 -100547 271707 1701264 4715492 6153971 4024071
42833 4024071 891722 -49246 280491 -1054368 -3925055 -5358800 -4101823 -2005043
42825 -2005043 -867632 -507937 -500450 -1512933 -3682189 -5244555 -4408390 -1980061 -669957
42816 -669957 -1679433 -3069722 -2134490 1253431 4600959 5866935 5298186 3883464 1669745
42807 1669745 -945382 -1699104 1128688 5092475 5330733 825847 -3696957 -3691043 -327661
42798 -327661 2007051 1753976 776654 108505 -1316803 -3418720 -3688992 -646317 3489329
42789 3489329 5259297 3965600 1883430 1313287 2594773 4461359 5316423 4508455 3115360
42780 3115360 3064943 4812986 6467013 6067161 4168782 3019795 3505172 4262087 3909040
42771 3909040 2796635 2046935 2008090 2394130 2962732 3100487 1582378 -1972973 -5807472
42762 -5807472 -7428388 -6214042 -3645244 -1253136 443632 1284945 1434142 2086953 4399853
42753 4399853 7244063 7878267 5636485 3049878 2215756 2074970 876635 -690632 -1051513
42744 -1051513 -669024 -691367 -112312 2378377 4548567 2602308 -2602381 -5167021 -1576397
42735 -1576397 4446971 6553791 3159872 -1791726 -4015475 -2932330 -1299450 -2145144
42727 -2145144 -5703557 -8989298 -9163296 -7084698 -5913303 -6497280 -6741862 -5805992 -5582731
42718 -5582731 -6621367 -5917151 -1236522 4994970 8936735 10214162 10430694 8879331
42710 8879331 3809534 -2874627 -6369970 -4998866 -2330421 -2407040 -5259923 -7992485
42702 -7992485 -8274317 -5878382 -2376845 -156874 -587031 -2589276 -3795529 -3116897 -1376672
42693 -1376672 45559 -35031 -2452814 -6493026 -9343206 -8766222 -6116737 -4666212 -5106881
42684 -5106881 -5083313 -3374743 -1876998 -2329474 -3204098 -1516085 3286637 8442232 10447693
42675 10447693 8168963 4013738 1915456 3231763 5024138 3728067 -29532 -2238018
42667 -2238018 -863289 1961883 3332087 2685107 901160 -1173869 -2182789 -625804
42659 -625804 2667043 4454603 3134461 988318 606089 1103013 355999 -714564 608766
42650 608766 3945937 5628217 3968059 1691427 1603890 2199865 -10633 -4968918 -8622443
42641 -8622443 -8291981 -6135706 -5875602 -7694895 -8603211 -7230367 -5514699 -5018715 -4328589
42632 -4328589 -2055101 -314982 -2301966 -7264012 -10859290 -10487065 -7624810 -4630710
42624 -4630710 -2001058 299990 1340168 602028 -869577 -2021713 -2981031 -3592765 -2513497
42615 -2513497 758774 4356504 6018419 5462127 3703441 1590021 348105 1628777
42607 1628777 4833144 6016010 2298239 -3476698 -5552562 -2689985 221400 -1173897
42599 -1173897 -5039466 -6126038 -2678421 1486421 1600200 -2712932 -7132252 -7237135
42591 -7237135 -3052820 1131828 1386489 -1930491 -5143049 -5446082 -3259172 -867660
42583 -867660 -39128 -1181248 -3598737 -5751623 -5964254 -3868319 -1019445 570779 414296
42574 414296 -489289 -1337284 -2107045 -2458030 -1628962 -313230 -1065114 -4999172 -9191421
42565 -9191421 -9945471 -8164732 -8185849 -10815832 -11455399 -7170532 -1875645 -904301 -3216888
42556 -3216888 -3558103 -782162 1001320 -661178 -3345318 -4189753 -3334435 -1825930 43921
42547 43921 1094037 -261273 -2549388 -2120238 1068669 2772914 1378720 715792 3177736
42538 3177736 5016422 2605867 -1064409 -1244321 930819 1368505 549677 1706260 3672561
42529 3672561 2697412 409670 2404145 8387532 11251903 7895229 3848851 3904082 4709932
42520 4709932 1465350 -3309425 -3625955 576213 3743097 2840339 50252 -1946806
42512 -1946806 -2810783 -2661085 -1317722 22880 -472919 -2211174 -2494130 -498255 1508891
42503 1508891 1609198 625616 210511 579006 1196654 1963961 2510789 1753311 -565560
42494 -565560 -2984006 -4090539 -4131140 -3745253 -2371166 428116 3076571 3671643 3208496
42485 3208496 4573030 7850499 9311011 6642955 2952353 2977136 6574827 8975289
42477 8975289 7290832 3794554 2087445 2754868 4215292 5590116 6749498 7025175
42469 7025175 5948316 4463943 3779204 3679252 3289688 2616163 2001043 1125816 58978
42460 58978 91057 1697534 2870026 1691107 -469034 -898122 133553 -1430 -1692916
42451 -1692916 -2542307 -1905821 -2547271 -6163194 -9922918 -9601002 -4597563 1921081 6725783
42442 6725783 8829387 8964606 8218929 6995825 4765362 1219055 -2392469 -4124355
42434 -4124355 -3594123 -2138032 -757739 459377 848078 -710704 -3533744 -5221853
42426 -5221853 -5114702 -5573370 -8333373 -11512651 -12188967 -10439295 -8602075 -7527837 -5929918
42417 -5929918 -3143488 -355822 1211653 1718266 1788211 1404036 445769 -406428 -242900
42408 -242900 574312 228063 -2436125 -5721283 -6252645 -3099566 437622 546462 -2535146
42399 -2535146 -5498099 -6658528 -7119600 -7513899 -6718279 -4644391 -3430794 -4314714 -5638523
42390 -5638523 -5667469 -5286201 -5940793 -6780311 -6158474 -4591141 -3776565 -3516369 -1993662
42381 -1993662 1126591 3857510 4360685 3086980 2372757 4337472 8562162 11595320
42373 11595320 10132394 5220344 1396095 700979 54244 -3532422 -7788832 -8413176
42365 -8413176 -5585490 -3331935 -3198095 -2758340 -746034 463167 -938791 -2877459
42357 -2877459 -2694381 -1469656 -2348107 -5759642 -8870715 -9460934 -8182353 -6759509 -5826506
42348 -5826506 -5377999 -5922779 -7672009 -9110707 -8121308 -5014511 -3003463 -4460050 -7600217
42339 -7600217 -8464405 -5847178 -2596878 -1915666 -3918759 -6190173 -6319248 -3515093 834623
42330 834623 3730397 3101334 261770 -1522784 -1124258 -477587 -1247830 -2839742 -4287572
42321 -4287572 -5592153 -6214240 -4933778 -2596440 -2244619 -4723909 -6899503 -6333196 -4832718
42312 -4832718 -4704653 -4462355 -1867528 1089172 378532 -4229661 -9266651 -12378148 -13418192
42303 -13418192 -11931057 -7666566 -3147310 -1798134 -3439881 -4848513 -4495449 -3573396
42295 -3573396 -2922165 -2358117 -2389315 -3032682 -1918138 2277229 5632646 3365743 -2179743
42286 -2179743 -3813608 34776 3575472 3511403 3546676 6264285 7511216 3647881 -1300619
42277 -1300619 -1565476 1459509 2394702 1035124 1850699 5654675 7990576 6200394 3100717
42268 3100717 2347428 3678065 4206416 2291970 -851739 -2307719 -297229 3298286
42260 3298286 4352434 1599997 -1395085 -1115641 1122503 1783604 588335 97113 1048096
42251 1048096 1603465 753925 -717141 -2441689 -4625313 -6051164 -4883236 -1775048
42243 -1775048 420743 420376 -336140 -537668 -610631 -1015109 -1187491 -886700 -758992 -974843
42233 -974843 -917965 -648123 -1121205 -2600079 -4267579 -5577662 -6511415 -6419620 -4251215
42224 -4251215 -245171 3920837 6734058 7362811 4989758 -450899 -6760694 -10531900
42216 -10531900 -10233586 -7147950 -3432989 -680668 90131 -847198 -1152698 1452595 5824671
42207 5824671 8174006 6871894 4565184 4486011 6265002 6800620 4454118 1154515 361401
42198 361401 3333774 7582589 9442092 8140583 6085197 4714517 2255374 -2667324
42190 -2667324 -7342966 -7838867 -4218440 332202 4505804 9096228 12757091 12274870
42182 12274870 7967633 4344444 3657704 2975427 2374 -2391599 -1004160 1820567
42174 1820567 1696006 -621644 -527077 2767525 4800949 2714297 -777650 -1974674 -1382568
42165 -1382568 -1869139 -3851086 -5124441 -4574996 -3491268 -3087833 -2753282 -1534204 51811
42156 51811 875938 1072652 1636233 2379763 1898869 41312 -1047352 610641 4313561
42147 4313561 7679440 9157590 8372818 5257358 787060 -2300512 -1931776 364836
42139 364836 1203703 -67674 -985085 -312857 110044 -1185263 -2700549 -2420380 -763123
42130 -763123 654961 1528157 2373002 2841702 2221930 775409 -597087 -1156985 -184885
42121 -184885 2424216 4711181 3935413 620285 -961863 1703939 5480503 5635664 2039142
42112 2039142 -1500021 -2725922 -2621440 -2361807 -1850032 -1312322 -1485383 -1814856 -875752
42103 -875752 1001456 1745974 605990 -977211 -2039968 -3361213 -5184956 -5837470 -4003263
42094 -4003263 -813257 1727342 3142940 3879007 3345472 499954 -3639429 -5737645
42086 -5737645 -3463022 1393374 4253417 2718613 -575353 -1156435 1719848 4449974
42078 4449974 4107041 1767606 -223234 -1820360 -3875196 -5104392 -3567773 -322893
42070 -322893 1501089 1091595 466960 454445 -750776 -4066399 -7257074 -7745485 -5910855
42061 -5910855 -4197540 -4143875 -5227730 -5655996 -3900890 -607921 1158644 -594980 -3234342
42052 -3234342 -2100191 2870567 6232883 4154510 -471523 -2196827 117759 3217085
42044 3217085 4390621 3592498 1678342 -707347 -2774604 -4085833 -5031364 -5457565 -4022657
42035 -4022657 -710890 1538455 262683 -2683525 -3658544 -2579674 -2176508 -2464816 -437177
42026 -437177 3842674 5390215 1169587 -4643575 -5849508 -2593982 -644931 -3030215
42018 -3030215 -6254035 -5669485 -1686203 1201532 140157 -3085539 -4477227 -2157842
42010 -2157842 1876894 3904158 2148650 -1763545 -4933764 -6155410 -6169794 -5591802 -4093941
42001 -4093941 -2087545 -1737040 -4725508 -9371763 -11604580 -9345735 -4809804 -1695762
41993 -1695762 -1091215 -1350716 -1284063 -1618254 -3082278 -4743565 -5188109 -4264708 -2689342
41984 -2689342 -839815 915864 1436954 -203884 -3108562 -5052630 -4605370 -2070521
41976 -2070521 1209178 3511163 3360129 1041964 -797735 213575 2937686 3927777
41968 3927777 2072147 -11485 154422 1818012 2949365 3202289 3234325 2869099 1996575
41959 1996575 1796901 2758645 2870438 568444 -1691142 -315453 3456068 4535089 1486946
41950 1486946 -1211536 -97980 2252951 2038643 383710 552581 1681874 377662
41942 377662 -2648684 -2976657 173685 2148013 -17917 -3233140 -3547035 -1784550 -856463
41933 -856463 -732368 80132 482589 -1454131 -4024672 -3533916 6728 2859200 3282165
41924 3282165 3287868 4103290 3922973 1640461 -794804 -1735555 -2360919 -3492482 -2873336
41915 -2873336 1238061 5905421 6417317 2253602 -2867108 -6049514 -7353670 -7453563 -6368543
41906 -6368543 -4794790 -4036434 -3987538 -3131595 -859723 1965947 4704367 7218715 8630480
41897 8630480 8062804 6564289 5836063 5203591 2932499 615433 2156599 7080159 9219485
41888 9219485 4925874 -1188170 -2667732 -398555 -285995 -3331056 -3942009 1106279
41880 1106279 7295237 8525043 5057633 2074850 2361727 3752201 3313600 1282070
41872 1282070 134576 1282639 3695070 5368964 5400249 4331615 2909162 1419539
41864 1419539 455318 1100630 3313894 5044124 4358072 1839542 -560597 -2342516 -4263446
41855 -4263446 -5920754 -5918188 -4387613 -2831918 -1184861 2173361 6605546 8350366 5243012
41846 5243012 10635 -3177800 -3635736 -3600849 -4391790 -5388247 -5715806 -4894274 -2724826
41837 -2724826 -225615 514676 -851242 -1711950 -29707 2614629 3847835 4391190 5929527
41828 5929527 6902140 4622493 699754 -280146 2418923 4670899 3912315 2020308 637059
41819 637059 -1525302 -4548040 -5159568 -1935814 1344770 1278867 245598 1939602 4625838
41810 4625838 4101926 1299114 999380 3536903 3686863 -1184510 -6965977 -8705139 -6562527
41801 -6562527 -3634159 -1308031 496734 1025397 -483179 -3022787 -4940406 -5692000
41793 -5692000 -5100991 -2572569 1185241 3298178 1808612 -1365118 -2565940 -791785
41785 -791785 1801312 3045125 2535364 773696 -1539404 -3418958 -4358386 -5183352 -6907231
41776 -6907231 -8955506 -9831566 -9279600 -8348029 -7515637 -6369471 -5101739 -4481804 -3953623
41767 -3953623 -1662057 2607162 6017900 5621962 1839385 -2291593 -4673402 -5531144
41759 -5531144 -5649865 -5054474 -3964215 -3576542 -4672429 -6131089 -6116170 -4539772 -3101017
41750 -3101017 -2810436 -2910638 -2794590 -3388248 -5271303 -6743846 -5844659 -3613845 -2864365
41741 -2864365 -3720804 -3167818 111733 3233038 3175800 946333 -683900 -1547826 -3123280
41732 -3123280 -4629059 -3786599 -1123428 236581 -418008 -197223 2387285 4736080 4499054
41723 4499054 3468575 4322137 5950505 5475188 3328798 2535028 3517736 3428941 1077185
41714 1077185 -877586 131139 3126639 5595656 6776627 7199770 6603095 4290759
41706 4290759 775846 -2446121 -4322266 -4601499 -3623047 -2631801 -3268330 -5581349 -7349535
41697 -7349535 -6434763 -3058175 995849 4121438 4831828 1871600 -3540036 -7093609
41689 -7093609 -5708943 -1616055 588668 137399 27992 1225318 1152433 -1185177 -2932008
41680 -2932008 -2437763 -2693839 -6401411 -10615470 -10397538 -5983833 -2102382 -1108892 -1021139
41671 -1021139 -144134 626437 786781 1574940 3007618 3017484 1220325 334592 1713826
41662 1713826 2416008 -485717 -4947580 -6428786 -3821007 120655 3150025 5135832
41654 5135832 5834489 4363551 1345112 -976844 -1394960 -622313 616927 2209228 3181108
41645 3181108 2158605 16800 -455303 1306936 2311019 469155 -1959473 -1739534
41637 -1739534 428979 1386995 818685 1605302 4745854 7235612 6347786 3564289 2334521
41628 2334521 3523536 5174836 5832974 5757179 4916601 2171632 -2366517 -5690292 -4564820
41619 -4564820 199655 3681442 1908032 -3708390 -7979943 -7781098 -5169717 -4323817
41611 -4323817 -6437784 -8745714 -8178114 -4756017 -1232533 -365848 -2793220 -6609587
41603 -6609587 -8632609 -7106485 -3779087 -2274807 -3669268 -5048099 -3837634 -2071787
41595 -2071787 -3780094 -8717106 -11876162 -9957584 -5366058 -2236536 -1242119 -791498
41587 -791498 -993717 -2794953 -4310358 -2170816 3045365 6430918 5206054 2480099
41579 2480099 2545900 4977088 6130986 4849112 3516112 3909811 4870513 4626563 3378551
41570 3378551 2693316 3587177 5907229 8708181 10653927 10668711 8668199 5391638 1531885
41561 1531885 -2518185 -6185192 -8613641 -9144777 -7677427 -4908669 -2502162 -2137094
41553 -2137094 -3447887 -3685592 -848184 3260322 4714774 2197525 -1548999 -3192205
41545 -3192205 -2061894 532230 3375357 5535918 5882431 4059229 1387612 -499616
41537 -499616 -1577929 -2872046 -4282520 -4280196 -2072344 819930 1794573 -129571 -3103632
41528 -3103632 -4134872 -2151109 837453 2118035 1573300 1599121 3548420 5559555 4927310
41519 4927310 1802434 -822937 -655693 1549090 3434302 3975268 4350052 6011511 8269041
41510 8269041 8308477 4250450 -1895454 -5461490 -4072813 -561427 219101 -2903629 -6220564
41501 -6220564 -5733267 -1693685 2057667 2482694 239670 -1613975 -1184309 287950 42507
41492 42507 -2812810 -6080353 -6971390 -5246202 -3087955 -2240261 -2413522 -2567471 -2462071
41483 -2462071 -2272368 -1657268 -219656 1579482 2842054 3274535 3075621 2196647 712252
41474 712252 -326137 298836 2094169 3054813 2302459 1317410 1602482 2274068 1525750
41465 1525750 -192984 -433987 1722567 4301891 5259432 4964122 4753397 4531704 3493330
41456 3493330 2272637 2374871 3635605 3974352 1958975 -1590302 -4692038 -5804165
41448 -5804165 -4396467 -1304673 1289977 1627023 553445 735193 3272867 6349423
41440 6349423 7698332 7017330 5231360 2826364 97052 -1994007 -2496196 -1515313 205525
41431 205525 2137409 3809462 4616569 4413928 3546934 1993563 -338195 -2223903 -1868149
41422 -1868149 252210 1400209 611111 391364 2637997 5305117 5675895 4745638 5113285
41413 5113285 6258634 5678374 3560580 2252696 1694108 -266359 -3002024 -3090907 112929
41404 112929 3251267 4358361 5006164 5622807 3650801 -1017731 -3545048 -776652 3640305
41395 3640305 4846601 3782143 3924660 4481417 2656411 245622 1326803 4439338
41387 4439338 4009473 -101622 -1473539 2561949 6078014 3590272 -1488981 -2250867
41379 -2250867 1593600 4348400 3153147 922216 578800 693614 -1761711 -6827974
41371 -6827974 -11256361 -11897669 -8730411 -4831663 -3315844 -4224026 -5038074 -4192369 -2655695
41362 -2655695 -1645412 -648841 1093493 2764216 3237938 2980285 3046681 3159583 2492194
41353 2492194 1694192 2421280 4980320 7551627 7655960 4095083 -1598957 -5295066 -3589591
41344 -3589591 1960602 5756670 4683326 1668231 878046 1784122 1079502 -1328491 -2206653
41335 -2206653 -285364 2189710 3386682 3858810 4058374 3323163 2328908 3200571 5609353
41326 5609353 5792750 1568354 -4118826 -6929361 -6417867 -5240276 -4791332 -4370175 -3758685
41317 -3758685 -3911791 -5067184 -6078786 -5830893 -4148201 -1509861 1090054 2442372
41309 2442372 2411144 2449275 3707893 5231881 5376427 4481090 4479788 5938436 7110403
41300 7110403 6350843 4235343 2607505 2168932 1556813 -1283086 -6684768 -11961563 -13066669
41291 -13066669 -8493186 -1484315 2522826 1032175 -3276951 -5591643 -3951532 -1007066
41283 -1007066 -858745 -4375133 -8166638 -8504233 -5526913 -2608342 -2195827 -3930140 -6659984
41274 -6659984 -9956851 -12761356 -12782376 -9131624 -4251506 -1393503 -1057393 -1475698 -1509825
41265 -1509825 -1120297 43056 2040270 2999842 664558 -4081537 -7454460 -7188489 -4848626
41256 -4848626 -3063565 -2335140 -1668125 -787181 -294474 -471223 -993017 -1222997 -178422
41247 -178422 2807318 6583395 8428046 6987977 4159099 2684946 2516198 1291100
41239 1291100 -1656293 -3805356 -2958367 -694465 -444241 -2625028 -3902688 -1994940
41231 -1994940 768586 497322 -2798217 -5201968 -4175781 -1310180 868756 2317017
41223 2317017 4050943 5307217 4578508 2685469 2531751 5614993 10022800 11982207
41215 11982207 9047131 2665850 -1975434 -482085 5199603 7967102 4268599 -833874
41207 -833874 -405062 4826039 8073788 6311497 3129006 1684682 543650 -1611002
41199 -1611002 -2359929 62732 2721811 2083197 -707222 -2269238 -2232517 -2217330 -1704301
41190 -1704301 724436 3294891 2769278 18176 -514515 2421508 4625924 2499078
41182 2499078 -1841155 -3627572 -1497072 1703034 2905275 1613586 -797285 -2894198
41174 -2894198 -4007642 -4113046 -3490417 -2581173 -1947714 -1874344 -1841038 -931387 947625
41165 947625 2809196 3719979 3359109 1369025 -2362506 -6183668 -7265920 -5104684 -2957102
41156 -2957102 -4077613 -7638229 -10067361 -9353052 -6288622 -2652697 -155052 12753
41148 12753 -1118515 -193131 4229981 8419720 7614036 2704257 -764353 -1160 2539793
41139 2539793 4363712 6172202 8312012 8177415 4106066 -942987 -2670396 -639206
41131 -639206 2288191 4031312 4267122 2785442 -243429 -2896039 -2809144 40906 3198085
41122 3198085 4022531 1361102 -3803294 -8154001 -8068527 -3655411 521341 563027 -2307223
41113 -2307223 -4287942 -4079600 -2679327 -85790 3703978 5426655 1266092 -6545933
41105 -6545933 -10689635 -8214650 -4627993 -5609629 -8723849 -7896740 -3385904 -1529799
41097 -1529799 -5016814 -9005893 -8493234 -4970597 -2923087 -3041229 -2582366 -611633 997519
41088 997519 1291855 1447062 1846613 1068253 -1069265 -2086028 -278384 2308674 2435327
41079 2435327 884 -2303003 -3010209 -3350742 -4620388 -5953279 -5494288 -2882217 25920
41070 25920 658884 -1947386 -6029143 -8737822 -9248460 -9348980 -10351975 -10868510 -9110991
41061 -9110991 -6085516 -4293474 -4005550 -3273468 -1353602 417869 1167470 1225190 53628
41052 53628 -3565450 -8374272 -10686184 -9144662 -6719133 -6104414 -5886145 -3804914 -1269709
41043 -1269709 -1144473 -2657358 -2386638 160318 1592254 -362404 -3938418 -6186750
41035 -6186750 -6232326 -4815085 -2822507 -1361049 -1438744 -2458391 -2528333 -1199326 -361055
41026 -361055 -1391568 -2920579 -2716832 -589183 1910012 3624745 4247878 3542432 1709848
41017 1709848 55227 -198191 479621 793913 814622 1811567 3959542 5860478 6742779
41008 6742779 7519511 8789411 9202146 7196289 3517486 545254 -462557 -134670 582771
40999 582771 1182559 925482 -811591 -3236010 -4866492 -5840221 -7418834 -8659351 -6472247
40990 -6472247 -803387 3165930 1261689 -3300087 -3922284 44388 2812818 1183496
40982 1183496 -1239783 -766597 469060 -976935 -3219667 -1824914 2708273 5252045
40974 5252045 3483213 585608 -82917 801400 1022295 474467 435909 1225355 2358614
40965 2358614 3631678 4526967 3741733 949552 -1723046 -1709552 551353 1647462 -702010
40956 -702010 -4477642 -5463268 -2494645 761796 336699 -2784831 -4000732 -1484270 1453529
40947 1453529 1378701 -598457 -1315222 -550641 -555827 -1826498 -2539763 -1833307 -748626
40938 -748626 21658 600377 202093 -2079024 -4494874 -3850958 -300585 2206283 1506158
40929 1506158 150357 1028636 3106723 3919355 3615359 3508176 2717435 -239799 -3775964
40920 -3775964 -4714822 -2907479 -1030158 -35627 1621737 3879393 4054619 1490384 -186729
40911 -186729 2009932 5750738 6660962 4552532 2937285 3142084 2746419 317587 -2045903
40902 -2045903 -2604399 -3231390 -6005561 -8782532 -7709952 -3268428 -244947 -1486131
40894 -1486131 -4759410 -6448663 -5451897 -2430833 1799109 5406530 5750726 2742056
40886 2742056 -25120 292639 2186941 2968955 3319565 5488424 8699993 10117240 9415941
40877 9415941 8618065 7998461 6208625 4289956 5084930 7917708 8295788 4543564 744218
40868 744218 872681 3503136 4931291 4472901 3698252 2953700 1881329 1535007 2799936
40859 2799936 3999165 2945701 327060 -1561106 -2369593 -3315006 -4232623 -3880518 -2658648
40850 -2658648 -2352074 -3451935 -5056273 -6880601 -8814976 -9094031 -6072310 -1884141
40842 -1884141 -1048742 -4569488 -8334767 -8659159 -6688757 -5430914 -4857831 -2910306 -224812
40833 -224812 -467730 -5150195 -10477557 -11292905 -7293051 -3247716 -2802718 -4187009 -3567414
40824 -3567414 -911851 361605 -918139 -1852074 -392342 1218772 199520 -2211770
40816 -2211770 -2949029 -1963401 -1425892 -1358764 -11062 1762757 733293 -3242581 -5900446
40807 -5900446 -4541422 -2005760 -2058984 -3421099 -1917589 2585519 5131945 2178404
40799 2178404 -3552373 -6261554 -3739898 750271 2772209 1363316 -969405 -1668328
40791 -1668328 -381204 1694414 3216877 3180315 1420429 -567909 -593084 1291027 1985308
40782 1985308 -851936 -5062884 -6171673 -3087617 568629 1179021 -962637 -3328381
40774 -3328381 -4760588 -5798326 -6678195 -6902129 -6379700 -5402399 -3571012 -323958 3090708
40765 3090708 3747150 384766 -4293971 -6373262 -5621038 -5658071 -8492964 -11031673 -9200483
40756 -9200483 -4210289 -1528836 -3462317 -5987814 -4464290 93032 2808064 1470803
40748 1470803 -1250934 -1563679 1512612 5760130 7801624 5771948 1222041 -1978957
40740 -1978957 -1674833 302136 947096 85065 -97467 1361154 3125220 3764441 3187693
40731 3187693 1944819 648932 35605 288227 495625 -116294 -983457 -1445496 -2269005
40722 -2269005 -4262390 -6204139 -6123680 -4130767 -2145237 -1409176 -2065419 -4270016 -7438303
40713 -7438303 -9222101 -7922180 -5458153 -5249658 -7505609 -9370495 -9298669 -8107428 -5981638
40704 -5981638 -2237069 1474626 1715726 -1525427 -3568983 -881131 4521417 8284029
40696 8284029 8893097 7851076 6889683 6944681 8262937 9904406 10339960 9371318 8026980
40687 8026980 6448253 4221656 2879588 4704079 8231949 8777331 5156045 2095251
40679 2095251 3470223 6752459 7413319 5620367 4511408 4183553 1972419 -2347108
40671 -2347108 -5895014 -7108705 -7298829 -7481853 -6670102 -4117942 -1105366 480154 225606
40662 225606 -598546 -383317 1157455 2559981 2596116 2420746 3923826 6022909 5520305
40653 5520305 2475587 1265833 4362334 8433981 9441187 8482480 8947554 10390961
40645 10390961 9514117 5727598 1555140 -1607858 -4182322 -5458576 -3995504 -1075977
40637 -1075977 -168390 -2343577 -5030274 -5722172 -4411991 -2077137 833333 3862024
40629 3862024 6194638 7108728 5934802 2571734 -896433 -1120447 2046506 4346909
40621 4346909 3016825 1263951 3275898 7301394 8343425 5863555 3535917 2464048
40613 2464048 338782 -2860183 -4081827 -2851904 -2439456 -4206783 -5550380 -4688260
40605 -4688260 -2966643 -1274390 1187216 3341451 2354194 -1037726 -2152454 768672
40597 768672 4058950 4919929 5097525 5865516 4808342 1060385 -1312714 652414 3722397
40588 3722397 3676557 1603417 563831 -78984 -1954916 -2846558 -226071 3017130 2234871
40579 2234871 -1401874 -2731954 -830294 310218 -1084722 -2245559 -1189732 300227
40571 300227 21193 -1898996 -4208422 -5438813 -3554444 2086273 8272460 10443292
40563 10443292 7762299 3166911 -967072 -4136504 -5518635 -4252879 -1783740 -438415
40555 -438415 176968 1940441 3881057 3171936 366081 -773152 840612 2291841 2041863
40546 2041863 2086606 3345853 3418637 1056083 -1197897 -1302330 -965641 -1930105 -2524160
40537 -2524160 -1038310 580867 -29044 -1184252 302035 3842408 6020496 5722616
40529 5722616 4920745 4986212 5362427 5629699 6039531 5922422 4008067 644356 -2179810
40520 -2179810 -3233561 -3015335 -2475104 -2159317 -2252777 -2032756 110579 4372201 7846564
40511 7846564 7249423 3113831 -820696 -2321995 -2470105 -2521131 -1605095 1179432 4328167
40502 4328167 5288494 3314812 -126894 -2894259 -3290106 -918118 2384382 3625523
40494 3625523 2097427 649645 1804525 3747420 2769819 -852187 -2851646 -1615353
40486 -1615353 -1152223 -4845869 -9114828 -7412196 466700 7395450 7765054 3438593
40478 3438593 -585167 -2711744 -4119900 -4466723 -2306821 1148047 2574545 1303629
40470 1303629 516588 2629380 5843821 6776932 4849710 2285086 619315 -864786
40462 -864786 -3016229 -4624609 -3634735 -327854 2155283 1435171 -917959 -1416425 661054
40453 661054 2797735 3405217 3619274 4044743 2843399 -866495 -4443009 -5293198 -4680824
40444 -4680824 -4824021 -4442859 -1175874 3304539 5320658 5453485 7625463 11836747 13191675
40435 13191675 9477901 4768829 3351734 4393335 5147863 5521495 6429902 6856289 5669405
40426 5669405 3889718 2631632 1387810 527192 2198727 6077847 7861968 5433609
40418 5433609 2850121 4012657 6084169 4620420 2040499 4161272 10014857 12607992
40410 12607992 9866619 7422511 8916736 10537380 8372508 5167412 5266173 7205933
40402 7205933 6330081 2116288 -1693465 -2718717 -1697205 399046 3271838 5509926
40394 5509926 5092416 2302396 81510 779763 3563672 5258493 3348723 -1365571
40386 -1365571 -4829172 -3580981 989024 3771648 2032142 -1544538 -2981202 -1864717
40378 -1864717 -200591 1297602 2923871 3513151 1556536 -1709618 -3274650 -2380273
40370 -2380273 -1026694 -483558 46564 951307 1064775 -63058 -916352 -169318 1540902
40361 1540902 2935807 3675798 3723003 2615347 462809 -1511217 -2450627 -2958927 -3918668
40352 -3918668 -5125101 -5718985 -5041016 -2723775 664624 2634405 450177 -4910785
40344 -4910785 -8326724 -6063940 -564945 2412452 717402 -2280015 -2341043 1288393
40336 1288393 6340966 10253902 11635292 10499829 8138313 6222701 5555072 5905673
40328 5905673 6702882 7135455 6186407 3896116 2158048 2606319 3977867 3560267 1215214
40319 1215214 -473334 -468962 -772740 -2301941 -2333149 1269800 5581835 5950091 2715282
40310 2715282 810226 2640598 5095416 4755518 2730388 2057996 2606021 1503270 -2137513
40301 -2137513 -5543836 -5681393 -2673824 812836 2642207 2952006 3177205 3960217 4388720
40292 4388720 3336587 1123631 -710813 -1144289 -556873 48764 -6669 -878808 -2063136
40283 -2063136 -2372906 -1060899 799977 1162000 -381934 -2075482 -2718746 -3421193 -5346838
40274 -5346838 -7008157 -5869011 -2240435 601209 693990 -10172 1485168 4886627 6787330
40265 6787330 5066186 1674165 330012 2260285 5245955 6568629 5666198 3696248
40257 3696248 1873031 1079031 1862371 3419976 3546311 1409261 -249753 2090664 7808534
40248 7808534 12331602 12606078 9997433 7101207 4412185 1662239 -92145 -17980 649137
40239 649137 588711 695756 2082958 3338191 2563999 951668 1161876 2799987 2836752
40230 2836752 489451 -1597224 -1545385 -577347 -262057 -184955 417556 1057983 1349638
40221 1349638 1933422 2801626 2597515 885950 -615404 -375445 950449 2056430 2976892
40212 2976892 4371910 6286708 8586901 10969384 11698186 8551046 2393088 -2490568
40204 -2490568 -3446117 -2626554 -3020576 -3688912 -1914845 1767803 4250506 4587219 4539475
40195 4539475 4721533 3583698 515829 -2971269 -5635371 -7498842 -8128963 -6665814
40187 -6665814 -4166260 -3129162 -3699301 -3072498 -92215 2200644 717664 -3010943
40179 -3010943 -4882567 -3838466 -2904284 -4761861 -8254234 -9796982 -7231814 -1837537
40171 -1837537 3092663 5465864 6058678 6756273 7711770 7461740 5693481 4103470 3834333
40162 3834333 3716114 2285950 291699 -312645 945279 2850228 4431115 5605357
40154 5605357 6169037 5704534 4766111 4962640 7256848 10718223 13286113 13450068 11181477
40145 11181477 7762217 4921826 3731851 3915865 4167445 3263839 1058968 -1450852
40137 -1450852 -3074756 -3529244 -3466793 -3391863 -3051712 -2242928 -1564695 -1581814 -1735330 -1126361
40127 -1126361 -73104 332807 128853 593854 2227833 3844776 4084634 2851437 1005789
40118 1005789 -357235 -226867 1441287 2931976 2270348 -86500 -1484606 -469615
40110 -469615 1546492 2546927 2173004 980178 -775819 -2442790 -2602326 -733722 1877160
40101 1877160 3856519 5102196 5675583 5084859 3767806 3445266 4602694 5348718 4203461
40092 4203461 2253157 1152356 1029960 1837139 4221840 7094073 7167452 3593519 265383
40083 265383 381673 1642504 671130 -846846 577976 3404589 3437703 1339534 1187340
40074 1187340 2413105 535568 -3632120 -3285464 3642379 10171459 10007997 5334934
40066 5334934 1191260 -1853494 -4799588 -5493947 -2388470 1117190 1523225 953151 2884139
40057 2884139 5611833 5463961 3365128 2364697 1504525 -1506056 -3927823 -1290301
40049 -1290301 4407794 6870978 5155158 4041282 4964397 4108918 530770 -1282074
40041 -1282074 813166 3010655 2587474 2357786 4665640 6582679 5196297 2856050
40033 2856050 2697293 2953858 359295 -3955870 -6458711 -6565902 -5803998 -3906610 -67063
40024 -67063 3556968 3735471 641942 -2884121 -5460174 -7488965 -8685431 -8498078 -7848679
40015 -7848679 -7323369 -4919505 916022 7056728 8377341 4337551 -707276 -3645070
40007 -3645070 -5365074 -7076843 -7780361 -6848117 -5959070 -6339314 -6173687 -3040554 2079503
39998 2079503 5213383 3796358 -518212 -3821620 -4129622 -2849067 -2036198 -1525294 -228927
39989 -228927 738759 -953846 -4538758 -5998074 -3528634 -49337 1750966 3568752
39981 3568752 7457191 10534617 8345978 2207199 -1590378 14583 3622704 5030807
39973 5030807 4285728 3646317 3625120 3102814 1548763 -523965 -2313002 -3152645 -3122160
39964 -3122160 -3385316 -4747198 -6054780 -5523364 -3345593 -1260634 -2321 722732 276193
39955 276193 -2099455 -4537418 -3699300 588762 4557126 5265699 3635914 1810482 293767
39946 293767 -765954 -112817 2549467 4907080 4839145 3714480 4662118 8172684 11472246
39937 11472246 12264932 11459610 11613907 13577812 15551431 15465595 13435304 10900513 7912361
39928 7912361 3362057 -1677929 -3635929 -1320866 1500656 1272009 -16955 1421442
39920 1421442 4108972 3278295 -756956 -2141176 1637183 6039436 6745221 5419760
39912 5419760 5207050 5085156 2598786 -1291145 -4027880 -5378608 -5965127 -4635184 -1084590
39903 -1084590 1515059 664894 -956423 468207 3426176 3624419 1491280 1516733 4487380
39894 4487380 6132445 4387130 2609183 3521679 4566425 2299204 -1857278 -3472408
39886 -3472408 -796114 3977082 7662189 8147076 4897304 -268038 -3649311 -2946062
39878 -2946062 229024 2546423 3052808 3328747 3992497 3432245 849736 -1427319 -591367
39869 -591367 2566560 4444045 3511995 2043580 2114703 2455788 1315401 60030 605030
39860 605030 986599 -2011259 -6352402 -6141783 -535071 4091122 3217854 237665 -137124
39851 -137124 488823 -1642715 -4620799 -3702445 285773 2147838 1061949 1491822 5147293
39842 5147293 8427080 8975928 8679335 8331917 5367574 -286335 -3745560 -2393134 -701779
39833 -701779 -3293698 -7267265 -6725083 -1944992 1732326 2403207 3039567 4854622 5041044
39824 5041044 2215400 -832632 -1823182 -2355265 -4053824 -4809808 -2304825 1068474 928112
39815 928112 -2276649 -3381693 -187856 2865304 1081403 -3347381 -4331144 -765957
39807 -765957 1944956 -198589 -4673797 -7416016 -9018068 -11925934 -13985553 -10239496
39799 -10239496 -1125772 6151009 6147805 1318894 -2459415 -3138703 -2405518 -1083060 1410857
39790 1410857 4010249 4214955 1817577 -413824 -696716 -575410 -1893045 -3279678 -1949384
39781 -1949384 1608582 3277470 552689 -3742609 -4816960 -1985094 929810 1041242
39773 1041242 -444199 -1166223 -827026 165148 2475785 5611396 6238070 2256712 -2951696
39764 -2951696 -4272015 -2017390 -1161741 -3660071 -6124037 -5821117 -4265202 -3131337
39756 -3131337 -1129795 2280756 3978868 1636119 -1718824 -1488134 1959039 4307017
39748 4307017 3741707 2709824 3470831 5027667 4944471 2142516 -2349918 -5919420 -5870262
39739 -5870262 -1952839 2837289 5258030 5092300 4224320 3496626 2360972 940843 255667
39730 255667 454247 646276 584738 946051 1807353 2303809 2071985 1771873 1806880 1635335
39720 1635335 957919 804637 2512849 5603059 7445270 5935948 2475799 986684
39712 986684 3195096 6265610 6549566 4243282 2138055 1151441 257131 -100806 1448026
39703 1448026 3385039 2515355 -380381 -932298 1462922 2044716 -1092891 -2905449 320334
39694 320334 3792805 1057856 -5825234 -9414091 -7712939 -5172207 -4147613 -2217553
39686 -2217553 1660499 4419043 3781014 1330114 -627623 -1642810 -1874469 -1629220 -2294194
39677 -2294194 -4329788 -4802762 -977197 4168763 4743523 75595 -4962461 -7582280
39669 -7582280 -9196833 -9607774 -5996362 348834 3143827 286406 -2151101 919794
39661 919794 6076123 7690830 6620126 7005469 8553243 8144246 6278460 5930800 6955491
39652 6955491 7192085 7467735 9906835 12517127 11244891 6941829 4655808 5816236
39644 5816236 6555111 4641072 2938604 4311368 7426306 9597121 10216602 9471940 6934935
39635 6934935 3568797 2382320 4758422 8008681 8441056 5418129 1155628 -1915622
39627 -1915622 -2608116 -1565514 -1322174 -3967900 -7988667 -9538599 -7654960 -5627243
39619 -5627243 -5900980 -6508794 -4733370 -1655238 342 615273 2616851 5490361 5625865
39610 5625865 1629192 -3240393 -5015911 -3170428 259701 3627274 6158804 6981346
39602 6981346 5671655 3384497 1963599 1924599 2228435 1866499 709775 -1087474 -3360928
39593 -3360928 -5273645 -5371719 -3079341 265654 2533595 2907853 2555236 3317529 5939523
39584 5939523 9368732 11558384 11170680 8738292 6030592 4282666 3426672 2963953 2709497
39575 2709497 2392929 1614989 938969 1919049 4838946 7385963 7236477 5326932 4557508
39566 4557508 5505375 5820691 4337710 3269727 4867228 7812631 8915955 7276750
39558 7276750 4785989 3115846 2205584 1647731 1639677 1929298 1231277 -1234583 -4232212
39549 -4232212 -5476940 -4048424 -1282029 748289 1131386 371036 -642160 -1301351 -1283942
39540 -1283942 -767557 -618541 -1444822 -2434758 -2295575 -1396462 -1251533 -1437365 597137
39531 597137 5261830 8902029 8556926 6349215 5823905 5882208 2817545 -2588534 -5243378
39522 -5243378 -3460104 -1251221 -1302818 -760131 3067615 7185224 7044483 3177170 -252943
39513 -252943 -1372161 -1332640 -735666 1093805 4110149 7473199 10406519 11245647 7912535
39504 7912535 1882998 -1150943 1824580 6241306 6242526 3305824 3150005 5963511 6362243
39495 6362243 2770583 -55916 894451 2805819 3362168 4999226 9194619 11832953
39487 11832953 9105880 4235666 3139275 5870005 7530663 6283546 5233814 6329722
39479 6329722 7055155 4600858 114856 -2972932 -2966321 -841858 1526512 2842837 2839386
39470 2839386 2330363 2710403 4828126 8143113 10977539 11699014 9941912 6798815 3749691
39461 3749691 1580127 456129 402607 1074968 1728509 2330623 3928264 6636080 8215698
39452 8215698 6732316 4119586 4494882 8606050 12446906 12248738 8674407 5002441
39444 5002441 3139469 2720278 2537641 1630939 232602 311622 3460675 7626811 8285534
39435 8285534 4111300 -837134 -2165181 -52903 2735102 5147538 7362840 8192628
39427 8192628 6626978 4945062 6631779 11278313 14716451 14516889 12495374 11202235
39419 11202235 10707573 10051836 9631438 10506425 12621413 14994634 16841030 17717882 17474561
39410 17474561 16783914 16796342 17478247 17172128 14791118 11812469 10881754 12469471 13902606
39401 13902606 12188245 7406616 2845961 1793562 4454073 8032793 9499380 8108039
39393 8108039 5625049 4493519 5486095 6770649 5676680 1830229 -2050344 -3088745
39385 -3088745 -1137618 2169130 5988514 10086740 13138569 13870445 13632080 14930754
39377 14930754 17116859 16664698 12710915 9098145 9124848 11133274 11647786 10471152 9970383
39368 9970383 11198657 13480596 16291026 18803055 19000064 16186819 13297625 13757445
39360 13757445 16889477 19293045 19888635 20460970 21870020 23139052 24105676 25588063
39352 25588063 26775459 25774299 23172391 21845520 22606532 23220604 22539033 22371393 24102356
39343 24102356 26630493 29195198 33218712 39368988 45378127 48885172 50315886 51151983
39335 51151983 51750425 52983555 57464478 66130460 75378312 80836970 83109824 86946069
39327 86946069 95336109 107134860 120169140 133889430 148567178 164186305 181072746
39320 181072746 200363411 223238130 250233846 281054259 314309660 347990582 380817463
39313 380817463 411661097 436175032 446029766 435020171 406001779 368931917 331609052
39306 331609052 295016344 258171171 223588174 195034760 172227062 151493645 131268374
39299 131268374 113712717 100387089 89260201 77746539 66749118 59223879 55378595
39292 55378595 51788693 45799926 38803793 33877859 31566725 29726611 26827925 23479635
39284 23479635 20741311 18782524 17587275 17176940 16381025 13243944 8039122 4294543
39276 4294543 4875128 8097640 9946779 9477368 9355903 11016777 12335125 11367414 9688221
39267 9688221 9659011 10240698 8584407 5049822 3291679 4841087 6724462 6055291 4360744
39258 4360744 4789684 6855053 7335977 5811556 5549969 7993188 9779623 7545369 3319044
39249 3319044 2079156 4956862 7890521 7070655 3139323 -639716 -2174702 -1367130
39241 -1367130 1148647 4443798 7172615 8351382 8201175 7610103 7005566 6218844 5139032
39232 5139032 4009450 3247715 3283310 4388268 6402988 8679161 10341233 10623969 9323258
39223 9323258 7246860 5813539 5659359 5991072 5871876 5573430 5796412 6190261 5920552
39214 5920552 5271689 5174937 5393285 4941064 4317573 5241721 7575807 8587818 6514084
39205 6514084 3263506 2129882 3958117 6916609 8983549 9125918 6898541 2783190
39197 2783190 -1127698 -2301423 -130429 3434345 5739123 5682462 4366076 3707566 4128340
39188 4128340 3893069 1687366 -496707 993118 6325695 10759110 9888243 4839313
39180 4839313 509974 -187166 1538252 2964028 2422460 -261060 -3742539 -5539139
39172 -5539139 -4178057 -1095072 961996 1199209 953470 1046154 1025892 1081601 2427217
39163 2427217 5002210 6673323 5918426 4048183 3586791 5196782 7121066 7220989 5006173
39154 5006173 1976867 135259 -188131 -712564 -2676603 -4555663 -3841626 -878840 1047346
39145 1047346 -72572 -2515461 -3492429 -2649789 -1653964 -1539922 -1943207 -2273012 -2374223
39136 -2374223 -2365046 -2657898 -3733985 -5291083 -6199689 -5844783 -4791882 -3691070 -2598316
39127 -2598316 -1973853 -2869352 -4919438 -5545324 -2860612 1667871 5262249 7426741 9097489
39118 9097489 9086292 4856925 -2519579 -7552163 -6509572 -2131515 250594 -322158 -230926
39109 -230926 2709346 6268282 7471214 6562099 5673623 5265342 4012942 1750013 601662
39100 601662 2548815 6673620 9587257 8806822 5599988 3882090 5663615 8292081
39092 8292081 7827676 4893717 4432696 8446910 12024764 9674368 3419207 57888
39084 57888 1074677 788724 -4033767 -8321778 -6301562 -685301 1235316 -1597188 -3208319
39075 -3208319 -305648 3218636 3070099 729191 4742 1212781 2093735 1839944 967079
39066 967079 -674455 -2438321 -1284411 4504334 10991120 12025359 7119725 2257844
39058 2257844 2138098 4982917 6429492 5524276 4531139 4739693 5085361 4330140 2711460
39049 2711460 1461618 1725565 3755894 6529266 8570154 9590208 10605388 12027716
39041 12027716 12732022 11747105 9695135 7519956 5006157 2019555 132644 1020173
39033 1020173 3731953 5638247 6036563 6722762 8613320 9952923 8946734 6471824
39025 6471824 4720455 4253486 3864225 2715150 1312874 713174 1680650 4123172 6511826
39016 6511826 6689637 4485332 2730043 4093751 7588926 10239088 11732383 14546247
39008 14546247 18897153 20837658 17616733 12521605 11075591 13514540 14784049 12286861
39000 12286861 9805674 11759087 16550488 18908151 17348569 15514424 16018627 16751811
38992 16751811 15044675 12468799 12425877 14587676 15371644 13764451 12971962 15018983 16940370
38983 16940370 14902136 10002108 6803609 7032184 8008105 7444640 6688903 8082380 11511727
38974 11511727 15123104 17728877 18999999 18817115 18150904 19245831 22814546 25860936
38966 25860936 24582612 19276235 14239740 12565308 13029216 12761951 10998647 8764446
38958 8764446 6256459 2625909 -1748405 -4490040 -3572939 217240 3922732 5355910
38950 5355910 4836277 4029832 3868777 4226628 5070562 6696064 8576045 9141209 7635829
38941 7635829 5594819 5343762 7018752 8039194 6062369 2006702 -579317 662132
38933 662132 4259236 6788341 7125188 7484288 9732858 12439383 13365547 13502084 15691713
38924 15691713 19537688 21102480 18595201 15103210 13928008 14291904 14200827 14666858 17480811
38915 17480811 20867313 21643437 20724703 22102904 26493338 30384998 31998426 33760686
38907 33760686 37320762 40301891 40623451 40645049 43656978 48520616 51316778 51078156 50493523
38898 50493523 51170779 51122223 47649652 40968351 34171388 30312530 29787355 30308396 29571620
38889 29571620 27769905 26695754 26717788 26307605 24612940 22323854 19477711 15074326
38881 15074326 10171893 8508071 11641803 15660887 15494911 10901079 5474085 1425985
38873 1425985 -1293337 -1967269 690586 5250224 8031936 7484347 5266834 2711163
38865 2711163 -544015 -3675240 -3937670 -574689 3263210 4536178 4133153 4670599 6314453
38856 6314453 7053864 5955853 4057610 2672406 2375085 3016249 3472689 2250564 -359107
38847 -359107 -1720495 33288 3243198 4790555 4136244 3334702 3526044 3688621 3023669
38838 3023669 2365356 2399114 2234728 940820 -739501 -1534267 -1691388 -2426947 -3641117
38829 -3641117 -3706402 -1895271 231979 777291 71012 6213 1000902 1191913 -642284
38820 -642284 -2727552 -2428863 -135438 914035 -1002706 -3644062 -3707661 -915459 2093933
38811 2093933 3116917 2177319 464008 -815674 -376418 2685084 7430543 11020891
38803 11020891 11171010 8357234 4974198 2790917 2022658 2396682 3806566 5740147
38795 5740147 7254080 8098360 8945987 9849336 9485786 7034594 3939738 2247737 1684277
38786 1684277 302591 -1942900 -2470756 265967 4350129 6949918 7655542 7663545 7128280
38777 7128280 5457282 3277266 1795900 719842 -877985 -1955001 -439367 2955387
38769 2955387 4618410 2781040 -17595 -652749 474713 923392 183244 -82896 1114003
38760 1114003 3165718 5446746 7857576 9721644 9860310 8271314 6543628 6027699
38752 6027699 6334531 6075483 4571984 2518638 1281687 1693437 3311426 4858456 5548956
38743 5548956 5811485 6521298 7817151 8933619 8879178 7063087 3776297 474075 -957610
38734 -957610 96612 2213473 3346400 2825128 1613941 903554 870838 668414 -537210
38725 -537210 -2283629 -2765951 -894925 1656140 1810148 -1003740 -3709675 -3315357 -507844
38716 -507844 1668701 1425663 -1043167 -5093648 -9501158 -11435121 -8338065 -1360022
38708 -1360022 5066223 7645916 6644923 3825988 269678 -2950425 -4231788 -3239774
38700 -3239774 -1792062 -1470747 -1583731 -897336 -76854 -611226 -2229199 -3257849 -3036007
38691 -3036007 -2305478 -1673168 -1355597 -2000709 -3866523 -5329440 -4144955 -387733 3546934
38682 3546934 5945518 6904031 6365474 3498045 -1005155 -4247980 -4295558 -2343553 -311153
38673 -311153 1828970 4362027 5414783 3301019 404460 1274289 6439601 11131454
38665 11131454 11362710 8826407 7954715 9852558 11411412 9845955 6123917 3559876
38657 3559876 4123806 6706414 8703614 8863161 8153849 7727824 6931750 4460814 947530
38648 947530 -1322286 -1406432 -671052 -301870 244162 1335908 1597386 -183095 -2953846
38639 -2953846 -4867082 -5726852 -6372423 -6833312 -6992753 -7894476 -9992703 -10962424 -8116525
38630 -8116525 -2826450 412565 -239084 -2008040 -2315569 -2616920 -5350305 -9144545 -9899776
38621 -9899776 -6141292 -1052776 1182717 -250726 -2576761 -2843827 -965707 717610
38613 717610 632145 -28773 916915 3565222 5900045 6606491 6409182 6373279 6325699 5567262
38603 5567262 4003395 1943056 -253991 -1813626 -1835120 -528630 682977 753160 -93744
38594 -93744 -1240685 -2351314 -2872138 -2054775 72417 2720970 5401576 7690571 8067478
38585 8067478 4965851 -560361 -5175899 -6961391 -6922735 -6291308 -4724518 -2259829 -532541
38576 -532541 -349758 -190721 1126843 2398747 2498109 2583478 3564468 3665731 1379483
38567 1379483 -1135689 -910532 1038336 1225098 -949554 -2764730 -2526362 -1160398 88070
38558 88070 566973 -523544 -2675414 -2754763 1229828 5840747 5959437 2398779 851622
38549 851622 2983497 4200948 1907062 231839 3206188 7966299 9077498 6209201
38541 6209201 3018424 983212 -883533 -1837199 37164 3302719 3715868 205289
38533 205289 -3113865 -2273932 1593206 4067730 2671358 -999405 -3604896 -3586004 -2399891
38524 -2399891 -2443896 -4019139 -5013889 -3572455 9124 4160140 7280862 7813737 5185357
38515 5185357 1612737 651045 2369105 2323598 -2384937 -8170162 -9079569 -4426909 929164
38506 929164 3100131 2629837 1698073 1229638 1409070 2366627 3393781 3348709 2419323
38497 2419323 1922907 2282147 2922939 3946460 5726170 6998739 5977023 3672910 3408566
38488 3408566 6233615 9297991 9727284 7750446 4946264 1895461 -910097 -2101001
38480 -2101001 -1263753 -11650 461780 1170995 2925454 3995819 2544294 12695 -586158
38471 -586158 843158 1182573 -1693836 -6356924 -9668278 -9773531 -7206024 -4191673 -2788381
38462 -2788381 -2771335 -1761502 1599359 5425969 6919379 6010212 4772099 3948355 2605772
38453 2605772 1140845 1687097 4549307 6792033 6040639 3683196 2286929 1530767 -584657
38444 -584657 -3352295 -3419123 191331 3876408 3865921 915848 -1469581 -2192951 -3193506
38435 -3193506 -5102774 -5352108 -2140960 1905951 2580743 -254778 -2460041 -1177395
38427 -1177395 1853925 3463558 3315377 3196806 3570056 3319721 2588523 3405291 6706478
38418 6706478 10417591 11670916 9934196 6761654 3115177 -1590085 -7631985 -13341421
38410 -13341421 -16091541 -14639716 -10065456 -4644336 -324626 1802133 1435393 -731019
38402 -731019 -2942421 -3408344 -1851692 314193 1671788 2302561 3194796 4526906 5303174
38393 5303174 4776048 3527031 2630380 2065292 656067 -2152255 -4944557 -5538784 -3730527
38384 -3730527 -2028755 -2761014 -4882162 -5123601 -2616282 -635311 -2328773 -5970237
38376 -5970237 -6780953 -3311791 497739 514820 -2581926 -5254658 -6295860 -7385229 -9109521
38367 -9109521 -9428979 -6841820 -2744138 626871 2802703 4169388 4061093 1771024
38359 1771024 -1531089 -3992307 -5560768 -7078762 -7393774 -4299433 1071400 3761674
38351 3761674 752907 -4763270 -7034447 -4432216 -398858 1308038 -66965 -3228549
38343 -3228549 -6380309 -7326594 -4467516 891938 4708463 4191327 899150 -1299462
38335 -1299462 -748873 684257 433767 -1992214 -5300358 -8349401 -10906853 -12806814
38327 -12806814 -13351787 -12111697 -9923924 -8302198 -7753581 -7437272 -6797155 -6597979 -7538126
38318 -7538126 -8667082 -8503557 -7330121 -6803826 -7184778 -6642519 -4103426 -1369933 -1000935
38309 -1000935 -2793676 -3981164 -3025279 -1769173 -2881243 -5941819 -7578738 -5783835
38301 -5783835 -2599601 -1159887 -1139725 377728 3459003 3922060 -725126 -6507278 -7364602
38292 -7364602 -3088196 631731 -157430 -3538325 -5814252 -6218092 -5921425 -5209166 -3878799
38283 -3878799 -2627077 -2110473 -2030532 -2553040 -4866232 -8746533 -11454127 -10964919 -8634626
38274 -8634626 -6791091 -5526753 -3944480 -2480506 -1370414 1079107 5414141 8123799
38266 8123799 5799966 941392 -789834 1540083 3664022 3394813 3122026 4052232 3397226
38257 3397226 -186826 -3023806 -1722021 1515586 2532005 1290889 477796 316147
38249 316147 -1069776 -3450443 -4630577 -4276140 -4218833 -5152827 -5891281 -5677476 -4679857
38240 -4679857 -2665180 170175 1629780 -224083 -3530780 -4431889 -2319469 -68230
38232 -68230 1027546 2830312 6061400 8240305 7718187 6518236 6830698 7354776 5791530
38223 5791530 2870944 988068 277943 -988030 -2871429 -3422412 -1687522 1226783
38215 1226783 4029534 6116774 6615721 4747605 1551910 -686066 -1381825 -2333620 -4674255
38206 -4674255 -6805793 -6664745 -4840843 -3843812 -4802802 -6411362 -7097742 -6855544 -6497420
38197 -6497420 -6188690 -5511499 -4322240 -2683573 -412905 2240450 3745257 2610513
38189 2610513 -94937 -1204919 416715 1719767 -525873 -4471686 -4775598 199691
38181 199691 5651487 6394873 3319496 1231386 1719931 1590007 -1498330 -5216124 -6115449
38172 -6115449 -4638874 -3978943 -5036757 -5442008 -3766461 -1929299 -2048274 -3059977 -2667464
38163 -2667464 -1293729 -1343602 -2947249 -3472554 -1920928 -910022 -2675162 -5481678 -6215989
38154 -6215989 -4718550 -3000240 -1565289 485792 2375000 1793676 -1671292 -5722068
38146 -5722068 -8149480 -8320582 -6172980 -2415827 373183 -22970 -1759183 -647052
38138 -647052 3826528 7632427 8207585 7406373 6924773 5131849 1244822 -1342245 246064
38129 246064 3364448 3636069 1389287 188248 962099 1924910 2699421 4001988 4462035
38120 4462035 2369321 -364293 -720018 -186745 -2617171 -6896360 -7616570 -3641722 -45585
38111 -45585 -68613 -1056282 -668043 -1161088 -3940416 -5216753 -1806092 2899663 3902601
38102 3902601 2434362 3436561 7252030 9340519 7566796 4720780 3382765 2491708
38094 2491708 269851 -2373502 -2906898 -360783 3195848 3982586 119036 -5416477
38086 -5416477 -7114028 -3517807 590976 511518 -2250314 -3011644 -866071 1241271 2063081
38077 2063081 3294062 5338373 5988133 4412232 3262678 5176713 9092415 11336337
38069 11336337 9450953 4634180 1073200 2150645 6225588 7602883 3509466 -1717676
38061 -1717676 -2225649 1324931 3303811 1723817 446513 2240672 4467836 3779596
38053 3779596 1323529 423622 1591503 2714804 2739838 2637640 3328181 4476164 5174415
38044 5174415 4828065 3628982 2667174 3127125 5003801 6859115 6802114 3741295 -1300782
38035 -1300782 -4727504 -3059671 2605800 6808234 6249129 3832049 3683522 4953582
38027 4953582 4539452 3466574 5121246 8479206 9209709 7301525 7151385 9274139 8649072
38018 8649072 3369378 -1582364 -2278508 -1450306 -2288046 -2505925 421826 3223707 1981598
38009 1981598 -575845 738308 4760689 5657301 1846047 -2628599 -4800124 -5442757
38001 -5442757 -5305177 -3626257 -809306 1266383 1876635 1591966 560670 -605240 21532
37992 21532 2311687 2267317 -2023622 -5238369 -1476896 5876361 8009234 3744974 968534
37983 968534 3988493 7402454 5545046 950244 -1109641 -836844 -1326011 -1921331 150928
37974 150928 3931580 5759271 5032895 4564130 5588174 6042492 3982204 45501 -3817060
37965 -3817060 -6290565 -7140691 -6696820 -4869073 -705726 5876559 11985544 13653249
37957 13653249 10608461 6820509 5254417 4694838 3226186 1866948 2236598 3085111
37949 3085111 2272647 587090 439706 1730633 2020043 421958 -1315151 -1596964 -685623
37940 -685623 498727 1480728 1866174 1180293 -592035 -2811762 -4328371 -3804670 -1050520
37931 -1050520 1734026 1838583 -160177 -667908 1693624 3659807 2080212 -1397350
37923 -1397350 -3114061 -2733154 -2502295 -2838409 -2392543 -1508303 -1606022 -1471822 1618273
37914 1618273 6563194 8364084 4829184 -216878 -2348958 -1987119 -1968797 -2472856 -1751873
37905 -1751873 -343737 -838229 -3513175 -5335874 -4247623 -2172536 -2244171 -4357350 -5258928
37896 -5258928 -2837963 1110716 2905765 988744 -2676666 -4736428 -3334797 702145
37888 702145 4584934 5525387 3112460 96101 -197198 2197308 3477604 469004 -5287013
37879 -5287013 -8853053 -6979376 -1114522 4266279 5524781 2381489 -2421207 -5685837
37871 -5685837 -6260021 -5110831 -3425473 -1706927 -809017 -2226823 -6183005 -10402618
37863 -10402618 -12111996 -10794863 -8043877 -5397970 -3479078 -2604783 -2778683 -3204782
37855 -3204782 -2957743 -2064683 -1051795 244796 2328869 4695447 5978111 5608307 4560142
37846 4560142 4250669 5019845 5572953 3892514 -541284 -5157209 -6059591 -2172926 3365641
37837 3365641 6702057 6893426 5147994 2291363 -1057176 -3198206 -2845607 -1395214
37829 -1395214 -1343507 -2693185 -3218434 -2167746 -1207594 -1391130 -1679090 -1244534 -972510
37820 -972510 -1496678 -1645636 -279160 1715217 2668170 2390105 1954052 1946748 1973093 1330277
37810 1330277 -628395 -4154636 -8255441 -10657852 -9519805 -5173934 98499 3764763
37802 3764763 4499640 2728069 249700 -1034021 -463652 1207482 2664278 2735214 889374
37793 889374 -1991437 -3679260 -2659955 -124623 1243948 512890 -707016 -800092 17367
37784 17367 847521 1507304 1772965 551327 -2685042 -6242664 -7478280 -5741398 -2924987
37775 -2924987 -852753 807978 3209939 5557996 5205046 1178887 -3533009 -4837130
37767 -4837130 -2473946 -324424 -1318293 -3890072 -4671137 -3005253 -914231 263862
37759 263862 960900 1613941 2024162 2484500 3608970 4821608 4755483 3484513 2746988
37750 2746988 3484331 4570917 4525372 3335823 2140504 2022279 3323095 5291123 6455437
37741 6455437 6205457 5571923 5377165 4514673 1908487 -605412 31658 3568214 6286705
37732 6286705 5860865 3756262 1988542 273091 -2004409 -3377016 -2167104 573030
37724 573030 2146236 1659975 768201 1217304 2798202 3740872 2687438 410845 -622027
37715 -622027 874048 2937931 2459767 -888406 -4395331 -5807059 -5159421 -3185931 -353521
37706 -353521 1958606 1825960 -501404 -2281703 -1856697 -680083 -681545 -1559643 -1980155
37697 -1980155 -1630940 -738664 735489 2110761 1909038 51716 -1535144 -1619737 -1063944
37688 -1063944 -505117 870904 2681340 2204858 -1690582 -5716379 -6037562 -3302879 -1066686
37679 -1066686 -636906 -418526 567649 1402356 1171857 -110531 -2194760 -4455179 -5671729
37670 -5671729 -5544470 -5532433 -6603134 -7334799 -6025387 -3377678 -1152243 425257 1746404
37661 1746404 1828796 -152524 -2523459 -2997757 -2043123 -1862448 -2894934 -3783212 -3862288
37652 -3862288 -3194586 -1274491 1512579 2288578 -1215253 -6608778 -9056809 -7157994
37644 -7157994 -3744876 -1436144 -505178 -665772 -1637887 -2023778 -644077 1157444 1326817
37635 1326817 576284 922799 1672295 686101 -1046280 -510828 1846581 2450688 722864
37626 722864 -56557 1163819 1474147 -14776 239390 3872647 6555595 3898540 -2088991
37617 -2088991 -6010676 -5817942 -3337632 -611468 1071615 612846 -1361635 -2124307 -523609
37608 -523609 950846 228147 -629320 1152193 4079422 4443444 1916555 -527480 -1461792
37599 -1461792 -2262563 -3707372 -4506852 -3728852 -2305452 -1419606 -945205 -44250 1545582
37590 1545582 3007865 2991392 1213550 -396295 580400 3884604 6750593 7605631 7505252
37581 7505252 7319126 6205850 4169529 3297964 4481999 5433424 4221983 2462151 2568134
37572 2568134 4063275 5201699 6075201 7281794 7635897 6369339 5656920 7443857 9431718
37563 9431718 8082528 4421752 2756861 4161780 5295815 3857712 1512125 671741
37555 671741 1393256 2385663 2857827 2727318 2673331 3983877 6713414 8501863 7135119
37546 7135119 3640052 882808 32568 536223 2218328 4625078 5589564 3716360 1241988
37537 1241988 954954 1393504 -736461 -4092974 -3520137 2270046 8467623 10656834 9318967
37528 9318967 6635888 3124351 -551427 -2214906 -1151067 292950 61312 -1159177
37520 -1159177 -2269664 -3546733 -4450656 -2919199 881136 3115767 1310952 -1699034
37512 -1699034 -1765816 651656 1615952 -510974 -3230535 -3370937 -503551 2722354 2746117
37503 2746117 -1400714 -6237156 -7168694 -4104256 -1281986 -859581 -138029 3051289 5859284
37494 5859284 4502743 169137 -2692887 -2189824 177564 2877906 5136126 5554750
37486 5554750 3385257 519627 -758450 -1215168 -2876001 -4784332 -4166611 -1461925
37478 -1461925 -349466 -2255036 -4314044 -3878064 -2012300 -966702 -612018 661049
37470 661049 2949140 4487317 3700949 651234 -3076558 -5418964 -5314984 -3547209 -1881365
37461 -1881365 -1491629 -2443949 -3961532 -4491407 -2493089 1588109 4920974 5304430 3947792
37452 3947792 3731319 5331986 6814273 6581468 4799256 2117057 -937132 -3034613
37444 -3034613 -2463596 674159 3773826 3941023 600013 -3927977 -6114565 -4319885
37436 -4319885 -875073 106469 -2090412 -3506128 -913490 3653033 6307869 7131760
37428 7131760 8813316 10843630 9794564 5449128 1885764 1189526 428264 -3001553
37420 -3001553 -6839400 -7618894 -5922270 -4846361 -5243136 -5434665 -4284002 -2074401 451944
37411 451944 1929915 891426 -1405827 -722530 4697162 10283959 10408804 6188989 3822398
37402 3822398 5654920 7655069 6464115 4016254 2901756 1627697 -1625806 -3733776
37394 -3733776 -203258 7101500 10931205 8046290 3201641 1903715 3154133 2690403
37386 2690403 526957 584457 3661424 5662488 4014352 1793270 2976733 6498788
37378 6498788 8184144 6791195 4729174 3606406 2507212 828858 -236350 137671
37370 137671 1182461 2358713 4264674 6714068 7860829 6431970 3266920 -264159
37362 -264159 -3597507 -5800979 -5274261 -2275732 179837 -5530 -995995 146432 3052698
37353 3052698 5061339 5564565 6297364 7634564 7794453 6277859 5194559 5889355 6570100
37344 6570100 4979243 1720262 -942752 -2418215 -3886797 -5621511 -6284745 -5170624
37336 -5170624 -3482428 -2554847 -1926156 -350013 1773191 2344933 290687 -2690141 -3947120
37327 -3947120 -2908828 -1229226 -70906 1423017 4341567 7694086 9045162 7360046
37319 7360046 4428621 3131837 4420120 6179699 5431165 1911873 -1097974 -404751
37311 -404751 3050675 5182070 3816875 1051428 -13241 917651 1936784 1740104 276673
37302 276673 -2073137 -4190397 -4223803 -1899937 128032 -534211 -2298693 -1639049 1678038
37293 1678038 4406293 4801478 4378666 4027502 2147109 -1392381 -2816203 889924 7114146
37284 7114146 10833737 11230991 11409234 12241006 10736820 5416553 -385646 -2706104 -2025248
37275 -2025248 -1787120 -3402665 -5269346 -6086309 -6566177 -7428289 -7651608 -5849877 -2412869
37266 -2412869 790389 2461210 2782058 2424127 1525867 31523 -1553967 -2547130 -3204928
37257 -3204928 -4589683 -6684624 -7206082 -3499403 4036315 11319741 14203720 12401761
37249 12401761 9163185 7438659 7456664 8151022 9501885 12143563 15185004 16187087
37241 16187087 14207729 11993061 13729245 20373581 28250960 33081355 34791076 37107276
37233 37107276 42392232 48384731 50993135 49125891 45075138 40691444 35482246 29070040
37225 29070040 23293058 20082858 18475661 15727311 10999446 6279041 3808183 4052508
37217 4052508 6013561 8026014 8389898 6842992 5307484 5419022 5567523 2825123 -2006115
37208 -2006115 -4306434 -1789881 2148174 3168014 1506167 283495 499568 720032
37200 720032 166719 -1025849 -3434686 -6991648 -9021687 -7196901 -3811838 -3330372 -5978087
37191 -5978087 -7832076 -7242403 -6465294 -6203994 -3824643 892888 3351082 830469 -2795526
37182 -2795526 -3007788 -1313730 -1252463 -1418569 1467875 5068065 4113297 -171872 -725874
37173 -725874 4213150 7736204 4784427 -339102 -1267216 834632 549590 -2443187 -3631890
37164 -3631890 -1801640 -717047 -2365138 -3979915 -3483470 -3364697 -6283119 -9931564
37156 -9931564 -9758221 -5392559 -1215270 -782980 -3191991 -5362637 -5878237 -5446762 -4761848
37147 -4761848 -3403057 -892973 1985237 3417915 2158498 -1102522 -4050148 -4676888
37139 -4676888 -2990310 -617106 1191696 2585672 4029791 5180740 5712464 6450644
37131 6450644 8172618 9562054 8240710 4222377 418051 -1190524 -1887922 -3266217
37123 -3266217 -4042127 -2409344 -121910 -816485 -4425036 -6590650 -4453350 -189855
37115 -189855 2456682 2718160 2301823 2446129 3317673 4746990 5802788 5048195 2920358
37106 2920358 2319658 4764039 7339828 5994230 963640 -3781060 -6031031 -7293948
37098 -7293948 -8968918 -9640107 -7724730 -4682334 -3434314 -4441206 -5288160 -4228443
37090 -4228443 -2616309 -2908790 -4947932 -5709674 -3298495 149902 1187553 -107950
37082 -107950 -536440 830923 788916 -2902405 -7420958 -8547754 -6306198 -3839979 -2356418
37073 -2356418 -845868 263924 -633881 -2558133 -2561523 -613193 112068 -1358549 -2217809
37064 -2217809 -1015536 -56298 -635953 -305469 2122706 3100071 -31550 -3588592 -2758534
37055 -2758534 503104 607969 -2266630 -2365888 2074721 5847873 4927676 1896412 515550
37046 515550 -247344 -3045710 -6632572 -7728600 -6251559 -4809035 -4288380 -3440110 -2094645
37037 -2094645 -1650953 -2625689 -4213748 -5874682 -7049079 -6062044 -2175840 1676240 1496397
37028 1496397 -2050695 -3705953 -447425 4687798 7216116 6980807 6977802 8343995 9333750
37019 9333750 8475566 6220287 3614353 1431194 691988 2086751 4375360 4943057 2685778
37010 2685778 -742978 -3111059 -3951993 -4065286 -3721355 -2451876 -180071 2393627 4477157
37001 4477157 5657030 5718907 4530056 2336623 46583 -1026318 -67684 2355040 4643076
36992 4643076 5796027 6282285 6701030 6282867 4077798 1291920 473618 1865457 2555781
36983 2555781 533138 -2087730 -1726601 1896039 5716087 7430760 7534428 7462848 7788493
36974 7788493 8417914 8683241 7036298 2697099 -1989106 -3185374 -591558 1424040
36966 1424040 -601038 -4448674 -5304538 -2351652 380132 -515389 -3908450 -6196065
36958 -6196065 -5552022 -3331215 -2209700 -3500744 -5873092 -6771864 -5591967 -4792543 -6688274
36949 -6688274 -9757082 -10100014 -6734545 -3293722 -3348022 -5709158 -6158237 -3060425 608665
36940 608665 964926 -2401048 -6265337 -7222022 -4723677 -1052027 1148541 1117369 -77629
36931 -77629 -1363039 -2750279 -4459475 -5850660 -6213878 -6256999 -7453185 -9582931 -10273488
36922 -10273488 -7972346 -4318589 -2063051 -1348976 -136863 1772133 1837596 -869675
36914 -869675 -2889367 -485976 4740898 7177957 3826188 -2856280 -8559270 -10842379
36906 -10842379 -9106394 -4196666 566009 950066 -3278443 -7157134 -6645628 -3988817
36898 -3988817 -4054763 -6977816 -8337602 -6252132 -4053142 -4637745 -5731946 -3393025 1863045
36889 1863045 5441215 4582431 1293933 -1029430 -1779023 -2564221 -3736620 -3633945 -1569678
36880 -1569678 318464 -351145 -2847879 -4393319 -4028619 -3236985 -2834296 -1931902 -634724
36871 -634724 -791293 -2446714 -2439420 862137 3771804 1580604 -4752180 -9554682 -9253566
36862 -9253566 -5067553 274916 4937159 7438855 7426284 7145617 8680578 9749486 6381463
36853 6381463 171902 -2140556 1807221 5800667 3624758 -2236194 -4759217 -2357904
36845 -2357904 208751 -369067 -1947836 -1012110 2689180 6375995 6956806 3276153 -2509961
36836 -2509961 -5850632 -3901063 1284789 5102455 5510772 4169848 3108010 2494650
36828 2494650 1786286 1004294 229117 -818886 -2143879 -3280900 -3950313 -4247927 -4243209
36819 -4243209 -3910056 -3140774 -1504391 1172397 3560501 3557404 1201149 -678924 -110875
36810 -110875 1242117 712422 -1422316 -2787989 -2485648 -1357729 326659 2656331 4102067
36801 4102067 2788519 -114479 -1072991 1125182 3747238 3920827 1878356 -587258
36793 -587258 -2937473 -5630425 -8115254 -8604498 -6008721 -1720188 946816 -116657
36785 -116657 -3141627 -4221119 -2121379 526023 1616893 2384838 3932865 4189134 1834967
36776 1834967 518790 4256198 10174788 11380400 6760329 2285259 1859861 2627463
36768 2627463 1266880 -503510 105645 1816351 1773058 45256 -1677819 -3266736 -4957280
36759 -4957280 -5329073 -3384721 -590788 1599614 3912826 6571419 7262585 4697074
36751 4697074 1500496 426574 405163 -283082 67144 3266089 6566360 6221191 3527935
36742 3527935 2031245 607234 -4423981 -11193718 -13237113 -9337449 -5836538 -7065993
36734 -7065993 -9397707 -7836598 -3394042 -71807 1413369 2623408 3059817 1213672
36726 1213672 -1688360 -2811309 -1797608 -815359 -1207065 -2465532 -3797741 -4574458 -3974718
36717 -3974718 -2116526 -761327 -1125825 -1890650 -1138407 697274 1632019 912828 -848337
36708 -848337 -3309711 -6123962 -7896019 -7566342 -6176085 -5192412 -3841875 -501288 3761951
36699 3761951 5674696 3864718 206721 -3038764 -5157563 -5824489 -4440955 -1486408
36691 -1486408 1220320 2281696 1427799 -1364933 -5366281 -7792835 -5902364 -1191912
36683 -1191912 1314499 -664170 -3721584 -3747229 -1181444 996169 2036883 3088300
36675 3088300 3835151 2956476 1156107 519429 1125745 1131471 -47162 -1458303 -3190092
36666 -3190092 -6021638 -8511103 -7984996 -5049294 -3557241 -5017004 -6650967 -6535587
36658 -6535587 -6773965 -9049756 -10656069 -8433387 -3931887 -991609 -436032 -920601 -2781602
36649 -2781602 -6465481 -8786350 -6050091 -440279 1946087 -308750 -2539185 -1993546
36641 -1993546 -1582150 -3466696 -4321231 -763461 4472681 6070422 3290995 -219702
36633 -219702 -1815487 -1495593 214505 2601396 4101577 4139642 4334903 5356229 4621046
36624 4621046 402193 -3878284 -3667005 -130768 1643896 404230 -439449 361802 -152576
36615 -152576 -3080178 -4830382 -2876754 90647 834870 632143 2087469 4012218 3703638
36606 3703638 2298736 3347468 6768365 8358546 5604570 606971 -3396285 -5388400
36598 -5388400 -5444479 -3146023 848945 3513351 2195380 -1840043 -4539442 -3800408 -1530215
36589 -1530215 -557468 -973287 -704060 1201148 3493278 4759355 4839793 3859375 1669880
36580 1669880 -690976 -743807 2321641 5390811 4563143 146109 -3737060 -4578755 -4291312
36571 -4291312 -5961491 -9646909 -12369174 -11175279 -5667698 1526202 6621744 8046518
36563 8046518 7781544 8206646 8536166 6613236 3377439 2122730 3270387 3863942 3206015
36554 3206015 4466050 8304567 9438506 3789074 -4210493 -6625372 -2634083 1133141
36546 1133141 339070 -2230884 -2325592 51051 2421281 3597658 3411905 1478582 -1546709
36537 -1546709 -3562837 -3696126 -3429697 -3554976 -2382271 996998 4081787 4346327 3345207
36528 3345207 4231079 6487111 6740545 4357319 2509599 3220579 4806231 5389899 5782603
36519 5782603 7015630 7718416 6454089 4714947 4807592 5991508 5549513 2993285 367330
36510 367330 -1306585 -2900350 -4387322 -4461739 -3883914 -5897382 -11293966 -15770965 -14944707
36501 -14944707 -10170848 -6483945 -6047773 -6817578 -7030262 -7509132 -8975317 -10005987 -8929745
36492 -8929745 -5883788 -2067754 1437033 3436663 2995821 1011271 -54529 1011537
36484 1011537 2781545 3253357 1991317 -390169 -3295106 -5748145 -6356728 -4833130
36476 -4833130 -2564377 -863597 265503 1039449 1061369 459111 345029 1030152 1196251
36467 1196251 73691 -930755 -223344 1478983 2128107 1066280 -415595 -608440 1237570
36458 1237570 4135725 5517571 3601644 119952 -1151250 796546 3132493 3682323
36450 3682323 3447709 3133468 805002 -4056476 -7389779 -5428784 -489880 2265877
36442 2265877 2012417 1701833 1845123 128633 -3125875 -4447999 -2889529 -1479644 -1927300
36433 -1927300 -2323446 -1518811 -1408714 -2890533 -3540952 -1653984 922303 2334384 3702387
36424 3702387 5952825 6933547 4740842 1223341 -841010 -1549967 -1853970 -443885 3580503
36415 3580503 7089205 6243266 2300920 88962 1292962 3101608 3296405 2819447 2766865
36406 2766865 2342709 1050567 276849 1232452 3003770 3724536 2555220 19548 -2563548
36397 -2563548 -3857873 -3739324 -3494869 -3754876 -3103789 -447267 2236949 2027258 -522344
36388 -522344 -1936624 -940043 -125205 -1767442 -4693468 -6553781 -6845925 -6138066 -4295834
36379 -4295834 -1302983 1571101 3099610 3542288 3487005 2558380 784401 -72257 1461284
36370 1461284 4003059 4823312 3577272 2553960 3205859 4482966 5219227 6228394 8525121
36361 8525121 10624554 9677945 5411232 1168102 21905 1080359 1325590 466205 1421190
36352 1421190 5245001 8198838 6238195 846683 -2682893 -2272970 -967936 -1357171
36344 -1357171 -1810279 -292314 1202106 -640496 -5055794 -8160118 -8674167 -9032306 -10473769
36335 -10473769 -10686026 -7860550 -4056113 -2145973 -1606300 -194631 1611470 1217122
36327 1217122 -1359140 -2823713 -1670606 -983977 -4186027 -9908323 -13475500 -12535367
36319 -12535367 -8987392 -5825132 -4332193 -4371151 -5080104 -4612742 -1326220 3501204 5802507
36310 5802507 3195099 -1770064 -4465003 -3488151 -1375836 -564042 -710932 -260566 1180309
36301 1180309 2877276 4178142 4766732 4403213 3140903 1387524 -636528 -2971533
36293 -2971533 -5159331 -6176072 -5700480 -4793254 -4536542 -4414173 -2911751 364838 3936650
36284 3936650 5983311 6093168 5210909 4213617 3023811 1189350 -1085520 -2983934 -4077280
36275 -4077280 -4585679 -4350617 -2474440 986145 3618876 2685840 -1190314 -4073079 -3366523
36266 -3366523 -969867 -381208 -1894850 -2802739 -1856892 -937945 -1614206 -2357150 -894937
36257 -894937 2056659 3510734 2232376 115188 -687539 -333769 -231622 -715971 -1090383
36248 -1090383 -1405193 -2663746 -4853363 -5876659 -3602910 1149175 4850969 5142538
36240 5142538 3612740 3478176 4976862 5019112 1923821 -1607022 -1900659 794035 3034636
36231 3034636 2884247 1318194 -621976 -3010174 -4915907 -4251687 -1152172 1173538
36223 1173538 767379 -355146 61393 562987 -1265461 -4131621 -4770731 -3164998 -2147655
36214 -2147655 -2286179 -1262248 1254024 2152657 -322661 -3707610 -5050015 -4774562 -4920968
36205 -4920968 -5830231 -6528927 -6509237 -5324323 -2154810 2465812 6048582 6857638 5742415
36196 5742415 4034281 1615408 -1332531 -2832984 -1536039 1042961 2671755 3059454
36188 3059454 2562473 548916 -2503804 -3687348 -1613518 404965 -1222184 -4556322
36180 -4556322 -4950972 -2366582 -1114546 -2785923 -4401740 -3983372 -3047647 -2420728 -338106
36171 -338106 3357226 5486701 4532867 3498020 4824732 5968474 3623302 -465312
36163 -465312 -2043703 -930076 -835530 -3283819 -5559308 -4979283 -2172335 530720 1683380
36154 1683380 1074652 -683435 -2267002 -2602582 -2064619 -1709988 -1395781 70329 2833077
36145 2833077 5306707 5929556 4753532 3133068 2562963 3799911 6278082 8231284
36137 8231284 8064242 5845480 3109170 1143338 -289543 -2548879 -6403680 -10485262
36129 -10485262 -11832370 -8900404 -3883111 -724259 -646447 -1238248 -467575 414347 -667302
36120 -667302 -3034991 -4251990 -3676818 -2765735 -2170102 -721719 2285483 5398072 6336039
36111 6336039 4325114 803490 -1806241 -2167938 -1212037 -798127 -1038045 -197541 2025411
36102 2025411 2911047 300901 -3516076 -4108176 -690650 3073712 4280160 3982406 4080430
36093 4080430 3619005 552982 -4063975 -6321875 -4201951 -283517 1345415 38001
36085 38001 -951157 793814 2997150 1211478 -4982561 -10406694 -10174122 -5608683 -2273619
36076 -2273619 -2955973 -5139762 -5503715 -4175460 -3192164 -2842542 -1753964 231236 1446928
36067 1446928 863024 -359841 -346510 1367643 3689342 5202087 4950554 2671579 -758936
36058 -758936 -3321118 -3434067 -1909071 -1435107 -3543239 -6837256 -8895800 -9033656 -8158894
36049 -8158894 -6852910 -5226329 -4077684 -4186847 -4619203 -3880019 -2806467 -3758988 -6378819
36040 -6378819 -7030358 -3819845 607477 3151720 4295600 5420280 4909212 899790
36032 899790 -3821177 -4295161 -445124 2634786 1818816 -702718 -2092693 -2692747 -3322874
36023 -3322874 -2618805 -284 1559000 -827807 -5235130 -7131346 -5363742 -2837847
36015 -2837847 -1661572 -812328 829129 1984643 1152836 -414763 73041 3113394 5882227
36006 5882227 5512442 2405260 -642652 -2047839 -2669695 -3238430 -2567404 24756 1993817
35997 1993817 53285 -4748349 -7255248 -4494832 451737 2264695 -567233 -4962063
35989 -4962063 -7157965 -5877070 -2615478 -308847 -1012377 -3624856 -4569307 -1843554
35981 -1843554 2390298 4389724 3108921 598973 -930946 -812487 663990 2675372
35973 2675372 3793291 2993940 873585 -1091035 -2163867 -2231712 -829800 2081009 4818961
35964 4818961 5341929 3838053 2178245 900725 -1025074 -3084984 -2527684 1694968
35956 1694968 6320811 7274506 4721867 2573354 3495896 6428863 8905653 9727124 8796937
35947 8796937 6213213 2796871 347079 -66303 485238 283943 -600105 -725306 136063
35938 136063 482654 -553938 -1952723 -2667985 -3264202 -4491665 -5442917 -4650167 -2189327
35929 -2189327 840755 4099802 7384446 8953703 7037629 3118748 1088679 2283798
35921 2283798 3672826 2249315 -877862 -2558602 -2160863 -1954198 -3733859 -6835182
35913 -6835182 -9111114 -8653857 -5146919 -631744 1822059 1318401 79567 75569 144511
35904 144511 -1646901 -4037943 -3624975 431578 5219124 7771151 7817897 6580795 5011703
35895 5011703 3964687 4287828 5741195 6990305 7218172 6614120 5153001 2564684 -128723
35886 -128723 -1032962 -221003 -241607 -2430201 -4344285 -2708808 2044425 6033918 6419686
35877 6419686 4174045 2346570 2621929 3864330 3671447 1286965 -1238026 -1418059 357077
35868 357077 1191003 -429382 -2746925 -3480927 -2750082 -1969778 -1416939 -685350 -328163
35859 -328163 -914592 -1259912 96823 2051024 1988033 -282223 -2104886 -2011244 -1733857
35850 -1733857 -3049269 -4735009 -4438241 -2219862 -395051 -496643 -1871223 -2893685
35842 -2893685 -2405525 -312339 2220365 3476793 2908130 1698309 960842 275405 -899483
35833 -899483 -1386692 374534 3631338 5804489 5563034 3647973 771475 -3003167 -6264878
35824 -6264878 -6160624 -1955104 2994784 4732706 3158674 1249668 747525 755459 290922
35815 290922 -126457 -115995 -860468 -3548883 -7169791 -9102398 -7947329 -5083534 -3072849
35806 -3072849 -2750019 -2447441 -439601 2432181 3632204 2285955 181746 -1037120
35798 -1037120 -1996619 -3716582 -5146364 -4503284 -2215388 -455362 -76311 8951 466885
35789 466885 563551 -110945 -661920 -206075 1090868 2638421 3976863 4620175 4440264
35780 4440264 4019847 3485030 1715781 -1571880 -3964343 -3156843 -824477 -330632 -1002112
35771 -1002112 970657 5388728 6917063 3289331 -338588 982509 4141862 2714230
35763 2714230 -3228017 -7562880 -7054622 -4471478 -2968498 -2320473 -1524701 -1007790 -1011862
35754 -1011862 -938473 -1129896 -2412171 -3457773 -1843161 1736922 3803663 3443915 3567282
35745 3567282 5471767 6090847 3010032 -1125009 -2157575 70482 2590605 3653003
35737 3653003 3377507 1783975 -848750 -2739489 -2343647 -478203 1484005 4230787
35729 4230787 8580374 12040477 10753964 4944058 -676990 -2664154 -2416997 -2920052
35721 -2920052 -4194695 -3846709 -965823 2388746 3562203 2143882 223340 214102 2527043
35712 2527043 5241070 5997384 4235881 1664206 608034 1724515 3178823 2454279
35704 2454279 -631967 -3273434 -2810748 27517 2145376 1817757 -134043 -2495920
35696 -2495920 -4844943 -6379372 -5894329 -3795375 -2118640 -1578147 -671254 1146687 1814527
35687 1814527 6928 -2190660 -2431821 -1977766 -3333818 -5417554 -4804773 -1552780 -73599
35678 -73599 -3185467 -8119350 -9978572 -7299907 -2756430 260575 332868 -1749928 -3950462
35669 -3950462 -4313517 -2260788 1135350 4177624 5725065 5577407 4218354 2317780
35661 2317780 318145 -1472743 -2579214 -2796655 -2934306 -4082871 -5791674 -6164683 -4395684
35652 -4395684 -1922696 -229985 1002593 2330587 2757586 1428265 -102422 455325
35644 455325 2793917 4422279 3999295 2335378 485334 -1201833 -2478527 -3557036
35636 -3557036 -5589903 -8695272 -10136155 -7193489 -1696969 1338793 111753 -1873449
35628 -1873449 -1138721 1128702 1464249 -1038803 -4343889 -6576899 -7576200 -7908646 -7751399
35619 -7751399 -6753698 -4614147 -1974248 -293929 22117 546081 2267410 3139740 856065
35610 856065 -2566531 -2630643 868994 3022965 1203547 -942516 398258 2995560 2491615
35601 2491615 -351117 -1257968 117862 -386870 -4333273 -7741281 -6911536 -3582241 -1945195
35592 -1945195 -2928535 -4015554 -3494589 -2405715 -2292520 -2811599 -2447018 -999717 -318399
35583 -318399 -1965317 -4685080 -5480608 -3405007 -772080 180934 177251 1024014 2485395
35574 2485395 3251313 3849531 5745398 7934965 7535324 4254791 1349953 1010554 1513652
35565 1513652 739390 76485 2154745 6168571 8511302 7715186 5891946 4784512 3081295
35556 3081295 -771749 -4972575 -5956380 -3164083 -115335 -171548 -2667992 -4178178 -2672992
35547 -2672992 689209 3369039 3840726 2388326 741084 1044811 4026018 7717821
35539 7717821 8897912 6289742 1693589 -2218725 -4233631 -4492630 -3489446 -2002452
35531 -2002452 -798294 628454 3825063 8596013 11634100 9763902 3910687 -1950753
35523 -1950753 -5275380 -6394127 -5936591 -3539224 144528 2565456 2096240 375545
35515 375545 194390 1787520 2733309 1277045 -1508948 -2993337 -1562327 2247754 6478711
35506 6478711 9070346 8680241 5034179 -609518 -5318968 -6122728 -3009086 270148
35498 270148 -166984 -3953375 -7054475 -6711707 -4162693 -2056527 -1055004 -167851 1062479
35489 1062479 2322484 3452705 3924487 2179655 -2512522 -7790838 -9846141 -7666736
35481 -7666736 -3920255 -1208727 597724 2365201 3140899 1662865 -742732 -1246023
35473 -1246023 593167 2188622 1670099 355568 509294 2186764 3697483 4162183 4056950
35464 4056950 3756379 3042227 1944228 853794 -171980 -1220487 -1832135 -1608107 -1265603
35455 -1265603 -1716442 -2181808 -867578 2127952 4164300 3086221 -182003 -2602522
35447 -2602522 -1632961 3128118 9246681 12158583 8772453 1360722 -4138572 -4764167
35439 -4764167 -3177474 -2384233 -1044940 2973484 7154495 6967578 2848765 -52802
35431 -52802 888889 3180763 4478025 5866206 8062471 8511798 5262595 795202 -1126504
35422 -1126504 -273837 1223081 2750190 4647577 5522972 3914909 1721774 2094349 4141607
35413 4141607 3724171 130834 -2040062 500433 4540793 4637957 590623 -2481661 -955805
35404 -955805 3077094 4909876 2803808 -519353 -1363017 794276 2961451 2341489 -345890
35395 -345890 -2048822 -1394303 -45535 39434 -1056403 -2380963 -3871117 -5471846 -5859122
35386 -5859122 -3966052 -1000513 1011812 2119277 3654256 4846576 3032781 -1990127
35378 -1990127 -6422168 -6888143 -4481364 -2535406 -1978330 -1181393 660516 2562746 3745722
35369 3745722 4146551 3040053 -268854 -3963532 -4551061 -1317997 2199206 2551600 295827
35360 295827 -1839986 -2646024 -2266776 -279699 3155136 5292914 3233836 -1624434 -4513467
35351 -4513467 -3271439 -744050 -222750 -1049054 -516533 1811524 3937025 4535744 4098692
35342 4098692 3390616 2623428 2099789 2053973 1668798 -251047 -3089831 -4158185 -1572525
35333 -1572525 3222665 6683055 6699583 4292560 1978554 1211745 1613160 2035578 1776501
35324 1776501 1001169 602150 1576900 3848996 5636886 4924081 2046437 -149822 270344
35315 270344 1520195 245006 -3711628 -6549945 -5209081 -1234652 1424292 1474884 1293205
35306 1293205 3032704 5644667 6652372 5557407 4033927 3309638 2959046 2372683 1823411
35297 1823411 1414450 446040 -1011619 -1275830 447075 1778248 -136802 -3945919 -4905541
35288 -4905541 -984889 4414654 6879663 5637070 2412128 -1684781 -5866952 -8424854
35280 -8424854 -8455420 -7372769 -6376686 -4221616 -230627 2534349 918352 -2814303 -3303085
35271 -3303085 600107 4889574 6395501 5415867 2600370 -1755551 -4687880 -2197973
35263 -2197973 4403947 8789071 8269140 6980857 7874335 7422257 2656373 -1956503 -768118
35254 -768118 3729770 4543190 826546 -1906486 -1201528 -602535 -2802285 -5748240 -6819899
35245 -6819899 -6112488 -4317114 -1497350 944030 947184 -720320 -1496931 -2001024 -5400073
35236 -5400073 -10872369 -12835365 -8816683 -3354929 -1284575 -1494687 -701032 606384
35228 606384 148959 -1298704 -1496495 -1037569 -1780879 -2589433 -984568 1814560 1759261
35219 1759261 -2105982 -6197329 -7278185 -5828833 -4125061 -3624952 -4767311 -6931588
35211 -6931588 -7959864 -5882300 -1845842 556960 -378323 -2452260 -2586876 -328327
35203 -328327 2501770 4319217 4922032 4973503 5215891 5739933 5577575 3567036 75112
35194 75112 -2620095 -2279918 914967 4212629 4880174 3161216 2183836 4219724 7574480
35185 7574480 8636028 6766437 4955146 5087440 5255708 3487677 1612688 2504284 5091997
35176 5091997 5556923 2850363 -434796 -2635169 -4744943 -6700075 -5671906 -364432
35168 -364432 5629652 7624475 5561434 3299767 3071590 3393985 2477764 1102478 1043038
35159 1043038 2299382 3294712 3082695 2093540 868860 -807864 -3111237 -5250910 -6146406
35150 -6146406 -5865903 -5634733 -6246667 -7169445 -7623910 -7829149 -8364072 -8738215 -7727811
35141 -7727811 -5288906 -3170613 -2997411 -4197675 -4547870 -2803737 -220071 1007176
35133 1007176 567776 469416 2246533 4581490 4796534 2314112 -744473 -2381577 -2578281
35124 -2578281 -2010696 -700439 1135947 2513496 3230371 4575697 7057537 8859940
35116 8859940 8338053 6663742 5782177 5018673 2589125 -305060 -396151 2390672 4083687
35107 4083687 2254851 -612145 -1151830 139594 640498 135669 674547 2708348 4075455
35098 4075455 2969058 30185 -2784475 -4062480 -3516390 -1894926 -551595 -281439
35090 -281439 -555276 -542693 -486582 -1029415 -1538934 -557154 1933135 4072075 4423925 3441596
35080 3441596 1914346 -668864 -4712378 -8356207 -8939487 -6918369 -6158804 -8935467
35072 -8935467 -12297164 -11648649 -7059356 -3146531 -2593448 -3035785 -1703636 105850 -105959
35063 -105959 -1342134 -1097560 -400096 -2221747 -5192225 -4002198 2590649 8850292 9675096
35054 9675096 7077273 5697104 5419893 3077887 -768300 -2112009 -117208 1472428
35046 1472428 279407 -1580783 -1713043 -1075021 -1369284 -1870703 -1404045 -1232173 -3133725
35037 -3133725 -5884702 -6320303 -3424588 706523 3695905 4930068 4964545 4490296 3979611
35028 3979611 3232513 1413735 -1456889 -3560656 -3258533 -1639166 -1280886 -2419103 -2390015
35019 -2390015 365811 3658341 4354927 2486037 739576 610430 1080442 1071378 1156399
35010 1156399 2058379 3042883 3074018 2559087 2518271 2609194 1571070 -440723 -1568967
35001 -1568967 -771381 744515 1434528 1644709 2726648 4603005 5596990 4614486 2392613
34992 2392613 423448 -531699 -726985 -1024374 -2371514 -4892264 -7205883 -7401423 -5134930
34983 -5134930 -2175743 -434606 -8118 299525 1042764 1501482 859150 -627018 -1834562
34974 -1834562 -1970407 -1486553 -1707488 -3290299 -5148617 -5424156 -3590632 -982044 888886
34965 888886 1725576 1891016 1549865 1122403 1573428 3101456 4330409 4140154 3587510
34956 3587510 4329147 5667491 5304581 2987822 998291 508719 60857 -1153034 -1247162
34947 -1247162 876784 2314674 -332819 -5420764 -7706986 -5189240 -1289763 210520
34939 210520 -616673 -1655528 -1945365 -1513491 -246555 1332394 1851552 1131399 755393
34930 755393 1257787 836575 -1291822 -2513482 -491757 2579696 2736602 251243 -691502
34921 -691502 1873581 5383309 7019104 6926748 6060534 3905706 230836 -3157414 -4447724
34912 -4447724 -4046777 -3038798 -990803 2627647 5990071 6350749 3816826 1659229
34904 1659229 2360921 4756510 5902576 4932705 3868321 4467066 5352434 3583800 -1026710
34895 -1026710 -4918706 -5056712 -2571707 -427938 1057662 3736099 7528711 10077662
34887 10077662 10586271 10667929 10568580 7961039 2225965 -3062900 -4336089 -2541976 -1113056
34878 -1113056 -1253464 -1643545 -1279299 -125251 1896198 4272154 5278024 4115701 2664398
34869 2664398 3083261 4762638 5624997 5126828 3835307 1599708 -1270613 -2549279 -794372
34860 -794372 1885633 2992150 4009292 7528591 11149884 9388561 2022256 -4439837
34852 -4439837 -5095249 -2197324 -528160 -1155219 -2187605 -2392419 -1327454 1451202 4627016
34843 4627016 4860615 985885 -3423973 -4258829 -1954867 145778 884103 1843351 3811187
34834 3811187 5508151 5639959 4181431 1811748 -443969 -1489110 -1321630 -1200002 -1639827
34825 -1639827 -1540212 -566257 -690136 -3433292 -7087670 -8947169 -9008523 -8934030 -8471230
34816 -8471230 -5947061 -1949929 448759 -536973 -3708574 -7061089 -9350440 -9379223 -6428628
34807 -6428628 -2343435 -961357 -4048077 -9072012 -11949876 -10927425 -7213250 -3142614
34799 -3142614 -482519 653025 2013061 5302668 9423131 10892733 8019801 3465082
34791 3465082 1193578 1636998 1682730 -581727 -3051572 -2576402 509432 2565790 1165725
34782 1165725 -2262756 -4813964 -5506962 -5160086 -4290316 -3005636 -2209431 -2869274 -4376493
34773 -4376493 -5415082 -5888037 -5881273 -3721702 1603055 6572409 6102200 1179617 -1224049
34764 -1224049 2146236 6044939 4834532 678573 -983094 -103415 -193356 -578778 2545380
34755 2545380 8106515 9986784 5779471 115637 -2122035 -1131165 509160 1205506
34747 1205506 -391886 -4868503 -9087080 -8345001 -3496627 -1250210 -4811111 -8918553
34739 -8918553 -7616460 -2733588 -432158 -2573670 -5852797 -7105346 -5435022 -1105145
34731 -1105145 3846006 5730087 3595157 1572561 3179193 5573671 4019930 86452
34723 86452 -225647 4047396 6964645 4183933 -1557930 -5084626 -4855693 -2485434 392834
34714 392834 2486634 2533226 805078 -644033 -655427 -371549 -970171 -1768470 -1699339 -946973
34704 -946973 124844 2071044 4947085 6995853 6228281 2762741 -1247787 -3443274
34696 -3443274 -2648305 475108 3464885 3697532 889179 -2477443 -3728426 -2622830
34688 -2622830 -1144134 -1055389 -1878043 -1300655 2041131 6201824 7397264 4323909 -276774
34679 -276774 -3118608 -3758920 -3310252 -1917798 342610 1991225 2231750 2680041 3973267
34670 3973267 2942574 -2375243 -6813712 -3355320 5818893 10411718 5969943 114790
34662 114790 1237211 6960354 9209236 6238217 3048326 2310104 1712580 26788 -258144
34653 -258144 2350120 5498171 6591431 6025942 5246001 4123952 1861715 -1225466 -4037571
34644 -4037571 -5686999 -5736798 -4653377 -4031420 -4868114 -5715866 -4332342 -1139700 1008416
34635 1008416 814367 224419 1438038 4037016 6037418 6403554 5548348 4305607 3176917
34626 3176917 1998804 107057 -2483524 -4189236 -3223398 119791 3560554 5145680
34618 5145680 4523479 2396095 159216 -255268 2030312 5302412 6848927 6143506 5029691
34609 5029691 5004580 6011074 7456461 8185993 5843152 -725953 -8052927 -10222892 -5685626
34600 -5685626 798483 4215696 4405378 3586000 2123445 -417937 -2565593 -2704873 -2090927
$$ [...]
##END NTUPLES=NMR SPECTRUM
##END=
