##TITLE=31Pdec_1713FPH0606
 , 24 sc
 6.6.2019
##JCAMPDX= 6.0         $$ Bruker NMR JCAMP-DX V2.0
##DATA TYPE= NMR SPECTRUM
##DATA CLASS= NTUPLES
##ORIGIN= UXNMR, Bruker Analytische Messtechnik GmbH
##OWNER= root
$$ XWIN-NMR		Version 3.5
$$ Thu Jun  6 15:40:34 2019 Russian Standard Time (UT+4h)  she@DPX200
##.OBSERVE FREQUENCY= 81.013821
##.OBSERVE NUCLEUS= ^31P
##.ACQUISITION MODE= SIMULTANEOUS
##.ACQUISITION SCHEME= undefined
##.AVERAGES= 24
##.DIGITISER RES= 17
##SPECTROMETER/DATA SYSTEM= spect
##.PULSE SEQUENCE= zgpg30
##.SOLVENT NAME= DMSO
##.SHIFT REFERENCE= (INTERNAL, DMSO, 0, 182.463)
##AUDIT TRAIL= $$ (NUMBER, WHEN, WHO, WHERE, WHAT)
$$ ##TITLE= Audit trail, XWIN-NMR		Version 3.5
$$ ##JCAMPDX= 5.01
$$ ##ORIGIN= Bruker BioSpin GmbH
$$ ##OWNER= she
$$ F:/spectra/data/she/nmr/P31/1/pdata/1/auditp.txt
$$ ##AUDIT TRAIL=  $$ (NUMBER, WHEN, WHO, WHERE, WHAT)
(   1,<2019-06-06 15:39:20.68 +0400>,<she>,<DPX200>,
      <created by zg, POWCHK disabled, PULCHK disabled
       configuration hash MD5:
       00 E9 B6 7A A2 85 ED C7 34 08 36 98 17 FE 4E 26
       data hash MD5: 32K
       92 51 41 78 DD CC 3E 60 37 F1 98 8F BB 35 B5 97>)
(   2,<2019-06-06 15:39:23.01 +0400>,<she>,<DPX200>,
      <Start of raw data processing
       efp BC_mod = 2 LB = 1 FT_mod = 6 PKNL = 1 PHC0 = -2531.688 PHC1 = 44.99912 SI = 64K 
       data hash MD5: 64K
       97 9B DC 65 3E A2 25 92 F3 49 2D EE E4 33 FB C2>)
(   3,<2019-06-06 15:39:44.07 +0400>,<she>,<DPX200>,
      <pk PHC0 = -22.75555 PHC1 = 53.39999 
       data hash MD5: 64K
       D4 AA E3 EA 73 BC 64 42 C4 E6 41 18 C7 5C 05 30>)
(   4,<2019-06-06 15:39:59.59 +0400>,<she>,<DPX200>,
      <abs ABSG = 5 
       data hash MD5: 64K
       80 3A F8 00 72 AF E5 78 B4 01 FB 3B 96 C1 2A 6F>)
$$ ##END=
$$ 
$$ hash MD5
$$ D7 A0 17 B8 AF 65 12 8A BD 36 A3 D6 F7 F0 0A 57
##$RELAX= 
##$RELAX= 
##$RELAX= 
##$RELAX= 
##$RELAX= 
##$RELAX= 
##$RELAX= 
##$RELAX= 
$$ Bruker specific parameters
$$ --------------------------
##$DU= <F:/spectra>
##$EXPNO= 1
##$NAME= <P31>
##$PROCNO= 1
##$TYPE= <nmr>
##$USER= <she>
##$AMP= (0..31)
100 100 100 100 100 100 100 100 100 100 100 100 100 100 100 100 100 100 
100 100 100 100 100 100 100 100 100 100 100 100 100 100 
##$AQSEQ= 0
##$AQ_mod= 1
##$AUNM= <au_zg>
##$AUTOPOS= <>
##$BF1= 81.014009
##$BF2= 200.13
##$BF3= 200.13
##$BF4= 200.13
##$BF5= 200.13
##$BF6= 200.13
##$BF7= 200.13
##$BF8= 200.13
##$BYTORDA= 1
##$CFDGTYP= 0
##$CFRGTYP= 5
##$CHEMSTR= <none>
##$CNST= (0..31)
1 1 145 1 1 1 1 1 1 1 1 1 1 1 1 1 1 1 1 1 1 1 1 1 1 1 1 1 1 1 1 1 
##$CPDPRG= <waltz16>
##$CPDPRG1= <>
##$CPDPRG2= <waltz16>
##$CPDPRG3= <>
##$CPDPRG4= <mlev>
##$CPDPRG5= <mlev>
##$CPDPRG6= <mlev>
##$CPDPRG7= <mlev>
##$CPDPRG8= <mlev>
##$CPDPRGB= <>
##$CPDPRGT= <>
##$D= (0..31)
0 1 0 0 0 0 0 0 0 0 0 0.03 2e-05 3e-06 0 0 0 0 0 0 0 0 0 0 0 0 0 0 0 0 
0 0 
##$DATE= 1559821160
##$DBL= (0..7)
120 120 120 11 120 120 24 19 
##$DBP= (0..7)
150 150 150 150 150 150 150 150 
##$DBP07= 0
##$DBPNAM0= <>
##$DBPNAM1= <>
##$DBPNAM2= <>
$$ [...]
##$SUBNAM3= <"">
##$SUBNAM4= <"">
##$SUBNAM5= <"">
##$SUBNAM6= <"">
##$SUBNAM7= <"">
##$SUBNAM8= <"">
##$SUBNAM9= <"">
##$SW= 369.568048894756
##$SWIBOX= (0..15)
0 1 3 0 0 0 0 0 0 0 0 0 0 0 0 0 
##$SW_h= 29940.119760479
##$TD= 32768
##$TD0= 1
##$TE= 0
##$TE2= 300
##$TE3= 300
##$TEG= 300
##$TL= (0..7)
0 120 53 12 22 120 120 120 
##$TP= (0..7)
150 150 150 150 150 150 150 150 
##$TP07= 0
##$TPNAME0= <>
##$TPNAME1= <>
##$TPNAME2= <>
##$TPNAME3= <>
##$TPNAME4= <>
##$TPNAME5= <>
##$TPNAME6= <>
##$TPNAME7= <>
##$TPOAL= (0..7)
0.5 0.5 0.5 0.5 0.5 0.5 0.5 0.5 
##$TPOFFS= (0..7)
0 0 0 0 0 0 0 0 
##$TUNHIN= 0
##$TUNHOUT= 0
##$TUNXOUT= 0
##$USERA1= <user>
##$USERA2= <user>
##$USERA3= <user>
##$USERA4= <user>
##$USERA5= <user>
##$V9= 5
##$VALIST= <valist>
##$VCLIST= <CCCCCCCCCCCCCCC>
##$VD= 0
##$VDLIST= <DDDDDDDDDDDDDDD>
##$VPLIST= <PPPPPPPPPPPPPPP>
##$VTLIST= <TTTTTTTTTTTTTTT>
##$WBST= 1024
##$WBSW= 4
##$XGAIN= (0..3)
0 0 0 0 
##$XL= 0
##$YL= 0
##$YMAX_a= 30751
##$YMIN_a= -39014
##$ZGOPTNS= <>
##$ZL1= 120
##$ZL2= 120
##$ZL3= 120
##$ZL4= 120
##$ABSF1= 182.463
##$ABSF2= -187.1042
##$ABSG= 5
##$ABSL= 3
##$ALPHA= 0
##$AQORDER= 0
##$ASSFAC= 0
##$ASSFACI= 0
##$ASSFACX= 0
##$ASSWID= 0
##$AUNMP= <proc_1d>
##$AZFE= 0.1
##$AZFW= 0.5
##$BCFW= 0
##$BC_mod= 2
##$BYTORDP= 0
##$COROFFS= 0
##$CY= -3
##$DATMOD= 1
##$DC= 0
##$DFILT= <>
##$DTYPP= 0
##$F1P= 0
##$F2P= 0
##$FCOR= 1
##$FTSIZE= 65536
##$FT_mod= 6
##$GAMMA= 0
##$GB= 0
##$INTBC= 1
##$INTSCL= 5.30512e-09
##$ISEN= 30
##$LB= 1
##$LEV0= 0
##$LPBIN= 0
##$MAXI= 10000
##$MC2= 0
##$MEAN= 0
##$ME_mod= 0
##$MI= 50
##$NCOEF= 0
##$NC_proc= -5
##$NLEV= 6
##$NOISF1= 182.463
##$NOISF2= 159.3651
##$NSP= 0
##$NTH_PI= 0
##$NZP= 0
##$OFFSET= 182.463
##$PC= 4
##$PHC0= -2554.444
##$PHC1= 98.39911
##$PH_mod= 1
##$PKNL= yes
##$PPARMOD= 0
##$PSCAL= 0
##$PSIGN= 0
##$REVERSE= no
##$SF= 81.0140089999434
##$SI= 65536
##$SIGF1= 159.3651
##$SIGF2= -187.1042
##$SINO= 113.3802
##$SIOLD= 16384
##$SREGLST= <1H.CDCl3>
##$SSB= 0
##$STSI= 65536
##$STSR= 0
##$SW_p= 29940.119760479
##$SYMM= 0
##$S_DEV= 0
##$TDeff= 32768
##$TDoff= 0
##$TI= <>
##$TILT= no
##$TM1= 0
##$TM2= 0
##$TOPLEV= 0
##$USERP1= <user>
##$USERP2= <user>
##$USERP3= <user>
##$USERP4= <user>
##$USERP5= <user>
##$WDW= 1
##$XDIM= 65536
##$YMAX_p= 404802595
##$YMIN_p= -45309672
$$ End of Bruker specific parameters
$$ ---------------------------------
##NTUPLES= NMR SPECTRUM
##VAR_NAME=  FREQUENCY,     SPECTRUM/REAL,   SPECTRUM/IMAG
##SYMBOL=    X,             R,               I
##VAR_TYPE=  INDEPENDENT,   DEPENDENT,       DEPENDENT
##VAR_FORM=  AFFN,          ASDF,            ASDF
##VAR_DIM=   65536,         65536,           65536
##UNITS=     HZ,            ARBITRARY UNITS, ARBITRARY UNITS
##FACTOR=    0.456856943014862, 1,           1
##FIRST=     14782.0589164792, 0,            0
##LAST=      -15158.0608439998, 0,           0
##MIN=       -15158.0608439998, -45309672,   0
##MAX=       14782.0589164792, 404802595,    0
$$ Real data points
##PAGE= N=1
##DATA TABLE= (X++(R..R)), XYDATA
$$ [...]
42147a088906q75177M77889J393640J007735J25047j84844j33103m10775o54920
42138c43414l3266J012253J050794j69732j128591o28562N26852P51166q2315
42129I55185n94736N9252J030074R86014j04980j028075r93402n42766m91562
42120g24996n85593J6017J136793J467862L94179r19946r86652J8016O27617K13817
42110F57114k70199J26558R14404R18601m999p53047m52697M44115Q34508L84329
42100B798687j87383j89964J75769K80752l983k91340l63697l40103k47195P433
42090A638976K29074J10375j18715R3984N84425M58223m84468j140705o03931
42081G67238M22362N97994j42049o38306k40569M84181P58624M48197j64115o92866
$$ y = [-1088906, -1964083, -1486194, -92554, 915181, 1040228, 855384, 722281, 311506, -343414, -376680, 635573, 1686367, 1516635, 388044, -240518, 286334, 1037500, 955185, 360449, 419701, 1449775, 2435789, 2330809, 1302734, 309332, -233434, -724996, -1310589, -1294572, -157779, 1310083, 1704262, 784316, -202336, -184320, 443297, 657114, 386915, 513473, 1427877, 2346478, 2341479, 1588432, 1135735, 1579850, 2414358, 2798687, 2611304, 2421340, 2597109, 2877861, 2873878, 2582538, 2218841, 1878738, 1631543, 1638976, 1868050, 1978425, 1859710, 1953694, 2538119, 2996342, 2511874, 1371169, 767238, 1189600, 1787594, 1645545, 1007239, 766670, 1250851, 2009475, 2457672, 2293557, 1600691]
42071A600691o59548O6388P36454M19589n93736r25209O431J060425R10859j62056
42061B460288p78735l59345L16599L90585K0756r0590J72142J67070n14748j268661
42051E15361j101806J893Q87560O86383o3371l02593J3563J08378j62474j13013
42041D69881M61017Q59544O97823N29853P34138P44037J21945m57868k38690K75749
42031D197429Q9132o15745p35510m117O52604N93487K46915J63520K07973J06908
42021D902596N2583K69586N45601O61205Q09389J124191J234493Q36581L91838
42012A0828063O45849J578212K385995K525569K296032K273398K567930K878397
42004B7979445L016796L054714K999475K609408J684424M63302m16421m24395
$$ y = [1600691, 941143, 1007531, 1743985, 2163574, 1569838, 644629, 651060, 1711485, 2622344, 2460288, 1681553, 1322208, 1638807, 2029392, 2050148, 1959558, 2131700, 2298770, 1784022, 515361, -586445, -584552, 303008, 989391, 926020, 623427, 636990, 745368, 582894, 469881, 930898, 1790442, 2488265, 3018118, 3752256, 4496293, 4618238, 4160370, 3921680, 4197429, 4286561, 3670816, 2935306, 2931189, 3583793, 4177280, 4424195, 4587715, 4795688, 4902596, 4955179, 5224765, 5770366, 6431571, 7240960, 8365151, 9599644, 10436225, 10828063, 11473912, 13052124, 15438119, 17963688, 20259720, 22533118, 25101048, 27979445, 30996241, 34050955, 37050430, 39659838, 41344262, 41807564, 41391143, 40966748]
41996D0966748M06931J546704K483107L191827M098713N529957P169301Q153613
41988G3546901P805508O183407L795311R78508k078460m790050o208224n876800
41980G3356101m321354k410520m97664J524232L591100N266804O024215N436584
41972H7969498L303571k1298l543156o238413p730497q162130p655588o304055
41964E1617932m510225k836619j552970o94672m09287p61519j332428j603851
41956C7916361j706829k176936k949424l286140k869892k308421k246750k531343
41948A7840626k598720k236851j636211j083758q71385j097117j342644j041356
41940E932584l86457k49263q52363j233572n93745M70862Q22316L51899j50286
$$ y = [40966748, 41373679, 42920383, 45403490, 48595317, 52694030, 58223987, 65393288, 73546901, 81352409, 87535816, 91331127, 92309635, 90231175, 85441125, 79232901, 73356101, 69034747, 66624227, 66126563, 67650795, 71241895, 76508699, 82532914, 87969498, 91273069, 91251771, 87708615, 81470202, 73739705, 65577575, 57921987, 51617932, 47107707, 44271088, 42718118, 42023446, 41614159, 40852640, 39520212, 37916361, 36209532, 34032596, 31083172, 27797032, 24927140, 22618719, 20371969, 17840626, 15241906, 13005055, 11368844, 10285086, 9413701, 8316584, 6973940, 5932584, 5546127, 5296864, 4444501, 3210929, 2617184, 3088046, 3910362, 4262261, 4111975]
41931D111975l25243m96890p44583o73750k12322J46111R4655r0504p0771J48002
41921A886680M41518P18425P69391M36835k1994k12495k12908l54383m67809r1395
41911B891865N26166M98606l52864j063422q63302j91755J56156J73770K60782
41902B036002L25973Q9973j58986L0853M02072L62314K9792K1174K80158O9571
41892C488896p35326j265747r25352k56725n0683k27197k08185P0492K17840J90192
41882B98205L08923N24989L65379k04628m67077R0373Q87230Q73344o1313q61078
41872A754347o58828J14600L77664j38027o43363m81118N4358L27218K63717K08440
41862A179008K51425K41659K43996L85845L64698k17142r88273j014242j35104
$$ y = [4111975, 3786732, 3289842, 2545259, 1871509, 1659187, 1805298, 1899953, 1809449, 1738678, 1886680, 2328198, 3046623, 3816014, 4252849, 4230855, 4018360, 3805452, 3451069, 2983260, 2891865, 3418031, 3916637, 3563773, 2500351, 1637049, 1445294, 1601450, 1775220, 2036002, 2361975, 2451948, 2292962, 2323815, 2725887, 3088201, 3117993, 3139167, 3419325, 3488896, 2753570, 1487823, 562471, 305746, 255063, 27866, -180319, -109827, 108013, 298205, 607128, 1132117, 1497496, 1292868, 825791, 916164, 1803394, 2676738, 2615425, 1754347, 1095519, 1210119, 1587783, 1449756, 806393, 325275, 379633, 706851, 970568, 1179008, 1430433, 1672092, 1916088, 2301933, 2666631, 2449489, 1461216, 446974, 311870]
41853C11870N92061K64405o25566r62832n95709l30104n09825n11411J53296R93631
41843a220184J218378P39780O0446m35028o02449l03592L61131P78739M19241
41834A016462l15534m54085K28425Q56853O57546n8739n02431m87967l71466k91138
41824B77926j36407o0478k91642m81930k3540Q43444J035355J14423r35676r95051
41814f53576k86607J59439P7064P9629L82146M32675j064l04880j5309M11043
41804B80560M00661K04277L21425N01765K24189j50378J99176R89779R04099l62076
41794C513477j295081o72908M82034L53436q38502j099545K11105J264156N19361
41785B437533r07979r82414J76453O70746j49879q91464n44073L9696j61057o13770
$$ y = [311870, 903931, 1168336, 542770, -420062, -1015771, -1345875, -1855700, -2367111, -2213815, -1220184, -1806, 737974, 798420, 363392, -239057, -542649, -181518, 597221, 1016462, 700928, 246843, 475268, 1332121, 1989667, 1930928, 1428497, 940530, 569064, 277926, 141519, 81041, -210601, -692531, -716071, 127373, 1162728, 1277151, 341475, -653576, -940183, -780744, -703680, -624051, -241905, 190770, 189706, -115174, -130483, 280560, 681221, 885498, 1206923, 1708688, 1932877, 1782499, 1981675, 2971454, 3875553, 3513477, 2218396, 1545488, 2027522, 2380958, 1542456, 442911, 654016, 1918172, 2437533, 1529554, 547140, 723593, 1394339, 1244460, 352996, -191077, -151381, -312438, -926208]
41775i26208l35801L37077M19724M4260J46163P12698P65904Q8740l81234j34802
41765G36521J77604M7795k4042L51798N07442j75411r96299q58897L1319N11795
41755C09625K50102M6687L42207N24281L7014p11250j015736p93276l74092O6204
41745a318234L84454K74419k51547n68368k09988L69663M37586J36555K29653
41736e15807P46241P52870k33277j327969j315550j74864R67463J167576M84672
41727E51355l39030n60699O1188R82022J179713K23778j023626j283665m02605
41718f11569N67581Q38445O87041N81871L57788j84936n70547l26585R6391n9939
41708A375541o22755p56929l09017O7101J15230K89243O49804M73549n25246j416929
$$ y = [-926208, -1262009, -924932, -505208, -460948, -314785, 397913, 1163817, 1252557, 871323, 736521, 914125, 961920, 937878, 1289676, 1797118, 1621707, 625408, -233489, -202170, 309625, 559727, 606414, 948621, 1472902, 1509916, 798666, -217070, -1010346, -1384438, -1318234, -933780, -659361, -910908, -1479276, -1689264, -1319601, -882015, -745460, -515807, 230434, 983304, 750027, -577942, -1893492, -2068356, -1100893, 66683, 551355, 212325, -348374, -287186, 694836, 1874549, 2098327, 1074701, -208964, -611569, -43988, 794457, 1481498, 2063369, 2421157, 2236221, 1665674, 1339089, 1435480, 1375541, 752786, -4143, -313160, -246059, -130829, 158414, 808218, 1281767, 756521, -660408]
41698f60408j175377j0500J032991J338866J006167L41114k84472m25015n2462
41689A110904K27309R202k35853L2056L72766M048p93038r33935j69300N43009
41679A67168M69190k3158k96401k83467j07431L42964R48152J118123N52683k63367
41669B624456p48295q73924p68887l67089O3594j54109r36884j013198L18749
41660a855587J704686J339968l34871j087046n9210J103639P66203n05640j131280
41651e9138p50519j70350J37037L04060K94131j7808k30092R9880N23034K83422
41641D13657k65517l876J051650J438238L69732r37829r13593K14839R40749O33697
41631B941747N1751j27223j64405m29003o07284k37882M67047Q11506M31255l35746
$$ y = [-660408, -1835785, -1846285, -813294, 525572, 1531739, 1872853, 1588381, 1163366, 1110904, 1338213, 1347415, 1111562, 1143618, 1516384, 1520432, 727394, -206541, -375841, 167168, 636358, 613200, 316799, 33332, -74099, 268865, 1217017, 2335140, 2887823, 2624456, 1876161, 1002237, 233350, -133739, -70145, -224254, -1161138, -2174336, -1855587, -150901, 1189067, 854196, -232850, -292060, 811579, 1577782, 1072142, -59138, -809657, -980007, -842970, -538910, -244779, -262587, -492679, -392799, 130235, 413657, 148140, 144264, 1195914, 2634152, 3003884, 2066055, 1152462, 1367301, 2308050, 2941747, 2993498, 2866275, 2701870, 2272867, 1665583, 1427701, 1894748, 2706254, 3137509, 2801763]
41621B801763p78597m60544K84850N80605M3236n47896j61582R40691J321426
41612D023952K83464j086507j332620m78767K74080K96898J04413K72733O22257
41603B979903O73723L16854k26303o81687p80914m25258L8365Q0832k89296m45991
41593A240228j4491N35618M75654k47071r56522r86324k77373N94074Q42492J70147
41583A376432p81901r54131o8557R77291J186042O03591J6370j42057j6337K90372
41573B487115Q05005J141976O77028m27299j066159n87831J95723R3020p23702
41564B594876r43822p0048P93151N10808m66712p84452q5757O13939M38526k54587
41554B345922n81528l21288P8778K88865L23999J76762j93636n01169k98547L30972
$$ y = [2801763, 2023166, 1562622, 1847472, 2428077, 2471313, 1923417, 1761835, 2702526, 4023952, 4307416, 3220909, 1888289, 1409522, 1683602, 1980500, 2084913, 2357646, 2979903, 3653626, 3970480, 3744177, 3062490, 2281576, 1856318, 1894683, 1975515, 1686219, 1240228, 1225737, 1761355, 2237009, 1989938, 1033416, 47092, -230281, 363793, 1206285, 1376432, 594531, -359600, -428157, 549134, 1735176, 2338767, 2355137, 2213080, 2196743, 2487115, 3292120, 4434096, 5111124, 4683825, 3617666, 3029835, 3225558, 3318578, 2594876, 1651054, 1581006, 2374157, 2884965, 2418253, 1633801, 1548044, 2161983, 2600509, 2345922, 1764394, 1443106, 1521884, 1810749, 2134748, 2311510, 2117874, 1616705, 1318158, 1649130]
41544A649130O83933L07420l66315n85759k57135L5491r2830l46034k67696N8830
41534H19035J05382l79369r83597j059573m34123M14618Q51092O42923M9713m70523
41524d44422n59212j38228M95795Q22684N69026M1950k03599n4850N1183j72088
41514D08239l34787J20902R88877J321198N84753n25913q36254j41648N85317
41505B170684N39783P5044n2485Q3665j46734o70674o98036j01160J92304l30970
41495A061421q22461l80028M45036M94610j37842l17604K44795O08799K54816
41486A451542j24033O1836K74790j62412q75387j009975m34138L24877Q82791
41477C89891J095539P81458J8247n89601n41638q8227K35325L68556N01112M94684
$$ y = [1649130, 2333063, 2640483, 2274168, 1688409, 1431274, 1466765, 1373935, 1027901, 760205, 819035, 924417, 545048, -438549, -1498122, -1932245, -1517627, -666535, -23612, 26101, -444422, -1003634, -1141862, -646067, 176617, 745643, 787593, 583994, 529144, 580327, 408239, 73452, 194354, 1183231, 2504429, 3089182, 2563269, 1727015, 1585367, 2170684, 2710467, 2785511, 2733026, 2816691, 2669957, 1999283, 1301247, 1200087, 1392391, 1061421, 238960, -141068, 303968, 798578, 660736, 343132, 587927, 1196726, 1451542, 1327509, 1389345, 1664135, 1501723, 626336, -383639, -817777, -492900, 389891, 1485430, 2266888, 2285135, 1695534, 1153896, 1065669, 1300994, 1669550, 2170662, 2665346]
41467B665346J56276k53379m20899n47534q51061r00193k74221M45346L32115
41458C51796l83165n10319L53318J287421J456164J074823O24364K7631q29993
41449C452040j473919j384619p28856m1973M27911O20657L48829l53806q60030
41440F234n33358L77005R08113N20594k64840n13588Q673N74671M10524k97448
41430A196580o27708j75282L93161L22830j73354l74565j80119o7546j50862p3396
41420H9739K16946L53133K40860J55328J31299j5956q3172K68661O47010K88470
41410B292318n89640q69201k43529K64577m9067n07659k68660M07654Q21101Q43150
41400B101044N48445k19177j125200j173360j75302N80985J60858n24414k71712
$$ y = [2665346, 2821622, 2568243, 2147344, 1599810, 748749, -151444, -425665, 19681, 351796, -31369, -541688, -188370, 1099051, 2555215, 3630038, 4254402, 4282033, 3452040, 1978121, 593502, -135354, -177327, 250584, 871241, 1220070, 866264, 6234, -527124, -150119, 757994, 1278588, 1013748, 500160, 508833, 1083504, 1494028, 1196580, 568872, 393590, 786751, 1109581, 936227, 561662, 381543, 313997, 163135, 89739, 306685, 659818, 900678, 1056006, 1187305, 1171349, 1088177, 1356838, 2003848, 2292318, 1702678, 833477, 589948, 854525, 805458, 297799, 29139, 436793, 1257894, 2101044, 2649489, 2430312, 1305112, 131752, -43550, 537435, 698293, 173879, -97833]
41391i7833L88206K53188l20713p7659P81214Q64166M0404l45729J38535L27244
41381A951023l84870r66512n69611R1869O7557l67459m77399k57023k608L96168
41371e18865R14868R65001K98921l79104m13324r5818O9746K05845M73566M88109
41361B008945J14442J7640N24360P59497p788q86642n16130P73075J315075M89650
41351D592124n33240n74497J02988M65468O5312o43692q96899l09695P47797J459903
41341D475569J456302J166916J018278P18665j41437j206881j761478j696631
41333D029303j366750p91368J64636J028967J077739M55550Q8102L74831P26253
41324E787263N40507n6574o18652r12213q76721n84008l50860m14431m92334j84622
$$ y = [-97833, 290373, 543561, 222848, 145189, 926403, 1790569, 1830973, 1485244, 1623779, 1951023, 1566153, 599641, 30030, 121899, 189456, -178003, -655402, -912425, -915033, -518865, 396003, 1361004, 1659925, 1280821, 867497, 771679, 841425, 1047270, 1520836, 2008945, 2123387, 2141027, 2665387, 3424884, 3417096, 2530454, 2014324, 2787399, 4102474, 4592124, 4058884, 3484387, 3587375, 4052843, 4118155, 3474463, 2577564, 2267869, 3015666, 4475569, 5931871, 7098787, 8117065, 8835730, 8694293, 7487412, 5725934, 4029303, 2662553, 1871185, 2035821, 3064788, 4142527, 4598077, 4686179, 5061010, 5787263, 6327770, 6271196, 5652544, 4740331, 3863610, 3279602, 2928742, 2514311, 2021977, 1837355]
41314A837355K77619L41537J06547J86291N70712N23845j72368p57623o60382
41305B253533l41512m64197q47607q21213k21386M50121O34494K15142l75593
41296D81782m89318q600L65364Q7027k28028L35807J272428J061594m53626j494344
41286I30086q45947L74774N22103j12501n8544Q16011J161107L64823n49044n12620
41276B090248J94978N74763K06345m55595o59084n8509Q70478J198702O36168
41267D598494l8822q5394J36614p4013m34765j73734M43367L66506m29152p33855
41257C575246m9089N63886K26966l53680j71386L62309J84077n40361o28710J82718
41247C351976P59553K64817o52632q60902k80333J93991p47m55837m92792r1923
$$ y = [1837355, 2114974, 2456511, 2563058, 2749349, 3320061, 3843906, 3671538, 2913915, 2253533, 1912021, 1447824, 600217, -220996, -442382, 7739, 642233, 857375, 481782, -7536, -16136, 349228, 436255, 208227, 544034, 1816462, 2878056, 2424430, 930086, 84139, 458913, 981016, 868515, 809971, 1625982, 2787089, 3151912, 2602868, 2090248, 2285226, 2859989, 3066334, 2610739, 1951655, 1893146, 2763624, 3962326, 4598494, 4559672, 4474278, 4610892, 4536879, 4102114, 3928380, 4371747, 4738253, 4309101, 3575246, 3526157, 4090043, 4317009, 3963329, 3791943, 4154252, 4338329, 3797968, 3169258, 3351976, 4111529, 4376346, 3723714, 2862812, 2582479, 2776470, 2775723, 2319886, 1827094, 1735171]
41237A735171J52255j22353n76467o86233m56608k83015k50738m5968M03831P10304
41227E80179O44163N09610N87323O14277K39435l06472m72453j51866K39594L36194
41217B819984R5907l70690q43174r62222n83109j07633l6682k18353j8519O89888
41207D65397J193647Q16193k21905j063754j105638m49767L01059N22655O0645
41198E18532n53985n46618K49278J109115J163051L36165n92759p97733j87766
41189F97280N17392M49325n13492j477012j404819l45432N51372M58115r2583
41180a159854n2885N65159O95661j48479j021657p90036K91218R37289N84585
41171i8999K5446J20037N43151L47895n68257j244250r48484j11429L41557J95544
$$ y = [1735171, 1887426, 1765073, 1188606, 502373, 45765, -237250, -487988, -533956, -130125, 580179, 1224342, 1733952, 2321275, 2935552, 3174987, 2868515, 2396062, 2244196, 2483790, 2819984, 2915891, 2545201, 1702027, 739805, 156696, 49063, 12381, -205972, -224491, 465397, 1659044, 2475237, 2253332, 1189578, 83940, -365827, -64768, 457887, 518532, -35453, -582071, -332793, 776322, 1939373, 2275538, 1682779, 885046, 697280, 1214672, 1663997, 1150505, -326507, -1731326, -2076758, -1525386, -1067271, -1159854, -1212739, -647580, 48081, -100398, -1122055, -1912091, -1620873, -683584, -98999, -73553, 46484, 589635, 937530, 369273, -874977, -1823461, -1934890, -1593333, -1397789]
41161a397789J8428J95505M26626K95289j00961l79182m44964m57862l59756J07369
41151b097297Q23868J140571O17858k79986o04106m6159O79788P33083J68955
41142A136575k32332m4904L03853K43174j19059k64147j30335j61691m63202n25653
41132b57721j13214J42110l45750r72364n60682Q95724J981062J640299M52999
41123B862463l49093m58744m12493m69960m37111l33813l57179k74191K88618
41114E8497R41301Q13257j03790p88303o48543k50765j70575o4945M25735P14854
41104I26723J76499n81499m44505M96758J013527M61334m96136r57197p69197
41095a73693l00676R7821K32070J59216J85429L57509J79830n65564j068111m69348
$$ y = [-1397789, -1379361, -1183856, -757230, -461941, -562902, -942084, -1387048, -1844910, -2204666, -2097297, -1273429, -132858, 485000, 205014, -399092, -445251, 234537, 967620, 1136575, 904243, 859339, 1163192, 1406366, 1287307, 1023160, 892825, 731134, 267932, -257721, -370935, -228825, -574575, -1546939, -2107621, -1211897, 769165, 2409464, 2862463, 2513370, 2054626, 1642133, 1172173, 735062, 401249, 44070, -230121, 58497, 999798, 1813055, 1709265, 920962, 272419, 21654, -148921, -213866, 211869, 926723, 1103222, 521723, 77218, 573976, 1587503, 2048837, 1552701, 595504, -173693, -474369, -376548, -144478, 14738, 200167, 557676, 737506, 171942, -896169, -1365517]
41085a365517O53546R25952K38757j28199L78332P62905K71485l91256m30654
41076I15351k81991n52222p65818l58312L7672l60024r27937n85660K89121M47773
41066b142047j11363k51932K16522K69381l35542m49660N30308J520217J300408
41057E46292J56912p54007q42908k69736N37664R61462M90278n24305j043744
41048g42092o89135j91388j26076j04713K36829M19713P0274j91598K39985P80393
41038b97808N30813k15984m35289M0541M79370N63381O57611Q17490N64909j89504
41028B515530q45249r51879o84216l08695J95563P52362R54942N28843k50827
41019A906374p92926p18976j86329J99599j7968m99169m14032L70894R33580N64588
$$ y = [-1365517, -711971, 213981, 452738, 324539, 702871, 1465776, 1737261, 1346005, 915351, 633360, 81138, -684680, -1042992, -1005320, -1365344, -2293281, -2878941, -2589820, -2142047, -2253410, -2505342, -2288820, -2019439, -2354981, -2804641, -2274333, -754116, 546292, 703204, -50803, -893711, -1163447, -625783, 335679, 825957, 301652, -742092, -1431227, -1622615, -1748691, -1853404, -1616575, -1196862, -1126588, -1318186, -1078201, -297808, 233005, 17021, -418268, -377727, 101643, 665024, 1322635, 2140125, 2705034, 2515530, 1670281, 718402, 34186, -274509, -78946, 673416, 1628358, 2157201, 1906374, 1113448, 394472, 208143, 407742, 389774, -109395, -523427, -152533, 781047, 1345635]
41009A345635j70640l01866J03635K00536k73949p87695r48601p81989k52137
41000a867071N94772J152164Q54840J49085j09777p6283n62744j324801j114932
40991b304747K57518J334655J079809K66968K3191J55404o6711m34054k96748
40982A5285J03492j0057o00922q66006m60969J64634N25964N01608J40827l06507
40972g92651l69450O8631M41856K96418L4038K12961N29311L16409k63429m45763
40962B8331j06710J48712P3948K8211R5777j15076o07303p83663l92365O2870
40952a567268J86377K62947N60981P08307L10614k68025l41327J22393N03487
40943D78486M51494L43190O73362J234586J186956N2525j506151k209505j536754
$$ y = [1345635, 1174995, 873129, 976764, 1177300, 903351, 115656, -832945, -1614934, -1867071, -1272299, -120135, 734705, 883790, 774013, 697730, 134986, -1189815, -2304747, -2047229, -712574, 367235, 634203, 657394, 812798, 746087, 312033, 15285, 118777, 108720, -492202, -1358208, -1819177, -1654543, -1128579, -626971, -486144, -792651, -1162101, -1093470, -651614, -355196, -321158, -108197, 421114, 737523, 474094, 28331, -78379, 70333, 144281, 172492, 268269, 153193, -454110, -1237773, -1630138, -1567268, -1380891, -1117944, -556963, 151344, 461958, 193933, -147394, -25001, 478486, 929980, 1273170, 1946532, 3181118, 4368074, 4420599, 2914448, 704943, -831811]
40934h31811k64099N21000N49712K49011k0557q6237K70336R70762J303980O87332
40924C349429l41555o62597r8831L82710J03156m92127o94531n02780l21574k47357
40914D73943j18094O5133J32597k5167l67601o33663m14388L21500Q77013N56855
40904H68128l04010o98567l26649J47970K67347K91536L29525l3132p81166j096555
40894a335573n68522O7769J10474o86M02089R33344Q07374K30248N0955L58236
40884A055708M91412K62005J25867J81135k7880o09349j061763j052030p60833
40875a395728l76057Q7021M16016L37347P5589J04724L25749K33991p0814Q4655
40865a77507P39568J037778N23414j58530l28128k34680l51528m37796q9601L11794
$$ y = [-831811, -1095910, -574910, -25198, 223813, 203256, 117019, 387355, 1358117, 2662097, 3349429, 3007874, 2345277, 2246446, 2629156, 2732312, 2240185, 1545654, 1042874, 721300, 473943, 355849, 420982, 553579, 528412, 160811, -472852, -887240, -565740, 311273, 868128, 564118, -134449, -461098, -313128, -45781, 245755, 575280, 542148, -239018, -1335573, -1904095, -1836326, -1725852, -1726538, -1324449, -391105, 416269, 646517, 697472, 1055708, 1547120, 1809125, 1934992, 2116127, 2088247, 1478898, 417135, -634895, -1395728, -1771785, -1684764, -1268748, -931401, -855812, -751088, -425339, -191348, -262162, -177507, 562061, 1599839, 2123253, 1964723, 1636595, 1401915, 1050387, 612591, 522990, 834784]
40855H34784R9888n10066o37184o1458M74128M12608J16924J42175L41271J90196
40845A403266l00189n53281k84478R8277J37551k4248j0964M3997l01490q80618
40835f72177q89567p3875O78686M84572k55762m38721J48677O23052L56370k51425
40825b90170n10813k94106Q4306K94408Q2226n50093j048796p23181K96967J037839
40815a621413Q91106L27865R4983K42497L60775K90805J11957j81467n10340n57362
40805e50594k34461L3308o6674k00857J7630L00732J77516j21405k0668L58088
40795c07385L40363j26086k94454J48002M44519j26768j033811j055989N6073
40786a955536J112908R28637j47952o50067O7644R13488N38777p21178j238838
$$ y = [834784, 934672, 424606, -212578, -274036, 200092, 612700, 729624, 871799, 1213070, 1403266, 1103077, 549796, 265318, 363595, 501146, 476898, 465934, 509931, 208441, -672177, -1561744, -1635619, -956933, -472361, -728123, -1166844, -1018167, -395115, -38745, -290170, -800983, -1095089, -1010783, -716375, -634149, -1184242, -2233038, -2956219, -2659252, -1621413, -730307, -402442, -307459, -64962, 295813, 586618, 698575, 517108, 6768, -550594, -785055, -751747, -818421, -1019278, -1001648, -700916, -523400, -644805, -665473, -307385, 32978, -93108, -387562, -239560, 204959, 78191, -955620, -2011609, -1955536, -842628, 86009, -61943, -712010, -644366, 269122, 807899, 86721, -1152117]
40777a152117l54297P67655Q77914K59665q5448k9408j05150k73303o7881K72790
40767A10420R883p23311q67018j9579Q90266R18369K87267k03514k63029r8249
40757D1505J36395L68791M69398M60771N15020N05654N4020p07110j019244n62040
40747B63160l3318j19053m35316j93437N01564Q27425N15196J42665J58281L15881
40737A943048K39050J315j06514n3156q3446l83651p94300q25129j23865R37382
40727G50734J424137Q75037q1596m99772k45004Q2367R2786j00345l81369p54606
40717A162369r40976n12210L76033R32027O84105P1427j89237K3115K65250J55452
40707B027355k89041p39363p94582l18904L34384O26392M20067L1824k86740n37146
$$ y = [-1152117, -1506414, -738759, 139155, 398820, 313372, 283964, 178814, -94489, -162370, 110420, 120303, -603008, -1470026, -1489605, -599339, 319030, 606297, 402783, 139754, 41505, 177900, 546691, 1016089, 1476860, 1991880, 2497534, 2551554, 1844444, 825200, 263160, 229842, 110789, -324527, -517964, -16400, 811025, 1326221, 1468886, 1627167, 1943048, 2182098, 2183413, 2076899, 2023743, 1940297, 1556646, 762346, -62783, -186648, 750734, 2174871, 3049908, 2968312, 2468540, 2223536, 2305903, 2398689, 2298344, 1916975, 1162369, 221393, -290817, 85216, 1017243, 1701348, 1772775, 1583538, 1606653, 1871903, 2027355, 1738314, 998951, 204369, -114535, 219849, 846241, 1266308, 1298132, 1011392, 474246]
40697D74246o18258l05787K22308L81336L0895j88637J78200O00743L59865k45206
40687H89705l06100K32567M25317j98204q39170n70140L15235P06486J59059o16246
40677A98509p37139j76497L50462K83491j98652m53392j05328N81584J036627
40668G79665R39194L67527m05651j022442j097704n56259R4540K39516k3530P205
40658f77939N43785Q71175L96453l66896m87543L8712L95471K78138K66097O98542
40648A955995R88838N04315m62878j132340j218504r55546n12416J3594K77720
40639e41222K0144l88557l47224Q2816K98724J46051R0520L07354L55283L1095
40629E4984j86380K6871K49986J26771R3238N20596P21416j18442j323334j310917
$$ y = [474246, -144012, -449799, -227491, 153845, 184740, -3897, 174303, 775046, 1134911, 889705, 583605, 816172, 1241489, 1043285, 204115, -366025, -50790, 655696, 814755, 198509, -538630, -715127, -364665, -81174, -279826, -733218, -838546, -256962, 779665, 1718859, 2086386, 1680735, 658293, -439411, -995670, -901130, -661614, -685144, -677939, -134154, 737021, 1133474, 766578, 279035, 317747, 713218, 991356, 1257453, 1955995, 2944833, 3449148, 2986270, 1853930, 635426, -320120, -832536, -818942, -541222, -521078, -909635, -1256859, -1174043, -875319, -729268, -638748, -331394, 23889, 54984, -131396, -104525, 145461, 272232, 365470, 886066, 1607482, 1489040, 165706, -1145211]
40619a145211Q4579J114052M69911r04875j203662k00126P33752O73101J20635
40610b57844n9101K53029O51623Q35999O71463J26204n14276p52952m89758j79915
40600B84472j48772j65276J363R0668r2839q2762N71946J297293J044742j17055
40590B683780q69898m40663K98572J43125o87636r93068m47964K8102j65495l89508
40580h40653Q7072P79241O41571l10622r15543m64222L56800M65345j92524p15672
40570a109207m77518K44948Q13632R09825N71693j6511n26136n84012j85061J71769
40560a86578M6263l80849n81596l66193L0169M00779O91224P50836M47087M3122
40550H94264m0346J01842k0215l99237m42375j9549J77584k15455n29484j94236
$$ y = [-1145211, -1060632, 53420, 523331, -381544, -1585206, -1785332, -1051580, -378479, -257844, -316945, -63916, 587707, 1423706, 2095169, 2221373, 1707097, 954145, 464387, 284472, 135700, -29576, -28213, 62455, -30384, -113146, 458800, 1756093, 2800835, 2683780, 1813882, 1373219, 1671791, 1814916, 1127280, 134212, -313752, -285650, -451145, -840653, -753581, 25660, 667231, 356609, -558934, -1023156, -666356, -201011, -393535, -1109207, -1586725, -1341777, -528145, 381680, 953373, 936862, 410726, -173286, -358347, -186578, -140315, -521164, -1102760, -1468953, -1438784, -1038005, -346781, 404055, 851142, 894264, 853918, 955760, 935545, 536308, 93933, 74384, 251968, 36513, -492971, -687207]
40540f87207K06847l0939l58105R7783P40208K46738j023886j170625L21497J570216
40530h7473J068454j40161l14483L03917K83931m55859p30134k71823k9961l21739
40520f95331l57114J43150L67061q4563m43014j35418K50913Q7116k05617J3142
40510a059675M88115O06711L99626K12318m6257n22431p87317m28143J15887J39176
40500h81990k15335k60219N7345J68919j2507J01622P40463J295054J125685L20785
40490B439822n42921r74331q00965k66438J2700l63954r25817p38155L47177J295277
40480e17605J053638j79963j178308j035687m6860P33997O53272R2569r2989L21206
40470a96730O68869L35938m02681q04158o06400j21799L60269P07677O35894p6141
$$ y = [-687207, -480360, -511299, -869404, -771621, -31413, 215325, -808561, -1979186, -1657689, -87473, 980981, 840820, 526337, 830254, 1114185, 658326, -71808, -343631, -373592, -695331, -1052445, -909295, -542234, -626797, -1069811, -1205229, -954316, -867200, -1072817, -1059675, -571560, 35151, 434777, 647095, 600838, 78407, -708910, -1137053, -1021166, -881990, -1097325, -1357544, -1300199, -1131280, -1143787, -1042165, -301702, 993352, 2119037, 2439822, 1896901, 922570, 121605, -144833, -132133, -496087, -1421904, -2160059, -1812882, -517605, 536033, 356070, -822238, -1857925, -1904785, -1170788, -517516, -424947, -517936, -196730, 472139, 808077, 405396, -398762, -1005162, -1126961, -766692, -59015, 576879, 500738]
40460E00738j016367j383898r43387k36598K53619N87354Q59911Q34359M12333
40451a31936l9535k01558k06089j95039M6072N78252Q88571N30347j42112m27254
40441F99719k04874J12841K78611K74023l5464n92504p26127P3699J033230P94172
40431A707326n61879j304082m14654R03029R91284J22515j75951L47612L97857
40422B013057n70254j370517r89278j30514P8590j37377Q7538N53987M12715j29278
40412a81331l7670O60552P56026o6597n27459J97163J070490Q42799j0445k52183
40402B451345M7279j30221p79697q20471j531N82009K19498l54064j65480O24429
40392A673096J139722R35310K17836n68578r61406p29911k32952r8861l35914
$$ y = [500738, -515629, -1899527, -2842914, -3079512, -2825893, -2238539, -1378628, -544269, -131936, -171471, -373029, -579118, -774157, -728085, -149833, 738738, 1269085, 1126973, 699719, 494845, 607686, 886297, 1160320, 1124856, 532352, -193775, -120076, 913154, 1707326, 1145447, -158635, -573289, 329740, 1321024, 1443539, 1267588, 1615200, 2013057, 1442803, 72286, -916992, -1047506, -968916, -1106293, -1018755, -464768, -52053, -181331, -219001, 441551, 1197577, 1130980, 603521, 800684, 1871174, 2713973, 2703528, 2451345, 2498624, 2368403, 1588706, 768235, 766704, 1348713, 1568211, 1214147, 1048667, 1673096, 2812818, 3748128, 3965964, 3397386, 2435980, 1706069, 1473117, 1374256, 1038342]
40383A038342l10401J63394M10372j1190m82897k04141O13109J082899Q16744
40374C116231J37627n69896j074820j066484l74055N80704J047382P19856m7152
40365B469393p15282r74894q19183n09934l49868k68071J31460Q53662J201104
40356A018387O15050m55049j047197q78549n00023l48258k20756J98742P38261
40347h79392Q90654M01325l93897p91278l94727L72573O75009K95332r6666P9306
40337A58239N05261N17814P3438l44284m82090m34917k25414J77079N48920O20258
40327A114304M71636K96529j8609n87399j041530r42881m87177j80809K159M40313
40317i33464R55257Q66782L8201q12330r99244n36852J55734O93143Q05085M77074
$$ y = [1038342, 727941, 891335, 1301707, 1290517, 807620, 603479, 1216588, 2299487, 3116231, 3253858, 2683962, 1609142, 542658, 168603, 749307, 1796689, 2516545, 2469393, 1754111, 779217, -39966, -549900, -899768, -1167839, -1036379, -182717, 1018387, 1633437, 1178388, 131191, -747358, -1247381, -1595639, -1816395, -1617653, -879392, 11262, 412587, 18690, -772588, -1167315, -794742, -119733, 175599, 78933, 158239, 663500, 1181314, 1254752, 910468, 428378, -6539, -231953, -54874, 494046, 1114304, 1585940, 1882469, 1863860, 1276461, 234931, -707950, -1195127, -1375936, -1373777, -933464, 21793, 888575, 926776, 114446, -884798, -1421650, -1265916, -572773, 232312, 709386]
40307G09386P0545r0488j55336l48968m12632m6341L94411L98706J87687K13456
40297I20426J29677n81807j240740o93600O09019R20072j06625p78659r5155O61561
40287b55831J74246o88393m16360O40303J035828N87096J87971p8094p60997j339327
40277i13558o54698R00388J489760N09303n28936m05576P1159l05094j043248
40268h80500p70842N52739J505534J127659K3773n86777l20933J30627q620o26465
40258A46195q92102l80391L50887N99899N08132O06188P18692K17412p14815j082497
40248G7600n43738P7221J06266q8278m2544q7518m96858n83674K55393J154076
40238a72054P39752o82234j272614k59256Q78762N43946o65327q71766L69161
$$ y = [709386, 779931, 689443, 534107, 185139, -227493, -273834, 120577, 519283, 706970, 920426, 1050103, 468296, -772444, -1466044, -857025, 63047, -43578, -822237, -917392, -255831, -81585, -769978, -1186338, -546035, 489793, 1076889, 1264860, 1186766, 425769, -913558, -1568256, -667868, 821892, 1331195, 802259, 396683, 467842, 162748, -880500, -1651342, -1098603, 406931, 1534590, 1558363, 971586, 650653, 781280, 772660, 146195, -745907, -1126298, -775411, -175512, 332620, 938808, 1657500, 1874912, 1160097, 77600, -466138, -388917, -282651, -370929, -413473, -500991, -997849, -1581523, -1326130, -172054, 567698, -114536, -1387150, -1646406, -767644, -223698, -889025, -1760791, -1391630]
40229a391630J524620J277540J41635n40961l33079K34699O86466Q39100M10096
40220B848486o51821j548865j300851j48248N95320L21531j34561R6104O82108
40211G59203Q43029N04451q324o65068j288560j144207K2573J141216J113370
40202A277683M28215K56055M35325j03730j164565j316081k85235M61576J00821
40193I0064k62849L88892J189990Q63919j67396n86323k94761k45829o31233o96791
40183c52317k25444J18074K5797K534L33798N36740K03089l28324n24934l56585
40173e67572r1219J89878N13637P11808N47757J02084k03240r3564J14880j56069
40163A068380p97583q09311L56197J557662J109925p60498j848428q94367O71682
$$ y = [-1391630, 132990, 1410530, 1552165, 1011204, 678125, 912824, 1599290, 2438390, 2848486, 2196665, 647800, -653051, -801299, -205979, 115552, -19009, 77095, 759203, 1602232, 2106683, 2098359, 1433291, 144731, -999476, -976903, 164313, 1277683, 1705898, 1961953, 2397278, 2293548, 1128983, -187098, -472333, -10757, 90064, -172785, 216107, 1406097, 2270016, 2102620, 1516297, 1221536, 975707, 344474, -352317, -577761, -459687, -433890, -431356, -97558, 439182, 642271, 313947, -210987, -567572, -658791, -468913, 44724, 756532, 1304289, 1406373, 1203133, 1109569, 1224449, 1068380, 270797, -538514, -182317, 1375345, 2485270, 1724772, -123656, -1018023, -346341]
40154c46341Q77335k9168l69161K13540N13309j3274n25854m50156k81082l45500
40144g56352j71005L53490M63652j33922n36815p3058N60721M91022R3408J87053
40134D78194N35820L14176l99501p51051m96735k04475j65161p7430J57415K07936
40124d00812L051r9473K6355J08832Q8949K37834N17904M93145J09683o7247K65024
40113A283245N68409K01999o21993j050437n99891L19996Q20531L96622n03760
40104H14721q59284k72689M24382K49490m75981n56804K16523O85860J58419m53621
40094f8984p7623Q37146J115872O96869M73112O47502N21676j17924o19858o41012
40084B766776n83560n89835k12710M85960O14333j28378p13430k81966M91049
$$ y = [-346341, 530994, 501826, 132665, 346205, 859514, 846240, 320386, -129770, -410852, -756352, -927357, -573867, -110215, -244137, -780952, -854010, -293289, 197733, 291141, 478194, 1014014, 1328190, 928689, 177638, -319097, -523572, -688733, -766163, -608748, -400812, -397761, -497234, -470879, -362047, -273098, -35264, 482640, 975785, 1085468, 1018221, 1283245, 1851654, 2053653, 1431660, 381223, -218668, 101328, 921859, 1318481, 814721, -44563, -317252, 107130, 356620, -119361, -676165, -459642, 226218, 384637, -68984, -146607, 690539, 1806411, 2503280, 2976392, 3623894, 4145570, 4027646, 3407788, 2766776, 2183216, 1593381, 1380671, 1866631, 2480964, 2352586, 1639156, 1357190, 1848239]
40075A848239M93070r7338k79588J02053L41324K10816J43107J96546k9839m39415
40065B488975m68740j66138k00396o41665p81986l99540j18817j68895Q7866Q58272
40055D88936J259566P02073n6603j21958J47217l2033m12862k72358J42386J2158
40045A856522n17462n08375J25316M22394r885l77197p2642L81059L15680j6483
40035A598927k6240K07960K31792P8690J31566L39762K25059l29705p84043n75619
40025A098149J91961Q35732Q10093K66889j75701k28176k49750n54325p09837
40016A285035r4862R30283J147931O4392j248996j406967m04549N20198M91519
40007A283984j61604o31744n70555j08369N26028J009252Q98944J24225o27010
$$ y = [1848239, 2341309, 2243971, 1964383, 2066436, 2407760, 2618576, 2761683, 2958229, 2928390, 2488975, 2020235, 1854097, 1653701, 1012036, 230050, -169490, -288307, -457202, -369336, 488936, 1748502, 2450575, 2393972, 2272014, 2419231, 2387198, 1974336, 1701978, 1844364, 1856522, 1339060, 830685, 956001, 1378395, 1368510, 991313, 918671, 1299730, 1615410, 1598927, 1572687, 1780647, 2012439, 2091129, 2222695, 2562457, 2787516, 2457811, 1673768, 1098149, 1290110, 2125842, 2935935, 3202824, 3027123, 2798947, 2549197, 1994872, 1285035, 1190173, 2120456, 3268387, 3332779, 2083783, 676816, 272267, 792465, 1283984, 1122380, 490636, -79919, -188288, 337740, 1346992, 2245936, 2370161, 1743151]
39998A743151n59141J27277L39874m22384j226900q95723L33264J087513O99892
39989A226823o0373k61590l023R4898p5520j86731j36887l3052J60399M09603
39979A134547L62146j33829n78255m85633j74754j99686l15976J08432Q27305
39970E44297Q76514R5383m90319j37474N84406O87979N1136o79958r77081p49786
39960a94903j59668M36732O04037K37253k94618n79891n27740k41215J30485L26292
39950b63236J54863j36925p9175L21667N37561L02485l7271j26107o2558n4452
39940E56852q7036j37727k39035j60621L95978J077264J025609Q9995p77830p74811
39930I68638k49505M9670O9296J51316K26117O1362j26410o2624l7584l77504
$$ y = [1743151, 1184010, 1311287, 1651161, 1228777, 1877, -893846, -560582, 526931, 1226823, 1166450, 904860, 901837, 996735, 921215, 734484, 597597, 564545, 724944, 1134547, 1496693, 1362864, 784609, 298976, 124222, -75464, -391440, -283008, 544297, 1420811, 1516194, 1025875, 888401, 1472807, 2160786, 2211922, 1531964, 554883, -194903, -354571, 82161, 686198, 923451, 628833, 48942, -478798, -720013, -589528, -263236, -108373, -245298, -324473, -2806, 534755, 837240, 799969, 673862, 611304, 556852, 469816, 332089, 93054, -67567, 328411, 1405675, 2431284, 2521279, 1743449, 968638, 719133, 768803, 838099, 989415, 1215532, 1276894, 1150484, 1087860, 1050276, 672772]
39920F72772o52420k57607M80249O80419K47018r1862n2535j40743n69619p57567
39910d41895k91710L42108M78370J97974N7546K52917M81862M17143n054n93316
39900H95945r69006q14040k45396K42327L58159L05228L29715K95374K7975j70389
39890B55892J54968P94611R05187J10331q28088r03777k27383J25584l20010p52394
39880f85079l63726L51818L86931j28518j44683N01186O94646j51623r96725o34210
39870a169983N53349J235460R97192N57076L98211K17402k10292n05540l20773
39861A752102P7428J77256j50233n80153o88122l24351K05626M01097J54479j22529
39851I02600j49119j91689m70175n60344J7532Q93487J230769Q87506M82964L30555
$$ y = [672772, 20352, -237255, 242994, 923413, 1170431, 1078569, 1026034, 885291, 315672, -441895, -733605, -391497, 86873, 284847, 342393, 595310, 1077172, 1494315, 1489261, 895945, -73061, -887101, -1132497, -890170, -532011, -226783, 102932, 398306, 426281, 255892, 410860, 1205471, 2110658, 2220989, 1392901, 489124, 261741, 387325, 67315, -685079, -1048805, -696987, -310056, -438574, -583257, -82071, 612575, 460952, -535773, -1169983, -616634, 618826, 1616018, 2173094, 2571305, 2788707, 2578415, 2072875, 1752102, 1829530, 2006786, 1856553, 1276400, 588278, 263927, 469553, 870650, 1025129, 902600, 753481, 561792, 91617, -468727, -451195, 442292, 1673061, 2560567, 3043531, 3374086]
39841C374086O4848n17449r64463q56542m46362k22238k20159j55633M1274K16246
39831C13608L56361N75476P34735M25681m52646j268547j179547j99871O21134
39822g3616M59217j53690q3020O98983J052895M44380k60239k65473r2536m87376
39812A239525r34691m52471O30874J002560L37751k88312r3627M05594M22165
39803B269368K9950k06520j15891K3405l8450k66329l67246o3405M42434M95749
39793B203065j34532p34746n59450P3540L04834K2658k16571k73582m33613m98970
39783b47367K1174Q23675J020316N10199M1390j70311o31531j188817q93173K29355
39773d85090O94472k75426j313527p55232R66838J975687J437968K53799m55738
$$ y = [3374086, 3438934, 2921485, 1957022, 1100480, 654118, 431880, 211721, 56088, 97362, 313608, 669969, 1245445, 1980180, 2405861, 1953215, 684668, -494879, -694750, -73616, 385601, 231911, 148891, 847874, 1900769, 2345149, 2084910, 1819437, 1726901, 1239525, 304834, -147637, 483237, 1485797, 1823548, 1535236, 1441609, 1847203, 2269368, 2299318, 2092798, 1976907, 2000312, 1961862, 1695533, 1328287, 1264882, 1707316, 2203065, 2068533, 1333787, 774337, 847877, 1152711, 1175369, 958798, 685216, 251603, -247367, -226193, 597482, 1617798, 2127997, 2169387, 1999076, 1367545, 178728, -714445, -485090, 209382, -66044, -1379571, -2134803, -1167965, 807722, 2245690, 2499489, 2043751]
39764B043751n24601m07932m11216m18352j14046N00955Q39872L77373m41037
39755A444767o13966l5814L08692r9037n09343j97391L66529M01550R4038J07077
39745A267102L94285L96588K2843l52480n35072m78040J7805Q86986J432744J058262
39735D111023J01702o10775p36425m70604n8607K31772R5482l38423m83916j99154
39725A642075j14653n68002r41860o96788k80166k29076j64040L92027R47723
39716a2760Q55148M97304N13548N01897j93540r66386p13714K25513M57416k53855
39706I10571o98751k25044M53558O80059O67377N30294j18030j055255j201018
39697e6239k19662O69561L20938o95536r39409m8972R55247J044896K57626n01906
$$ y = [2043751, 1519150, 1111218, 700002, 281650, 167604, 668559, 1508431, 1885804, 1444767, 830801, 794987, 1103679, 1004642, 495299, 297908, 664437, 1065987, 1160025, 1267102, 1661387, 2057975, 2080818, 1728338, 1193266, 715226, 733031, 1620017, 3052761, 4111023, 4212725, 3601950, 2865525, 2394921, 2336314, 2568086, 2663568, 2325145, 1841229, 1642075, 1527422, 959420, 17560, -679228, -959394, -1188470, -1352510, -960483, -12760, 842388, 1339692, 1853240, 2355137, 2161597, 1195211, 481497, 707010, 1164426, 910571, 211820, -13224, 440334, 1120393, 1787770, 2318064, 2200034, 1144779, -56239, -275901, 393660, 714598, 19062, -920347, -969319, -14072, 1030824, 1288450, 786544]
39687G86544m13512M09314R61616M83978n15000q29598j18873O94354O96531O5272
39677B220626l73826k20999J67664K03372k40383o06969k81100M78488O76582
39668B023455m4132p68224o07520K2279K42810J76109M56187Q05887M64210k49816
39658B521245k72690L82306O73699M73565P70669J564759J346323m76199k208157
39649D775520k101996p29678J58042J57983J85280N83873P59958M96530L42810
39640D628322N87536Q06002O28676K69805R5830J55644K88940L54867K46860q7595
39630G974887n61197r66165j078511p80482k10064K86467N46241P77494J078245
39621G066915J065249N01742N031L62013J261313J563647Q53740j47957p92327
$$ y = [786544, 373032, 782346, 1743962, 2227940, 1712940, 883342, 764469, 1458823, 2155354, 2220626, 1846800, 1625801, 1793465, 1996837, 1756454, 1149485, 868385, 1346873, 2023455, 1979323, 1211099, 603579, 625858, 868668, 1044777, 1500964, 2306851, 2771061, 2521245, 2248555, 2630861, 3304560, 3778125, 4548794, 6113553, 7459876, 6983677, 4775520, 2673524, 1943846, 2101888, 2259871, 2445151, 3029024, 3788982, 4285512, 4628322, 5215858, 6021860, 6650536, 6920341, 7016171, 7171815, 7460755, 7815622, 8062482, 7974887, 7413690, 6447525, 5369014, 4588532, 4378468, 4664935, 5211176, 5988670, 7066915, 8132164, 8633906, 8638937, 9000950, 10262263, 11825910, 12679650, 12531693, 11739366]
39612A1739366j169495j394398j233156p75317n22699m35385J21724J049844J242451
39603H622935L10434m86492M7717J265197J628463P87270l29167r81216j125782
39594I739359q07917j21114L25895j40770j221646j749484j023650L77502J231238
39585F609413Q85337j68584q34414n95668n7059j1216k32363Q4081Q05636Q29637
39575G314800k03980j241183j340094q59136n02232j89693K95553M60872p9860
39566C655047o53816m35945K47675N21356L50313K97149L33381r729n86395p75886
39556B943150m99147j67213J69172O66094Q98810K89246p35192j064672m89999
39547B010249J4193k02165n90526m06976J78413M80454K90248m6182k50617l45649
$$ y = [11739366, 10569871, 9175473, 7942317, 7167000, 6644301, 6208916, 6330640, 7380484, 8622935, 8933369, 8446877, 8494594, 9759791, 11388254, 12175524, 11846357, 10865141, 9739359, 8931442, 8810328, 9136223, 8995453, 7773807, 6024323, 5000673, 5378175, 6609413, 7494750, 7326166, 6491752, 5896084, 5839025, 5827809, 5595446, 5679527, 6485163, 7314800, 7110820, 5869637, 4529543, 3670407, 3168175, 2978482, 3274035, 3734907, 3655047, 3001231, 2565286, 2812961, 3334317, 3684630, 3981779, 4315160, 4305431, 3719036, 2943150, 2444003, 2276790, 2445962, 3112056, 4010866, 4300112, 3564920, 2500248, 2010249, 2024442, 1822277, 1231751, 824775, 1003188, 1483642, 1773890, 1727708, 1477091, 1131442]
39537A131442l41858q0085M48699Q19225N50189j52151m28787J18837P54751O28795
39527C449057R2306J21635O64169O97922j8374n08380k09582K00620J21866m9063
39517D562176J4528j93418q32829r46958K8196R84490O23297n42362r40088j63721
39507B593311P33585Q09916R8502p91826j151540o25513K05759K83013l87100
39498A768107n43667L54415J140109Q24472J84715K51096M72286r7604r01329
39489C452600q65034l28608k12515j40742O68921J416983P72900o03945q28743
39480C331817J68419N98786j89845q70929n65920p0754j62403m56737n15239n63025
39470G04170n99548j61051O09089R07247N97683M04204N87922O32111L63366J87752
$$ y = [1131442, 789584, 709499, 1158198, 1977423, 2527612, 2375461, 1946674, 2065511, 2820262, 3449057, 3541363, 3662998, 4327167, 5025089, 5006715, 4498335, 4288753, 4489373, 4611239, 4562176, 4576704, 4383286, 3550457, 2603499, 2631695, 3616185, 4239482, 3697120, 2757032, 2593311, 3326896, 4136812, 4235314, 3443488, 2291948, 1666435, 1872194, 2155207, 1768107, 1224440, 1578855, 2718964, 3543436, 3728151, 3979247, 4451533, 4353929, 3452600, 2587566, 2258958, 2046443, 1905701, 2574622, 3991605, 4764505, 4160560, 3331817, 3500236, 4099022, 3909177, 3038248, 2472328, 2401574, 2239171, 1782434, 1267195, 704170, 104622, -56429, 552660, 1459907, 2057590, 2461794, 3049716, 3681827, 4045193, 4232945]
39460D232945J51553o3782k81543j63600j70635q50180j486012r82126K08372
39451E94992O81265L08029J02838J79825j87197o70575j85000R23751J113298
39442B861226J90189m39854j79228J76482L23901P37979R96332J33980j174561
39433C626446j182064k272N20396M6348R3336Q36217N72181r27831j560576l78855
39423A643326R24047J081949R82079J209788P51873n57780j095639k86963L21362
39414D974042R434K0291O25942K97263q94042n99184J458456K240887N31143o21036
39404H043196Q97407K575790J833136M20209P58163J489959O06492k86860R79988
39395A7317480K830945L007071L054249N222588P845217Q946853J1565488J9058130
$$ y = [4232945, 4384498, 4320716, 4039173, 3875573, 3704938, 2854758, 1368746, 386620, 594992, 1276257, 1584286, 1687124, 1866949, 1679752, 1009177, 824177, 1747928, 2861226, 3051415, 2611561, 2432333, 2608815, 2932716, 3670695, 4667027, 4801007, 3626446, 2444382, 2442110, 2962506, 3008854, 3102190, 3938407, 4510588, 3582757, 2022181, 1643326, 2567373, 3649322, 4631401, 5841189, 6593062, 6035282, 4939643, 4652680, 4974042, 4983476, 5003767, 5629709, 5926972, 5032930, 4433746, 5892202, 8133089, 8664232, 8043196, 8940603, 11516393, 13349529, 13769738, 14527901, 16017860, 16624352, 16337492, 17317480, 20148425, 23155496, 26209745, 31432333, 39277550, 48224403, 59789891, 78848021]
39387G8848021K6619862K4376722R622328r154456k1230464k2680348j6565168
39380F9836497q582884l386388j958424j811074j122062j022132j881223q02123
39372D9270187L502292P181381P569221Q902885J5460227K3759019L0203032M1295277
39364A87143521O2682065P9376574O3903170J1053423m8119077p6784971o8848261
39357B10406444m6561525l0046030k1326056j4678618r034905o360693n596678
39350G6801939l529884O10001M358544N611611N858698Q677250J4755977K1352755
39342A34496891K9243346M4986572O7858839P7748158N0468789r742517o5278518
39335C29781560q2245985o4379234m0749577k8668596k2664431j4804769q141059
$$ y = [78848021, 105467883, 129844605, 139466933, 130312477, 109082013, 86401665, 69836497, 61253613, 57867225, 55908801, 54097727, 52975665, 51953533, 50072310, 49270187, 52772479, 59953860, 67523081, 76425966, 91886193, 115645212, 145848244, 187143521, 249825586, 329202160, 393105330, 404158753, 356039676, 279254705, 210406444, 163844919, 133798889, 112472833, 97794215, 88759310, 82398617, 76801939, 73272055, 73882056, 78240600, 83852211, 89710909, 98388159, 113144136, 134496891, 163740237, 208726809, 276585648, 354333806, 404802595, 395060078, 329781560, 247535575, 183156341, 142406764, 113738168, 91073737, 76268968, 68127909]
39328F8127909o914118p210738m188710j39020P91818o4535P59041K690683L319731
39319E7172061L852385P955001J6106674K3382157K2515375R715371j0188044
39312A30510980k5278966k7047944j9192597j2225521j0328572q961351n007355
39305B2468674j908602k518548l679070j940151N65420L78168j318113j466163
39297A0581615n57348q57811j801656j381233j68649r9281q33061p59819j52229
39288C970528j66600k08235O44042J111203k61461j972094j649618l5054L57986
39279A790697m92489n22815M90549P69485k2030l47504J86155K92651l06919l28729
39269A509051N54866J026693M58630j44034m6097J97000J05566L5248J21553r5315
$$ y = [68127909, 61213791, 54003053, 49814343, 49675323, 50467141, 50402606, 51161647, 53852330, 57172061, 61024446, 68979447, 85086121, 108468278, 130983653, 140699024, 130510980, 105232014, 78184070, 58991473, 46765952, 36437380, 27476029, 22468674, 20560072, 18041524, 14362454, 12422303, 12987723, 13365891, 12047778, 10581615, 10024267, 9166456, 7364800, 5983567, 5814918, 5715637, 4882576, 4122757, 3970528, 3803928, 3595693, 4239735, 5350938, 5089477, 3117383, 1467765, 1432711, 1790697, 1298208, 775393, 1265942, 2035427, 2013397, 1665893, 1852048, 2144699, 1837780, 1509051, 2063917, 3090610, 3549240, 3405206, 3359109, 3556109, 3661675, 3696923, 3818476, 3723161]
39259C723161o01472p34396l67802j29458k61025l32390j71447n4471J7033K34435
39249A322168K99910j40846n62578j57807P80664J185612Q02819L55319K25132
39240D110393P9355k06736k97540j37121p5682k23021l70508m53106m84038l02884
39230A639112K7608K0055m22976n97741r8013M26310M17438M12529Q95285J159785
39220C879392O12258K03296R56166J907623J360409l84903j477344j335594j043190
39211D678113j076430o90220K23782N77476j18345r48326j059049o27832n4783
39202I04386N48750Q39517M53372j30508j66692j0697m72478r90596k89067J133113
39192A819100J306059m4364q96001k51898K63622o25809j510170p28115O89572
$$ y = [3723161, 3121689, 2387293, 2019491, 1890033, 1629008, 1296618, 1125171, 1070700, 1087733, 1322168, 1622078, 1481232, 918654, 760847, 1541511, 2727123, 3529942, 3885261, 4110393, 4189748, 3983012, 3685472, 3548351, 3472669, 3249648, 2879140, 2426034, 1941996, 1639112, 1666720, 1686775, 1263799, 666058, 568045, 994355, 1411793, 1824322, 2719607, 3879392, 4491650, 4694946, 5651112, 7558735, 8919144, 8534241, 7056897, 5721303, 4678113, 3601683, 2911463, 3135245, 3712721, 3594376, 2646050, 1587001, 959169, 904386, 1453136, 2292653, 2746025, 2615517, 2448825, 2438128, 1965650, 975054, 685987, 1819100, 3125159, 3080795, 2184794, 1932896, 2196518, 1570709, 60539, -667576, 21996]
39183B1996P08400l56117n41726M09984P96528n0535p16353j16666Q14769O86834
39173A657114l31534r93595p34136p0253L93932O02441P13178O78996L93375J4100
39163B323618j50509o9518l7557k00285l38149l30976m53237q03858q38003j03252
39153a001726Q30616R44887J54987o49596q57225n97781n5334O75438J026804
39144D71070M02377o04289o44347L56309Q89989J86234n32187p2244P42280M70694
39134A665886n49205q43655k57702j0116m39013m45924M78765J233409Q30732
39125A663177o4884k64782J46745K20514j64466j88282L94432P18243J44697p00831
39115A904563q61621m63069l69370o86209n96644J61124O49800J28719p18869
$$ y = [21996, 730396, 374279, -167447, 242537, 1039065, 988530, 272177, 155511, 970280, 1657114, 1325580, 331985, -402151, -472404, -78472, 523969, 1237147, 1916143, 2309518, 2323618, 2173109, 2103591, 2066034, 1865749, 1527600, 1196624, 743387, -60471, -898474, -1001726, -171110, 773777, 928764, 279168, -578057, -1175838, -1231172, -555734, 471070, 873447, 269158, -375189, -18880, 871109, 1057343, 525156, 452912, 1195192, 1665886, 1116681, 273026, 15324, 5208, -433805, -879729, -400964, 832445, 1663177, 1598293, 1333511, 1480256, 1700770, 1536304, 1348022, 1742454, 2460697, 2605394, 1904563, 1042942, 579873, 210503, -475706, -1072350, -911226, -261426, -132707, -851576]
39106h51576p86294j77284J68788Q9750K51514P01206O49199p9703n76080k75307
39096h85787K18465K99547L14208O25638P15293J57511l45321o115O07710L85240
39086B086389n12952r26628n62445k71155m39844m29156Q4814M41979K24321O1507
39076b43170M39154O28192j58587j170338r34524M90278J332922M98087r12382
39067c0368j149116j51110O13240L15919k82130k08205L39690N40101K44149k017
39057B30153Q3972K56878L37857M28140N10141L97490J48018J9184m3896l45432
39047B022505p83333q34459l63842J14874K07944J11112N3659j24843m70320n73259
39037f39962k28732P0369j21519l92868p8461O29639R05898N05914M8687L7559
$$ y = [-851576, -1637870, -1815154, -1646366, -1556616, -1305102, -603896, 45303, -34400, -610480, -885787, -667322, -367775, -53567, 572071, 1287364, 1444875, 1099554, 1093439, 1701149, 2086389, 1573437, 646809, 84364, -186791, -626635, -1055791, -970977, -528998, -304677, -243170, 195984, 824176, 665589, -504749, -1439273, -948995, 383927, 882014, -30368, -1179484, -1330594, -717354, -401435, -683565, -891770, -552080, -11979, 232170, 230153, 314125, 571003, 908860, 1337000, 1847141, 2244631, 2392649, 2411833, 2367937, 2022505, 1239172, 404713, 40871, 155745, 363689, 474801, 528460, 403617, -66703, -639962, -868694, -798325, -919844, -1312712, -1391173, -761534, 144364, 650278, 698965, 736524]
39027G36524K31894K00015P599K6078L09510M81995K23113l07784o23605m77529
39017H07810j59763r7678k77002l32599j60746n6472j78732k99532k50325j95009
39007a200048k08977j0739N16329Q84835N51415k84131q53369p11187j30645L14221
38997a132296K81470j50454n73183n54616k9161O26506R50342P41999J08593n91377
38987c22177q69680n03324J49176N36124N88275O08790N85244K29218k81986l55550
38977C64110M5402K64690O9650N1976M77826O38049J0731p38414p31705j74463
38967B77852J90931K97424M56777M05055k60228j054742j112806m92902K9678
38958a262961K28492M27435M80239m1755p21096o15400J89260N71923J41136k13377
$$ y = [736524, 968418, 1168433, 1176032, 1202110, 1511620, 1993615, 2216728, 1908944, 1285339, 807810, 648047, 550369, 273367, -59232, -219978, -276450, -455182, -754714, -1005039, -1200048, -1409025, -1419764, -903435, -18600, 532815, 248684, -604685, -1315872, -1446517, -1132296, -850826, -1001280, -1574463, -2129079, -2158240, -1531734, -581392, 160607, 269200, -322177, -1191857, -1695181, -1546005, -1009881, -421606, 187184, 772428, 1001646, 719660, 364110, 409512, 674202, 743852, 795828, 1273654, 1911703, 1922434, 1184020, 452315, 277852, 468783, 766207, 1222984, 1628039, 1367811, 313069, -799737, -1292639, -1262961, -1034469, -607034, -126795, -168550, -889646, -1505046, -1315786, -743863, -602727, -816104]
38948h16104J15714N46188M91278L27071M90099N94927K37757j57165j18049j5900
38938A695816l11141n85240l00183M2122l59164j037218p03733O87187J548434
38929F76880Q06693n23431o94210M20526J276096Q56583k4995l2333P86453J199680
38919D747942O41909j03991k83521k93968p88961j376259j164817k58561L21213
38910A440986J44467j69903j08349Q5371J91763N13368J088961J226326N27023
38901D940013k10871O8781J141535J692376R94117k82923j082190j221845j259327
38892D779666j396081j116730j19308Q89304R60359K99644L4714M21721L47591
38883E100880p42781j532908o65773R49591J305595L42728q6328O51380R60294
$$ y = [-816104, -700390, -154202, 337076, 664147, 1154246, 1749173, 1986930, 1829765, 1711716, 1695816, 1384675, 799435, 499252, 541374, 182210, -855008, -1558741, -871554, 676880, 1483573, 960142, 265932, 686458, 1962554, 2819137, 2794142, 2761809, 3548262, 4747942, 5389851, 5285860, 5002339, 4708371, 3919410, 2543151, 1378334, 1119773, 1440986, 1585453, 1415550, 1307201, 1392572, 1584335, 2097703, 3186664, 4412990, 4940013, 4729142, 4797923, 5939458, 7631834, 8625951, 8343028, 7260838, 6038993, 4779666, 3383585, 2266855, 2147547, 3036851, 3997210, 4296854, 4331568, 4753289, 5100880, 4358099, 2825191, 2159418, 3109009, 4414604, 4757332, 4671004, 5322384, 6282678]
38874F282678j76591j345963r46983K39246L43934p18106j360178q02632J12130
38865A627535M48252K44428n957m553K64904M50234J9102q75830j160202k34797
38855G73116R01678R00353k4224n69088l70784k23386l99485k11709N12776Q73012
38845B162259L35615l61259l74502N0967K04407N979j78840k57494l04040j63998
38835A119094K39195N21901L06046j62496l48092k17452k29849n72692q24145
38826a68490n30930J02900L75342j026l90666l149Q94659J125042K09879q04306
38816H09255p09555J96461O28032J90729k26494N9156N79120N52741k2799n12077
38806A544569m57902K3376M20661L11606j55480m03904k68666k83848o96055p92842
$$ y = [6282678, 6106087, 4760124, 3813141, 4052387, 4396321, 3678215, 2318037, 1515405, 1627535, 2075787, 2320215, 2314258, 2309705, 2574609, 3024843, 3043945, 2168115, 1007913, 773116, 1674794, 2575147, 2550923, 1981835, 1611051, 1387665, 988180, 776471, 1289247, 2162259, 2497874, 2136615, 1762113, 1813080, 2017487, 2023466, 1844626, 1587132, 1283092, 1119094, 1358289, 1880190, 2186236, 2023740, 1675648, 1458196, 1228347, 655655, -168490, -699420, -596520, -221178, -222204, -612870, -616019, 278640, 1403682, 1613561, 809255, 99700, 296161, 924193, 1114922, 888428, 947584, 1526704, 2079445, 2056646, 1544569, 1086667, 1110043, 1530704, 1842310, 1686830, 1282926, 1014260, 730412, 34357, -758485]
38796g58485l3462P26921L46134o28972n84046N82980J154476K71065p28427m89765
38786a41581K85536J70889o54606q13651J14656J136314J289603N39432n99638
38777A326954j489200j555129p62261J96254O69327P45607P72869O76074L26865
38768I07360O9687J83867K85890j9417l71646k97120j01670k54978l99027J1529
38758A4475N17748K61090n05192p22069k00985K37545K67574M09609P42881N81513
38748A604189j87552o43467k35064L90616N10165K94322P0621l86756j078449
38739C38625j216912l84472M84511L30431l69014l07750N87385J025034L19666
38730H07504o39414p65223k27388O8396j34409k94806o6716K59351L79470M71620
$$ y = [-758485, -791947, -65026, 281108, -347864, -931910, -348930, 805546, 1076611, 348184, -141581, 143955, 314844, -339762, -1153413, -1038757, 97557, 1387160, 1926592, 1326954, -162246, -1717375, -2479636, -2283382, -1614055, -868448, -95579, 580495, 907360, 977047, 1160914, 1446804, 1427387, 1055741, 758621, 656951, 401973, 2946, 14475, 532223, 793313, 288121, -433948, -634933, -397388, -129814, 279795, 1022676, 1604189, 1416637, 773170, 538106, 928722, 1438887, 1733209, 1803830, 1417074, 338625, -878287, -1262759, -778248, -447817, -816831, -1124581, -537196, 487838, 807504, 168090, -597133, -824521, -756125, -890534, -1185340, -1252056, -992705, -613235, -141615]
38720a41615P55464R34279N47626k58746q12702p86235m95794k35855J07964N15656
38710A30042N34781K2882l71317j23832K53531J5042n23603m76424Q7778K48820
38700b02300j73280l47363L5909J95397k79418n43954J54379J151807J287391
38691A278568N00557l55094p82100q63276o16687j8593N24973N10358O1627k78983
38681c8650l47865l70246l41507l7428M20198O11042M59914L25860L82314L42389
38671A406021o6774o43509q69964m65373K09389L68786l21519j134060j005746
38662b522749O6543R57666R29208M84622L21008K26286k76331q31013p05247J019
38652a348988M55087K46943k41043m87691k91444K47743P22422O51994J36088
$$ y = [-141615, 613849, 1548128, 2095754, 1837008, 1024306, 238071, -257723, -493578, -385614, 130042, 664823, 687705, 316388, 192556, 446087, 461129, -62474, -538898, -451120, -202300, -375580, -722943, -687034, -491637, -771055, -1315009, -1160630, -8823, 1278568, 1779125, 1424031, 641931, -221345, -838032, -856625, -331652, 178706, 240333, -38650, -386515, -756761, -1098268, -1135696, -715498, -104456, 355458, 681318, 1063632, 1406021, 1339247, 695738, -174226, -639599, -430210, -61424, -382943, -1517003, -2522749, -2456206, -1498540, -569332, -84710, 236298, 462584, 186253, -644760, -1350007, -1348988, -893901, -646958, -888001, -1375692, -1667136, -1419393, -696971, -44977, 91111]
38643I1111j41480L4868J9982m61813n69385K50030R91942N14388m93042n09025
38633b72424L39166N46085k09205o26849o9583N29037M66761K81136L54512J31455
38623A470091n06519o27486O6710M03262l22782r41261k53970Q83408Q43277k52355
38613G62375q59312l69773L12587L50078r3868m41493l14232L32036J015018R78508
38603A671924K24563k61300J9808J73716n89553j411411j032325R6944M81443
38594f26191m6831k60512K73399N90781J31123l79568l04314n4377j00651j30412
38584i07553J63908L63751P3643k98196j50665L92429O84576L66328l14009p20795
38574c46583l29503O21816J102139M69401m98437n27878L27915P70887K03663
$$ y = [91111, -50369, -15501, 4481, -457332, -1026717, -776687, 215255, 729643, 236601, -272424, 66742, 612827, 403622, -223227, -292810, 236227, 702988, 984124, 1338636, 1470091, 963572, 336086, 402796, 806058, 483276, -457985, -711955, 171453, 1014730, 762375, -96937, -466710, -154123, 195955, 102087, -339406, -653638, -321602, 693416, 1671924, 1896487, 1635187, 1654995, 1828711, 1239158, -172253, -1204578, -1107634, -626191, -673022, -933534, -660135, -69354, 61769, -317799, -622113, -676490, -777141, -907553, -743645, -379894, -306251, -604447, -755112, -362683, 321893, 688221, 374212, -346583, -676086, -54270, 1047869, 1517270, 1018833, 490955, 818870, 1589757, 1793420]
38565A793420n02377m84948q3167j7485k50147l23442k13834k14972l51714l67713
38555a016379n4665N61462J045847O88879n66954j510199r12736O30756J262631
38546A28642M24549m48000k24628L37540J48794l53366j06617P02942R63449L29810
38536A903115n28161j020345j015883m54445N07420J205436J116580N59144J00665
38527B373526l06684q61881j101471n11572L90888N84638k8539o17513o75400
38518g54008m10784m7761L66764N38537J69515l97119n38959k87806j60357k06349
38508a728327m5990K80685L81416L23556M63809N66537J01711o08497o41401L3326
38498h73175M44926K10423N4519L91495O12494L70825L93035J148029J708447
$$ y = [1793420, 1291043, 806095, 722928, 705443, 455296, 131854, -81980, -296952, -648666, -1016379, -1071044, -509582, 536265, 1225144, 658190, -852009, -1764745, -1133989, 128642, 553191, 105191, -119437, 218103, 366897, 13531, -93086, 609856, 1573305, 1903115, 1374954, 354609, -661274, -1115719, -608299, 597137, 1713717, 2272861, 2373526, 2066842, 1204961, 103490, -408082, -17194, 567444, 538905, -78608, -754008, -1164792, -1212553, -845789, -307252, -137737, -534856, -1073815, -1361621, -1521978, -1728327, -1774317, -1493632, -1112216, -788660, -324851, 241686, 343397, -265100, -906501, -873175, -428249, -217826, -163307, 228188, 840682, 1211507, 1604542, 2752571, 4461018]
38489D461018J019677l86639j082418p38258l20885m55350o54477l43317J95529
38480A694880L00480j16406m90111l25180K30380N54663K71979k63998l66650
38471A490037J17210O03751N14170o9392o33654q32372o52804k38240K01763M52775
38461I53244M66015L79860K98570K04159J15379R5506N3166j82880n11240n82753
38451A289026k90834N8096J86555J60802J34659R1237P985n988P8498R5827o8735
38440A737128l22336n30905o13580m57198l8842L63068M35710K92483K39358J38698
38430A243584l84080j055231j035555j65019O16287N46679Q3522Q4639N10042
38421D44868O44295K35603l01049n95202n87273k41743L78855Q16233N66301k28852
$$ y = [4461018, 5480695, 5094056, 4011638, 3273380, 2952495, 2497145, 1842668, 1499351, 1694880, 1995360, 1878954, 1388843, 1063663, 1294043, 1848706, 2120685, 1856687, 1490037, 1607247, 2210998, 2725168, 2655776, 2022122, 1189750, 536946, 298706, 500469, 953244, 1419259, 1799119, 2097689, 2301848, 2417227, 2512733, 2565899, 2383019, 1871779, 1289026, 998192, 1056288, 1242843, 1403645, 1538304, 1629541, 1637526, 1631538, 1710036, 1805863, 1737128, 1414792, 883887, 270307, -186891, -225733, 137335, 573045, 865528, 1104886, 1243584, 859504, -195727, -1231282, -1396301, -780014, -233335, -149813, -65174, 444868, 1089163, 1324766, 1023717, 428515, -158758, -400501, -21646, 794587, 1360888, 1132036]
38411A132036q55318q12181k19547M62778Q05145O33339K15580O0932K23222J07189
38401A753175n86525j098404n20012P25077J200847L68982o83102p85296j89412
38392A85330Q0702j83789k83641Q5077L21238n4186n50916m02851K89740P37528
38382B24232O29709M35454M56408L12528k53455p26820n99451k66899l50815n41038
38372f80147j14272O26732O25427j71489n99922j43057K77495m3205m30685j94462
38362h47585O7158k96218n30129K51520J177562P78306m52504o19045N06988J030488
38352A066541L633j024140n28446N85325N45213m82031q29658j3584O77148K78949
38342B78950n27427n86682J89134R57108J042857M49434l65944q23288n46050
$$ y = [1132036, 276718, -535463, -755010, -292232, 512913, 1146252, 1361832, 1422764, 1645986, 1753175, 1166650, 68246, -451766, 273311, 1474158, 1843140, 1160038, 374742, 185330, 266032, 82243, -201398, -116321, 204917, 150731, -400185, -803036, -513296, 224232, 853941, 1289395, 1745803, 2058331, 1804876, 1078056, 478605, 211706, -139109, -680147, -794419, -167687, 457740, 286251, -313671, -456728, -179233, -222438, -653123, -847585, -780427, -1076645, -1606774, -1355254, -177692, 600614, 148110, -470935, 36053, 1066541, 1070174, 46034, -482412, 102913, 648126, 166095, -663563, -677147, 1, 278950, -248477, -835159, -646025, 311083, 1353940, 1803374, 1437430, 614142, 68092]
38333F8092K69204Q62706N96327k90990q31584m15390M23952O36266M3267l91404
38323I70446P1633Q38853Q30100Q2405l18939J32788O86697N31860j09331n32936
38313C183576n57039m04045p4280M98339R57581Q48157L17650m6015k0370Q2019
38303D785573K108j82382l76659o16105q04528p09427l58538q4450M428K52094
38293A912114Q70034J402062J207601M12464r7609J79854O17796K68053p91147
38284E981222j491457j219644o00415m69909o16024k10367P84476J437209J120980
38275D716071K69406l41008m75719l33015p3602J66143J71026q2278l22747l97007
38265C297270m57951n30949l34813J45411L81496N2695l55199k63194N3030q6309
$$ y = [68092, 337296, 1200002, 1796329, 1505339, 673755, 258365, 682317, 1318583, 1361850, 970446, 1042079, 1880932, 2711032, 2793437, 2474498, 2607286, 3293983, 3825843, 3716512, 3183576, 2626537, 2222492, 2148212, 2646551, 3604132, 4452289, 4769939, 4723924, 4703554, 4785573, 4787681, 4605299, 4228640, 3612535, 2808007, 2098580, 1740042, 1655592, 1660020, 1912114, 2782148, 4184210, 5391811, 5804275, 5706666, 5886520, 6504316, 6772369, 5981222, 4489765, 3270121, 2669706, 2199797, 1583773, 1373406, 2157882, 3595091, 4716071, 4985477, 4644469, 4168750, 3835735, 3762133, 3928276, 4099302, 4017024, 3694277, 3297270, 2839319, 2308370, 1973557, 2118968, 2500464, 2553159, 2197960, 1934766, 1987796, 1901487]
38255A901487n96783o94227j26831L98364K24841m00082p69005n92718j54297
38246h09251J17059O586l14950l55214J83059Q55959Q35865K953p50470o42982
38236h71386l1896J87757p8997q9969M49499Q26940L95508l86572n81039j09128
38226b89283K21487l9411m12991l40358J6684J86075J13232K8555l5748j05115
38216f56873L2933M26330N59088L0670n94317m39840K65659L89999l44386q45163
38206a175900l48836L50454J53427o20081p65116l0023O38745O09609L50320M78623
38196c58778P78273N98722j36999p33705n14629L34218Q42712L54461n57650p35231
38186a28606m7344L45019k93296j080119q09467J98765O04510O7298m10991j25374
$$ y = [1901487, 1304704, 610477, 483646, 882010, 1106851, 706769, -62236, -654954, -809251, -692192, -685606, -1000556, -1355770, -1172711, -316752, 519113, 522066, -228404, -871386, -903282, -715525, -794522, -884491, -434992, 391948, 787456, 400884, -180155, -289283, -67796, -107207, -520198, -860556, -843872, -657797, -544565, -516010, -551758, -656873, -623940, -197610, 361478, 392148, -202169, -642009, -376350, 13649, -330737, -1175900, -1524736, -1174282, -1020855, -1640936, -2406052, -2436075, -1797330, -1187721, -837401, -358778, 419495, 1018217, 881218, 147513, -367116, -32898, 809814, 1164275, 606625, -128606, -175950, 169069, -124227, -1204346, -2013813, -1815048, -1210538, -1143240, -1554231, -1679605]
38176a679605M96467Q85383J088751J182094Q90217K69323q1618J034j30819p66508
38166B154719j115180m99075M50827O73513J97019j62696j96490l65345o88040
38157D49252o14134m1160M46718M97314L78858L07236J31143j07454k4022L88955
38147A812706N33561P4462m97208n61806j89726J21016J46035J1182j06267m8332
38137A295623K25684L84493J2958n90245n13540M12022J023833L38356q99757
38128A689427j164748l15234L44530J24441k00102N4623K95579j90820q24536
38119a86840n34398N17493J086953N92967k14719m17402q366L90476L39910j02740
38109A463334n01324l69258K85014P62926M40575l39868o77943l64216m2152p1382
$$ y = [-1679605, -1183138, -297755, 790996, 1973090, 2863307, 3132630, 3051012, 3052046, 2921227, 2154719, 1039539, 540464, 991291, 1664804, 1861823, 1699127, 1502637, 1137292, 449252, -164882, -206042, 240676, 737990, 1116848, 1424084, 1555227, 1447773, 1423751, 1812706, 2346267, 2420729, 1923521, 1361715, 1171989, 1293005, 1439040, 1450222, 1343955, 1295623, 1521307, 1905800, 1918758, 1328513, 814973, 1226995, 2250828, 2589184, 1689427, 524679, 209445, 553975, 678416, 478314, 532937, 828516, 637696, -186840, -721238, -203745, 883208, 1476175, 1261456, 844054, 835688, 1226164, 1566074, 1463334, 962010, 592752, 877766, 1640692, 2081267, 1741399, 1063456, 699240, 657088, 585706]
38099E85706n6194K22206K82889j05409k58592L53615J010484O79868l54050q63632
38089A496891m95093j02764k19996l34678l0682J99458j07679m83258l15895J07811
38079b85885J87669J23028M81800R70560P10563k71337q83900n61081n5724j75176
38069B40517n62863m26813J57905N00268M35711L58265L53826J84126J9712K44864
38059A505518N04503m724j026690j146258J83332J520699J273191j21353r65438
38050A722780o98283k28811j47889l7849L02300L03465k26617n33699j22293L99097
38040G32201L51751M1503M4479J80005K2649j82565n056K57482M7753m39279n75063
38029D75860l07284j8298K79112P01397P92861J11705p05453n96678K81726P16230
$$ y = [585706, 529512, 751718, 1034607, 929198, 670606, 1024221, 2034705, 2714573, 2360523, 1496891, 1001798, 899034, 679038, 344360, 313678, 513136, 405457, -77801, -393696, -285885, -98216, 24812, 506612, 1477172, 2187735, 1916398, 1032498, 471417, 415693, 240517, -322346, -749159, -591254, -90986, 344725, 702990, 1056816, 1240942, 1260654, 1505518, 2010021, 2005297, 978607, -167651, 15681, 1536380, 2809571, 2688218, 1722780, 1024497, 795686, 647797, 609948, 912248, 1215713, 989096, 455397, 333104, 732201, 1083952, 1125455, 1169934, 1349939, 1372588, 1190023, 1184967, 1442449, 1490202, 1050923, 475860, 168576, 150278, 429390, 1130787, 1923648, 2035353, 1329900, 733222, 1014948, 1731178]
38019A731178K66434k71378l73509m58352o84082m19511M20590P50636n0382r12065
38009d41n73607M98002Q92754L84464o302K18904M71146K79439n1211j78797k18363
37998A715988k56682j27772R7952Q4203j05114p962L27601K06401n27306r21835
37988D85474k08458R04572J074464J75079n94441m40768Q7482J96018O4198L13154
37978B056774P71032O39424k06486r15242q54104l95486j28009P8435N93944J063044
37968B703326P41493k92236j018227p25975J58895O84609M00093l69298r22362
37959A360318p69275j19091K60274J4923j83263L97023J200357R53093l94854
37950B719505j407037j177552m80036k92916l11101J10868N18208J57385m35364
$$ y = [1731178, 1997612, 1726234, 1352725, 894373, 210291, -209220, 211370, 962006, 911624, -441, -574048, -76046, 816708, 1201172, 1194870, 1413774, 1884920, 2164359, 2113148, 1934351, 1715988, 1459306, 1331534, 1429486, 1513689, 1408575, 1400613, 1728214, 1934615, 1407309, 485474, 277016, 1181588, 2256052, 2431131, 1836690, 1395922, 1483404, 1679422, 1743620, 2056774, 2827806, 3467230, 3260744, 2345502, 1491398, 1095912, 967903, 1046338, 1640282, 2703326, 3444819, 3152583, 2134356, 1408381, 1567276, 2251885, 2651978, 2282680, 1360318, 591043, 471952, 732226, 747149, 563886, 960909, 2161266, 3114359, 2719505, 1312468, 134916, -345120, -638036, -949137, -838269, -320061, -162676, -598040]
37941e98040j15809Q71734J069252O2890q30130n38615K95930M81489q399k75962
37931D14340R2089O08619O58518J63587m60162p54228o80399o26142p59993n97593
37921a941364K79042J246505J188699R9342p48329n38195P4731J95418L6307K23158
37911A15314M94926J83733m21451l82726K88416N10196j60743p80821n00556J24779
37901e28933R1945m49569n45816n3540J89269j51962l38112J16948N16466J39621
37891a013683m09692o8723Q74512J075779K28236m26611o9315M38360M0100p83686
37881a14723q49526j43009L51264K89507J87003J64847k22471p87422n95158N26153
37871a193535J412252J089072O4087n11190l20826O6412J16119k44297p23427
$$ y = [-598040, -713849, 157885, 1227137, 1290027, 459897, -78718, 217212, 698701, 690302, 414340, 506429, 1115048, 1773566, 1937153, 1476991, 722763, 42364, -583778, -1343771, -1941364, -1662322, -415817, 772882, 872224, 123895, -414300, -339569, -144151, -107844, 115314, 610240, 793973, 372522, -10204, 278212, 788408, 627665, -153156, -653712, -528933, -436988, -886557, -1432373, -1485913, -1296644, -1448606, -1786718, -1669770, -1153304, -1013683, -1423375, -1492098, -617586, 458193, 686429, 259818, 190503, 628863, 668963, -114723, -964249, -1107258, -755994, -466487, -279484, -114637, -337108, -1124530, -1719688, -1193535, 218717, 1307789, 1371876, 860686, 539860, 606272, 722391, 478094, -245333]
37862b45333p92582j25542P96753J043477M75711j9202J21558L36575J3900m66007
37852A139308n07179l59398m85427n29471o194M94669N6524q67802q50597L59904
37842a555663J361581J105420K56065p985L43707M46640r8855q06187j014627
37833C0096n82736L3643K36904l6344j64995L01232Q21139N20997l92363p06843
37823F0730R8417J047397R85579K5278q43912j027444o49216o9681L24329J95853
37813A47330l09639m84604O6570P42957O79262o0435n84658l33591L88320R48616
37803A200128R76900M91132j30182l82018k25411k66282q80683j421451r87120
37794a624987J53913P65026L72122j14137J16478N42624K75027m14112n03274
$$ y = [-245333, -1037915, -1163457, -366704, 676773, 1152484, 1133282, 1254840, 1591415, 1605315, 1139308, 632129, 272731, -212696, -742167, -748361, -253692, -197168, -1064970, -1915567, -1555663, -194082, 911338, 1167403, 1159418, 1503125, 1949765, 1850910, 1044723, 30096, -552640, -518997, -282093, -318437, -483432, -182200, 638939, 1159936, 767573, 60730, 159147, 1206544, 2192123, 2217401, 1373489, 346045, -303171, -372852, -48523, 147330, -162309, -646913, -580343, 162614, 841876, 781441, 196783, -136808, 251512, 1200128, 2177028, 2668160, 2537978, 2155960, 1930549, 1664267, 783584, -637867, -1624987, -1471074, -706048, -333926, -448063, -331585, 211039, 486066, 71954, -431320]
37785d31320J32089N44469K62502o060L43369P01047J98528p90821j099801n11279
37775f57277Q763n7796k5083O07099J041162M10212o18809p03553Q1535L84714
37765D70967k06192n51608K6299N42330J7896q29697p41347R1713N23388L85245
37755b71006M71881Q29237N82346l57855q40998k53535M36122J54118o66161q24461
37745g40312j11549N56369M73218j25741n69741m51789J37637P08713P53891K57955
37735H88651k88014m96745m44367k96908J4673M72116P08117M51777j3380j72900
37725H23020J15248N58285P46144L93411m06867j040606r10074k60752N5980j83957
37715a10168k73755J93041O13623M32245O6465L2766m4198n85336r45734l40649
$$ y = [-431320, -299231, 245238, 507740, 501680, 845049, 1546096, 1744624, 953803, -145998, -657277, -648514, -706310, -731393, -124294, 916868, 1327080, 708271, 4718, 86253, 470967, 264775, -286833, -260534, 281796, 299692, -530005, -1271352, -1179639, -656251, -271006, 200875, 1030112, 1612458, 1254603, 413605, 160070, 596192, 750310, 84149, -740312, -851861, -295492, 177726, 51985, -517756, -969545, -831908, -123195, 630696, 888651, 600637, 103892, -340475, -637383, -622710, -150594, 557523, 1009300, 995920, 823020, 938268, 1496553, 2242697, 2636108, 2229241, 1188635, 278561, 17809, 73789, -110168, -383923, -190882, 422741, 854986, 921451, 954217, 910019, 324683, -621051, -961700]
37705i61700O48640Q13119K15989m6759K01222L4235p30649j078545n58933k4954
37695a488335m3934L2561O59760J076926O51059Q4066J71654L65453j65217q59802
37685D84191n81163M11990P63139Q4387o27555o43033l14757o5496K77470P35688
37675E24861P28253n6115r66223j116099m39099L74935P19030N37398J51976j14431
37665C44486j80850j67976j49390p9947k0678j55859m05703l51210J57840O39966
37655c69321N92671J65893j65850k80402l12508k28360k7584m3777m41572p13279
37645a824089l49342K55014L25284n0105n5614N05913Q70280M85059k02704m14256
37635d54560R209N49841N83050n2016p96294q44404j75619K61445j36227o52774
$$ y = [-961700, -313060, 500059, 716048, 669289, 870511, 904746, 174097, -904448, -1463381, -1488335, -1532269, -1499708, -839948, 236978, 888037, 972103, 1143757, 1509210, 1343993, 484191, -96972, 315018, 1078157, 1162544, 534989, -108044, -422801, -488297, -210827, 524861, 1253114, 1196999, 230776, -885323, -1324422, -949487, -230457, 306941, 458917, 344486, 163636, -4340, -153730, -233677, -254355, -410214, -815917, -1167127, -1009287, -369321, 223350, 389243, 223393, -57009, -369517, -597877, -625461, -669238, -1110810, -1824089, -2173431, -1918417, -1593133, -1643238, -1698852, -1192939, -322659, 162400, -40304, -454560, -445351, 104490, 687540, 635524, -160770, -1005174, -1180793, -919348, -1055575, -1708349]
37625a708349l42885M37390O23489J68713n9801R7895m5609n25510n24990O0117
37615a819540K61149k97021o89609k52330L77152M72474L36224M44670N30235
37606f36596L14986J73069K70893M3326o48644q83679j40866O48501N66395J93126
37596i9489M18652P61935K95664n74638p92509m73547m79778o99734l97986J16565
37586a924865p8977o32438k83313Q50981J209613L23718l79182Q9696P84505N28242
37576D87980k72209n41462k08020O9996P5555R246j05591k29912o7896L34946
37566d47367L37709l13339q53125n49459J67947L88256O8734r3359J87252N37837
37556e68914O41412M97374R2762n35141r53902o62427J58758O94818M25064l09535
$$ y = [-1708349, -2051234, -1613844, -990355, -821642, -881443, -783548, -829157, -1354667, -1879657, -1819540, -1558391, -1855412, -2545021, -2797351, -2420199, -1947725, -1611501, -1166831, -636596, -321610, -148541, 122352, 165678, -482966, -1366645, -1507511, -859010, -292615, -99489, 319163, 1081098, 1376762, 802124, 9615, -463932, -943710, -1643444, -2041430, -1924865, -2003842, -2636280, -2919593, -2068612, -858999, -535281, -914463, -824767, -40262, 487980, 215771, -325691, -533711, -463715, -388160, -378914, -484505, -714417, -782313, -447367, -109658, -422997, -1276122, -1825581, -1657634, -1269378, -1200644, -1294003, -1106751, -568914, 72498, 569872, 662634, 127493, -826409, -1488836, -1330078, -635260, -210196, -519731]
37546e19731p58945n52563L1031M12765K64963k13105n40576m38659O187N63117
37536a745516R94027R90281L34120o87142j282163q72014K15760R66964P06397
37527c79286j36976m71639J21895P63771M23086n10794o41703L11520Q87486L7450
37517D04810j134203r53463K52820O96380q3300o59722j19351O16292M90163m5684
37507e35258l067N23526P05253L06071k14569m99951n00296k30359J25945K04044
37497a18661l4009j76532o5952r0533m15989n54564j74728K71174K78234Q9204
37487i92356J77922M30660M42299K13885Q124j18445j90059j31441q1940l65269
37477f06620p88298o40931J56004O74040L41340j19493J31188P15322P90029M44541
$$ y = [-519731, -1278676, -1831239, -1800208, -1387443, -1122480, -1335585, -1876161, -2314820, -2308633, -1745516, -751489, 238792, 572912, -114230, -1396393, -2268407, -2052647, -1085683, -379286, -516262, -987901, -866006, -102235, 320851, -189943, -831646, -520126, 367360, 404810, -729393, -1682856, -1430036, -733656, -816956, -1476678, -1596029, -979737, -489574, -535258, -538325, -14799, 690454, 996525, 781956, 282005, -218291, -448650, -322705, -118661, -152670, -329202, -395154, -485687, -901676, -1456240, -1630968, -1359794, -1081560, -992356, -814434, -383774, 58525, 272410, 280534, 162089, -27970, -159411, -241351, -606620, -1394918, -2035849, -1879845, -1205805, -864465, -983958, -852770, -137448, 652581, 1097122]
37467A097122L13473L54635J11055k28504j46994J22821o0452n32164n40861q2364
37457D07767N4933l89282p59330n53623o6420J94492R2948j96884l25132M9700
37447a490831P17672Q61424J42772n81268l95653K82418L91434j24067m47421
37438f43520l35187k17770q3961M33579R46262O29873k77594o19879j23210K56213
37428c5194J9344j76529J18984L78321J97720J0812J68495L51983L59457M30878
37418A824271M19599j74999r52709p52753L87397Q80803j279q66144m23328M62030
37408H02888L28982m89175o65216j71827n3101m55372n50080j44115J40150J47613
37398a109253K80536M05491p429o75610p06497o8905L31216J31305r4176k4607
$$ y = [1097122, 1410595, 1765230, 1876285, 1647781, 1500787, 1623608, 1563156, 1030992, 490131, 407767, 462700, 73418, -685912, -1239535, -1305955, -1111463, -1018515, -1215399, -1540531, -1490831, -773159, 88265, 231037, -350231, -745884, -463466, -72032, -196099, -643520, -978707, -1196477, -1280438, -846859, 99403, 729276, 451682, -168197, -291407, -35194, -15850, -192379, -73395, 304926, 502646, 513458, 681953, 1033936, 1393393, 1824271, 2243870, 2068871, 1116162, 363409, 750806, 1631609, 1630330, 764186, 340858, 802888, 1131870, 642695, -22521, -194348, -247449, -702821, -1252901, -1397016, -1256866, -1109253, -828717, -423226, -430655, -1106265, -1812762, -1881667, -1550451, -1419146, -1513322, -1537929]
37388a537929J2366J0610M18289J001355Q29677j20652n82816Q8292P69705K82844
37378A171741p19609p90520K2462L08998m37270j037186m73845N41953O09092
37369h04184l41015r57926l46261P71678J122503N67006Q6469K82816O33028M12663
37359A426777k74536p87989p98124l73980L71323J135903J222238J84053j355752
37350G49913k132878j564304k27966R26726J361187R97762J05702p06926q67610
37341a358394m01477J90222O18909R49412J076897O74519j57035p55270p10530
37332A27253l58021j65529r4532O0431J35276j04472m19715l66861M8188M44184
37322f93798O68511Q48972R00359N14449k36481p52697o20059j36086J66146K32517
$$ y = [-1537929, -1525563, -1514953, -1096664, -95309, 734368, 613716, 30900, 119192, 888897, 1171741, 452132, -338388, -315926, -6928, -444198, -1481384, -1955229, -1413276, -804184, -1145199, -2103125, -2449386, -1677708, -555205, 11801, 98270, 381086, 1014114, 1426777, 1152241, 364252, -433872, -807852, -436529, 699374, 1921612, 2105665, 749913, -1382965, -2947269, -3175235, -2248509, -887322, 110440, 216142, -490784, -1358394, -1759871, -1569649, -950740, -1328, 1075569, 1750088, 1593053, 837783, 127253, -230768, -396297, -490829, -430398, -295122, -399594, -819309, -1186170, -1137982, -693798, -25287, 823685, 1724044, 2238493, 2002012, 1249315, 629256, 493170, 659316, 891833]
37312H91833L32161L82954j7719q21944j324084j025912l12977J35318K81332
37303a479038N28604Q14130O37209K6895k96983k0362K16022j53976o62906n49423
37293i39828P722K07853p7833k19381l808J4844m15497o41805p3136Q17672J064891
37282b58306M77862k29759m42165k46044j8708J12738J99900J78427m3039k97671
37272e66765k53635J44432N29807N45778K85485J20253J86497K80244K31701J21587
37262A625384Q2132J13661J46576P4023k55397p68446r29456k61382P90726J106020
37252A723841L16657n75931n18255J58851L28055k29616n83410j34605M96754
37243I82341M24255k41922o13508k70572K30614J84726k95415m93948j84866O979
$$ y = [891833, 1223994, 1606948, 1589229, 767285, -556799, -1582711, -1895688, -1760370, -1479038, -950434, -136304, 500905, 527800, 230817, 210455, 426477, 272501, -390405, -939828, -932106, -724253, -802086, -1021467, -1025275, -1010431, -1425928, -2067733, -2140869, -1323197, -258306, 219556, -10203, -452368, -698412, -717120, -604382, -404482, -226055, -269094, -566765, -820400, -675968, -146161, 399617, 685102, 805355, 991852, 1272096, 1503797, 1625384, 1707516, 1821177, 1967753, 2041776, 1786379, 1017933, 88477, -172905, 617821, 1723841, 2040498, 1464567, 946312, 1105163, 1433218, 1203602, 620192, 485587, 982341, 1406596, 1164674, 551166, 280594, 511208, 695934, 400519, -93429, -278295, -271316]
37233b71316l68763p03803j69587Q34602J045625K10334m87007k51649J81717
37224B0153n2331m69509k11437L46506K60088k79316l07916J64268K29072j81913
37214d82335j17999O45167J079656N35666l18891o74410o05900m27340p1910L27445
37204a10851K35587l14414n05383q1355J11150l85361p03172j27070N36721K48839
37194a095309m68812m05363K76237L66289k62102l98633M71754J249513Q37792
37185E71366l17131r30620n13019K64962N30608J43912k38821M9419P76753R23527
37175A260956q404j132398j180509j55313P03166N44947k06137o88695o37352
37166a499739l26434l9413O8675l9004j44350P6781N62938Q28246O13235K61670
$$ y = [-271316, -640079, -1343882, -1513469, -678867, 366758, 577092, 90085, -161564, 20153, -32178, -501687, -713124, -366618, -106530, -385846, -693762, -529494, -300422, -482335, -600334, 44833, 1124489, 1660155, 1341264, 666854, 60954, -366386, -438296, -110851, 124736, -189678, -695061, -776416, -665266, -1050627, -1753799, -1880869, -1344148, -1095309, -1564121, -1969484, -1693247, -1326958, -1589060, -1987693, -1515939, -266426, 571366, 254235, -676385, -1189404, -924442, -393834, -249922, -488743, -439324, 337429, 1260956, 1252552, 120154, -1060355, -1215668, -512502, 32445, -173692, -862387, -1499739, -1826173, -1865586, -1796911, -1835915, -1980265, -1903484, -1340546, -512300, 100935, 362605]
37156C62605K07989L74953L82329J47865n9605p6646k8117l1554k494J14568J34831
37145A526724j11514m12314l66699K1517K75720J20923j36721j82074k30197n05473
37135a08n75909L3060P86582O69711j98130n48731J18426P08481K59949n17602
37125G35729m00678M23011P55562K73585j96438j44967J9285o3085j31301J5248
37115A285951N1852k95677p55067q78981n30290J32657P74072R45977M66803k25498
37105I71799n02881l06289n7860O1631J91233K49857K506l27541k43739J25772
37095A64488R5891l74181l71795N88876J577190J357379R9700p83123m51291L55757
37085B258891L56547o11132j379257r19432L37092J029183N94335j30892k41248
$$ y = [362605, 570594, 945547, 1327876, 1475741, 1416136, 1339490, 1311373, 1279819, 1277325, 1391893, 1526724, 1415210, 1002896, 636197, 657714, 933434, 1054357, 917636, 735562, 505365, -108, -576017, -542957, 243625, 913336, 715206, 166475, 284901, 993382, 1253331, 735729, 335051, 758062, 1513624, 1787209, 1590771, 1445804, 1465089, 1402004, 1270703, 1285951, 1337803, 1042126, 287059, -591922, -1122212, -989555, -215483, 730494, 1197297, 971799, 468918, 162629, 104769, 166400, 357633, 607490, 609996, 282455, 38716, 164488, 260379, -113802, -485597, 103279, 1680469, 3037848, 3137548, 2354425, 1903134, 2258891, 2615438, 2004306, 625049, -294383, 42709, 1071892, 1666227, 1535335, 1294087]
37076A294087j7218k54131q42610q81810n3424R32451J296522R23208J16821p07358
37066A806538j047259o96613j75077j49826m36170l05596K31371L75532q2398
37057d79498l45738N2972M70728K63082j90797k52700p6255j26323k39233K6765
37047h96997N17490P08562M96383J29262l13222p49198p77708k30318K89351J59212
37037f67183k60187j92660K27876J69496l96733m69100M10487J298439J147816
37028A268251K65954k69295k06696k54203p11009q88548k52630N63650N63791
37019G9265j62603n92494k90684R0893L4833k7539L44004O57562L02986l08982
37009A27241l81648m8623k434j78510j6862K14840k37876r89506p77175M06193
$$ y = [1294087, 1276869, 1022738, 180128, -701682, -755106, 177345, 1473867, 2397075, 2513896, 1806538, 759279, 62666, -112411, -262237, -698407, -1004003, -772632, -397100, -479498, -825236, -772264, -301536, -38454, -229251, -481951, -558206, -684529, -923762, -896997, -379507, 329055, 825438, 954700, 641478, -107720, -885428, -1115746, -826395, -667183, -927370, -1120030, -892154, -722658, -1119391, -1588491, -1178004, 120435, 1268251, 1534205, 1264910, 1058214, 804011, 93002, -795546, -1048176, -484526, 79265, -83338, -675832, -966516, -875623, -840790, -868329, -524325, 133237, 436223, 127241, -254407, -303030, -305464, -483974, -500836, -285996, -523872, -1513378, -2290553, -1884360]
36999a884360J045670M82719p3312K90384O59541J03126n04033l5252P19150K74916
36989A078549r38934j127254N3006J040618P42614k16800p85164o76506q2264
36980i12135O32874P87863K6703q20843o29219K54443L80865n62424j267678q79067
36970b988618j38165J11184K24278P21978J083866O21604k19357m78865j21807
36961a183902P6918j94349m45218k36779K40124M88268K75067j39551k49494J19652
36951a249264N29167M76483Q8086j51948j86311k95830l73826o7015L86190L29529
36941e14739k01112m39727j30078J44764J06826K11390N52787M52169k72798o95448
36931g85966j98244M76737M68540J60405K78984M78071M4895o21387n78620L201
$$ y = [-1884360, -838690, -355971, -429283, -138899, 520642, 623768, 119735, 84483, 803633, 1078549, 139615, -987639, -934633, 105985, 848599, 631799, -153365, -829871, -912135, -279261, 508602, 535305, -285538, -914757, -660314, -279449, -841873, -2109551, -2988618, -3126783, -3015599, -2791321, -2069343, -985477, -363873, -583230, -1062095, -1183902, -1106984, -1301333, -1746551, -1983330, -1743206, -1254938, -979871, -1119422, -1368916, -1249264, -720097, -243614, -155528, -307476, -493787, -789617, -1163443, -1230458, -844268, -514739, -715851, -1155578, -1285656, -1140892, -1034066, -822676, -269889, 182280, -90518, -785966, -984210, -507473, -38933, 121472, 400456, 878527, 923422, 302035, -276585, -273384]
36921b73384J16605l26483l71059K79001P29818L83698j80175l03922k73170n95407
36911h14478r78847p81322p3836M29187L41249k2956j95296n6901K40570N23324
36901a389306O37541M65006Q9007j59570l6990K58757L17129J22145P7854K85581
36891F67154K65688k29372o17973l34120J41689n0148p09093q26508k10292K69438
36881a633537J78609O5775K13059J07551l31159k97367L90299O20010k05582r54831
36871a847173n68700J30332p1368n63179k5585J035917R93629k7774k20016Q43549
36861c20368J401159L55330j024022j196626n30107k27500l51408j87773K95115
36852a786200N58110N11930M41855L41499J25206P0353L06914L13016l11662r64112
$$ y = [-273384, -156779, -483262, -854321, -575320, 154498, 538196, 358021, 54099, -219071, -814478, -1793325, -2574647, -2648483, -2219296, -1878047, -1901003, -2096299, -2153200, -1912630, -1389306, -751765, -286759, -197752, -357322, -394312, -135555, 181574, 303719, 381573, 667154, 932842, 703470, 85497, -248623, -106934, -157082, -866175, -1692683, -1902975, -1633537, -1454928, -1389153, -1176094, -1068543, -1399702, -1697069, -1306770, -686760, -892342, -1847173, -2415873, -2285541, -2356909, -2920088, -2945673, -1909756, -916127, -943901, -1163917, -320368, 1080791, 1436121, 412099, -784527, -1314634, -1542134, -1893542, -2081315, -1786200, -1228090, -716160, -274305, 67194, 192400, 262753, 569667, 882683, 571021, -393091]
36842c93091p51130J64574P34961M58925p6440j55473J50151K48589j14080n19626
36832b52640l94255K21372O01072K21248m64828n44385J36745P72320O62755q682
36822I50722n80858o41720k28653K82055M03386L4895l13730k29710j01348m35684
36812h60645p52744k00937Q08829Q83357j82576q91502l05411N05125K27222o17489
36802a386771o10187L30597R90728P34157J06437k88440m65788n88491o09873
36793a787631m55191p0335N72531J128230R31725p6701r39083q27756j50841J72050
36783a503002M2641J84J82923L68600O40599J064997J076615K17250q07668q91128
36773C92011j38936L59419J92238r0233k16818m50156n89623o5056P54480O76674
$$ y = [-393091, -1144221, -979647, -244686, 214239, 137799, -17674, 132477, 381066, 266986, -252640, -646895, -425523, 175549, 396797, -68031, -612416, -475671, 296649, 959404, 950722, 369864, -271856, -500509, -218454, 184932, 219827, -93903, -323613, -424961, -860645, -1613389, -1814326, -1005497, -122140, -304716, -1196218, -1501629, -996504, -769282, -1386771, -1996958, -1666361, -675633, 58524, 164961, -123479, -589267, -1177758, -1787631, -2242822, -2313157, -1740626, -612396, 319329, 242628, -696455, -1524211, -1675052, -1503002, -1460361, -1460177, -1277254, -908654, -268055, 796942, 1873557, 2090807, 1283139, 392011, 253075, 612494, 804732, 714499, 497681, 47525, -542098, -607154, 147326, 824000]
36763H24000m70209j347887j016910j86379J15764M2198K41626N73651M99175
36754g24971J40812o301j5045k91185o57515n10793J66442O48079M24101j51246
36744i77622l42612O7908N41451M75887N2071N9010O86036R98148K23302q75338
36734I08241q88671J52056P54484J74608n91039m90327P5813J78271j78621m14109
36724c19294m32280m18327k04488K59758L86148j55738n62134K4597R95320J018563
36714E92125O5100n60487k13125L04342K05591j65143j99350p7638k57168n34418
36704h40171l71794J60170M35446J77291k08281k55199k2623R9525l2445j53400
36694a011481q39L02041M30677L11719J32551n0241l29789n06017j18822P65143
$$ y = [824000, 353791, -994096, -2011006, -2197385, -2081621, -2039423, -1797797, -1224146, -724971, -584159, -590460, -605505, -896690, -1554205, -2064998, -1898556, -1250477, -826376, -977622, -1320234, -1252326, -710875, -234988, -182917, -123907, 562129, 1560277, 1783579, 908241, 19570, 171626, 926110, 1100718, 509679, 19352, 95165, 273436, 94815, -319294, -751574, -1169901, -1374389, -1114631, -728483, -884221, -1446355, -1421758, -426438, 592125, 657225, 96738, -116387, 187955, 393546, 228403, 29053, -48585, -305753, -840171, -1211965, -1051795, -616349, -439058, -647339, -902538, -925161, -825636, -858081, -1011481, -1012320, -710279, -279602, 32117, 164668, 114427, -215362, -721379, -840201, -75058]
36684g5058J249505O31371n19399r27382k37146N34088L73012m02572o40436M1129
36674B7112P17548M32492m32047o48274P4028N86709j0425r22182p56743L79613
36664e52169J012297M35080m79966q17436p58426p02265m00063K85838P34920
36655a242190N46621L19378N54309O39610o447o05055j50617P52801O84106l20225
36645A172291q39779l25979K64548K43453J02452K62601K81930r8676k95901L9095
36635H06035K80672j00937n82902m76717o3090l3362l27592l24452J32986N72105
36625a17254N65524R7296n52824r37222o86805N9056O78728P31105L58637n4360
36615A41881k67912j70170J66861L35047P233m26076k52878M31238P27461K65725
$$ y = [-75058, 1174447, 1805818, 1286419, 359037, 121891, 655979, 1028991, 626419, -14017, 27112, 744660, 1177152, 745105, 96831, 170859, 757568, 747143, -175039, -931782, -552169, 460128, 895208, 415242, -402194, -1160620, -1862885, -2262948, -1977110, -1242190, -695569, -376191, 178118, 817728, 811281, 206226, 55609, 808410, 1492516, 1172291, 332512, 6533, 271081, 514534, 616986, 879587, 1161517, 1062841, 766940, 806035, 1086707, 985770, 402868, -73849, -136939, -170301, -497893, -822345, -689359, -117254, 448270, 545566, -7258, -944480, -1631285, -1572229, -893501, -162396, 196241, 141881, -126031, -296201, -129340, 205707, 212940, -213136, -466014, -34776, 692685, 958410]
36605I58410k87210l88431m13373p40995q65666k08669P56549J028696M23525
36596B62836l02549m82184j38460K90404M05614J58734o4729Q5065L10015L9148
36586E63894m99701l89244M75220R32832K47205o35829m43232N00285Q07047R1606
36576A650083o30272n14276J38561N98834O21090M09049J68337r1460m91436r95545
36566H62965j165136n77654L84270P44250K12864m13564m95179l61021l53140
36557a161345m6249P29779J052550K43337p52443o37399K17349M48029j17016
36548b3408n09099m99660p23142j040699n71804M72126P51432J3877l39419M58544
36538b011252J261604Q73627j78955p09092n51528k01819K16482O36452N84717
$$ y = [958410, 671200, 282769, -130604, -871599, -1737265, -1945934, -1189385, -160689, 262836, -39713, -521897, -660357, -369953, 35661, 194395, 129666, 214731, 524746, 563894, 64193, -325051, 150169, 1083001, 1330206, 694377, 251145, 751430, 1558477, 1650083, 1019811, 505535, 644096, 1242930, 1864020, 2273069, 2441406, 2349946, 1858510, 862965, -302171, -879825, -495555, 248695, 461559, 47995, -447184, -808205, -1161345, -1207594, -477815, 574735, 818072, 65629, -571770, -354421, 93608, -23408, -532507, -1032167, -1755309, -2796008, -3367812, -2895686, -2144254, -2130377, -2469796, -2011252, -749648, 123979, -54976, -764068, -1315596, -1517415, -1300933, -664481, -79764]
36529g9764o949l29114O9912M17062K6590m20241n4316N32954J91841p83736j027253
36518a463014k49971L98724J90021k34354q2947M34280O31854L25620j46755m44152
36508f40694m56184k79853r4896Q4723M21698Q27264Q38825K92227k52127k74075
36498D66908j22569m16608r26888q75681k02638L57300M80926O32692J022275
36489D15717J072949L99980l81493m66775n0764k2617o21611j041415n35532N14670
36479g16891J003118M63326l57164m77939M2048K55531k99482r35631p80033N4025
36469a749092O92941O28927J59023j76617j72151K7471J85092J95660J69836K40214
$$ y = [-79764, -86713, -415827, -345915, 71147, 97737, -322504, -376820, 156134, 347975, -435761, -1463014, -1712985, -1314261, -1124240, -1358594, -1441541, -1007261, -375407, -49787, -196542, -640694, -1096878, -1376731, -1471627, -1386904, -965206, -137942, 700883, 993110, 740983, 466908, 344339, -72269, -999157, -1874838, -2077476, -1720176, -1239250, -606558, 415717, 1488666, 1888646, 1507153, 1040378, 989614, 966997, 345386, -696029, -1231561, -716891, 286227, 749553, 392389, -85550, -43502, 212029, -87453, -1023084, -1803117, -1749092, -1056151, -427224, -268201, -444818, -616969, -589498, -404406, -208746, -38910, 201304]
$$ [...]
##END NTUPLES=NMR SPECTRUM
##END=
