##TITLE=31Pdec_166Et2R
 , 24 sc
 5.7.2023
##JCAMPDX= 6.0         $$ Bruker NMR JCAMP-DX V2.0
##DATA TYPE= NMR SPECTRUM
##DATA CLASS= NTUPLES
##ORIGIN= UXNMR, Bruker Analytische Messtechnik GmbH
##OWNER= root
$$ XWIN-NMR		Version 3.5
$$ Wed Jul  5 14:50:41 2023 Russian Standard Time (UT+4h)  she@DPX200
##.OBSERVE FREQUENCY= 81.013821
##.OBSERVE NUCLEUS= ^31P
##.ACQUISITION MODE= SIMULTANEOUS
##.ACQUISITION SCHEME= undefined
##.AVERAGES= 24
##.DIGITISER RES= 16
##SPECTROMETER/DATA SYSTEM= spect
##.PULSE SEQUENCE= zgpg30
##.SOLVENT NAME= CDCl3
##.SHIFT REFERENCE= (INTERNAL, CDCl3, 0, 248.564)
##AUDIT TRAIL= $$ (NUMBER, WHEN, WHO, WHERE, WHAT)
$$ ##TITLE= Audit trail, XWIN-NMR		Version 3.5
$$ ##JCAMPDX= 5.01
$$ ##ORIGIN= Bruker BioSpin GmbH
$$ ##OWNER= she
$$ F:/spectra/data/she/nmr/P31/1/pdata/1/auditp.txt
$$ ##AUDIT TRAIL=  $$ (NUMBER, WHEN, WHO, WHERE, WHAT)
(   1,<2023-07-05 14:49:26.59 +0400>,<she>,<DPX200>,
      <created by zg, POWCHK disabled, PULCHK disabled
       configuration hash MD5:
       00 E9 B6 7A A2 85 ED C7 34 08 36 98 17 FE 4E 26
       data hash MD5: 32K
       A4 4C 8C 52 22 DD 3E F8 E0 35 26 3B 5A 0D 21 D9>)
(   2,<2023-07-05 14:49:30.90 +0400>,<she>,<DPX200>,
      <Start of raw data processing
       efp BC_mod = 2 LB = 1 FT_mod = 6 PKNL = 1 PHC0 = -10841.91 PHC1 = 439.4848 SI = 64K 
       data hash MD5: 64K
       F9 68 CF EE 65 EA DF EB C6 43 22 3A AA E5 E5 07>)
(   3,<2023-07-05 14:49:54.20 +0400>,<she>,<DPX200>,
      <pk PHC0 = 8.759051 PHC1 = 0 
       data hash MD5: 64K
       FE 97 0A 7C E7 E9 EE E1 02 68 97 10 03 0F 45 B8>)
(   4,<2023-07-05 14:50:10.73 +0400>,<she>,<DPX200>,
      <pk PHC0 = -7.800004 PHC1 = 0 
       data hash MD5: 64K
       CD A8 8F 7D B8 E4 23 E0 34 B9 3E FB 2F 3F A8 B8>)
$$ ##END=
$$ 
$$ hash MD5
$$ 04 1C A1 9A 38 31 3A A4 03 23 F7 42 33 CD 8D 59
##$RELAX= 
##$RELAX= 
##$RELAX= 
##$RELAX= 
##$RELAX= 
##$RELAX= 
##$RELAX= 
##$RELAX= 
##$RELAX= 
$$ Bruker specific parameters
$$ --------------------------
##$DU= <F:/spectra>
##$EXPNO= 1
##$NAME= <P31>
##$PROCNO= 1
##$TYPE= <nmr>
##$USER= <she>
##$AMP= (0..31)
100 100 100 100 100 100 100 100 100 100 100 100 100 100 100 100 100 100 
100 100 100 100 100 100 100 100 100 100 100 100 100 100 
##$AQSEQ= 0
##$AQ_mod= 1
##$AUNM= <au_zg>
##$AUTOPOS= <>
##$BF1= 81.014009
##$BF2= 200.13
##$BF3= 200.13
##$BF4= 200.13
##$BF5= 200.13
##$BF6= 200.13
##$BF7= 200.13
##$BF8= 200.13
##$BYTORDA= 1
##$CFDGTYP= 0
##$CFRGTYP= 5
##$CHEMSTR= <none>
##$CNST= (0..31)
1 1 145 1 1 1 1 1 1 1 1 1 1 1 1 1 1 1 1 1 1 1 1 1 1 1 1 1 1 1 1 1 
##$CPDPRG= <waltz16>
##$CPDPRG1= <>
##$CPDPRG2= <waltz16>
##$CPDPRG3= <>
##$CPDPRG4= <mlev>
##$CPDPRG5= <mlev>
##$CPDPRG6= <mlev>
##$CPDPRG7= <mlev>
##$CPDPRG8= <mlev>
##$CPDPRGB= <>
##$CPDPRGT= <>
##$D= (0..31)
0 1 0 0 0 0 0 0 0 0 0 0.03 2e-05 3e-06 0 0 0 0 0 0 0 0 0 0 0 0 0 0 0 0 
0 0 
##$DATE= 1688554166
##$DBL= (0..7)
120 120 120 11 120 120 24 19 
##$DBP= (0..7)
150 150 150 150 150 150 150 150 
##$DBP07= 0
##$DBPNAM0= <>
##$DBPNAM1= <>
$$ [...]
##$SUBNAM2= <"">
##$SUBNAM3= <"">
##$SUBNAM4= <"">
##$SUBNAM5= <"">
##$SUBNAM6= <"">
##$SUBNAM7= <"">
##$SUBNAM8= <"">
##$SUBNAM9= <"">
##$SW= 501.771253377433
##$SWIBOX= (0..15)
0 1 3 0 0 0 0 0 0 0 0 0 0 0 0 0 
##$SW_h= 40650.406504065
##$TD= 32768
##$TD0= 1
##$TE= 0
##$TE2= 300
##$TE3= 300
##$TEG= 300
##$TL= (0..7)
0 120 53 12 22 120 120 120 
##$TP= (0..7)
150 150 150 150 150 150 150 150 
##$TP07= 0
##$TPNAME0= <>
##$TPNAME1= <>
##$TPNAME2= <>
##$TPNAME3= <>
##$TPNAME4= <>
##$TPNAME5= <>
##$TPNAME6= <>
##$TPNAME7= <>
##$TPOAL= (0..7)
0.5 0.5 0.5 0.5 0.5 0.5 0.5 0.5 
##$TPOFFS= (0..7)
0 0 0 0 0 0 0 0 
##$TUNHIN= 0
##$TUNHOUT= 0
##$TUNXOUT= 0
##$USERA1= <user>
##$USERA2= <user>
##$USERA3= <user>
##$USERA4= <user>
##$USERA5= <user>
##$V9= 5
##$VALIST= <valist>
##$VCLIST= <CCCCCCCCCCCCCCC>
##$VD= 0
##$VDLIST= <DDDDDDDDDDDDDDD>
##$VPLIST= <PPPPPPPPPPPPPPP>
##$VTLIST= <TTTTTTTTTTTTTTT>
##$WBST= 1024
##$WBSW= 4
##$XGAIN= (0..3)
0 0 0 0 
##$XL= 0
##$YL= 0
##$YMAX_a= 9283
##$YMIN_a= -8143
##$ZGOPTNS= <>
##$ZL1= 120
##$ZL2= 120
##$ZL3= 120
##$ZL4= 120
##$ABSF1= 0
##$ABSF2= 0
##$ABSG= 0
##$ABSL= 0
##$ALPHA= 0
##$AQORDER= 0
##$ASSFAC= 0
##$ASSFACI= 0
##$ASSFACX= 0
##$ASSWID= 0
##$AUNMP= <proc_1d>
##$AZFE= 0.1
##$AZFW= 0.5
##$BCFW= 0
##$BC_mod= 2
##$BYTORDP= 0
##$COROFFS= 0
##$CY= -3
##$DATMOD= 1
##$DC= 0
##$DFILT= <>
##$DTYPP= 0
##$F1P= 0
##$F2P= 0
##$FCOR= 1
##$FTSIZE= 65536
##$FT_mod= 6
##$GAMMA= 0
##$GB= 0
##$INTBC= 1
##$INTSCL= 6.047779e-11
##$ISEN= 30
##$LB= 1
##$LEV0= 0
##$LPBIN= 0
##$MAXI= 10000
##$MC2= 0
##$MEAN= 0
##$ME_mod= 0
##$MI= 50
##$NCOEF= 0
##$NC_proc= -6
##$NLEV= 6
##$NOISF1= 182.463
##$NOISF2= 159.3651
##$NSP= 0
##$NTH_PI= 0
##$NZP= 0
##$OFFSET= 248.5645
##$PC= 4
##$PHC0= -10840.95
##$PHC1= 439.4848
##$PH_mod= 1
##$PKNL= yes
##$PPARMOD= 0
##$PSCAL= 0
##$PSIGN= 0
##$REVERSE= no
##$SF= 81.0140089999694
##$SI= 65536
##$SIGF1= 159.3651
##$SIGF2= -187.1042
##$SINO= 113.3802
##$SIOLD= 16384
##$SREGLST= <1H.CDCl3>
##$SSB= 0
##$STSI= 65536
##$STSR= 0
##$SW_p= 40650.406504065
##$SYMM= 0
##$S_DEV= 0
##$TDeff= 32768
##$TDoff= 0
##$TI= <>
##$TILT= no
##$TM1= 0
##$TM2= 0
##$TOPLEV= 0
##$USERP1= <user>
##$USERP2= <user>
##$USERP3= <user>
##$USERP4= <user>
##$USERP5= <user>
##$WDW= 1
##$XDIM= 65536
##$YMAX_p= 404534179
##$YMIN_p= -189626153
$$ End of Bruker specific parameters
$$ ---------------------------------
##NTUPLES= NMR SPECTRUM
##VAR_NAME=  FREQUENCY,     SPECTRUM/REAL,   SPECTRUM/IMAG
##SYMBOL=    X,             R,               I
##VAR_TYPE=  INDEPENDENT,   DEPENDENT,       DEPENDENT
##VAR_FORM=  AFFN,          ASDF,            ASDF
##VAR_DIM=   65536,         65536,           65536
##UNITS=     HZ,            ARBITRARY UNITS, ARBITRARY UNITS
##FACTOR=    0.620285442955139, 1,           1
##FIRST=     20137.2065510682, 0,            0
##LAST=      -20513.1999529968, 0,           0
##MIN=       -20513.1999529968, -189626153,  0
##MAX=       20137.2065510682, 404534179,    0
$$ Real data points
##PAGE= N=1
##DATA TABLE= (X++(R..R)), XYDATA
$$ [...]
13258A296852n04244l59475K52145J53866l35907m47012k86020j09300L99604
$$ 1296852 792608 433133 685278 839144 503237 56225 -229795 -339095 60509
13249F0509J118705J028053j38139r84269m28894N31904M31248l20594l50400
$$ 60509 1179214 2207267 2069128 1084859 655965 1187869 1619117 1298523 948123
13240I48123J98656K0587q67201j006108l3295N58720j69529j048314o33424O07835
$$ 948123 1146779 1167366 300165 -705943 -739238 -180518 -350047 -1398361 -2031785 -1423950
13230a423950J098006L70721o22733r85817o76947q4080L82466M33684K80872
$$ -1423950 -325944 44777 -577956 -1563773 -2240720 -2324800 -1942334 -1508650 -1227778
13221a227778N92710J414442J577515J68690j732889k059106n12105J037477J220426
$$ -1227778 -635068 779374 2356889 2525579 792690 -1266416 -1778521 -741044 479382
13212D79382P76053P77096P43660j49429j128708q37157K92824N32170m07673
$$ 479382 1255435 2032531 2776191 2626762 1498054 660897 953721 1485891 1078218
13203A078218r79582m10135J25869l26172q12219j46204R74014J001919l5881
$$ 1078218 98636 -311499 -185630 -511802 -1324021 -1470225 -496211 505708 469827
13194D69827o45256j18991O53974P00745J85226j93053k38626k65018m43948m97238
$$ 469827 -175429 -294420 359554 1060299 1245525 1052472 813846 548828 104880 -392358
13184c92358l4682P94367J117363K65216j051071j242040M4764J125562M37517
$$ -392358 -427040 367327 1484690 1749906 698835 -543205 -498441 627121 1064638
13175A064638j166348j475630Q383J419889J157349q1554n69982J6441M11929
$$ 1064638 -101710 -1577340 -1568957 -149068 1008281 926727 356745 373186 785115
13166G85115k71977j301421j348173k96981N54038K03874o58413n64147O39415
$$ 785115 513138 -788283 -2136456 -2433437 -1879399 -1675525 -2333938 -2898085 -2258670
13157b258670J486225R01674l98496j069331q37382k30936N75517J497353J730337
$$ -2258670 -772445 129229 -269267 -1338598 -2175980 -2406916 -1831399 -334046 1396291
13148A396291O45959p43956p45118N03228R95409k58345j787493j821492o03300
$$ 1396291 2042250 1298294 553176 1056404 2051813 1793468 5975 -1815517 -2418817
13139b418817M26216P15552P42565P85778O85271M21592M8154n38081j021440
$$ -2418817 -1992601 -1277049 -534484 251294 936565 1358157 1406311 868230 -153210
13130a53210n19999J022971J990614R41832j131159j873264p48486M05723J71119
$$ -153210 -673209 349762 2340376 3282208 2151049 277785 -470701 -64978 106141
13121A06141o88297q17129k03847L61020O56364Q34714O61740R27m93079j54894
$$ 106141 -582156 -1399285 -1603132 -1242112 -585748 248966 910706 911633 418554 263660
13111B63660N81835P26824J13852n14046n48310m165P04818Q96441K4854j356941
$$ 263660 845495 1572319 1686171 1172125 623815 619650 1324468 2220909 2245763 888822
13101H88822j686207l60438J076789R23689j79578l26425N62626P35176l03319
$$ 888822 -797385 -1157823 -81034 842655 663077 336652 899278 1634454 1331135
13092A331135r23791k15031M61625q3695p75919k19046P98514O34697m45527q34177
$$ 1331135 407344 192313 653938 570243 -205676 -424722 373792 1008489 562962 -271215
13082b71215k34955K20956J44160K19732M62535N3455q86808j165867n68754l19099
$$ -271215 -506170 -285214 -141054 78678 541213 594668 -292140 -1458007 -2026761 -2345860
13072b345860q77222r62998K56798J496267J188185q6177m92162L68822J162244
$$ -2345860 -3223082 -4186080 -3929282 -2433015 -1244830 -1331007 -1823169 -1454347 -292103
13063b92103R82171L77071L9638k53748q03818j042204l43985O93224Q27170J2857
$$ -292103 690068 1067139 1106777 853029 49211 -992993 -1336978 -643754 183416 196273
13053A96273l78318M00098J196508O38090o75111j011015j98517J76921n58419
$$ 196273 -182045 218053 1414561 2052651 1377540 366525 168008 344929 -213490
13044b13490j075226l32253P05636P67542K36767M5293n6117n15961n14703N97565
$$ -213490 -1288716 -1620969 -915333 -147791 88976 134269 78152 -437809 -952512 -354947
13034c54947J446796M34713j373130j569496j22738P99515M75198K94706O66947
$$ -354947 1091849 1526562 153432 -1416064 -1538802 -739287 -264089 30617 697564
13025F97564K65421r74111j085257N32366J728635J108677K69919O88903R27456
$$ 697564 962985 -11126 -1096383 -564017 1164618 2273295 2543214 3232117 4159573
13016D159573o49150k500694k091306J7257J112592M46196l38129l25445k29200
$$ 4159573 3510423 1009729 -1081577 -1064320 48272 494468 156339 -169106 -398306
13007c98306l53084r2899M24647L42846j35356M5951O47866K62193j054282j389319
$$ -398306 -751390 -844289 -419642 -76796 -212152 -166201 481665 743858 -310424 -1699743
12997a699743K28J206739M29017j279624j507356J49785J698662J463417j2244
$$ -1699743 -1699515 -492776 -63759 -1343383 -2850739 -2700954 -1002292 461125 448881
12988D48881r72028n86993L76676P68589M01175p3135k75267m44940o86372o43372
$$ 448881 -523147 -1110140 -733464 35125 436300 363165 87898 -357042 -1043414 -1686786
12978a686786k11925J53245K48635N00921J035670J143416L34204p71278j290073
$$ -1686786 -1898711 -1745466 -1496831 -995910 39760 1183176 1517380 746102 -543971
12969e43971j142300o21839K75155J284227J489833N25612n43292n61018J40367
$$ -543971 -1686271 -2308110 -2032955 -748728 741105 1266717 723425 162407 302774
12960C02774M90391K94211K5274k62567o30439n50440K40826Q28372L42366n46240
$$ 302774 793165 1087376 1112650 850083 219644 -330796 -89970 738402 1080768 534528
12950E34528o74517k33918j24178j96797J98099N69649O0722o17199m4182J337608
$$ 534528 -139989 -373907 -498085 -694882 -496783 72866 133588 -483611 -527793 809815
12940H09815J567342J25399j372446j595889q12475L45232J551849J995538Q32810
$$ 809815 2377157 2502556 1130110 -465779 -1278254 -933022 618827 2614365 3447175
12931C447175j095703j742075n47508R02960J259291P80825L9892q89516j473078
$$ 3447175 2351472 609397 61889 964849 2224140 3004965 3044857 2155341 682263
12922F82263q39975M92938Q43264l3869m59078L18942Q43368N6092q65388o40866
$$ 682263 -157712 335226 1178490 1144621 685543 1004485 1847853 1903945 1038557 397691
12912C97691M226p2199l78952j6597M88915L30557J25315O55912J033178O6237
$$ 397691 401917 329718 -49234 -65831 423084 753641 878956 1534868 2568046 2634283
12902B634283j393194j478464j44542R07491Q13956K88095n7333m37034q64060
$$ 2634283 1241089 -237375 -381917 525574 1339530 1627625 1570292 1133258 269198
12893B69198q49773l56656P2647K63301N15766P58098N48770n4367n10703o81424
$$ 269198 -580575 -937231 -864584 -601283 -85517 672581 1221351 1166984 656281 -25143
12883b5143q68313r96396o00709K96175J013525J048036N77519J04753l0826J22193
$$ -25143 -893456 -1889852 -2490561 -2194386 -1180861 -132825 444694 549447 518621 640814
12873F40814J45498k44745o05142k75605L77285K30745o55747o90930P17015J665477
$$ 640814 786312 541567 -63575 -339180 38105 268850 -386897 -1077827 -360812 1304665
12863A304665L70062j809958k019219n5283J379074O42844q23461j056441j80546
$$ 1304665 1674727 -135231 -2154450 -2209733 -830659 -187815 -1011276 -2067717 -2248263
12854b248263N87300R35622J115794P88255k74210j057014m04862J059312J539370
$$ -2248263 -1660963 -725341 390453 1178708 904498 -152516 -557378 501934 2041304
12845B041304N83278l46184j32617M05679n8918j245294j640891o58771O16255
$$ 2041304 2624582 2278398 2145781 2551460 2492542 1247248 -393643 -1052414 -436159
12836d36159R28321K82312m18825n41719j24258M31484O37874K29858m25730n60428
$$ -436159 492162 774474 355649 -186070 -310328 121156 759030 988888 563158 2730
12826B730M328N21426M08070J35898L61134O75369J91679q69642j261503m60124
$$ 2730 7058 528484 936554 1072452 1433586 2108955 2300634 1430992 169489 -290635
12816b90635O08898Q49858K61570l49524l60231J49544M62138j22267j262968
$$ -290635 318263 1168121 1429691 1080167 719936 869480 1331618 1209351 -53617
12807e3617j582553l96770J072275J267471N54449M38849R10742N16905q44067
$$ -53617 -1636170 -2032940 -960665 306806 861255 1300104 2210846 2727751 1883684
12798A883684j417588n58191J1264q48261j509834j65333J983265K309046N97633
$$ 1883684 466096 -92095 -80831 -929092 -2438926 -2604259 -620994 1688052 2285685
12789B285685r16518r20153l04929p2731Q6474O39686J139661R94329L31618m14338
$$ 2285685 1369167 449014 144085 71354 157828 797514 1937175 2931504 3263122 2848784
12779B848784j022046j241596p70478J51852P24933N29366M5408m7149K91056
$$ 2848784 1826738 585142 -185336 -33484 691449 1220815 1266223 1219074 1510130
12770A510130N64881L91308j86562q34092j173797r83454l30620L79016N58153
$$ 1510130 2075011 2466319 2279757 1445665 271868 -711586 -1042206 -663190 -105037
12761a05037n1484q74296r16346o0548N63401J75499k71219N54013K019787K130771
$$ -105037 -156521 -1030817 -1947163 -2007711 -1444310 -1268811 -1540030 -986017 1033770 3164541
12751C164541N18228r31672r53056n93124j025116j381056l43921J337754J783529
$$ 3164541 3682769 2751097 1798041 1204917 179801 -1201255 -1545176 -207422 1576107
12742A576107P85227r0446K4637L12945j20801r41393j264780q37235j60566J90746
$$ 1576107 2361334 2270888 2295525 2608470 2487669 1546276 281496 -555739 -716305 -525559
12732e25559J98825L52048P84533P22943m51173j764984j549466O8896J112343
$$ -525559 -326734 25314 809847 1532790 1081617 -683367 -2232833 -2163937 -1051594
12723a051594O70981J08805M76490O82840k71754j092514k62735J147082J080757
$$ -1051594 -380613 -271808 204682 887522 615768 -476746 -739481 407601 1488358
12714A488358j58787o43279j54602j56732p68007m67302R66637J712358P32076
$$ 1488358 1329571 686292 531690 374958 -393049 -860351 106286 1818644 2550720
12705B550720p12060j112899o09464j23617k0959k47433o42166p17404j34730
$$ 2550720 1838660 725761 116297 -7320 -28279 -275712 -917878 -1635282 -1770012
12696a770012N32220N60406L33509N40116O27684k10567j029372l26338J051970
$$ -1770012 -1237792 -677386 -343877 196239 823923 613356 -416016 -742354 309616
12687C09616P99236r67893j580680j45540R90009K39820o81982M1554J218507
$$ 309616 1108852 140959 -1439721 -1585261 -595252 -355432 -1037414 -995860 222647
12678B22647R31737k15417n57613l58384q09966j363373o71706O73021Q95245
$$ 222647 1154384 938967 381354 22970 -786996 -2150369 -2822075 -2149054 -1253809
12669a253809L2387k24088N29431Q94681J86287n88723o00900l13036k90167l32256
$$ -1253809 -1221422 -1445510 -916079 -21398 164889 -423834 -1024734 -1337770 -1627937 -1960193
12659a960193k21039j39444k2240M48656R93687R18448K90213j14488j33139l46332
$$ -1960193 -2181232 -2320676 -2342916 -1894260 -900573 17875 308088 193600 60461 -285871
12649b85871p31580m58795N57009J100216L22383r68477j412507p77615J59995
$$ -285871 -1017451 -1476246 -919237 180979 503362 -465115 -1877622 -2655237 -2495242
12640b495242Q02327J025404P05243k03249j155031j250577k27268J086878J565461
$$ -2495242 -1692915 -667511 37732 -165517 -1320548 -2571125 -2798393 -1711515 -146054
12631a46054R71468J38639j28402n5588l64250q89151n80214P56386J620066O48810
$$ -146054 825414 964053 835651 780063 415813 -473338 -1053552 -297166 1322900 1971710
12621A971710j258224j867558n61157R05622R06817J3624j87572N55811J068456
$$ 1971710 713486 -1154072 -1715229 -809607 97210 110834 -76738 479073 1547529
12612A547529O01438l04302q30163q32960n04755J48030R47705J191470L70863
$$ 1547529 2148967 1844665 1014502 181542 -323213 -175183 772522 1963992 2334855
12603B334855r19732j447371p64764L43737R03402O89854P356p99022j245293
$$ 2334855 1415123 -32248 -797012 -453275 450127 1139981 1147337 348315 -896978
12594h96978p78272M32675J244580Q02602k70667o97650k87715J9260k70043n61045
$$ -896978 -1675250 -1242575 2005 804607 533940 -163710 -451425 -432165 -702208 -1263253
12584a263253k61214L58703P10311O28930K86689p5066j43573J75002L86021q428
$$ -1263253 -1524467 -1165764 -455453 173477 460166 385100 241527 416529 802550 794122
12574G94122n36273k44837P05147R79028j8377j199064j331191n83890J22131
$$ 794122 257849 13012 718159 1697187 1678810 479746 -851445 -1435335 -1313204
12565a313204M13817L70105k4214m95839l36806M96615R35465L77617j75401K73189
$$ -1313204 -899387 -529282 -553496 -1049335 -1386141 -889526 45939 423556 248155 521344
12555E21344Q72158K32514j081061j218813K9826R29769O12762K51709P49668
$$ 521344 1393502 1626016 544955 -673858 -644032 285737 898499 1150208 1899876
12546A899876J042169q1379j734589j964630m01670J368273J807564Q46797n20254
$$ 1899876 2942045 2860666 1126077 -838553 -1240223 128050 1935614 2782411 2262157
12537B262157j240223q54620K10048R89757R74189N58776K18786k60740j116827
$$ 2262157 1021934 167314 377362 1367119 2341308 2900084 3118870 2858130 1741303
12528A741303j666512j010814M59497J298674R16531K76109K80870M33660j07703
$$ 1741303 74791 -936023 -476526 822148 1738679 2014788 2295658 2729318 2621615
12519B621615q92037p63995J70490M63283n00496j408617q67514N05630R36807
$$ 2621615 1729578 965583 1136073 1599356 1098860 -309757 -1177271 -671641 265166
12510B65166L0439q02010n07576K47211L91626P8413J02907L97164K19993m17444
$$ 265166 295605 -506405 -1013981 -766770 -375144 -296731 -193824 203340 423333 5889
12500E889o34860j02915L80095R3344n65022p35597k88480J66196J68961j29166
$$ 5889 -628971 -731886 -351791 -258447 -823469 -1559066 -1847546 -1681350 -1512389 -1641555
12490a641555k66277K1031M59477L79560m49252j134709n03087J145441K013954
$$ -1641555 -1907832 -1886801 -1427324 -1047764 -1497016 -2631725 -3134812 -1989371 24583
12481B4583J153560r5872o3083O75097K69850j223807j661779j78273J264860
$$ 24583 1178143 1082271 1019188 1694285 1964135 740328 -921451 -1099724 165136
12472A65136P79617o77375j000556j29402L59358M8765m9627K53850k9485r29999
$$ 165136 944753 267378 -733178 -862580 -503222 -454457 -504084 -250234 -279719 -1209718
12462a209718j039330J89333J396120J393284P51084L97156J17051m42939o49192
$$ -1209718 -2249048 -2059715 -663595 729689 1480773 1877929 1994980 1552041 902849
12453I02849o1415M29688J5166n38306k41671K95123L447o10131l72281L66883
$$ 902849 841434 1271122 1286288 747982 506311 801434 804881 194750 -177531 189352
12443A89352L84477j64223j87975J26188k26103p29655o301J228496P15418j345377
$$ 189352 573829 409606 221631 347819 121716 -607939 -614240 614256 1329674 -15703
12433a5703j853828M27321K547882J679233p35672j504043l72041N21173M76944
$$ -15703 -1869531 -1442210 1105672 2784905 2049233 545190 173149 694322 1171266
12424A171266O02847J053204P42972k79159o60402j27892J54359j28707M9054
$$ 1171266 1774113 2827317 3570289 3291130 2630728 2502836 2657195 2528488 2577542
12415B577542P97694O94717p40775j875378j393034k86764j04730n39443k92988
$$ 2577542 3375236 4069953 3329178 1453800 60766 -225998 -330728 -870171 -1163159
12406a163159N90637R04045L51741r0717J12354K81561k17657q96369q56945o1555
$$ -1163159 -572522 331523 683264 592547 704901 986462 768805 -127564 -984509 -1046064
12396a046064O27682M99617k66376r17437r72972o06943k25676R6153N42130J037344
$$ -1046064 -418382 81235 -185141 -1102578 -2075550 -2682493 -2908169 -2812016 -2269886 -1232542
12386a232542J141495N68622l60731r16452o26344J99170O67109K78665l20503
$$ -1232542 -91047 477575 116844 -799608 -1425952 -1226782 -559673 -281008 -601511
12377f01511o4346R28706J244311K03648q28727k49539J211876J214430q55968
$$ -601511 -665857 262849 1507160 1710808 882081 632542 1844418 3058848 2202880
12368B202880k771240k293621M0921J830294J693384L38239p46695p78482l6207
$$ 2202880 -568360 -2861981 -2821060 -990766 702618 1040857 294162 -484320 -520527
12359e20527O27247O37770K78289J85662K92132n7773q10178j001700l02438L14483
$$ -520527 106720 744490 1022779 1208441 1500573 1442800 632622 -369078 -671516 -357033
12349c57033J73266J9565M78781N87228n42038j579360o44247J382493J716440
$$ -357033 -183767 -164202 314579 901807 359769 -1219591 -1863838 -481345 1235095
12340A235095J286r10219N23981J863298M59467k159212k368197J42659J946133
$$ 1235095 1236381 326162 850143 2713441 3172908 1013696 -1354501 -1211842 734291
12331G34291Q59558j278838j634141j45011J044856O67787n35677j200391p64128
$$ 734291 1593849 315011 -1319130 -1464141 -419285 248502 -287175 -1487566 -2251694
12322b251694L20229J123980J053660M18820j527j8078j61337o34178q48985l91058
$$ -2251694 -1931465 -807485 246175 664995 663468 645390 484053 -150125 -999110 -1390168
12312a390168K27836L37118R8972J06397L78463M11292K8839l83055m31655j42790
$$ -1390168 -1162332 -825214 -726242 -619845 -241382 169910 198749 -184306 -615961 -758751
12302g58751J08135n8676n44232o33724J62799J107461Q91144m27586j147098
$$ -758751 -650616 -709292 -1253524 -1887248 -1724449 -616988 274156 -153430 -1300528
12293a300528k32859J111306J197529K91763p6404L53058L72432m81479j164849
$$ -1300528 -1533387 -422081 775448 1067211 990807 1343865 1716297 1234818 69969
12284F9969q83165j78237K50450N47909Q79839P47257n4028p15957n49402j01890
$$ 69969 -813196 -991433 -740983 -193074 686765 1434022 1379994 664037 114635 12745
12274A2745k64749q67785j039247m80701M26654J301311J738350J171949k47176
$$ 12745 -252004 -1119789 -2159036 -2639737 -2213083 -911772 826578 1998527 1751351
12265A751351j138861m48810Q15561P48039o81815j521194o97106O00097R86429
$$ 1751351 612490 163680 979241 1727280 1045465 -475729 -1172835 -572738 413691
12256D13691P69623P21906L80168q71020j985173j397279L95459J272182N65739
$$ 413691 1183314 1905220 2285388 1414368 -570805 -1968084 -1572625 -300443 265296
12247B65296j25012L69100J064491O88227k82949o87857n83241o85021q35579
$$ 265296 140284 509384 1573875 2262102 1979153 1291296 708055 23034 -812545
12238h12545n15857j67723m33224o35283K70961J591010J591721K24415p52607
$$ -812545 -1328402 -1496125 -1929349 -2564632 -2293671 -702661 889060 1113475 360868
12229C60868n00967J1822J57897N38871J095622O04463q45893j145007N12303
$$ 360868 -140099 -128277 29620 568491 1664113 2268576 1422683 277676 789979
12220G89979J773816O61322j063976p12388Q04957N18387j457133j952551O2464
$$ 789979 2563795 3225117 2161141 1448753 2253710 2772097 1314964 -637587 -575123
12211e75123J869483J419061J40042j12116q8262j107053k186109j578337K26525
$$ -575123 1294360 2713421 2853463 2741347 2653085 1546032 -640077 -2218414 -1991889
12202a991889J269363R87255L42350j76618p49911r39368j21231J005383J081482
$$ -1991889 -722526 264729 607079 430461 -319450 -1258818 -1380049 -374666 706816
12193G06816J74708m17047l63444n58583j077796p76793N36058J336786P08077
$$ 706816 881524 464477 101033 -457550 -1535346 -2312139 -1776081 -439295 268782
12184B68782j72386n1915L19729l09440j229586p39348R50946J801275R49883
$$ 268782 96396 44481 364210 54770 -1174816 -1914164 -963218 838057 1787940
12175A787940k42077n37537m14274n43429l67357N76018J268078O68433m16421
$$ 1787940 1545863 1008326 594052 50623 -316734 259284 1527362 2195795 1779374
12166A779374n41694L3599l1040p01582o93246J03183L73313k17167m15032K69752
$$ 1779374 1237680 1271279 1240239 538657 -154589 -51406 321907 104740 -310292 -40540
12156d0540O10604o3139n63161L959N78187J19594m05515J84244Q94017O9515
$$ -40540 570064 506925 -56236 -52277 525910 645504 239989 424233 1318250 1387765
12146A387765j630254j996766n66775Q97425J081426M57642m3232r4323L32609
$$ 1387765 -242489 -2239255 -2806030 -1908605 -827179 -369537 -412769 -507092 -174483
12137a74483R38748Q37170l62079j448411j004413M35170J195699J035084J019196
$$ -174483 764265 1601435 1239356 -209055 -1213468 -778298 417401 1452485 2471681
12128B471681J115758J89877j423373j741673k77103Q21164p6633j593945j449898
$$ 2471681 3587439 3777316 2353943 612270 335167 1156331 1079698 -514247 -1964145
12119a964145K78296J514807J051970k52319q55482k43202O91564O82538l98681
$$ -1964145 -1685849 -171042 880928 628609 -226873 -470075 221489 904027 505346
12110E05346j286464r77475p7176L29066M06733Q57353J176562M09458p94214
$$ 505346 -781118 -1758593 -1835769 -1506703 -1099970 -242617 933945 1343403 549189
12101E49189r14731j50738p4111p34373n65584N47040P72371l91365j030517j21373
$$ 549189 -365542 -516280 -590391 -1324764 -1890348 -1343308 -570937 -962302 -1992819 -2114192
12091b114192O70443j0966q20980j61749J056418J128805L31675l6958M2306p5150
$$ -2114192 -1443749 -1454715 -2275695 -2437444 -1381026 -252221 79454 42496 84802 9652
12081I652l7843O58491J257054R07272K00748k9238k44666r35472j163818k04008
$$ 9652 -28191 630300 1887354 2794626 2995374 2966136 2721470 1785998 622180 418172
12071D18172O72427P8599j008170q28703J36300Q4695r33876j205083l03623M70431
$$ 418172 1090599 1169198 161028 -667675 -531375 -446680 -1380556 -2585639 -2889262 -2418831
12061b418831M75244M18506O30953N52942Q5236j71182j20706k25857m21250k66814
$$ -2418831 -1943587 -1525081 -894128 -341186 -255950 -427132 -547838 -773695 -1194945 -1461759
12051a461759M4414R5544K46476Q75367J178282K90179r13130q51216L05715R57055
$$ -1461759 -1417345 -1321801 -1075325 -199958 978324 1268503 355373 -495843 -190128 766927
12041G66927N38195q5745m18895p06156o83205J70609J143724Q79440m44314j236859
$$ 766927 1305122 1219377 800482 94326 -588879 -418270 725454 1604894 1160580 -76279
12031g6279r12736m98254o59166q05292m56655L5807M44324R60677J348961J133065
$$ -76279 -989015 -1487269 -2146435 -2951727 -3408382 -3372575 -2928251 -1967574 -618613 514452
12021E14452O69940O37603N64301m73051j750771j468806L20904J409721O83290
$$ 514452 1184392 1821995 2386296 1913245 162474 -1306332 -985428 424293 1107583
12012A107583l00643L3949Q47033M95546p37196j131502j21368J005606R15040
$$ 1107583 806940 840889 1687922 2183468 1446272 314770 193402 1199008 2114048
12003B114048k00222j038165p54518J41788N28886J48729j95978o5936j33884
$$ 2114048 1913826 875661 121143 262931 791817 940546 744568 678632 544748
11994E44748q77045j410518o93284P18602J315741O66763k79946o23944k78641
$$ 544748 -332297 -1742815 -2436099 -1717497 -401756 265007 -14939 -638883 -917524
11985i17524L37956N32030k20627j264832j040650O67162J847051R32075q10899
$$ -917524 -579568 -47538 -268165 -1532997 -2573647 -1906485 -59434 872641 61742
11976F1742j205081l38628J74770J18888N25840J229254J001138j04214p90694
$$ 61742 -1143339 -1481967 -1307197 -1188309 -662469 566785 1567923 1463709 673015
11967F73015p66141q42523r94931m67813L63123M02965p7233N0548M71832L027
$$ 673015 -93126 -935649 -1930580 -2398393 -2035270 -1632305 -1709538 -1658990 -1187158 -1184131
11957a184131q40455m53584Q54799J210582M44438J17326L02336m65108j806587
$$ -1184131 -2024586 -2478170 -1623371 -412789 31649 148975 451311 -13797 -1820384
11948a820384j516624M36612J417458N07091j82373L06067P9925j467399j712877
$$ -1820384 -3337008 -2900396 -1482938 -975847 -1158220 -852153 -772228 -2239627 -3952504
11939c952504O32791K584710J427829q60658r56544O27974J142916L06774j36859
$$ -3952504 -3319713 -735003 692826 -167832 -1124376 -496402 646514 953288 816429
11930H16429n0932o06638j359372q77290L46069N44929k35050m18069J49673J68545
$$ 816429 765497 158859 -1200513 -2077803 -1731734 -1186805 -1421855 -1839924 -1690251 -1521706
11920a521706m28423l05107P20390J229778N40174m26993q17679p52213m49253
$$ -1521706 -1950129 -2255236 -1534846 -305068 235106 -191887 -1009566 -1761779 -2211032
11911b211032J06324N72558N56559L84347M97512N07522j5866m48576j19783K81008
$$ -2211032 -2104708 -1532150 -975591 -591244 -93732 413790 397924 -50652 -170435 110573
11901A10573j95982r08715n39292O35173J120294N46946m8316j16163j52779l90950
$$ 110573 -85409 -994124 -1533416 -898243 222051 768997 720681 604518 451739 60789
11891F0789m03053r1266J54259L04075O31113R08084O60991N3840l63945m82626
$$ 60789 -342264 -433530 -279271 24804 655917 1564001 2224992 2278832 1914887 1432261
11881A432261m11909j883N41031L27250q50006j647198r25082M41576Q92661M98224
$$ 1432261 1020352 1018469 1559500 1886750 1036744 -610454 -1535536 -1093960 -201299 296925
11871B96925L67905M96056R833q92400j079125l85295K37015L31593K54177R6799
$$ 296925 664830 1160886 1170719 278319 -800806 -1186101 -949086 -617493 -363316 -266517
11861b66517k76621l74724L19262J154484J093208L32088k20382n52345j084813
$$ -266517 -543138 -917862 -598600 555884 1649092 1981180 1760798 1208453 123640
11852A23640j207236j20371J298870J446610N23638J01833L81058O9523j003553
$$ 123640 -1083596 -1203967 94903 1541513 2065151 2166984 2548042 2617565 1614012
11843A614012j451408q05814k25747k69063j09505M26977K33106q10007j044706
$$ 1614012 162604 -643210 -868957 -1138020 -1247525 -820548 -587442 -1397449 -2442155
11834b442155L18520J641525J292748L8742m44775j02856p110l56434m91853k48812
$$ -2442155 -2123635 -482110 810638 849380 404605 301749 294639 -61795 -553648 -802460
11824h02460P546K32967N39520O12715J94271k59007j79865K33021L98382J93900
$$ -802460 -794914 -561947 -22427 590288 784559 525552 345687 578708 977090 1170990
11814A170990j62034o05308j039717j107626o81374j87059k4823r9640k21464
$$ 1170990 1008956 403648 -636069 -1743695 -2425069 -2612128 -2636951 -2736591 -2958055
11805b958055l83754l39047L62268J453324J822258R12861l72804q11552l80199
$$ -2958055 -3341809 -3680856 -3318588 -1865264 -43006 869855 497051 -314501 -694700
11796f94700k9691l71583j123330j494180p83634Q73659K086726J357803q47435
$$ -694700 -724391 -1095974 -2219304 -3713484 -4497118 -3623459 -1536733 -178930 -1026365
11787a026365k131459j077100P98939J139872k114n52243L29989J177652O92018
$$ -1026365 -3157824 -4234924 -3435985 -2296113 -2298227 -2850470 -2520481 -1342829 -650811
11778f50811l45865m90787K30378P10861N65491L69458M19556L53632N425k72353
$$ -650811 -996676 -1487463 -1257085 -546224 19267 388725 808281 1161913 1167338 894985
11768H94985k94702l10581l98851k90809j3784K271k34414q5735O13109J025600
$$ 894985 600283 289702 -109149 -399958 -413742 -411471 -645885 -731620 -118511 907089
11758I07089N38279j97150k80315k392k33681q05756p04017K39718R82642P17070
$$ 907089 1445368 1248218 967903 965511 731830 -73926 -777943 -538225 444417 1161487
11748A161487k19892r74124r54487n9756J083447J325631L36376o25561l92852
$$ 1161487 941595 -32529 -987016 -1046772 36675 1362306 1698682 1073121 680269
11739F80269K02873l19166j319049p99218J059155J660665J1098j524596q09472
$$ 680269 883142 563976 -755073 -1554291 -495136 1165529 1176627 -347969 -1157441
11730a157441R21748J264711J99246n50608l70778L0547K92664M38154M0564r49741
$$ -1157441 -235693 1029018 1228264 677656 306878 337425 630089 1068243 1108807 159066
11720A59066j325398k16606J194878J198449M8797p03712o11953l56190j20190
$$ 159066 -1166332 -1382938 -188060 1010389 1059186 355474 -256479 -612669 -732859
11711g32859K84282L84178r0503j31207Q55937J279062l82733k462818k077944
$$ -732859 -448577 -64399 -154902 -286109 569828 1848890 1466157 -996661 -3074605
11702c074605K96806J370929J57768p81350J45857J117060L56010q79057p14147
$$ -3074605 -2777799 -1406870 -1249102 -2030452 -1884595 -767535 -411525 -1290582 -2004729
11693b004729K11826K03334n49655o17308J80275Q14550Q26744N20683M9994l77474
$$ -2004729 -1792903 -1589569 -2139224 -2756532 -2576257 -1761707 -934963 -414280 -364286 -741760
11683g41760j11995Q72333J306573L35780q71836o94731M00772N56410n44886
$$ -741760 -853755 18578 1325151 1660931 789095 94364 495136 1051546 506660
11674E06660j188438k61539J144218J344391J93814j073398j427520q27110J27418
$$ 506660 -681778 -943317 200901 1545292 1739106 665708 -761812 -1588922 -1461504
11665a461504P32942N90274o4280m94236k18104M44456Q07969O51090K75578j17997
$$ -1461504 -728562 -138288 -202568 -696804 -914908 -470452 337517 988607 1264185 1146188
11655A146188n65703q26193m56485K85888M21789k54806n36481L42740J118310
$$ 1146188 580485 -245708 -702193 -416305 5484 -249322 -785803 -443063 675247
11646F75247L16994j049849p66081Q72672J250396k52038j041518L67445J733049
$$ 675247 992241 -57608 -823689 48983 1299379 1047341 5823 373268 2106317
11637B106317Q26759q42831p73458K55526q3512j298302j095387K42478L44676
$$ 2106317 2933076 2090245 1316787 1572313 1488801 190499 -904888 -662410 -317734
11628c17734p87022p19678Q55433J401059M6783r48810l43819J56510m00740k40280
$$ -317734 -1104756 -1824434 -969001 432058 478841 -469969 -813788 -657278 -1058018 -1298298
11618a298298J394977K021414N9832j924656j209539N84253M84250o48337K0819
$$ -1298298 96679 2118093 2177925 253269 -956270 -372017 112233 -536104 -515285
11609e15285J833099J499827j089831k323951n98484J369511J128131n8419q2287
$$ -515285 1317814 2817641 1727810 -596141 -1194625 174886 1303017 1244598 1162311
11600A162311N15523J14568r28898j082142k82901K37139N8819j81429j76585
$$ 1162311 1677834 1792402 863504 -218638 -501539 -264400 -205581 -387010 -563595
11591e63595j44731R9M12548N74861K349o01514j96449P32022O14435o90103j312762
$$ -563595 -708326 -708227 -295679 279182 281531 -319983 -516432 215590 830025 139922 -1172840
11580a172840j6438J825478K009122M51662r44331j006944m88008m39826p13103
$$ -1172840 -1189278 636200 2645322 3096984 2152653 1145709 657701 217875 -495228
11571d95228o58357l43076k33901k60088m1362K92151L12550J44627L14527P57490
$$ -495228 -1153585 -1496661 -1730562 -1990650 -2032012 -1739861 -1427311 -1282684 -968157 -210667
11561b10667P31952n9946q54559p05661L18928J174463J028981K02744k23636
$$ -210667 521285 461339 -393220 -1098881 -779953 394510 1423491 1626235 1402599
11552A402599K53718Q78216O17891l71650r23083n33013j7373j23929l78916o5644
$$ 1402599 1656317 2534533 3152424 2780774 1857691 1324678 1307305 1183376 804460 738816
11542G38816L76971p116j022186j413069o31505M35698P05180J50905m27561l84413
$$ 738816 1115787 1108671 86485 -1326584 -1958089 -1522391 -817211 -666306 -1093867 -1478280
11532a478280K25090P38769M72237m95421j192795p66057M66506J334627J122151
$$ -1478280 -1253190 -514421 -42184 -537605 -1730400 -2496457 -2029951 -695324 426827
11523D26827K24473m33467l56422J10263K03980l34252q58961o71246o3601J49649
$$ 426827 651300 217833 -138589 -28326 175654 -158598 -1017559 -1688805 -1752406 -1602757
11513a602757k3318J27726N67405M91182j336K28759J186360J159256n34165j883425
$$ -1602757 -1626075 -1498349 -930944 -439762 -441098 -212339 974021 2133277 1599112 -284313
11503b84313r72701R19050J096012n41556j539234o52188O23872N44603o36552
$$ -284313 -1257014 -337964 758048 216492 -1322742 -1974930 -1351058 -806455 -1443007
11494a443007j447938j006812L80036J610980J668428P17392N6205L54717O27642
$$ -1443007 -2890945 -3897757 -3517721 -1906741 -238313 479079 535284 890001 1517643
11485A517643j29978j166695j116215j14355O84459R64786J047602N90673p06279
$$ 1517643 1387665 220970 -895245 -1009600 -325141 639645 1687247 2277920 1571641
11476A571641j743821j319521k68388k86704j081876q86318M89643J416099J153043
$$ 1571641 -172180 -1491701 -1760089 -2046793 -3128669 -4014987 -3525344 -2109245 -956202
11467i56202N45560O3426n58353p67694K48954J398971P22642j156807j468534
$$ -956202 -410642 -347216 -905569 -1673263 -1424309 -25338 697304 -459503 -1928037
11458a928037K89730J395603L49317p77119o061J319001J048612k66017o63198
$$ -1928037 -1638307 -242704 106613 -670506 -676567 642434 1691046 1425029 761831
11449G61831N6457O21683N84571L93956N6533o23665j158962j049341o81024n49949
$$ 761831 818288 1439971 2024542 2418498 2475031 1851366 692404 -356937 -1037961 -1587910
11439a587910l83422J06709N12764N48887N74540O36355J73449o63726p83556
$$ -1587910 -1971332 -1864623 -1351859 -802972 -228432 407923 581372 -82354 -865910
11430h65910j6427K89495n19784j124747l24480R96012J277163M80100l57572
$$ -865910 -882337 -592842 -1112626 -2237373 -2561853 -1565841 -288678 191422 -166150
11421a66150p06698n73031M6018P12371N51402l96381q66459j94320P09643R32310
$$ -166150 -872848 -1445879 -1399861 -687490 -136088 -532469 -1398928 -1593248 -883605 48705
11411D8705P81662O74321K61170m42988n40180J63037N02417j41298p70549n49034
$$ 48705 830367 1504688 1765858 1322870 782690 945727 1448144 1306846 536297 -12737
11401a2737q1191L5492K32966N43840K4329j228845j466025n5722J147624P40612
$$ -12737 -93928 -58436 174530 718370 742699 -486146 -1952171 -2007893 -860269 -119657
11391a19657r616L35280P77652p2290j248766j123763k64265j63960m76087N7139
$$ -119657 -129273 206007 983659 911369 -337397 -1461160 -1725425 -1889385 -2365472 -2308333
11381b308333J050054J177362M57925k30160q21039j325041q33693O65935J136862
$$ -2308333 -1258279 -80917 377008 146848 -674191 -1999232 -2832925 -2166990 -1030128
11372a030128m64250j794428o02714J239012O33326j388479j291304R27533J794680
$$ -1030128 -1494378 -3288806 -3891520 -2652508 -2019182 -3407661 -4698965 -3771432 -1976752
11363a976752L38534n09808P76509J878453R61540l18600j22276M28457k82182
$$ -1976752 -1638218 -2148026 -1371517 506936 1468476 1149876 1027600 1456057 1173875
11354A173875j269800q02045M60106N76352n49110j234651n77892O44117J249412
$$ 1173875 -95925 -897970 -437864 138488 -410622 -1645273 -2223165 -1579048 -329636
11345c29636P64215l52392r78584m04241N48636M05466p13628j048745J00513
$$ -329636 434579 82187 -896397 -1300638 -752002 -346536 -1060164 -2108909 -2008396
11336b008396J161003O99014l79074l49905O80771J165464N35706k41832l53996
$$ -2008396 -847393 -148379 -527453 -877358 -196587 968877 1504583 1262751 908755
11327I08755j24349j58639m48150o54680o89484o34279m11161Q8930O30169P47817
$$ 908755 784406 625767 177617 -477063 -1166547 -1800826 -2211987 -2123057 -1492888 -745071
11317g45071L98123J80840N26936R06295M93229m60067q04817k36682J81455k37932
$$ -745071 -346948 -166108 360828 1267123 1760352 1300285 495468 258786 440241 202309
11307B02309o04140R3042J178727J147298j34502j247680j102762o3982P63972
$$ 202309 -401831 -308789 869938 2017236 1882734 635054 -467708 -531690 232282
11298B32282O58550k44199j065268r35323M571P15478O55619M01445M63689L71949
$$ 232282 890832 646633 -418635 -1353958 -1349387 -633909 21710 423155 886844 1258793
11288A258793l33890j038282r13545k16093J86639N5872k44187m57634m13140
$$ 1258793 924903 -113379 -1026924 -1243017 -1056378 -1000506 -1244693 -1702327 -2115467
11279b115467Q2072O88250O43398K6560q9315N64712P41123k96573j360016j157160
$$ -2115467 -2033395 -1345145 -701747 -675187 -764502 -199790 541333 244760 -1115256 -2272416
11269b272416k38696K45137M32381Q24941P82163k05385r02545o8052J163564
$$ -2272416 -2511112 -2265975 -1833594 -1008653 -226490 -431875 -1334420 -1402472 -238908
11260b38908Q68308m70130p25045M08417J148286O40981j10978l82620n77923
$$ -238908 629400 159270 -565775 -157358 990928 1631909 1520931 1138311 560388
11251E60388p61494l97522J98988Q1696m42687p6591J093186J467355N33830l73458
$$ 560388 -201106 -598628 -399640 -317944 -760631 -837222 255964 1723319 2257149 1883691
11241A883691l82471k17370m59067n80925m09397o67530j238139p67574R21169
$$ 1883691 1501220 1283850 824783 243858 -165539 -833069 -2071208 -2838782 -1917613
11232a917613J803455M45568j625779j930277l87393R19866P05979k70738o77363
$$ -1917613 -114158 331410 -1294369 -3224646 -3612039 -2692173 -1986194 -2256932 -2934295
11223b934295j01933R41683J635761J389954L33125o49482p48800j11100L94056
$$ -2934295 -3036228 -2094545 -458784 931170 1264295 614813 -133987 -245087 148969
11214A48969K40127k28282l99394k32243j64426k63591l0009O31267Q47678m1540
$$ 148969 389096 160814 -238580 -470823 -635249 -898840 -928849 -297582 550096 508556
11204E08556j182097j167247r6552O00670L59756J9850J9865k37889p72415n92463
$$ 508556 -673541 -1840788 -1937340 -1336670 -976914 -957064 -937199 -1175088 -1947503 -2539966
11194b539966L86316Q43157L79322L49763J212971J265568l25999j478102m06689
$$ -2539966 -2153650 -1310493 -931171 -581408 631563 1897131 1571132 93030 -313659
11185c13659J132448N57606j208289j254205N13590J387153L10480q38145o19387
$$ -313659 818789 1376395 168106 -1086099 -572509 814644 1125124 286979 -332408
11176c32408P0866L1257n23492q39369n37987N67520K056617K454894Q64782j246575
$$ -332408 -261542 -230285 -753777 -1593146 -2131133 -1563613 493004 2947898 3812680 2566105
11166B566105j687328o07506K7356l73511n85977j16330J56110m0969K3975L20619
$$ 2566105 878777 271271 298627 -74884 -660861 -777191 -621081 -662050 -638075 -317456
11156c17456P218o73802n48844K41574K82357n53724p38736K77321J134235Q34364
$$ -317456 -310238 -984040 -1532884 -1291310 -1008953 -1562677 -2301413 -2024092 -889857 -55493
11146e5493O7091l19690m49765m81298j21621M54018N99830L48261K14812m1744
$$ -55493 11598 -308092 -757857 -1239155 -1360776 -906758 -306928 41333 256145 214401
11136B14401q94661j548257q46729N05832P06730k45795o07503J38581O83346
$$ 214401 -680260 -2228517 -3075246 -2569414 -1862684 -2108479 -2715982 -2577401 -1894055
11127a894055M45025L29240N69073K13812o51690n36904Q13772J600090P15594
$$ -1894055 -1449030 -1119790 -550717 -336905 -988595 -1525499 -711727 888363 1603957
11118A603957o28244r58199m74908n5637J15392J32044q0636k65544r2082l8366
$$ 1603957 975713 17514 -457394 -513031 -397639 -265595 -346231 -611775 -703857 -742223
11108g42223o63835j201640n62881N65354O32665q5311k9539O66079M13087o23572
$$ -742223 -1406058 -2607698 -3170579 -2605225 -1972560 -2057871 -2087410 -1421331 -1008244 -1631816
11098a631816m85372J013277J621653L23589j081097j014147k05871K23532L85953
$$ -1631816 -2117188 -1103911 517742 841331 -239766 -1253913 -1459784 -1236252 -850299
11089h50299M01668j67024q45307m61850N45734M63409n62887m92276Q78678J224640
$$ -850299 -448631 -615655 -1460962 -1922812 -1377078 -913669 -1476556 -1968832 -1090154 134486
11079A34486k86883j439825p49455K99209L30757L35168J059824J125638k05589
$$ 134486 -152397 -1592222 -2341677 -2042468 -1711711 -1376543 -316719 808919 603330
11070F03330j169747n80176r4052j072454j779094l63456J654103J732072K87847
$$ 603330 -566417 -1146593 -1240645 -2313099 -4092193 -4455649 -2801546 -1069474 -781627
11061g81627m82375k28340j47724l03649J08830P01802M78137j90572k02276K83500
$$ -781627 -1264002 -1492342 -1640066 -1943715 -1834885 -1133083 -654946 -845518 -1047794 -764294
11051g64294K71728k45272m32879l5651N36503R01449O66843l52691j280742q66152
$$ -764294 -492566 -737838 -1170717 -1206368 -669865 231584 898427 545736 -735006 -1601158
11041a601158M47883Q44069N2461k04004N84934O68556o04242j188232J11645
$$ -1601158 -1153275 -309206 -256745 -460749 124185 792741 188499 -999733 -888088
11032h88088J226399K28008j317896j027970L82060P01533L8590P3107P31057
$$ -888088 338311 566319 -751577 -1779547 -1397487 -695954 -657364 -584257 146800
11023A46800N08870n93006j021830k05063Q52986J163541N15730p02055j367883
$$ 146800 655670 62664 -959166 -1164229 -311243 852298 1368028 665973 -701910
11014g01910m33659J171679J099098q51383j873155m10702J181201M24169j241540
$$ -701910 -1135569 36110 1135208 283825 -1589330 -2000032 -818831 -394662 -1636202
11005a636202j013853O75506J301676N17924L8711K41947K4018n66208m43849
$$ -1636202 -2650055 -1974549 -672873 -154949 -116238 125709 149727 -416481 -860330
10996h60330J59319N1757n93717o63457l61010o62300j038446j96688J294805
$$ -860330 -701011 -649254 -1242971 -1906428 -2267438 -2929738 -3968184 -4164872 -2870067
10987b870067J603191O34853N5875M03637M75556l25547j134003j271622r48012
$$ -2870067 -1266876 -632023 -576148 -172511 303045 -22502 -1156505 -2428127 -3376139
10978c376139k66791P92195J471051R55207j15442m19237k2339q6486p45698r31985
$$ -3376139 -3642930 -2850735 -1379684 -424477 -539919 -959156 -981495 -1067981 -1813679 -2745664
10968b745664k38273N55234P87968M81118k39349j110493j397363o69540M41196
$$ -2745664 -2983937 -2428703 -1640735 -1159617 -1398966 -2509459 -3906822 -4576362 -4135166
10959d135166J122762J358235J237076M16452p05778p06964N91769J153054k17840
$$ -4135166 -3012404 -1654169 -417093 -641 -706419 -1413383 -821614 331440 113600
10950A13600j521484n69882J210977Q79343j195595j890119l28064J026918O06469
$$ 113600 -1407884 -1977766 -766789 112554 -1083041 -2973160 -3301224 -2274306 -1667837
10941a667837r7861M12133J136184O19097n15762p49334p3657L49457J70282J03816
$$ -1667837 -1765698 -1353565 -217381 401716 -114046 -863380 -937037 -587580 -417298 -313482
10931c13482M70880O07035m4397q79665p10100O18584J715340J251192k87411
$$ -313482 157398 764433 720036 -159629 -869729 -251145 1464195 2715387 2427976
10922B427976j278503j179559r17736j040576q73632L7197R59130J106189O36315
$$ 2427976 1149473 -30086 -947822 -1988398 -2862030 -2824833 -1865703 -759514 -123199
10913a23199l7957p96013j180183n18933P38505J143129L15443m75617l90427
$$ -123199 -161156 -957169 -2137352 -2656285 -1917780 -774651 -459208 -934825 -1325252
10904a325252j62409m83979q30290o89884m42747k60919L08068J014744Q92720
$$ -1325252 -1487661 -1971640 -2801930 -3491814 -3934561 -4195480 -3887412 -2872668 -1979948
10895a979948J74434K56077J099349R35139n67091j322176k42561Q77738M16934
$$ -1979948 -1805514 -1549437 -450088 485051 -82040 -1404216 -1646777 -769039 -352105
10886c52105n45837m90703J4871r2033l22423k4203J17495l30512m21224J66443
$$ -352105 -897942 -1388645 -1373774 -1465807 -1788230 -1812433 -1694938 -2025450 -2446674 -2280231
10876b280231J61400p44575q39665M46211J060039k4457n97102R26905K331225
$$ -2280231 -2118831 -2863406 -3703071 -3256860 -2196821 -2221278 -2818380 -1891475 439750
10867D39750J188834r62743j217108J16899P32704K58113j31435l75046q90210
$$ 439750 1628584 665841 -551267 -434368 298336 556449 425014 49968 -840242
10858h40242q53498J97766P23416l24806j275322n45052M92968J66766l23077
$$ -840242 -1693740 -1495974 -772558 -1097364 -2372686 -2917738 -2424770 -2258004 -2581081
10849b581081O01897J603396Q90942l07972j29911L70040m17136j102648O6116
$$ -2581081 -1979184 -375788 515154 207182 77271 447311 30175 -1072473 -1006357
10840a006357J351383M21966j108788m18746J321203J114739l88167m75590K74628
$$ -1006357 345026 766992 -341796 -760542 560661 1675400 1287233 811643 1086271
10831A086271n79403j980066r50402J404777J187149j392505k136950m7467J280328
$$ 1086271 506868 -1473198 -2423600 -1018823 168326 -1224179 -3361129 -3408596 -2128268
10822b128268J72676o84096L50023J080415n6144j124866l87079P57976N24513
$$ -2128268 -1955592 -2639688 -2289665 -1209250 -1265394 -2390260 -2777339 -2019363 -1494850
10813a494850n15301j058643r08101o2705J564323K752448J826429m83836j542706
$$ -1494850 -2010151 -3068794 -3976895 -4039600 -2475277 277171 2103600 1619764 77058
10804G7058o00179M55689M05875P0974N2161k18042p41921p02305k21964j80132
$$ 77058 -523121 -67432 338443 409417 461578 243536 -498385 -1200690 -1422654 -1602786
10794a602786l63765J515L56910j56107n47597M14536J395347M15156j345049
$$ -1602786 -1966551 -1965036 -1608126 -1764233 -2311830 -1897294 -501947 -86791 -1431840
10785a431840j162795N54984J004568j01973l23866R39090J608854Q49890J08842
$$ -1431840 -2594635 -2039651 -1035083 -1137056 -1460922 -521832 1087022 1936912 2045754
10776B045754m3692n80296j281315p69369N06402O45328k68000m07996K27390
$$ 2045754 2002062 1421766 140451 -628918 -122516 522812 254812 -153184 74206
10767G4206l3395r97047q67142R9011k4112r11963m24287J064361R30019q88932
$$ 74206 40811 -956236 -1823378 -1724367 -1748479 -2660442 -3084729 -2020368 -1090349 -1979281
10757a979281j566514l27357M83369q7546j74151R33309J366699L18835n36685
$$ -1979281 -3545795 -3873152 -3389783 -3477329 -3651480 -2718171 -1351472 -1032637 -1569322
10748a569322k93153j00533l92567j25206N79568L17148o21480m89701M55278
$$ -1569322 -1862475 -1963008 -2355575 -2480781 -1901213 -1584065 -2205545 -2695246 -2239968
10739b239968K57803q48146o63474O92192P84014n00190n50381J090034J690134
$$ -2239968 -1982165 -2830311 -3493785 -2801593 -2017579 -2517769 -3068150 -1978116 -287982
10730b87982J20163j332684r92427N3011O97018J145493R24532p48078k212644
$$ -287982 -167819 -1500503 -2492930 -2439919 -1742901 -597408 327124 -420954 -2633598
10721b633598r45541J773894K047518l48948j469416K31673J644842O20341q47219
$$ -2633598 -3579139 -1805245 242273 -106675 -1576091 -1344418 300424 920765 73546
10712G3546q00756l94024q14039r48578q6144M07599j70547m69009K29519P88202
$$ 73546 -727210 -1121234 -1935273 -2883851 -2969995 -2562396 -2732943 -3201952 -2972433 -2184231
10702b184231O12801M42830K82178m96393r66489J26289J283784J97548j729804
$$ -2184231 -1571430 -1128600 -846422 -1342815 -2309304 -2183015 -899231 -701683 -2431487
10693b431487j195020J112551J403190n63125j160316M16422Q62050q62960j554834
$$ -2431487 -3626507 -2513956 -1110766 -1673891 -2834207 -2417785 -1555735 -2418695 -3973529
10684c973529K71152J777568J035266n1549O0158N5042p10864o00846O31950P89813
$$ -3973529 -3702377 -1924809 -889543 -941092 -880934 -825892 -1536756 -2137602 -1505652 -715839
10674g15839n83605j095252O6807P60797J34060l6616O45016K39667j337037j582447
$$ -715839 -1299444 -2394696 -2327889 -1567092 -1433032 -1469648 -824632 -584965 -1922002 -3504449
10664c504449j6236Q29464R2185j08856R34437J162395j34135r19971r7051J054835
$$ -3504449 -3520685 -2691221 -2599036 -2707892 -1773455 -611060 -745195 -1665166 -1762217 -707382
10654g07382J533621J409731M92091m97057P65379L732898K960392l873102r569018
$$ -707382 826239 2235970 2728061 2231004 2996383 6729281 9689673 5816571 -3752447
10645c752447o494446J245185L676161K91974r06749J908706K388330j066643
$$ -3752447 -10246893 -9001708 -5325547 -5033573 -5940322 -4031616 -1643286 -2709929
10637b709929k297279P14192K219125j76174j424745O76987J417456j075777k037620
$$ -2709929 -5007208 -4293016 -2073891 -2250065 -3674810 -2997823 -1580367 -2656144 -4693764
10628d693764K69603R87850j446397j832122J377434K356985j021508k695027
$$ -4693764 -4424161 -3436311 -4882708 -6714830 -5337396 -2980411 -4001919 -6696946
10620f696946K24070J979064o52487k170499P58872K594135l53635k557424K61312
$$ -6696946 -6472876 -4493812 -5146299 -7316798 -6557926 -3963791 -4317426 -6874850 -6613538
10611f613538K955693P54003j927082k61855K028530M18553j810019n28670J287781
$$ -6613538 -3657845 -2903842 -4830924 -5092779 -3064249 -2645696 -4455715 -4984385 -3696604
10602c696604Q9637j182814K82433R72645j587384k944635n2072K369692O29241
$$ -3696604 -3606967 -4789781 -4507348 -3534703 -5122087 -8066722 -8118794 -5749102 -5119861
10593e119861r50433J191423K583104m04535k927968o22898K147180P59008j233156
$$ -5119861 -6070294 -4878871 -2295767 -2700302 -5628270 -6251168 -4103988 -3344980 -4578136
10584d578136J30720J377802o95669j967019O08250K226471l92274j954166J197809
$$ -4578136 -4447416 -3069614 -3765283 -5732302 -5124052 -2897581 -3289855 -5244021 -4046212
10575d046212L371172K65757k484620j94017J676955j567100m154358q80592K542228
$$ -4046212 -675040 -409283 -2893903 -3087920 -1410965 -2978065 -7132423 -8013015 -5470787
10566e470787M24300k010474P18926L292903K40350k858915k46594K474491n81553
$$ -5470787 -5046487 -7056961 -6338035 -3045132 -2804782 -5663697 -5910291 -3435800 -4017353
10557d017353l642749n75522K685063l67780l772437o60660L085923L26612l161581
$$ -4017353 -7660102 -8235624 -5550561 -5918341 -9690778 -10351438 -7265515 -6938903 -10100484
10548a0100484n5455L906128J129427k931054p63808K362639n11758l487564L39387
$$ -10100484 -10155939 -6249811 -5120384 -8051438 -8815246 -6452607 -6964365 -10451929 -10112542
10539a0112542M184339M68904l710419j91189L861544k3338m491229q25807L330097
$$ -10112542 -5928203 -5459299 -9169718 -9360907 -5499363 -5522701 -10013930 -10839737 -7509640
10530g509640q64164n097359j09286N000276J65393m989061K99529N665298o10848
$$ -7509640 -8373804 -13471163 -13580449 -8580173 -8414780 -13403841 -13104312 -7439014 -8049862
10521h049862p302574j150216O300164K92747p643192j607800O693860K26654
$$ -8049862 -15352436 -16502652 -10202488 -9909741 -17552933 -19160733 -12466873 -12240219
10513a2240219q910402k286204P690482J163691r158096k224437Q367178J16844
$$ -12240219 -21150621 -23436825 -15746343 -14582652 -23740748 -25965185 -17598007 -17481163
10505a7481163j1726375k257170J1303589M32731j5887510m602490J3592039J03788
$$ -17481163 -29207538 -31464708 -20161119 -19728388 -35615898 -40218388 -26626349 -26522561
10497b6522561k2268002p533605J8986283P99736l4187440j4656950K6806401
$$ -26522561 -48790563 -56324168 -37337885 -36538149 -70725589 -85382539 -58576138
10490e8576138q922069q5611822l6516124J60461017K81103974J52595341q3833180
$$ -58576138 -67498207 -153110029 -189626153 -29165136 251938838 404534179 320700999
10483C20700999j65987014o7153880J9979461l746161m3257474j7383003J8031436
$$ 320700999 154713985 87560105 107539566 103793405 60535931 43152928 61184364
10476F1184364K091468k3701488r047459J3676235J833786j7749064p454016J0305193
$$ 61184364 63275832 39574344 30526885 44203120 46036906 28287842 20833826 31139019
10468C1139019J998243j3199842n066170R488825K567189j0907827m738932Q240577
$$ 31139019 33137262 19937420 14871250 24360075 26927264 16019437 11280505 19521082
10460A9521082L530880p925217l405823P508813L448241p386427m800913M732924
$$ 19521082 23051962 15126745 11720922 19229735 22677976 15291549 10490636 15223560
10452A5223560K887183n007911k785032M330326J677364n251867k515763M469592
$$ 15223560 18110743 13102832 10317800 14648126 16325490 11073623 8557860 13027452
10444A3027452K325650l849137j471713M326360J455678m828169k449535L687840
$$ 13027452 15353102 11503965 10032252 14358612 15814290 10986121 8536586 12224426
10436A2224426J659843m181298k365209L170631J558236l418796j484869L341978
$$ 12224426 13884269 9702971 7337762 10508393 12066629 8647833 7162964 10504942
10428A0504942R11400m591999k718575K714955J209524l816715j861815M072034
$$ 10504942 11416342 6824343 4105768 6820723 8030247 4213532 2351717 6423751
10420F423751L323047k043434j857840K464426J548809l227643k799317J708730
$$ 6423751 9746798 7703364 5845524 8309950 9858759 6631116 3831799 5540529
10412E540529J602092k263735j728574K316532J967142j941750j673245K146812
$$ 5540529 7142621 4878886 3150312 5466844 7433986 5492236 3818991 5965803
10404E965803K066143j484891j465284J677237J182586k361203k092929J673354
$$ 5965803 8031946 6547055 5081771 6759008 7941594 5580391 3487462 5160816
10396E160816K085543j165745j789269R02953J472860o66276p90058J323686J395067
$$ 5160816 7246359 6080614 4291345 5194298 6667158 6000882 5210824 6534510 7929577
10387G929577m93776o06304L67655q73141k453648n20331K300754R27354k465602
$$ 7929577 7435801 6829497 7197152 6324011 3870363 3350032 5650786 6578140 4112538
10378D112538k148691P10282Q66436q21443J23546K167629P21941k095837q65089
$$ 4112538 1963847 2674129 3540565 2719122 2842668 5010297 5732238 3636401 2771312
10369B771312K562413K111835j297911j806125L70575K16643j826966j122384
$$ 2771312 5333725 7445560 6147649 4341524 4712099 4928742 3101776 1979392
10361A979392J438129J061296j245328n54726K056876J441842j392216j080112
$$ 1979392 3417521 4478817 3233489 2678763 4735639 6177481 4785265 3705153
10353C705153J573669J106999j830723j616436J356207J299067j824442k196342
$$ 3705153 5278822 6385821 4555098 2938662 4294869 5593936 3769494 1573152
10345A573152Q00856J640433p89136j546533O71433J612946J37724j66741J157384
$$ 1573152 2374008 4014441 3225305 1678772 2350205 3963151 4100875 3934134 5091518
10336E091518O39055j439378j120880J053894O13341j842067j223016K042587
$$ 5091518 5730573 4291195 3170315 4224209 4837550 2995483 1772467 3815054
10328C815054K014524j802498l095157N0530K053333K04553j064577Q21378K009366
$$ 3815054 5829578 4027080 931923 982453 3035786 3240339 2175762 2997140 5006506
10319E006506P9992j446499j32450J003961k45591j178327J69708J264681K28254
$$ 5006506 5086498 3639999 3507549 4511510 4265919 3087592 3257300 4521981 4750235
10310D750235p66473j59374J61822p71302r16963K54548K58913j315894j405687
$$ 4750235 3983762 3824388 3986210 3214908 2297945 2552493 2811406 1495512 89825
10301H9825P84996J834958R2620j453690o10286N21138j10168j056106o34586
$$ 89825 874821 2709779 2802399 1348709 738423 1259561 1149393 93287 -541299
10292e41299K41170N11521P19823Q43110j19322j341705o03528J645697K380341
$$ -541299 -300129 211392 931215 1774325 1655003 313298 -290230 1355467 3735808
10283C735808Q12810o44517o62462l69356j82007P16927J535882N75730j144950
$$ 3735808 4548618 3904101 3241639 2872283 2690276 3407203 4943085 5518815 4373865
10274D373865j043829M23552N69005n47164n63502K32622n54735k217889j575713
$$ 4373865 3330036 3753588 4322593 3775429 3211927 3444549 2889814 671925 -903788
10265i03788J140097K320749J110297K63742O50317K25559j123924j014825O19111
$$ -903788 236309 2557058 3667355 3931097 4581414 4806973 3683049 2668224 3287335
10256C287335J223314M94571N21159J007350k69182k240071j570954R22746R75535
$$ 3287335 4510649 5005220 5526379 6533729 6264547 4024476 2453522 3376268 4351803
10247D351803j557549k185786K69031J680409K3602j513786p10400L20789J6272
$$ 4351803 2794254 608468 877499 2557908 2581510 1067724 357324 678113 694385
10238F94385M0120R77670O86070r68110r21857J421648K427072L39936j708956
$$ 694385 734505 1712175 2398245 1430135 508278 1929926 4356998 4696934 2987978
10229B987978j107013M07157N92836J63653K52853K47359p8775K01314O56157
$$ 2987978 1880965 2288122 2880958 3044611 3297464 3544823 3466048 3667362 4323519
10220D323519j99931j549998j134911M03122L80147q89294p51439M34085J0901
$$ 4323519 4123588 2573590 1438679 1841801 2221948 1332654 581215 1015300 1026201
10211A026201j304888m87752J405154N79337j887177j157079K320092K873774
$$ 1026201 -278687 -766439 638715 1218052 -669125 -1826204 493888 3367662
10203C367662l00494j572024Q72971J967064m55674j678196N88606J642049j109998
$$ 3367662 3067168 1495144 2368115 4335179 3879505 2201309 2789915 4431964 3321966
10194C321966k887902m48231J743856p4136j929889K35291K845512J370057j478629
$$ 3321966 434064 -14167 1729689 1655553 -274336 -39045 2806467 4176524 2697895
10185B697895j156129O51680L00811n94892P91213J982846j34297k443191o64050
$$ 2697895 1541766 2193446 2494257 1899365 2690578 4673424 4539127 2095936 1431886
10176A431886K536730J884869j350093j972560P2273O33943p10007q40703K50132
$$ 1431886 3968616 5853485 4503392 2530832 2603105 3237048 2527041 1686338 1936470
10167A936470j82863j623099j001576J254275J768803K75379l68272K94366O4907
$$ 1936470 1753607 130508 -871068 383207 2152010 2427389 2059117 2353483 2418390
10158B418390j016713o04294J250367J974073R99686K18303J23158n04218j349294
$$ 2418390 1401677 797383 2047750 4021823 5021509 5239812 5362970 4858752 3509458
10149C509458q54964M97708P45317q9786l74645q7154m16156r00899k25915Q90898
$$ 3509458 2654494 3152202 3897519 3807733 3433088 3345934 2929778 2028879 1802964 2693862
10139B693862P48669k35147m72830k12739n95253r26086j3908J043134O08299
$$ 2693862 3442531 3207384 2734554 2521815 1926562 1000476 986568 2029702 2638001
10130B638001k78065K74341J334509P93645n99677n19810O49576N26863r79886
$$ 2638001 2359936 2634277 3968786 4762431 4162754 3642944 4292520 4819383 3839497
10121C839497j660616q16693J63453O18210J021923J070760J56551p87293m81635
$$ 3839497 2178881 1362188 1525641 2143851 3165774 4236534 4393085 3605792 3124157
10112C124157L63747L04956k35096m5274L55632j94891j058467r13274j31383
$$ 3124157 3487904 3792860 3557764 3512490 3868122 3673231 2614764 1701490 1570107
10103A570107K50894N10741R70711N41650j087695j824330l30911J330398R76679
$$ 1570107 1821001 2331742 3302453 3844103 2756408 932078 601167 1931565 2908244
10094B908244q3731K49532R71360J94902r83881m98463P90004P87034j34949n19879
$$ 2908244 2824513 3074045 4045405 4240307 3256426 2757963 3547967 4335001 4200052 3680173
10084C680173p92439j474429r55386J305882K202416k41971k526499q93977K083062
$$ 3680173 2887734 1413305 457919 1763801 3966217 3724246 1197747 303770 2386832
10075B386832J639349j154710j700340o8213j24501j784474j191060J722653K744911
$$ 2386832 4026181 2871471 1171131 1102918 978417 -806057 -1997117 -274464 2470447
10066B470447Q55797l43991M73295L48034j696676k359684o6484J999459J187343
$$ 2470447 3326244 2982253 3455548 3803582 2106906 -252778 -319262 1680197 2867540
10057B867540p42510j211850m55652L25948J021939J300430L93941p63131k92022
$$ 2867540 2125030 913180 457528 783476 1805415 3105845 3499786 2736655 2444633
10048B444633J175418J165116k43740m96657O50919O25689j040862j616700o6093
$$ 2444633 3620051 4785167 4541427 4044770 4695689 5321378 4280516 2663816 2597723
10039B597723J108619K49883j039209j177988p67427l22362P24635J784815J268905
$$ 2597723 3706342 3956225 2917016 1739028 971601 649239 1373874 3158689 4427594
10030D427594k73905o20841Q1419m41138j926060j480661J097713K420841J092713
$$ 4427594 4153689 3532848 3614267 3173129 1247069 -233592 864121 3284962 4377675
10021D377675k47983J33707M94655l59547p70158J17801M21816p27428j285834
$$ 4377675 4129692 4263399 4758054 4398507 3628349 3746150 4167966 3440538 2154704
10012B154704j52499P18004N0453m62434L61128Q69310j40438j004388j81961
$$ 2154704 2002205 2720209 2770662 2308228 2669356 3538666 3398228 2393840 2211879
10003B211879J149969J343509N78682m45501j555636j937065o97640Q64727O25443
$$ 2211879 3361848 4705357 5284039 4838538 3282902 1345837 648197 1512924 2138367
9994B138367n78085j15163J536958J374996n51051j055075K52241K97589j359924
$$ 2138367 1560282 1445119 2982077 4357073 3806022 2750947 3003188 3300777 1940853
9985A940853j468618N82392J281411m00599r70353Q41774J482810n88742j702437
$$ 1940853 472235 1054627 2336038 1935439 965086 1806860 3289670 2700928 998491
9976I98491J54747J414610l66375j834805j42380J697346M38533j528050q05085
$$ 998491 1153238 2567848 2201473 366668 224288 1921634 2360167 832117 27032
9967B7032J102625J289251O25516Q80954P69523p68768j425239J49502J076872
$$ 27032 1129657 2418908 3044424 3925378 4694901 3926133 2500894 2650396 3727268
9958C727268o22480k072559q03607P22452O2118o54458N01661J088656m97078
$$ 3727268 3104788 1032229 228622 951074 1013192 358734 860395 1949051 1451973
9949A451973j059031J242454K439178k08227k554363p50606J806264R39781q08910
$$ 1451973 392942 1635396 4074574 3866347 1311984 561378 2367642 3307423 2498513
9940B498513K01022J512851K3429j279770O44764K149429j83185k205672J02524
$$ 2498513 2699535 4212386 4235815 2956045 3600809 5750238 5567053 3361381 3463905
9931C463905K310806k52892k959693l12019L195253J383979j597383O23146L653891
$$ 3463905 5774711 5521819 2562126 2250107 5445360 6829339 5231956 5855102 9508993
9922I508993M83380m219494k120530K882083J908305j967498k66303L554017R64008
$$ 9508993 9992373 5772879 3652349 6534432 8442737 6475239 6208936 9762953 10726961
9913A0726961l470001j50023N267916J211173n940865j793565P415273M276083
$$ 10726961 7256960 7106937 12374853 13586026 7645161 5851596 13266869 17542952
9905A7542952n571979j539852J1078486P265059p521412K40242K6325790J7774384
$$ 17542952 11970973 10431121 21509607 28774666 21253254 21493496 47819286 65593670
9897F5593670m2144373q7392736n4829173K0537746N2580103K3064953q008144
$$ 65593670 23449297 -63943439 -118772612 -98234866 -45654763 -22589810 -30597954
9890c0597954j826748J3959839Q113960m691242j344608P626536L424857n457179
$$ -30597954 -32424702 -18464863 -10350903 -15042145 -16386753 -8760217 -5335360 -10792539
9882a0792539k400861N863217M016007l302314k503451L254172K264842k774016
$$ -10792539 -13193400 -7330183 -3314176 -6616490 -9119941 -5865769 -3600927 -6374943
9874f374943j250664M413029L883931j559108k514737P74364O42181k321351j281289
$$ -6374943 -7625607 -3212578 671353 -887755 -3402492 -2628128 -1985947 -4307298 -5588587
9865e588587K547583K125018j520704j249475K389254K315588j515303k172221
$$ -5588587 -3041004 -915986 -2436690 -3686165 -1296911 1018677 -496626 -2668847
9857b668847J215914K249312p32600k317034m57322O88816n37306p85027Q68170
$$ -2668847 -1452933 796379 63779 -2253255 -2710577 -2021761 -2559067 -3344094 -2475924
9848b475924J188809l06434l12367J367183J144516j162147j559147O03325J278174
$$ -2475924 -1287115 -1593549 -1905916 -538733 605783 -556364 -2115511 -1512186 -234012
9839b34012p18183j486040P79252K583458J325673p52175j098925n99087o10664
$$ -234012 -952195 -2438235 -1658983 924475 2250148 1497973 399048 -200039 -810703
9830h10703l95657M99096Q17904J31788k77958m7117k37893p25608k33668P49514
$$ -810703 -1206360 -707264 110640 242428 -35530 -82647 -320540 -1046148 -1279816 -530302
9820e30302L99079r20149r77063L17001P39078j87238n30193K94290O04139k07051
$$ -530302 -131223 -1051372 -2028435 -1711434 -972356 -1159594 -1689787 -1395497 -791358 -998409
9810i98409o99663k77368J7518j1322O00818J513494J192886k59504j112275q96542
$$ -998409 -1698072 -1975440 -1957922 -1969244 -1368426 145068 1337954 1078450 -33825 -930367
9800i30367o56411n26178J97645R16982M97930k85494M8995P22620J2948j261671
$$ -930367 -1586778 -2112956 -1915311 -998329 -500399 -785893 -736898 -14278 -1330 -1263001
9790a263001r67831L81568N01261m83317m81279N16474P26216L71899J118556
$$ -1263001 -2230832 -1849264 -1348003 -1831320 -2312599 -1796125 -1069909 -698010 420546
9781D20546K157291J162316j099931j571119k18115N3601j128648j081088N64164
$$ 420546 2577837 3740153 2640222 1069103 850988 904589 -224059 -1305147 -740983
9772g40983R74971m89394r40496O79591J643118M38498p61589l79764R7839k63915
$$ -740983 233988 -255406 -1195902 -516311 1126807 1565305 803716 423952 521791 257876
9762B57876M4546J339946J317480o75433j891680q37036K18720m13865r14125
$$ 257876 302422 1642368 2959848 2284415 392735 -444301 -225581 -639446 -1553571
9753a553571J65476R14954k31209j307993l06201J259151J203013K92845K04998
$$ -1553571 -1388095 -473141 -704350 -2012343 -2318544 -1059393 143620 436465 641463
9744F41463M62435Q3854j85171K21102M0941j189751j485884J85271J537155N73929
$$ 641463 1103898 1187752 1002581 1223683 1264624 74873 -1411011 -1225740 311415 885344
9734H85344j069309j079646j80669q8254k46630M30176Q61185j16695j054651
$$ 885344 -183965 -1263611 -1444280 -1532534 -1779164 -1348988 -487803 -604498 -1659149
9725a659149k86907R40549P02167j66611R8401P41812N0770j206435j097324J3124
$$ -1659149 -1946056 -1005507 -303340 -469951 -371550 370262 421032 -785403 -1882727 -1869603
9715a869603L84182J36441N73991J256840O97536p13977j170670l13358O54297
$$ -1869603 -1485421 -1348980 -774989 481851 1179387 465410 -705260 -1018618 -364321
9706c64321J096129J144067N52478o98019j486976r97686r4604K42686M67719
$$ -364321 731808 1875875 2428353 1730334 243358 -754328 -848932 -606246 -138527
9697a38527R37461O71712n56300r70430K34324R11284n15923j886816p32116J320088
$$ -138527 798934 1470646 914346 -56084 178240 1089524 573601 -1313215 -2045331 -725243
9687g25243J178673m63542n38400R61772J194267l89131j231159j62716R89583
$$ -725243 453430 -10112 -548512 413260 1607527 1218396 -12763 -175479 814104
9678H14104Q27281K19346O3641k9430k04016M7383K92330n37691j889933j907099
$$ 814104 1641385 1860731 1924372 1894942 1690926 1738309 2030639 1492948 -396985 -2304084
9668b304084l93216P22544L44490m05261k71384M90643J065283J132373O24431
$$ -2304084 -2697300 -1974756 -1630266 -2035527 -2306911 -1816268 -750985 381388 1005819
9659A005819k46969o49944p6469N84585K52752n01037l44759N78235J000396O74807
$$ 1005819 758850 108906 32437 617022 869774 368737 23978 602213 1602609 2277416
9649B277416M15622L91191J17577k41604k55534l93700j112987j471428n28303
$$ 2277416 2693038 3084229 3201806 2960202 2704668 2310968 1197981 -273447 -801750
9640h01750O54999N17945k83611k2735R44701Q15595l21464n92553L25031P59699
$$ -801750 -146751 371194 87583 64848 1009549 1825144 1503680 911127 1236158 1995857
9630A995857R3489m34808k90204l84096p95257l41871Q81189J027606m87289j726372
$$ 1995857 2089346 1654538 1364334 980238 184981 -156890 724299 1751905 1264616 -461756
9620d61756j091110M47991J091783N95475j22055m42957k49337K92465N69823
$$ -461756 -1552866 -1104875 -13092 582383 460328 17371 -231966 60499 630322
9611F30322P3178o76826p41911k19174R1500J71948M91931O13433j66997j085966
$$ 630322 703500 26674 -715237 -934411 -842911 -670963 -179032 434401 267404 -818562
9601h18562p64011M09080Q01899L05679L04148Q84110N74861p73658j358337l63857
$$ -818562 -1582573 -1173493 -371594 -65915 238233 1122343 1697204 923546 -434791 -798648
9591g98648P64736Q20892M72596N09607M78510L2206k09057n6767k52687p82123
$$ -798648 -33912 786980 1259576 1769183 2247693 2279899 2070842 2014075 1761388 979265
9581I79265n41879N09900Q42275q3603p53638j93506L98420j02882q34280p63504
$$ 979265 437386 947286 1789561 1705958 952320 758814 1157234 1054352 220072 -543432
9571e43432n57048r26884q43082N98197J928332J166489r47841j781341m92059
$$ -543432 -1100480 -2027364 -2870446 -2272249 -343917 822572 -125269 -1906610 -2398669
9562b398669J080398J220596L59726r1602K53806N44085J101r83553j181656n7011
$$ -2398669 -1318271 -97675 262051 170449 424255 968340 969441 -14112 -1195768 -1252779
9552a252779J334696J559237O83129K1718J18247J83415k93883p19363o31634
$$ -1252779 81917 1641154 2324283 2346001 2464248 2647663 2353780 1634417 1002783
9543A002783m82580n46806k65719N37615R11036J78663q31872r50522l19890O9645
$$ 1002783 520203 -26603 -292322 245293 1156329 1334992 503120 -447402 -767292 -697647
9533f97647p4396j98514N4230M43953O14886M67702J75162M5542J52062J19586
$$ -697647 -772043 -970557 -916327 -472374 142512 610214 785376 830918 982980 1102566
9523A102566l01006o13833k21821M69831N01319j52097n64343l41401K8133L90404
$$ 1102566 801560 187727 -34094 435737 937056 784959 220616 -120785 -92652 297752
9513B97752J158876K003713J717083O4978j431395j399472l39321L70978L27104
$$ 297752 1456628 3460341 5177424 5242402 3811007 2411535 2072214 2443192 2770296
9504B770296O0948j62116n39381j050299j335915j154199n58829K14116Q31160
$$ 2770296 2831244 2669128 2129747 1079448 -256467 -1410666 -1969495 -1755379 -924219
9495i24219J053581R18579N14386k38289j183612j645251j189840l71229K8912
$$ -924219 129362 1047941 1562327 1324038 140426 -1504825 -2694665 -3065894 -3036982
9486c036982J45026N31889R52547P88763L12257K42708L00298l07940j081986
$$ -3036982 -2891956 -2360067 -1407520 -618757 -306500 -63792 236506 -71434 -1153420
9477a153420o27854R30886J700223P45773n22444n14989L54100O45328J5069o74800
$$ -1153420 -1781274 -850388 849835 1595608 1073164 558175 912275 1557603 1572672 897872
9467H97872p19971k17551K66735K00805l90230p58534k91229N31091P52091L68541
$$ 897872 177901 -39650 227085 427890 37660 -720874 -1012103 -481012 271079 639620
9457F39620J93817M12316M14459Q8016L1912L07171K10047m05961p41090l50729
$$ 639620 833437 1245753 1660212 1748228 1780140 2087311 2297358 1891397 1150307 799578
9447G99578K04977L56659K16758N348k95220n01966l15316N3244J47097M6713
$$ 799578 1004555 1361214 1577972 1583320 1288100 786134 470818 524062 671159 717872
9437G17872J8834k41999r02361j036112J50671J595682J603811M47254j63865
$$ 717872 736706 494707 -407654 -1443766 -1293095 302587 1906398 2353652 2189787
9428B189787Q1259k2005n86385l97317M59510L46232q96010j253361R9815J214176
$$ 2189787 2271046 2249041 1662656 1265339 1724849 2071081 1175071 -78290 21525 1235701
9418A235701M92350q38702r72810k76369n0738j97829O4087M46811K66967j32003
$$ 1235701 1728051 889349 -83461 -359830 -410568 -608397 -544310 -97499 169468 37465
9408C7465j02010P0883r8781k47117L3410L02005J93160J74442M25510J81340
$$ 37465 -64545 6338 -92443 -339560 -306150 -4145 189015 363457 788967 970307
9398I70307p38038j040490J15865J489463J435930K37254o24027o59813m62367
$$ 970307 232269 -808221 -692356 797107 2233037 2470291 1846264 1186451 724084
9389G24084k74468J62749O94759P72308K26341n77088j064424o99841M90691J522229
$$ 724084 449616 612365 1307124 2079432 2305773 1728685 664261 -35580 455111 1977340
9379A977340J396522M56339j95428m22842q43161j190833p32000j28355o53979
$$ 1977340 3373862 3830201 3634773 3211931 2368770 1177937 445937 317582 -336397
9370c36397j557541q35608J097769J557276J03039m73122J000966J814109P8725
$$ -336397 -1893938 -2729546 -1631777 -74501 28538 -444584 556382 2370491 2449216
9361B449216j740105r14545R03522O33992r60107q30433J035862J761666L48921
$$ 2449216 709111 -205434 698088 1332080 371973 -458460 577402 2339068 2687989
9352B687989j231276j508788j024338m00525M10910Q83686K48153q63797j047021
$$ 2687989 1456713 -52075 -1076413 -1476938 -1066028 -182342 65811 -797986 -1845007
9343a845007k21624O21589J190356J556573R39137r47062k197003r42972J385506
$$ -1845007 -2066631 -1445042 -254686 1301887 2241024 1293962 -903041 -1846013 -460507
9334d60507J782121J70402p70915r3151L12406n50786j098946k04073Q05395N14844
$$ -460507 1321614 1492016 721101 627950 940356 389570 -709376 -913449 -108054 406790
9324D06790l55664m59944J26516N69961O20720L22241l96627j072674q41697J56199
$$ 406790 51126 -408818 -282302 287659 908379 1230620 833993 -238681 -1080378 -924179
9314i24179P23740M95950N30469J333712J668824L32994j872801k990388k172798
$$ -924179 -200439 295511 825980 2159692 3828516 4161510 2288709 -701679 -2874477
9305b874477l57244R61680J111124N92958L05197L98755J99292n27831r18838
$$ -2874477 -3231721 -2270041 -1158917 -565959 -260762 137993 337285 -190546 -1109384
9296a109384k70559P07717Q05594n3320r85112j386875j101636n8059J218197
$$ -1109384 -1379943 -672226 133368 80048 -905064 -2291939 -3393575 -3451634 -2233437
9287b233437J531299O14045r8032M12662R52386J08166j117281q34554M43105
$$ -2233437 -702138 -88093 -186125 226537 1178923 1287089 169808 -664746 -221641
9278b21641N52248p22034j402223o17548L74807O51685O88500O56328M3218o09167
$$ -221641 330607 -391427 -1793650 -2411198 -2036391 -1384706 -696206 -39878 3340 -605827
9268f05827j668J350755J323420l16471j188278j09118R83448L65375p09566m65996
$$ -605827 -607495 743260 2066680 1750209 561931 452813 1436261 1801636 1092070 626074
9258F26074L58347J65854n71446m57723P9099k86177r99779l78417J252134J699672
$$ 626074 984421 1150275 578829 121106 200205 -85972 -1085751 -1464168 -212034 1487638
9248A487638L25627r57155o39967M17790Q32438P90900J070092J227316L04503
$$ 1487638 1813265 856110 216143 633933 1466371 2257271 3327363 4554679 4859182
9239D859182j262920j926998j150582k2574M14046L17617J46627k40384p94998
$$ 4859182 3596262 1669264 518682 496108 910154 1227771 1374398 1134014 339016
9230C39016o24725O48747J615410P08671j250753j890207o72627M41741J21018
$$ 339016 -285709 363038 1978448 2687119 1436366 -453841 -1126468 -684727 -563709
9221e63709n35322j94342N96858P67352N44342M67915Q8095p81288r78493P8720
$$ -563709 -1099031 -1293373 -696515 70837 615179 1083094 1171189 389901 -588592 -509872
9211e09872Q44815K6418r71554l71844O24955k07858j862813j316306J286493
$$ -509872 334943 361361 -610193 -982037 -357082 -564940 -2427753 -3744059 -2457566
9202b457566K399178N86175j307994p99017O28711M81774p70976j039062j23568
$$ -2457566 -58388 527787 -780207 -1579224 -950513 -468739 -1239715 -2278777 -2402345
9193b402345N06097L76553K93489N15757M71324R6974k87K54871J69808n34260
$$ -2402345 -1896248 -1519695 -1226206 -710449 -239125 -142151 -142438 112433 282241 -252019
9183b52019j064603m82510R46326J719164P59795j006718j537818m09232M85485
$$ -252019 -1316622 -1799132 -852806 866358 1626153 619435 -918383 -1327615 -842130
9174h42130j91416j008989n1926J716908J699501k19715j386223m15995R53857
$$ -842130 -1033546 -2042535 -2094461 -377553 1321948 1102233 -283990 -699985 253872
9165B53872Q06794l23816q87510o85226n36782o86474o02611K08615J608271K536764
$$ 253872 1060666 736850 -150660 -835886 -1372668 -2059142 -2661753 -2453138 -844867 1691897
9155A691897J644110p98695k306767j125877R58338R71215p11449j059108N60073
$$ 1691897 3336007 2537312 230545 -895332 63006 1034221 322772 -736336 -176263
9146a76263J452238L09536p24297n2322P03529k7287q84405l21135M63761m3614
$$ -176263 1275975 1585511 861214 808892 1512421 1485134 600729 279594 743355 699741
9136F99741o68986J92790J339784P83303o45645p80440J23872K29358l47683m2329
$$ 699741 30755 223545 1563329 2346632 1700987 920547 1044419 1273777 926094 883765
9126H83765Q14890M03196j085764j457712j84819P63094J77582q02595r21064
$$ 883765 1698655 2101851 1016087 -441625 -626444 136650 314232 -488363 -1409427
9117a409427m34190N9222N05042O30698M2204n73102m6656J231551J613789P07821
$$ -1409427 -1843617 -1784395 -1279353 -648655 -606451 -1179553 -1226209 5342 1619131 2326952
9107B326952k38185n89706r23560j140097k73951J229519J406506r5903j051189
$$ 2326952 2088767 1499061 575501 -564596 -838547 390972 1797478 1701575 650386
9098F50386r6290J022791L30763j162507j217036Q1039P94311L05828k22987j74462
$$ 650386 554096 1576887 1907650 745143 -471893 -390854 403457 709285 486298 311836
9088C11836j64848m17547k97472K64518M55328O2653j20356J85004J61342n44499
$$ 311836 146988 -270559 -568031 -303513 151815 214468 94112 279116 440458 -104041
9078a04041r40225k41442P56295R22551N50633O13867Q85564L01528j002057j590816
$$ -104041 -1044266 -1285708 -529413 393138 943771 1557638 2443202 2744730 1742673 151857
9068A51857r22040j67912k84797o18911k98075K29284K21614J60454P83229J395082
$$ 151857 -770183 -938095 -1222892 -1841803 -2139878 -1910594 -1688980 -1528526 -745297 649785
9058F49785Q42527l04337m06933N30098P63799l02679j098086m35454O81579P85631
$$ 649785 1492312 1187975 781042 1311140 2074939 1772260 674174 238720 920299 1705930
9048A705930j1591p64419j145983j054862o8647J459879J952746O22944j100185
$$ 1705930 1694339 929920 -216063 -1270925 -1339572 120307 2073053 2695997 1595812
9039A595812j511458r05259m49598k0529R43534J508987N10310r04592n54935
$$ 1595812 84354 -820905 -1270503 -1291032 -347498 1161489 1671799 767207 212272
9030B12272J129844J423020m06161j786057p81472J065260J297420K1307r23780
$$ 212272 1342116 2765136 2358975 572918 -208554 856706 2154126 2175433 1251653
9021A251653q49239m18426Q5146Q43103J336440P66542m76642j124143p96173
$$ 1251653 402414 -16012 69134 912237 2248677 3015219 2538577 1414434 618261
9012F18261l04653j84225p4860K31424K09461m39615j028928p34676J79523N88409
$$ 618261 313608 129383 54523 285947 495408 55793 -973135 -1707811 -1528288 -939879
9002i39879p0983r97346q78535N15206J888497J840603N26994o09988p16487l82480
$$ -939879 -1010862 -2008208 -2886743 -2371537 -483040 1357563 1884557 1274569 558082 175602
8992A75602l81290m34640O5201P73733Q10408J29235m91490o65912o40980m14312
$$ 175602 -205688 -640328 -575127 198606 1009014 1138249 646759 -19153 -660133 -1074445
8982a074445K73647R38914N63986p23500j342619m14290P86814O14745m82686
$$ -1074445 -800798 138116 702102 -21398 -1364017 -1778307 -991493 -376748 -859434
8973h59434o40539O22534J724607J299951p9978r43450p53045j06477K58906O6666
$$ -859434 -1499973 -877439 847168 2147119 2067141 1123691 370646 264169 523075 589741
8963E89741m96797q92923n97121L06430J099798J187776O36072j09717o64126
$$ 589741 92944 -799979 -1397100 -1090670 9128 1196904 1832976 1723259 1059133
8954A059133p87937m87120j38038q3642r9427J92043M66880Q7112o52344p31625
$$ 1059133 271196 -215924 -353962 -437604 -537031 -344988 121892 209004 -443340 -1174965
8944a174965p2372K44428j15129l4077R93156J567596N37751q17420n87115O62818
$$ -1174965 -1247337 -1002909 -1118038 -1152115 -158959 1408637 1946388 1128968 541853 1204671
8934A204671P24970o64514j370342k42609J216374J350242O30163K64453N5168
$$ 1204671 1929641 1265127 -105215 -347824 868550 2218792 2848955 3113408 3168576
8925C168576q23067j872904j764847m55143O19176N58922R1197K77182R56137
$$ 3168576 2345509 472605 -1292242 -1747385 -1128209 -569287 -478090 -200908 755229
8916G55229J088763K75726p16965j008896o74541l82096k67621J62772R51606
$$ 755229 1843992 2119718 1402753 393857 -280684 -662780 -930401 -767629 183977
8907A83977J276520N76825m92726q65132m10858J67422M36110M93711L81731J0709
$$ 183977 1460497 2037322 1544596 679464 268606 436028 872138 1365849 1747580 1758289
8897A758289m12684n51213m61930l95244k40497K28521P49366Q46795N41882K02488
$$ 1758289 1345605 794392 332462 -62782 -303279 -74758 674608 1521403 2063285 2265773
8887B265773p3819l47321m45713l20690l85187q05310r59692l92479K89231L91760
$$ 2265773 2191954 1844633 1398920 1078230 693043 -112267 -1071959 -1464438 -1175207 -783447
8877g83447L16114O30369P17114j81155j182874p81241O89305J416374Q30125
$$ -783447 -467333 163036 880150 698995 -483879 -1265120 -575815 840559 1670684
8868A670684J32772O7137K6469l58764n57629m45636n64299o94482P3474J391029
$$ 1670684 1803456 1870593 1897062 1538298 980669 535033 -29266 -723748 -650274 740755
8858G40755J600503K67969r94552r62735l36531o2222J45604O65794R71067P54958
$$ 740755 2341258 2609227 1614675 651940 315409 253187 398791 1064585 2035652 2790610
8848B790610N93663O39990J95737o54782p49430l6976p8522j277514j747456l91420
$$ 2790610 3384273 4024263 4220000 3565218 2815788 2778812 2700290 1422776 -324680 -716100
8838g16100J024558O88613l68048l17248L36520P5476o82399n28202J97471J98011
$$ -716100 308458 997071 629023 311775 648295 723771 41372 -486830 -289359 -91348
8828i1348j69933L04211J022720M37493r03667r48358L69020R71670J39532m96809
$$ -91348 -261281 42930 1065650 1503143 599476 -348882 20138 991808 1131340 634531
8818F34531O6167P42544O29296M47480P10791M76747q59776k158290k155537j219139
$$ 634531 700698 1443242 2072538 2520018 3230809 3707556 2847780 689490 -1466047 -2685186
8808b685186l86372K07539Q62657J248419R06465J73259k74095k93846j08440
$$ -2685186 -3071558 -2864019 -2001362 -752943 153522 326781 52686 -241160 -349600
8799c49600J56431K64983j24679p46790p26556J56931R17938P08322M2065q3691
$$ -349600 -193169 71814 -52865 -799655 -1526211 -1369280 -451342 256980 299045 215354
8789B15354K61343J82304n11751r51262m93668L42371N97005J38092k53425o177
$$ 215354 476697 659001 147250 -804012 -1297680 -955309 -358304 -220212 -473637 -479814
8779d79814M93154N39092J64495K1382K87348L72042o4294m55416j66264M97342
$$ -479814 13340 552432 716927 738309 1025657 1397699 1333405 877989 711725 1209067
8769A209067O86274J24694o82172j143425j034943m41594L20103Q05536P67249
$$ 1209067 1895341 2020035 1337863 194438 -840505 -1282099 -961996 -156460 610789
8760F10789L36495j81618n00092m05035k4389M3527n53750j173346r18877o7651
$$ 610789 947284 765666 265574 -139461 -163850 -120323 -674073 -1847419 -2766296 -2833947
8750b833947K54923j10666j02988O96176J281011Q81554J03387l20472o19252
$$ -2833947 -2579024 -2689690 -2792678 -2096502 -815491 66063 169450 -151022 -770274
8741g70274r62374o88051L59701J002414M93509r5496L45375R88338N31119l98413
$$ -770274 -1732648 -2420699 -2060998 -1058584 -565075 -660571 -315196 673142 1204261 805848
8731H05848k27921Q42221J084356q6698j462700j921033j400571j97093J181524
$$ 805848 577927 1420148 2504504 2417806 955106 -965927 -2366498 -2563591 -1382067
8722a382067J653477O19286p56793q58492k9740J6141q91447j008972M20540J771337
$$ -1382067 271410 890696 133903 -724589 -754329 -738188 -1629635 -2638607 -2218067 -446730
8712d46730J376118j75981j079858o61593K79209Q60662R76899R31596P69672
$$ -446730 929388 753407 -326451 -988044 -708835 151827 1128726 2060322 2829994
8703B829994J81001q76117j641150j227827M6582Q28304N58565J15095R5747k08772
$$ 2829994 3010995 2134878 493728 -734099 -687517 140787 699352 814447 910194 701422
8693G01422j154205j484517k40706J276269J257129J44817l11508M9795M2219
$$ 701422 -452783 -1937300 -2178006 -901737 355392 500209 188701 238496 280715
8684B80715l10855J23375J079411R19894n46230j485306q23787L06382N38015
$$ 280715 -30140 93235 1172646 2092540 1546310 61004 -762783 -456401 81614
8675H1614K6579l89813l83474J4126N61412N91232j71220p01366j7444Q94126
$$ 81614 108193 -281620 -665094 -650968 -89556 501676 330456 -370910 -388354 505772
8665E05772L45104j121660j314469N7999R02738K08757n76709m07369k82336q42818
$$ 505772 850876 -270784 -1585253 -1527254 -624516 -415759 -992468 -1399837 -1682173 -2524991
8655b524991p86770P02105K050021J639319L28141k02184q6772l54719o83426
$$ -2524991 -3311761 -2609656 -559635 1079684 1407825 1205641 1118869 764150 80724
8646H0724j33670P72138O87363l67867j144343j089962o60074r9390O53647J124769
$$ 80724 -52946 719192 1406555 1038688 -105655 -1195617 -1855691 -1955081 -1301434 -176665
8636a76665P24580r2245k53642L60076P41020J79531q86765j472475r82164L32373
$$ -176665 547915 455670 202028 562104 1303124 1482655 595890 -876585 -1858749 -1526376
8626a526376J459734J431516L92561m60140k96454M25938P27262K56229o23541
$$ -1526376 -66642 1364874 1757435 1297295 1000841 1426779 2154041 2410270 1786729
8617A786729j325800j309734m34667O51767J024731N78933M5742j14370q8254
$$ 1786729 460929 -848805 -1283472 -631705 393026 971959 1017701 903331 815077
8608H15077j2336J55041Q9477m50290o73669L21992J606283J163200r50288k123494
$$ 815077 802741 957782 1047259 596969 -76700 245292 1851575 3014775 2064487 -59007
8598e9007q29858J095693J218561m4857n15748L50427J121143Q64268J26109m32282
$$ -59007 -888865 206828 1425389 1380532 864784 1215211 2336354 3200622 3326731 2894449
8588B894449q16801r73900n19950M55164J111880P33039m86202j605243j730849
$$ 2894449 2077648 1103748 583798 1038962 2150842 2883881 2397679 792436 -938413
8579i38413p97758L39237Q49035Q66343R66666R32705O1667j255366j528339k15008
$$ -938413 -1736171 -1396934 -547899 318444 1285110 2217815 2279482 1024116 -504223 -719231
8569g19231J338082J615441O46835n49083j248987j157516k65356P26267P44025
$$ -719231 618851 2234292 2881127 2332044 1083057 -74459 -339815 386452 1130477
8560A130477k35060r58049o25725J30522N00330N58000M65171r9854r15916r16543
$$ 1130477 895417 -62632 -688357 -557835 -57505 500495 965666 865812 -50104 -966647
8550i66647J39951R48295O14326M1602K17048M69485j16601p72988k55971Q87770
$$ -966647 -826696 121599 735925 777527 994575 1464060 1347459 574471 318500 1206270
8540A206270J023435j16655j239707j394154p34906K22182Q91937O12891m81605
$$ 1206270 2229705 2113050 873343 -520811 -1255717 -1033535 -141598 471293 -10312
8531a0312j097341m40003L91614k8005j137060j164582J97057J469226J576259
$$ -10312 -1107653 -1547656 -1156042 -1184047 -2321107 -3485689 -3288632 -1819406 -243147
8522b43147R16159K50046k09580m94322o33045p25808o01489K01819J381222J548335
$$ -243147 673012 923058 713478 219156 -413889 -1139697 -1741186 -1539367 -158145 1390190
8512A390190P7740j491742j324167Q6823P85953L40729O5706M62042M98780k55324
$$ 1390190 1467930 -23812 -1347979 -1261156 -475203 -134474 -68768 393274 892054 636730
8502F36730p28785k70580J83319k00548o58424j44770Q50308J016139K07478m17381
$$ 636730 -92055 -362635 -179316 -379864 -1038288 -1183058 -332750 683389 890867 473486
8492D73486j03516N66461O30298N8401k95139Q5975O18016L58990o78195j456599
$$ 473486 369970 936431 1566729 1625130 1329991 1415966 2033982 2392972 1714777 258178
8482B58178j230785m05166J45283J10377j89136l01944O0093P43081R77367J37794
$$ 258178 -972607 -1377773 -1232490 -1122113 -1311249 -1613193 -1553100 -810019 167348 305142
8472C05142j105567j255975q64J195947J080768J85264l52125n08892q45685j087221
$$ 305142 -800425 -2056400 -2057264 -861317 219451 404715 52590 -456302 -1301987 -2389208
8462b389208n20544O45902J471833J550168J141197L91066o25245j358962j230582
$$ -2389208 -2909752 -2263850 -792017 758151 1899348 2290414 1665169 306207 -924375
8453i24375n11921m6302j96137n63790n33422K29880J400037J917460J013958
$$ -924375 -1436296 -1482598 -1678735 -2242525 -2775947 -2546067 -1146030 771430 1785388
8444A785388m83062q62920J44082R79463O27572j17754m32464p76559j357534
$$ 1785388 1302326 439406 583488 1562951 2190523 2072769 1640305 863746 -493788
8435d93788j089363L83456J280351J70205j521992j499283P3399J243272J225640
$$ -493788 -1583151 -1199695 80656 250861 -1271131 -2770414 -2697015 -1453743 -228103
8426b28103O44234j43074q36348l85064J318760K047681J32009k298718j942015
$$ -228103 416131 273057 -563291 -948355 370405 2418086 2550095 251377 -1690638
8417a690638O18097J806608N83340n43559j33766L03094k13070l73297M11710
$$ -1690638 -1072541 734067 1317407 773848 640082 943176 730106 356809 768519
8408G68519N20687p24769j366067j49100J082411M33953q88224p21234O26974
$$ 768519 1289206 564437 -801630 -950730 131681 565634 -322590 -1043824 -416850
8399d16850J319425Q54592m3668j030249j739015j163770O38109J597451M20676
$$ -416850 902575 1757167 1713499 683250 -1055765 -2219535 -1581426 16025 436701
8390D36701j028656m06387J285560J205678p71329j892039q27482O20291O56738
$$ 436701 -591955 -998342 287218 1492896 721567 -1170472 -1997954 -1377663 -720925
8381g20925l6307R58O45667Q26844L95398J04433K51403L40610k51m12139k87357
$$ -720925 -757232 -756274 -110607 716237 1111635 1216068 1467471 1808081 1807830 1395691 1108334
8370A108334L61441P71936L34965n66896j046764r05201o61084m45301J53271
$$ 1108334 1469775 2241711 2576676 2009780 963016 57815 -603269 -1048570 -895299
8361h95299R39250R94090K41388j03570N20117Q70858j09011j303325j003387
$$ -895299 43951 1038041 1279429 1175859 1695976 2566834 2457823 1154498 151111
8352A51111L32759P17470l55652j372154j244595n51705o6897L29448P44670O93377
$$ 151111 483870 1201340 845688 -526466 -1771061 -2322766 -2389663 -2060215 -1315545 -622168
8342f22168J05871k38251M6931L15565J19928n510K82495L05759l49288q08568
$$ -622168 -516297 -754548 -707617 -392052 -272124 -277634 4861 310620 -38668 -847236
8332h47236l69784L7375o05048j236812j03688K032256K398548L39777j375496
$$ -847236 -1217020 -1179645 -1784693 -3021505 -3125193 -1092937 1305611 1645388 269892
8323B69892n37865J239611J081895q02703j685177n49019P12983M76881m49521
$$ 269892 -267973 971638 2053533 1250830 -434347 -983366 -270383 206498 -243023
8314b43023n73709J06149O68451P59089N33992L4995n36015o66466k93240J4536
$$ -243023 -816732 -710583 -42132 716957 1250949 1285944 749929 83463 -209777 -195241
8304a95241L7272J35821J98036l56097j072558n89517R52623J464496R6858j056427
$$ -195241 -157969 -22148 175888 -180209 -1252767 -1842284 -889661 574835 671693 -384734
8294c84734j95597J145474O69542p19292n28460Q42490P20453j053053j608118
$$ -384734 -580331 565143 1234685 515393 -13067 829423 1549876 496823 -1111295
8285a111295J42468J670637J053524j30775O7470O81081l4931j313063j293324
$$ -1111295 -968827 701810 1755334 1624559 1692029 2373110 2338179 1025116 -268208
8276b68208k55861J33421j73965J22479R57298R14027j33854o62133o3745M39978
$$ -268208 -524069 -390648 -564613 -442134 515164 1429191 1295337 633204 569459 1009437
8266A009437K8717l80407O9845N39373j13888j301751j449257l25827O52098M39093
$$ 1009437 1038154 657747 727592 1266965 1153077 -148674 -1597931 -1923758 -1271660 -832567
8256h32567m06694p93827m89294J09716Q66588J719891K016559J068511o11676
$$ -832567 -1239261 -2033088 -2522382 -2412666 -1546078 173813 2190372 3258883 2647207
8247B647207j590276j252980l94413J76753N68444Q59370M29079q23722j616511
$$ 2647207 1056931 -196049 -590462 -413709 154735 1014105 1443184 619462 -997049
8238i97049q56550O63883J381946J090496O27574J55139o33961j123376m36328
$$ -997049 -1853599 -1189716 192230 1282726 1910300 2065439 1431478 308102 -128226
8229a28226P42558R02321K04736K37815J106241R69081q56312k411870j834581
$$ -128226 614332 1516653 1721389 1959204 3065445 4034526 3178214 766344 -1068237
8220a068237Q3146J282377J063159J62485o60751r94617o33616l256Q5246k64867
$$ -1068237 -985091 297286 1360445 1522930 862179 -132438 -766054 -769310 -684064 -948931
8210i48931k3066R17676J239203L43447m98918k53542J07790o02625j516194r85153
$$ -948931 -971997 -54321 1184882 1528329 1029411 775869 883659 281034 -1235160 -2220313
8200b220313P16337J720448J140490j61425j021575r21380R2814J224426J125042
$$ -2220313 -1503976 216472 1356962 1195537 173962 -747418 -654604 569822 1694864
8191A694864n02873j990939j656773j49624N67897J16659q1340O61548J276830
$$ 1694864 1191991 -798948 -2455721 -2605345 -2037448 -1920789 -2002129 -1340581 -63751
8182f3751P75640l32811j008995j001133o48265j83623K34557L51316J09281j75306
$$ -63751 711889 379078 -629917 -1631050 -2279315 -2462938 -2228381 -1877065 -1767784 -1943090
8172a943090j22229L75187J003538J066268J05757j173090j266581J78394J478291
$$ -1943090 -2065319 -1690132 -686594 379674 485431 -687659 -1954240 -1775846 -297555
8163b97555R63453o71675j336481m97206L55617K20936o3728M18297R64355M13087
$$ -297555 665898 -5777 -1342258 -1839464 -1483847 -1262911 -1326639 -908342 56013 469100
8153D69100q41158j243600k51607R46002J042052J67228n65135n66867k32289
$$ 469100 -372058 -1615658 -1867265 -921263 120789 288017 -277118 -843985 -1076274
8144a076274l8706J38844N54666R47652Q73288M03985k9123k94328m91520m25584
$$ -1076274 -1114980 -976136 -421470 526182 1399470 1803455 1774332 1480004 988484 562900
8134E62900J32358P37527O16984k29510j024971j317098j236805o97776N17615
$$ 562900 695258 1432785 2049769 1820259 795288 -521810 -1758615 -2456391 -1938776
8125a938776J681769J440680k20841j510655j082051K71733R81589P55477L13402
$$ -1938776 -257007 1183673 962832 -547823 -1629874 -1358141 -376552 378925 692327
8116F92327j1540k84726k78912R8534K18025l64462q91178l94930O65590R17240
$$ 692327 680787 396061 117149 215683 433708 69246 -821932 -1216862 -551272 365968
8106C65968P4417o52222k64213P34085J036902J22542j082749j168855P800Q79177
$$ 365968 440385 -211837 -476050 258035 1294937 1417479 334730 -834125 -826325 52852
8096E2852J30912j267822j254518K36829J130275M90924j32478L96739P81431
$$ 52852 183764 -1084058 -2338576 -2101747 -971472 -480548 -613026 -216287 565144
8087E65144j43731q73543L21678J951308J244991j264833k234013n51994J140832
$$ 565144 421413 -452130 -130452 1820856 3065847 1801014 -432999 -984993 155839
8078A55839O57947p24459p50035M56783J154724P14965l5173m29190n62053n96434
$$ 155839 813786 89327 -660708 -203925 950799 1665764 1630591 1201401 639348 42914
8068D2914m34818k4031M82058P71435N08938k47668q25860o34218K9968M53116
$$ 42914 -391904 -415935 66123 837558 1346496 1098828 272968 -361250 -331282 121834
8058A21834N42617O08191M19343m08313j225151q78447L92911R46970Q2063q85715
$$ 121834 664451 1272642 1691985 1283672 58521 -819926 -427015 519955 602018 -283697
8048b83697o15213L08996M22687m04158r47986m91163L66134Q07141Q48470R02510
$$ -283697 -898910 -589914 -167227 -571385 -1519371 -2010534 -1644400 -837259 11211 913721
8038I13721Q50635K41222o53437p66823K72378J198372O04576r37155j505031
$$ 913721 1764356 2005578 1352141 585318 857696 2056068 2660644 1723489 218458
8029B18458n70442L86878L55256J54226M88797M59796n73214j293253m49979P75685
$$ 218458 -351984 34894 390150 544376 1033173 1492969 919755 -373498 -823477 -47792
8019d7792N58419n30540o17192K34844M60175J9140J76335O29140o9533j234107
$$ -47792 510627 -19913 -637105 -402261 57914 77054 253389 882529 812996 -421111
8009d21111n30548J750064K376523K82476j428169l64990J442340J111707n79533
$$ -421111 -951659 798405 3174928 3457404 2029235 1664245 3106585 4218292 3638759
8000C638759j136799o16230p49428j331548p89604N17233P50120l9947N717J113016
$$ 3638759 2501960 1885730 1136302 -195246 -984850 -467617 282503 242556 248273 1361289
7990A361289J373413Q2102j036983p12186L6901m4815m61160k34665L20131L46243
$$ 1361289 2734702 2816804 1779821 1067635 1104536 1059721 598561 363896 684027 1030270
7980A030270q1751l50057m05417n14210n24102j93553J96933K59915J66311K95288
$$ 1030270 948519 598462 193045 -321165 -845267 -1038820 -841887 -581972 -415661 -120373
7970a20373M91678K28582n60470j191469q87897K97317J310361J147027J47492
$$ -120373 371305 599887 39417 -1152052 -2039949 -1742632 -432271 714756 862248
7961H62248k94268L97928J146277Q62402N4128k54476l72815j171275k009931
$$ 862248 567980 965908 2112185 2974587 3028715 2774239 2401424 1230149 -779782
7952g79782j390506L66450J191381M35790j65231M34347P55531m57054j644649
$$ -779782 -2170288 -1803838 -612457 -176667 -341898 92449 847980 390926 -1253723
7943a253723p85329J086608J309161k01436r30783J16447J044152M45043m03394
$$ -1253723 -2039052 -952444 356717 155281 -775502 -659055 385097 830140 426746
7934D26746j6791P34880L22473p07239p20761J77615L72956n39946j186201o89225
$$ 426746 409955 1144835 1467308 760069 39308 216923 589879 49933 -1136268 -1825493
7924a825493J53713M29541M47670Q04688J156747P97386j45127q63967r22320
$$ -1825493 -1671780 -1242239 -794569 10119 1166866 1964252 1819125 955158 32838
7915C2838n70859j97312Q9129L51344N48303M33832j74667r22351j008243j64226
$$ 32838 -538021 -735333 -646204 -294860 253443 687275 512608 -409743 -1417986 -1582212
7905a582212P10792N32093m60122r19460j91432Q87358J237466Q55646M65905
$$ -1582212 -871420 -339327 -799449 -1718909 -1910341 -1022983 214483 1070129 1536034
7896A536034M07423L62903p1897q32000j254943o08795Q65175J716681Q55114
$$ 1536034 1943457 2306360 2234463 1402463 147520 -461275 403900 2120581 2975695
7887B975695q35281j466600o70287J28066J02920J17199P91505J122529K18533
$$ 2975695 2140414 673814 3527 131593 234513 351712 1143217 2265746 2484279
7878B484279r37078r71920l58492m66130j088257p94824N06106J233116N61660
$$ 2484279 1547201 575281 216789 -249341 -1337598 -2132422 -1626316 -393200 168460
7869A68460m34881n47841P823M13504N34265O58498P20357M75625j0453n13817
$$ 168460 -266421 -814262 -806439 -392935 141330 799828 1520185 1995810 1985357 1471540
7859A471540q94349r11354l04659O02766Q87720J00733r38174r35608K91452J414210
$$ 1471540 577191 -334163 -638822 -36056 851664 952397 14223 -921385 -629933 784277
7849G84277J033609n75600j584332p70115Q63140J360834M79279r6982N67404
$$ 784277 1817886 1242286 -342046 -1112161 -249021 1111813 1591092 1494110 2061514
7840B061514J161900K41595j310132j386713K96133J744554J303076m30163j591092
$$ 2061514 3223414 3465009 2154877 768164 1064297 2808851 4111927 3681764 2090672
7831B090672j219454j25194J61120p46383j439167n28933J072511J053489p91055
$$ 2090672 871218 746024 907144 160761 -1278406 -1807339 -734828 318661 -472394
7822d72394j793799k65933J784630J673661J36549j61031R19478J092740j64012
$$ -472394 -2266193 -2532126 -747496 926165 1062714 901683 1821161 2913901 2749889
7813B749889p78398J20863O40116n37383j872520j535977j31658P60819J002109
$$ 2749889 1971491 2092354 2732470 2195087 322567 -1213410 -1345068 -584249 417860
7804D17860J179410R68123k3876r00753o79665j3696j46852q31791q05015J39877
$$ 417860 1597270 2565393 2541517 1640764 961099 947403 800551 -31240 -836255 -696378
7794f96378R53978R19550K60377n71125j171843j012685J7681J065028J170178
$$ -696378 257600 1177150 1437527 866402 -305441 -1318126 -1300445 -235417 934761
7785I34761N20416Q0845J65673J60112l79042j021650j010447j95504O68779O14223
$$ 934761 1455177 1536022 1701695 1861807 1482765 461115 -549332 -744836 -76057 538166
7775E38166l46845r55890k19393J056266J196357M8547q06668m61434J05784j69282
$$ 538166 191321 -764569 -983962 72304 1268661 1317208 510540 49106 154890 -14392
7765a4392p63908o34535J21672O98647Q31891O78580K32952k66624j68315M88346
$$ -14392 -778300 -1412835 -1291163 -592516 239375 917955 1150907 884283 715968 1204314
7755A204314O06719k82044r84267m59976L56218L8276q76926p04633N68967J165208
$$ 1204314 1811033 1528989 544722 84746 440964 479240 -397686 -1102319 -533352 631856
7745F31856K40274r64446j058763j95573O60668J000521P45843p7586j000556
$$ 631856 872130 -92316 -1151079 -1346652 -685984 314537 1060380 982794 -17762
7736a7762j165083l76750L87810J45951p29671r40430J1377J119007J170910L47941
$$ -17762 -1182845 -1559595 -1171785 -1025834 -1755505 -2695935 -2684558 -1565551 -394641 -46700
7726d6700q1242L86153P57274J24480q23843q28275n0511K31965l03532o97851
$$ -46700 -127942 258211 1015485 1139965 316122 -512153 -562664 -330699 -634231 -1332082
7716a332082n00064l17996k64247M38363J600751J563236k75746j945856j429629
$$ -1332082 -1832146 -2150142 -2414389 -1976026 -375275 1187961 912215 -1033641 -2463270
7707b463270M77048J468428R70484L06668K38502K12278r9886k12454L8992J36991
$$ -2463270 -1986222 -517794 452690 759358 997860 1210138 1110252 897798 936790 1073781
$$ [...]
##END NTUPLES=NMR SPECTRUM
##END=
