##TITLE=31Pdec_DE-153_TFA
 DMSO+CCl4,64 sc
 23.6.2026
##JCAMPDX= 6.0         $$ Bruker NMR JCAMP-DX V2.0
##DATA TYPE= NMR SPECTRUM
##DATA CLASS= NTUPLES
##ORIGIN= UXNMR, Bruker Analytische Messtechnik GmbH
##OWNER= root
$$ XWIN-NMR		Version 3.5
$$ Thu Jun 25 13:36:25 2026 Russian Standard Time (UT+4h)  she@DPX200
##.OBSERVE FREQUENCY= 81.013821
##.OBSERVE NUCLEUS= ^31P
##.ACQUISITION MODE= SIMULTANEOUS
##.ACQUISITION SCHEME= undefined
##.AVERAGES= 64
##.DIGITISER RES= 17
##SPECTROMETER/DATA SYSTEM= spect
##.PULSE SEQUENCE= zgpg30
##.SOLVENT NAME= CDCl3
##.SHIFT REFERENCE= (INTERNAL, CDCl3, 0, 197.392)
##AUDIT TRAIL= $$ (NUMBER, WHEN, WHO, WHERE, WHAT)
$$ ##TITLE= Audit trail, XWIN-NMR		Version 3.5
$$ ##JCAMPDX= 5.01
$$ ##ORIGIN= Bruker BioSpin GmbH
$$ ##OWNER= she
$$ F:/spectra/data/she/nmr/P31/2/pdata/1/auditp.txt
$$ ##AUDIT TRAIL=  $$ (NUMBER, WHEN, WHO, WHERE, WHAT)
(   1,<2026-06-25 13:35:07.98 +0400>,<she>,<DPX200>,
      <created by zg, POWCHK disabled, PULCHK disabled
       configuration hash MD5:
       00 E9 B6 7A A2 85 ED C7 34 08 36 98 17 FE 4E 26
       data hash MD5: 32K
       0A 5B 32 3F 1B C6 A6 14 B8 E9 64 76 1F 8C 58 67>)
(   2,<2026-06-25 13:35:10.68 +0400>,<she>,<DPX200>,
      <Start of raw data processing
       efp BC_mod = 2 LB = 1.5 FT_mod = 6 PKNL = 1 PHC0 = 1826.378 PHC1 = -362.6993 SI = 64K 
       data hash MD5: 64K
       53 D5 DE AE EA 37 34 91 48 D8 1C 34 99 57 C0 EB>)
(   3,<2026-06-25 13:35:55.29 +0400>,<she>,<DPX200>,
      <pk PHC0 = 150.0772 PHC1 = -560.0026 
       data hash MD5: 64K
       BD 94 CE 10 E8 15 B9 2B 76 5F 84 9D 51 75 5A CF>)
(   4,<2026-06-25 13:36:00.85 +0400>,<she>,<DPX200>,
      <abs ABSG = 5 
       data hash MD5: 64K
       05 A4 B1 B9 6B 41 AC 20 BF D9 85 C5 66 4B A1 F7>)
$$ ##END=
$$ 
$$ hash MD5
$$ 2A 5A 1E 7D 0F 6E 02 42 A9 F9 3F 44 2D 68 D0 5C
##$RELAX= 
##$RELAX= 
##$RELAX= 
##$RELAX= 
##$RELAX= 
##$RELAX= 
##$RELAX= 
##$RELAX= 
$$ Bruker specific parameters
$$ --------------------------
##$DU= <F:/spectra>
##$EXPNO= 2
##$NAME= <P31>
##$PROCNO= 1
##$TYPE= <nmr>
##$USER= <she>
##$AMP= (0..31)
100 100 100 100 100 100 100 100 100 100 100 100 100 100 100 100 100 100 
100 100 100 100 100 100 100 100 100 100 100 100 100 100 
##$AQSEQ= 0
##$AQ_mod= 1
##$AUNM= <au_zg>
##$AUTOPOS= <>
##$BF1= 81.014009
##$BF2= 200.13
##$BF3= 200.13
##$BF4= 200.13
##$BF5= 200.13
##$BF6= 200.13
##$BF7= 200.13
##$BF8= 200.13
##$BYTORDA= 1
##$CFDGTYP= 0
##$CFRGTYP= 5
##$CHEMSTR= <none>
##$CNST= (0..31)
1 1 145 1 1 1 1 1 1 1 1 1 1 1 1 1 1 1 1 1 1 1 1 1 1 1 1 1 1 1 1 1 
##$CPDPRG= <waltz16>
##$CPDPRG1= <>
##$CPDPRG2= <waltz16>
##$CPDPRG3= <>
##$CPDPRG4= <mlev>
##$CPDPRG5= <mlev>
##$CPDPRG6= <mlev>
##$CPDPRG7= <mlev>
##$CPDPRG8= <mlev>
##$CPDPRGB= <>
##$CPDPRGT= <>
##$D= (0..31)
0 1 0 0 0 0 0 0 0 0.06 0 0.03 2e-05 3e-06 0 0 0.0002 0 0 0 0 0 0 0 0 0 
0 0 0 0 0 0 
##$DATE= 1782380107
##$DBL= (0..7)
120 120 120 11 120 120 24 19 
##$DBP= (0..7)
150 150 150 150 150 150 150 150 
##$DBP07= 0
##$DBPNAM0= <>
##$DBPNAM1= <>
$$ [...]
##$SUBNAM3= <"">
##$SUBNAM4= <"">
##$SUBNAM5= <"">
##$SUBNAM6= <"">
##$SUBNAM7= <"">
##$SUBNAM8= <"">
##$SUBNAM9= <"">
##$SW= 400.765351723535
##$SWIBOX= (0..15)
0 1 3 0 0 0 0 0 0 0 0 0 0 0 0 0 
##$SW_h= 32467.5324675325
##$TD= 32768
##$TD0= 1
##$TE= 0
##$TE2= 300
##$TE3= 300
##$TEG= 300
##$TL= (0..7)
0 120 53 12 22 120 120 120 
##$TP= (0..7)
150 150 150 150 150 150 150 150 
##$TP07= 0
##$TPNAME0= <>
##$TPNAME1= <>
##$TPNAME2= <>
##$TPNAME3= <>
##$TPNAME4= <>
##$TPNAME5= <>
##$TPNAME6= <>
##$TPNAME7= <>
##$TPOAL= (0..7)
0.5 0.5 0.5 0.5 0.5 0.5 0.5 0.5 
##$TPOFFS= (0..7)
0 0 0 0 0 0 0 0 
##$TUNHIN= 0
##$TUNHOUT= 0
##$TUNXOUT= 0
##$USERA1= <user>
##$USERA2= <user>
##$USERA3= <user>
##$USERA4= <user>
##$USERA5= <user>
##$V9= 5
##$VALIST= <valist>
##$VCLIST= <CCCCCCCCCCCCCCC>
##$VD= 0
##$VDLIST= <DDDDDDDDDDDDDDD>
##$VPLIST= <PPPPPPPPPPPPPPP>
##$VTLIST= <TTTTTTTTTTTTTTT>
##$WBST= 1024
##$WBSW= 4
##$XGAIN= (0..3)
0 0 0 0 
##$XL= 0
##$YL= 0
##$YMAX_a= 10450
##$YMIN_a= -3560
##$ZGOPTNS= <>
##$ZL1= 120
##$ZL2= 120
##$ZL3= 120
##$ZL4= 120
##$ABSF1= 197.3918
##$ABSF2= -203.3724
##$ABSG= 5
##$ABSL= 3
##$ALPHA= 0
##$AQORDER= 0
##$ASSFAC= 0
##$ASSFACI= 0
##$ASSFACX= 0
##$ASSWID= 0
##$AUNMP= <proc_1d>
##$AZFE= 0.1
##$AZFW= 0.5
##$BCFW= 0
##$BC_mod= 2
##$BYTORDP= 0
##$COROFFS= 0
##$CY= -3
##$DATMOD= 1
##$DC= 0
##$DFILT= <>
##$DTYPP= 0
##$F1P= 0
##$F2P= 0
##$FCOR= 1
##$FTSIZE= 65536
##$FT_mod= 6
##$GAMMA= 0
##$GB= 0
##$INTBC= 1
##$INTSCL= 9.790993e-09
##$ISEN= 30
##$LB= 1.5
##$LEV0= 0
##$LPBIN= 0
##$MAXI= 10000
##$MC2= 0
##$MEAN= 0
##$ME_mod= 0
##$MI= 50
##$NCOEF= 0
##$NC_proc= -8
##$NLEV= 6
##$NOISF1= 182.463
##$NOISF2= 159.3651
##$NSP= 0
##$NTH_PI= 0
##$NZP= 0
##$OFFSET= 197.3918
##$PC= 4
##$PHC0= 1976.455
##$PHC1= -922.7019
##$PH_mod= 1
##$PKNL= yes
##$PPARMOD= 0
##$PSCAL= 0
##$PSIGN= 0
##$REVERSE= no
##$SF= 81.014063255964
##$SI= 65536
##$SIGF1= 159.3651
##$SIGF2= -187.1042
##$SINO= 113.3802
##$SIOLD= 16384
##$SREGLST= <1H.CDCl3>
##$SSB= 0
##$STSI= 65536
##$STSR= 0
##$SW_p= 32467.5324675325
##$SYMM= 0
##$S_DEV= 0
##$TDeff= 32768
##$TDoff= 0
##$TI= <>
##$TILT= no
##$TM1= 0
##$TM2= 0
##$TOPLEV= 0
##$USERP1= <user>
##$USERP2= <user>
##$USERP3= <user>
##$USERP4= <user>
##$USERP5= <user>
##$WDW= 1
##$XDIM= 65536
##$YMAX_p= 90477170
##$YMIN_p= -425214398
$$ End of Bruker specific parameters
$$ ---------------------------------
##NTUPLES= NMR SPECTRUM
##VAR_NAME=  FREQUENCY,     SPECTRUM/REAL,   SPECTRUM/IMAG
##SYMBOL=    X,             R,               I
##VAR_TYPE=  INDEPENDENT,   DEPENDENT,       DEPENDENT
##VAR_FORM=  AFFN,          ASDF,            ASDF
##VAR_DIM=   65536,         65536,           65536
##UNITS=     HZ,            ARBITRARY UNITS, ARBITRARY UNITS
##FACTOR=    0.49542278885378, 1,            1
##FIRST=     15991.5117654749, 0,            0
##LAST=      -16476.0207020576, 0,           0
##MIN=       -16476.0207020576, -425214398,  0
##MAX=       15991.5117654749, 90477170,     0
$$ Real data points
##PAGE= N=1
##DATA TABLE= (X++(R..R)), XYDATA
$$ [...]
##PAGE= N=2
##DATA TABLE= (X++(I..I)), XYDATA
7482a303330M173241O310473M199704k755174p541149m484277J805720K655508
7474C060716k108293m949271k704005q945j10625j56343J940088L076687J100524
7465h59467p15121L45915J299683q36149k898115p10476L376794M064908J498440
7456D566412K6433N10322O6548j515304j261866J012600J816939j97611k370200
7447B654273k840619k784747k928512k103114l97867K50340k44044K77306J840080
7438f276904J719277m43172j305675M20453J318921q78949k933657j179194K412569
7429g146331L319107J202205n02832n8772J362986K746824L801584L239521J02883
7420H067175l423001l833690j120671J103874N74346j215241k027650j732338
$$ plain form
7482 -1303330 2869911 9180384 13380088 10624914 3083765 -1400512 405208 3060716
7474 3060716 952423 -3996848 -6700853 -6709798 -6820423 -6976766 -5036678 -1959991 -859467
7465 -859467 -1574588 -1228673 71010 -765139 -3663254 -4373730 -996936 3067972 4566412
7456 4566412 4592845 5103167 5169715 3654411 2392545 3405145 5222084 5024473 2654273
7447 2654273 -186346 -2971093 -5899605 -8002719 -8400586 -8150246 -8394290 -8116984 -6276904
7438 -6276904 -4557627 -5000799 -6306474 -5886021 -4567100 -5446049 -8379706 -9558900 -7146331
7429 -7146331 -3827224 -2625019 -3127851 -3186623 -1823637 923187 4724771 7964292 8067175
7420 8067175 4644174 810484 -310187 793687 1368033 152792 -1874858 -3607196
7412c607196j223643o14688K68534R82034J079977P57164L23772j26207k31289
7403b391542N04573J762499K418999J798821L10766j141663j681462o47057J674230
7394B608164L548304L179201Q23525j386452j869213r22758M43402J795210K855701
7385A1075084K807838R78669k047054m618279n346804m087707j781689M21399
7377b598543J850770K303523J789777P50520K35517R08513J724744P39745k154434
7368E550132m423432l832043j228720Q92538J705263K112399K016797l6235l834862
7359a078163o233471m552588k41516K505520J569789r64950j653264M40956L274073
7350f933614M482691L598632J753615J42345p20206q05677m23810j11507j1514
$$ plain form
7412 -3607196 -4830839 -5445527 -5176993 -4194959 -3114982 -2357818 -2034046 -2160253 -2391542
7403 -2391542 -1886969 -124470 2294529 4093350 4404116 3262453 1580991 933934 2608164
7394 2608164 6156468 9335669 10159194 8772742 6903529 5980771 6424173 8219383 11075084
7385 11075084 13882922 14861591 12814537 8196258 2849454 -1238253 -3019942 -2598543
7377 -2598543 -747773 1555750 3345527 4096047 4331564 5240077 6964821 7704566 5550132
7368 5550132 1126700 -2705343 -3934063 -3041525 -1336262 776137 2792934 2756699 -1078163
7359 -1078163 -7311634 -11864222 -12105738 -9600218 -8030429 -8995379 -10648643 -10207687 -6933614
7350 -6933614 -2450923 1147709 2901324 3043669 2323463 1517786 1093976 982469 970955
7341I70955M98507J798271K802755J902533n97727k239343j421504L64908N07626
7332D586981j132646k030922m38132K249433L190418J497508q77619j614948o60078
7323D769995J65947k03661r56584j191210j447957k266178k376307l25146K572377
7314a258724L213107Q74243j742383k146552o53257J256519K830516L351640K026384
7305G751493q6827n51076M55440m99286m466229o983409m086544J183119K808649
7296d474670O59228J03351L127343N277949K753880k069277m477794l422491j316644
7287c839125k75148o92704j821017k133612n06452K038044L274708K756593J786871
7278E88158M89580k013896m204879k868861J508550M062820K303317l86413n19517
$$ plain form
7341 970955 1469462 3267733 6070488 7973021 7375294 5135951 3714447 4079355 4586981
7332 4586981 3454335 1423413 985281 3234714 6425132 7922640 7045021 5430073 4769995
7323 4769995 4935942 4732281 3775697 2584487 1136530 -1129648 -3505955 -3831101 -1258724
7314 -1258724 1954383 2828626 1086243 -1060309 -1713566 -457047 2373469 5725109 7751493
7305 7751493 7664666 7113590 7569030 7069744 2603515 -4379894 -8466438 -7283319 -4474670
7296 -4474670 -3815442 -3712091 -584748 4693201 7447081 5377804 900010 -2522481 -3839125
7287 -3839125 -4114273 -4806977 -6627994 -8761606 -9268058 -7230014 -3955306 -1198713 588158
7278 588158 1077738 -936158 -5141037 -8009898 -6501348 -2438528 -135211 -521624 -1041141
7269a041141L86713o9870r3392K470027M508412J662762l930177n874316k702289
7260d683271R60354K255557L061319M163917K599113k499463o335867m374648
7252d852989J388307N339259N023426K170587q90893k890629l137323k000419
7244A49326j018580q16871j55540J523332K477828J491056L20672Q68371J693191
7235F532785L49239k115465k439628l65166R98619K61110l08408R66537K150286
7226F029909R53851j354749j872388m60253N77184O19759J474930L410930L458393
7217A2837566j96755m185868l591805R06246L159872j19021m603741m481922o10455
7208h85883J316234o42283k477423r01707K177213L506066L167104K938204K725744
$$ plain form
7269 -1041141 -654428 -724298 -817690 1652337 6160749 7823511 3893334 -1980982 -4683271
7260 -4683271 -3722917 -1467360 1593959 5757876 8356989 5857526 -478341 -4852989
7252 -4852989 -3464682 1874577 6898003 9068590 8177697 5287068 2149745 149326
7244 149326 -869254 -1686125 -1841665 -318333 2159495 3650551 3971223 4839594 6532785
7235 6532785 6882024 4766559 2326931 1961765 2960384 3221494 2913086 3879623 6029909
7226 6029909 6983760 5629011 3756623 3296370 3873554 4493313 5968243 9379173 12837566
7217 12837566 12640811 8454943 4863138 5769384 8929256 8810235 4206494 -275428 -885883
7208 -885883 430351 -211932 -2689355 -3591062 -1413849 2092217 5259321 8197525 10923269
7199A0923269J498167k8278l75722J53829J53683p03646k014947l835537n572411
7190A98407n263132k264797Q60913J649621J272007J880389K303360L14881k177242
7181a225593j098123K789278L945479K05180l880528l817082j032299O49277O68653
7172b795758O21828M55989n93949j305312k31650J234896Q46072n49469k78010
7163b595363J678893K764152K187760J980293L232103M042237K301759j297892
7155A4293942m057935m073930j835973K08203j81296k504666l727823k044146
7147c923624N37122R41489o13990j190825M74438K516531K850464J360826r01319
7138B051112k609882k160006R68312M470985N010170K251598q86439k307447k689104
$$ plain form
7199 10923269 12421436 12393158 12017436 12171265 12324948 11621302 9606355 5770818 198407
7190 198407 -5064725 -7329522 -6468609 -4818988 -3546981 -1666592 636768 951649 -1225593
7181 -1225593 -2323716 465562 4411041 4616221 735693 -3081389 -4113688 -3464411 -2795758
7172 -2795758 -2173930 -1717941 -2311890 -3617202 -3848852 -2613956 -1767884 -2317353 -2595363
7163 -2595363 -916470 1847682 4035442 6015735 9247838 13290075 15591834 14293942
7155 14293942 10236007 6162077 4326104 4534307 4353011 1848345 -1879478 -3923624
7147 -3923624 -3386502 -2445013 -3059003 -4249828 -3775390 -1258859 1591605 2952431 2051112
7138 2051112 -558770 -2718776 -1750464 2720521 7730691 9982289 9095850 6788403 4099299
7129D099299k892056k240904o43408J56756q12131j980644j816916j191976j282108
7120h604088j051272Q82515L410011M367417L619371K367722N42002k452195n150538
7111b069055n083320k335733M60685J792577K535297L314726L101227J346417
7103C062821m44329m93038J022175K310001J792958n59611k829855k388998J078830
7094B550954M161940L202183r62734l905222l289013j081199L05182J005159J564888
7085C552138R26882j153929k220980n09462J691984J263103o08285j69066K707038
7076E479423M071671K005281p36313j504286j568067k779328l395146o84384L824323
7067D713174N425156K558237j120694j911901p09702o97290k198825k447700k50301
$$ plain form
7129 4099299 1207243 -1033661 -1677069 -1520313 -2332444 -4313088 -6130004 -7321980 -8604088
7120 -8604088 -9655360 -8772845 -5362834 -995417 2623954 4991676 5533678 3081483 -2069055
7111 -2069055 -7152375 -9488108 -9027423 -7234846 -4699549 -1384823 1716404 3062821
7103 3062821 2618492 2125454 3147629 5457630 7250588 6690977 3861122 1472124 2550954
7094 2550954 6712894 9915077 8952343 5047121 1758108 676909 982091 1987250 3552138
7085 3552138 4479020 3325091 1104111 594649 2286633 3549736 2941451 2772385 5479423
7076 5479423 9551094 11556375 10820062 9315776 7747709 4968381 1573235 888851 4713174
7067 4713174 10138330 12696567 11575873 9663972 8954270 8256980 6058155 3610455 3360154
7058C360154J671243L13107l145606m598018k449628M24696R78614J72692Q78785
7049b393961K959104L315702Q27516j670108j438452N33662J658654J562795J552869
7040F907781J655954P98803o61238j150142n94610n87834j569490k066595j295034
7031A437595l74183j16502L29045J465198J995065Q99295o49193j177454j351270
7022B457596k500725l680682k537850J024120M064006L960357J289874j098346
7014B978350j164852L78724R19103j014546l524528l220997K90365L418879L140787
7005B201285P25064q11989j073040j466538j578179R2917K348791K107906n91271
6996A954946k135999r73580n4843j762930l731720k503609J072007L188912K311374
$$ plain form
7058 3360154 5031397 5344504 2198898 -2399120 -4848748 -4424052 -3445438 -3272746 -2393961
7049 -2393961 565143 3880845 4708361 3038253 1599801 2133463 3792117 5354912 6907781
7040 6907781 8563735 9362538 8701300 7551158 6956548 6368714 4799224 2732629 1437595
7031 1437595 1063412 946910 1275955 2741153 4736218 5635513 4986320 3808866 2457596
7022 2457596 -43129 -3723811 -6261661 -5237541 -1173535 2786822 4076696 2978350
7014 2978350 1813498 2192222 3111325 2096779 -1427749 -4648746 -4358381 -939502 2201285
7005 2201285 2926349 2114360 1041320 -425218 -2003397 -1910480 438311 2546217 1954946
6996 1954946 -181053 -1154633 -1209476 -2972406 -6704126 -9207735 -8135728 -4946816 -2635442
6987b635442J61980j459440k043778j198272J130103L280806L086195P97730r74549
6978A45333n41206J117977K061297J459546k63164k103657k913312k103442l57248
6969c497876Q33287N42128p84605j696097j013849O24796Q21067j635582m123203
6960i929934k748379K052009N298061M116492J509777J274641K325242J506949
6952E404858n85267j056124k96590j124168k981729k258173J117244K590329P4366
6943H84746k594872j762714N32664L33231k044143l131308j683722L97698J490984
6934g577436J823896K015703J997544J245728p48288l477460m659530k382519
6926a1762362J366950J933010j769577m896755k796142K789068O331804N555095
$$ plain form
6987 -2635442 -2473462 -3932902 -5976680 -7174952 -6044849 -2764043 322152 1119882 145333
6978 145333 -395873 722104 2783401 4242947 3979783 1876126 -1037186 -3140628 -3497876
6969 -3497876 -2664589 -2122461 -2907066 -4603163 -5617012 -4992216 -4171149 -5806731 -9929934
6960 -9929934 -12678313 -10626304 -5328243 -1211751 298026 1572667 3897909 5404858
6952 5404858 4819591 3763467 3466877 2342709 -639020 -2897193 -1779949 810380 884746
6943 884746 -1710126 -3472840 -2940176 -2606945 -4651088 -7782396 -9466118 -9068420 -7577436
6934 -7577436 -5753540 -3737837 -1740293 -494565 -1242853 -4720313 -9379843 -11762362
6926 -11762362 -10395412 -8462402 -10231979 -15128734 -17924876 -15135808 -8804004 -3248909
6918c248909K904662J175577O71979L67810m67559j763026k370079r69824J651410
6909b047959K725267J344882J97860J407746K824920J285780k323813m550899
6901H63784m383319l256803j454717J481491L710036K858437M73616K30477J748386
6892B271388J052744k294416l886941j857541j07713j344246k045718J415747
6884f796696N849591N768034K077718M06442J946222J985412j821822n262062
6876D152839m020318j68995J257299l33401j029528J017294K814924J386271j491374
6867C585011j779439R85306L165546K311249K32346l07824M07199L52440o71048
6858H280786j311292j449790j963458k271431j049092P31449O06406j127293j223297
$$ plain form
6918 -3248909 -344247 831330 1503309 1871119 1403560 -359466 -2729545 -3699369 -2047959
6909 -2047959 677308 2022190 2220050 3627796 6452716 7738496 5414683 863784
6901 863784 -3519535 -6776338 -8231055 -6749564 -3039528 -181091 292525 523002 2271388
6892 2271388 3324132 1029716 -2857225 -4714766 -4822479 -6166725 -8212443 -6796696
6884 -6796696 -947105 4820929 6898647 7305089 9251311 11236723 9414901 4152839
6876 4152839 132521 -36474 1220825 887424 -142104 875190 3690114 5076385 3585011
6867 3585011 1805572 2790878 5956424 8267673 8500019 8192195 8599394 8951834 8280786
6858 8280786 6969494 5519704 3556246 1284815 235723 967172 1573578 446285 -777012
6849g77012J384700L428198K014782j263052l057228k757065j882294r85572J46434
6840c748109N86227p17481k695789l138459j462651J090639L223298M100668L300978
6831E39321J851150J878822L402962L239003m57716m370161m022939l32314J686033
6822C414161K55810j243200j45288J768659J882930O74331o7825l52746j014330
6813E172502j468968p13433N86518R28379J39978p79996j270807j300473m90601
6804H03099J416752L393411L575465J209886k161101l692992j893666J340002
6796C990856K179577o11284l620505l045699j0869J191350k62332o78133J633419
6787G66380K920492k46453n014215n784163j864621K191744K990387J453138j26922
$$ plain form
6849 -777012 607688 4035886 6050668 4787616 1730388 -1026677 -2908971 -3894543 -3748109
6840 -3748109 -3161882 -3879363 -6575152 -9713611 -11176262 -10085623 -6862325 -2761657 539321
6831 539321 2390471 4269293 7672255 10911258 10453542 6083381 2060442 1728128 3414161
6822 3414161 3669971 2426771 2281483 4050142 5933072 6607403 6539578 6186832 5172502
6813 5172502 3703534 2990101 3576619 4504998 4644976 3864980 2594173 1293700 803099
6804 803099 2219851 5613262 9188727 10398613 8237512 4544520 2650854 3990856
6796 3990856 6170433 5559149 1938644 -1107055 -1117924 73426 -188906 -867039 766380
6787 766380 3686872 3440419 -1573796 -7357959 -9222580 -7030836 -4040449 -2587311 -2714233
6778b714233p63616j70889J523651K761263J731210p97344k096153j364541m88192
6769b378844m03162L45973K300336L391950K381597J174261J349857J037357j659508
6760G539817m339801l323158K75437J808439K29825m87961J936167M187644K488072
6751A0314481j571834l370191j501060J271010K209992J062818j117150l093804
6743D204262l431542j492570J192236K112213O78149j220345j664544o35224N58616
6734C01251Q35082L19461L61452K045372M060265L327375q47436m660400m086540
6725A655882k23313K348939J771574J80394q87799k302264l766373k661815J458055
6716b426720M781846M320322K105049J394799J455055l28674l275174m314992
$$ plain form
6778 -2714233 -3477849 -3648738 -2125087 636176 2367386 1570042 -526111 -1890652 -2378844
6769 -2378844 -2782006 -2436033 -135697 3256253 5637850 6812111 8161968 9199325 7539817
6760 7539817 3200016 -123142 152295 1960734 2190559 1702598 3638765 7826409 10314481
6751 10314481 8742647 5372456 3871396 5142406 7352398 8415216 7298066 4204262
6743 4204262 772720 -719850 472386 2584599 3262748 2042403 377859 -257365 301251
6734 301251 1136333 1455794 1817246 3862618 7922883 11250258 10402822 5742422 1655882
6725 1655882 1432569 3781508 5553082 5733476 4845677 2543413 -1222960 -3884775 -2426720
6716 -2426720 2355126 6675448 8780497 10175296 11630351 11301677 8026503 3711511
6708C711511k852187j033207k3426N09252O1275j854371l171903j535360J218463
6699d969953J007522j998871l252504p88632K271455L347765L773439M608418
6691C998639L878932R36456p93409Q77763K636212R26416j935768j880941m98037
6682H146263k362289o460374o802397j880390K615271K235249l69389o82158J007554
6673d552660J676009J086795J251038K126680J657955l86740j711596q93261P54261
6664A008481J293945O59271L46092J318408K674481K368234m82000l994875n029367
6655A62670k659489P19368K308188J969027J517764J826651J899533N98010j732634
6646F609088l521975l470671j860560m40791n64587j451452j142062P31304K380868
$$ plain form
6708 3711511 859324 -173883 -197309 311943 373218 -1481153 -4653056 -6188416 -4969953
6699 -4969953 -3962431 -5961302 -9213806 -10002438 -7730983 -4383218 -609779 3998639
6691 3998639 7877571 8814027 8020618 8898381 11534593 12461009 10525241 8644300 8146263
6682 8146263 5783974 -676400 -7478797 -9359187 -6743916 -4508667 -4878056 -5560214 -4552660
6673 -4552660 -2876651 -1789856 -538818 1587862 3245817 2859077 1147481 254220 1008481
6664 1008481 2302426 2961697 3307789 4626197 7300678 9668912 9186912 5192037 162670
6655 162670 -2496819 -1777451 530737 2499764 4017528 5844179 7743712 8341722 6609088
6646 6609088 3087113 -383558 -2244118 -2684909 -3249496 -4700948 -5843010 -5111706 -2730838
6637b730838K519017K067328K181803K032628K30486k479758l875150l216413
6629c270897j744807l63703J290169L152809L884062K591103K98729j122410q74730
6620C840325L27594J101813M62956j230111k278094j416552L91604R88924j09124
6611B079335j215178j059929k48873M83543J635128L260243L570335J146680k413297
6602G237987m106346l326646k115473j828558j619563n05866J017008K131993
6594c115464K842242L092980K214385L46588p98428M8839J727631K014165N25755
6585H898693r63347q80348N49558J966173K170468P44164j777170m165860n409381
6576A132950n317671l979979j295863K120681M300464L700286J460116K24697
$$ plain form
6637 -2730838 -211821 1855507 4037310 6069938 6300424 3820666 -54484 -3270897
6629 -3270897 -5015704 -5379407 -4089238 -936429 2947633 5538736 5837465 4715055 3840325
6620 3840325 4167919 5269732 5732688 4502577 2224483 807931 1199535 2188459 2079335
6611 2079335 864157 -195772 -444645 38898 1674026 4934269 8504604 9651284 7237987
6602 7237987 3131641 -195005 -2310478 -4139036 -5758599 -6264465 -5247457 -3115464
6594 -3115464 -273222 2819758 5034143 5380731 4582303 4631142 6358773 8372938 8898693
6585 8898693 7935346 7054998 7604556 9570729 11741197 12485361 10708191 6542331 1132950
6576 1132950 -4184721 -8164700 -9460563 -7339882 -3039418 660868 2120984 2345681
6568B345681N04911J17518j908965k929556k03345M399497N887126K439179k182144
6559H469902l451175j363846O73303Q29604M40868Q64094J046813p03012l778472
6550C028079n471778l916695p1771L236479L910683K354823Q76398J159061K361303
6541G466582K250295K24176j787511j935235q68564m53042q90781p00768O25378
6532C930530J588272P34289j474044l404530l937920k926843r49853P36061Q75219
6523d828819k85415p59199J021655M087081N710005M249191P76369k039374k390818
6514E540676q13720N91666M36595o52651j227339r65225o71482q17015j202366
6505B19139j739127k180997j364042J446946M419325M529703J588275j338375
$$ plain form
6568 2345681 2850592 2968110 1059145 -1870411 -2073756 2325741 8212867 10652046 8469902
6559 8469902 5018727 3654881 4328184 5157788 5598656 6462750 7509563 6806551 3028079
6550 3028079 -2443699 -6360394 -6432165 -3195686 714997 3069820 3946218 5105279 7466582
6541 7466582 9716877 9941053 8153542 6218307 5349743 4896701 4005920 3305152 3930530
6532 3930530 5518802 6253091 4779047 1374517 -2563403 -5490246 -6440099 -5704038 -4828819
6523 -4828819 -5114234 -5873433 -4851778 -764697 4945308 9194499 9970868 7931494 5540676
6514 5540676 4726956 5318622 5755217 5102566 3875227 2910002 2238520 1421505 219139
6505 219139 -1519988 -3700985 -5065027 -3618081 801244 5330947 6919222 5580847
6497E580847k240720k322456k670082j827159R95517L064858J740747j077321
6489A244231j767795p21852j077287k559638j417634K906898N663724L270300
6481E540947j651638m075328k755859k44465J194749J213050L04394o29167l76729
6472a480046J266499K885565L224417K643008J828951L54493k097092m151734
6464D474061m025936j911328J61930O00952l35684j035630p7820K146110L317418
6455C314073J679827j449641l097438k488922j554615j453611j062214L45570
6447e766971J536853J737831K111741L172761L151460R74264j378155j831979
6439C707805j478313k235559l118686j926474O30928J697920N59119o85266m20061
$$ plain form
6497 5580847 3340127 1017671 -1652411 -3479570 -2484053 580805 2321552 1244231
6489 1244231 -523564 -1245416 -2322703 -4882341 -6299975 -3393077 2270647 5540947
6481 5540947 3889309 -186019 -2941878 -3186343 -1991594 -778544 -474150 -1103317 -1480046
6472 -1480046 -213547 2672018 5896435 8539443 10368394 10722887 8625795 4474061
6464 4474061 448125 -1463203 -1301273 -700321 -1036005 -2071635 -2149455 -3345 3314073
6455 3314073 4993900 3544259 446821 -2042101 -3596716 -5050327 -6112541 -5766971
6447 -5766971 -4230118 -2492287 -380546 2792215 5943675 6917939 5539784 3707805
6439 3707805 2229492 -6067 -3124753 -5051227 -4420299 -2722379 -2163260 -2848526 -3268587
6430c268587R08848K132033K124402p8716l640916n185543k287788K811986N501305
6421i82976M302913J617422l08069j226233j164190l0684R95861N60376l69512
6412C394908J11626J252586P37507p91854k39555K431120L413141J101708j221567
6403A0189620q20906K72328o96577k335916j841193r3919r5063j728864j902311
6394I47199N69633L500065M741463M236702K437926o33955l944100n276579l826534
6385B751820j573983q03547j205764q44549M76401N89780j655342l861773k694610
6376h821567J407623M293942L420887R20082J5026N68369M98800j66997J75720
6367B311885J099545O11234q60474m68105K416883M773243M201510J807665l29227
$$ plain form
6430 -3268587 -2359739 -227706 1896696 1817980 -1822936 -7008479 -9296267 -6484281 -982976
6421 -982976 3319937 4937359 4629290 3403057 2238867 2208183 3204044 3764420 3394908
6412 3394908 3506534 4759120 5496627 4704773 4465218 6896338 10309479 11411187 10189620
6403 10189620 9368714 9641042 8944465 6608549 4767356 4673437 4578374 2849510 947199
6394 947199 1516832 5016897 9758360 13995062 16432988 15799033 11854933 6578354 2751820
6385 2751820 1177837 374290 -831474 -1676023 -1199622 -609842 -2265184 -6126957 -8821567
6376 -8821567 -7413944 -3120002 300885 1220967 1235993 1804362 2303162 2136165 2311885
6367 2311885 3411430 4022664 3162190 2694085 5110968 9884211 14085721 15893386 15564159
6358A5564159j856902k963819l023933j970107r04944j27915J220783K557746
6350H495068J673572j411764l296705j803913R33121J982012J455381O10724r29418
6341G708078l156298l603505q21246K160938J533577j673881l303213k132884
6333c288434n05431K10356R17293J802905J661564M75822l00731k68620k90455
6324D14269k44193P35447J853177J328975m09443j040014j24850K85884o37718
6315B161534j072888J33512J238797K06756k189753l307708j766419J154290K665413
6306g76466R83020k549459m278779k209810J539946L463877K747738R83814p72544
6297h68663k189025k040489N12833L462297L766498J536961l59757o66738p24362
$$ plain form
6358 15564159 13707257 10743438 7719505 5749398 4844454 4716539 5937322 8495068
6350 8495068 10168640 8756876 5460171 3656258 4589379 6571391 8026772 8637496 7708078
6341 7708078 4551780 948275 127029 2287967 3821544 2147663 -1155550 -3288434
6333 -3288434 -3793865 -3583509 -2666216 -863311 798253 1274075 973344 704724 414269
6324 414269 170076 905523 2758700 4087675 3678232 2638218 2513368 2799252 2161534
6315 2161534 1088646 1222158 2460955 2667711 477958 -2829750 -4596169 -3441879 -776466
6306 -776466 206554 -2342905 -6621684 -8831494 -7291548 -3827671 -1079933 -96119 -868663
6297 -868663 -3057688 -5098177 -4585344 -1123047 2643451 4180412 3820655 3153917 2429555
6288B429555j232188j303381r87815j453343k180626j227004J144069K413618
6280b397115K007096J985749K726323J848982j145860l172276k439628j152064
6272a738793j013720p8745K789547M221167J319556k677281k553170R80770K543398
6263C792729L59167j741930q94940Q53432O64073o50647n79757R09715J515905
6254D227747J07309j653983j361819J096782K961712J483479k585713n326524
6246a051010m070760n03174J582431P02806j339332k179859j234892L85289J222529
6237f485972Q05427J30069M09695J252679J210119L77484O57360K546455L658324
6228D561640K053770o99798j818155j223338r01246j445159j721421j294600p07328
$$ plain form
6288 2429555 1197367 -106014 -1093829 -2547172 -4727798 -5954802 -4810733 -2397115
6280 -2397115 -390019 1595730 4322053 6171035 5025175 1852899 -586729 -1738793
6272 -1738793 -2752513 -2831258 -41711 4179456 5499012 2821731 268561 1249331 3792729
6263 3792729 4151896 2409966 1515026 2368458 3032531 2381884 1802127 2711842 4227747
6254 4227747 4335056 2681073 1319254 2416036 5377748 6861227 4275514 -1051010
6246 -1051010 -5121770 -5624944 -4042513 -3339707 -4679039 -6858898 -8093790 -7708501 -6485972
6237 -6485972 -5680545 -5550476 -5140781 -3888102 -2677983 -2300499 -1643139 903316 4561640
6228 4561640 6615410 5915612 4097457 2874119 1972873 527714 -1193707 -2488307 -3195635
6219c195635K56819K107082L580322K581765m69718k507832j665157O01119J809858
6210C098623J185830m56513j879072j810490K22623K620091K668856k86120l745192
6201A618636m911476l557329j332287M72184J348529R31887m74142j266210l9150
6192g209358K266866L103476J575365k49589p1409J562808K163088Q12041q33747
6183C119541j280199j176061j496252j320436O42901L201352L698528J757868
6175G147242l34680j253571k085218l280602k849273M87366M335742N165872K636024
6166I968902o87249k859513l588617k642625P6512K916945L398804J340300p92522
6157G130937j300604j336986k599270m257892l703769j71258L558303L832468
$$ plain form
6219 -3195635 -2938816 -831734 2748588 5330353 4860635 2352803 687646 1288765 3098623
6210 3098623 4284453 3827940 1948868 138378 361001 2981092 5649948 5363828 1618636
6201 1618636 -3292840 -6850169 -8182456 -7710272 -6361743 -5429856 -5903998 -7170208 -7209358
6192 -7209358 -4942492 -1839016 -263651 -513240 -584649 978159 3141247 3953288 3119541
6183 3119541 1839342 663281 -832971 -2153407 -1510506 1690846 5389374 7147242
6175 7147242 6812562 5558991 3473773 193171 -2656102 -2168736 2167006 7332878 9968902
6166 9968902 9281653 6422140 2833523 190898 267410 3184355 6583159 7923459 7130937
6157 7130937 5830333 4493347 1894077 -2363815 -6067584 -6238842 -2680539 1151929
6149A151929L71326l061194k927729p2580J833712J437956Q86460J544462J519646
6140B683988q17708l437929l468466j612399o69197p92111L43829K932606M074541
6131g62846K147471o97235j608446m90843Q24155J191756P34211N4137o0403R64983
6121B296940K572426L239073K102206j55046k233147l317141l197729k178936
6113h71354j035521l50431J11387P48221J191909R21380L86044L95089P12050
6104B208774M47783m16344j079752j189664q82585k2265J255129J752455N60722
6095B634253j185473j555453m92522M51548O34179O55067N46719j48441o09507
6086I30370N65302K648343L100683J102931j376790k543318k603091k037931m40402
$$ plain form
6149 1151929 1523255 -1537939 -4465668 -4538248 -2704536 -1266580 -380120 1164342 2683988
6140 2683988 1866280 -1571649 -5040115 -6652514 -7321711 -8113822 -7769993 -4837387 -762846
6131 -762846 1384625 687390 -921056 -1411899 -587744 604012 1338223 1392360 1331957 2296940
6121 2296940 4869366 8108439 10210645 10055599 7822452 4505311 1307582 -871354
6113 -871354 -1906875 -2257306 -2145919 -1397698 -205789 715591 1101635 1496724 2208774
6104 2208774 2656557 2240213 1160461 -29203 -911788 -934053 321076 2073531 2634253
6095 2634253 1448780 -106673 -599195 -147647 486532 1141599 1688318 1539877 930370
6086 930370 1495672 4144015 7244698 8347629 6970839 4427521 1824430 -213501 -653903
6077f53903J837968K981169K029020L48375l44425n4447K58436P5160p90224k152167
6067C534962k672092r15577K036926L022871R02143j758762k398900j817601k057536
6058b123566k741789j843912Q36005L148835L321729J670834l03324j413245j408398
6049h56831q11819j79260N08735J350831J806724J450326J009793J218200J090960
6040F587659o27843k588496k076373N67900J750888j59582k398718k164080n80665
6031a689310j60072p71332p49786j30721k6713q5942Q31520K317936K978574K539839
6021E053993J518471j69727k300346l173710j594297Q37938J576921N26155m42697
6012A832701m81477q1065P22454J973457K253670J81328k744051l383554j184967
$$ plain form
6077 -653903 1184065 4165234 6194254 6542629 6198204 6143757 6402193 6477353 5687129 3534962
6067 3534962 862870 -52707 1984219 5007090 5909233 4150471 1751571 -66030 -2123566
6058 -2123566 -4865355 -6709267 -5873262 -2724427 597302 2268136 1964812 551567 -856831
6049 -856831 -1668650 -1847910 -1339175 11656 1818380 3268706 4278499 5496699 6587659
6040 6587659 5959816 3371320 1294947 1862847 3613735 3454153 1055435 -1108645 -1689310
6031 -1689310 -1849382 -2620714 -3370500 -3501221 -3527934 -3613876 -2782356 -464420 2514154 5053993
6021 5053993 6572464 6402737 4102391 928681 -665616 172322 1749243 2275398 1832701
6012 1832701 1351224 1270159 1992613 3966070 6219740 6401068 3657017 273463 -911504
6003i11504J200116J770937J287156J008522O91613n0710k95311P62490K055142
5994G518451J836146K32042o58921N04953K237862J719377j570672m709278m739141
5985B370819k387009p61940q96290r35781J49896Q89024K74175m20386l10544
5976b028036o18755j714261j267323J869953M442341K884904j175899l135990
5968g43066j852985k17761j49503o76322o23873J17143J700210L648971L757174
5959D959988R78074j535667k84090K517938J611551k757626m639957j765380Q83920
5950c1249n37498k490400m14274L233275K752774j671595m240081k014478J797118
5941c616408L211586K052468L24701p51850q25400J54894J301007J115508n32611
$$ plain form
6003 -911504 288612 2059549 3346705 4355227 5046840 4996130 4700819 5463309 7518451
5994 7518451 9354597 9586639 8927718 9432671 11670533 13389910 11819238 7109960 2370819
5985 2370819 -16190 -778130 -1674420 -2610201 -2460305 -1571281 -1297106 -1717492 -2028036
5976 -2028036 -2646791 -4361052 -5628375 -3758422 683919 3568823 2392924 -743066
5968 -743066 -2596051 -2813812 -2963315 -3639637 -4263510 -4146367 -2446157 1202814 4959988
5959 4959988 5938062 4402395 4118305 6636243 8247794 5490168 850211 -915169 -31249
5950 -31249 -568747 -3059147 -3473421 -240146 2512628 841033 -3399048 -5413526 -3616408
5941 -3616408 -404822 1647646 1972347 1220497 395097 549991 1850998 2966506 2433895
5932B433895j872760j438665N2677O63093n00459k395698l040819j285115J978252
5923e405599M331854M028770J740608k49711o02208k41420r39032k860458l997431
5914d194627k382697J318036M142354M054759K065806N00857N9490j49456l15543
5905E098979M23772J849353K028423j65375l027986l700282j451778J539030K559270
5896E153406J001767j394746k653338k543830k132066j758988p04127Q52213J182896
5887b996813m36935j933532j013335J431298K597018J809310R27526R58826Q52660
5878B196023L2183l83094J67888L20793j039072k807605l189569k084399p72357
5869g559209j7295M69540J064566J436938P35707j313143l307898k969753O5749
$$ plain form
5932 2433895 561135 -877530 -824853 -161760 -662219 -3057917 -6098736 -7383851 -5405599
5923 -5405599 -1073745 2955025 4695633 4445922 3843714 3602294 2663262 -197196 -4194627
5914 -4194627 -6577324 -5259288 -1116934 2937825 5003631 5504488 5563978 5414522 5098979
5905 5098979 5522751 7372104 9400527 9235152 6207166 2506884 1055106 2594136 5153406
5896 5153406 6155173 4760427 2107089 -436741 -2568807 -4327795 -5031922 -4179709 -2996813
5887 -2996813 -3433748 -5367280 -6380615 -4949317 -2352299 -542989 384537 1343363 2196023
5878 2196023 2228206 1845112 2013000 2333793 1294721 -1512884 -4702453 -6786852 -7559209
5869 -7559209 -7576504 -7106964 -6042398 -4605460 -3869753 -5182896 -8490794 -11460547 -11394798
5860a1394798L110473L442508J718334P42915J550093K661536K712594J699381
5852F243036K6362j508886j307154R55987K397025J02312l988694m830685j229105
5843c139802K542837K947987J413569R01028J566167J803846R90781o38438k636702
5834E751273l556350j942812Q15242J474697j42725o06931J329941K349768K43438
5825E715541k041717j216828J033072J266426j99833r80353j229044k325503l080052
5816c058291j583893Q40450J771613K126967L971898N432534K991313j863140
5808A0629451l756043j458180N10557o30364j959442m59021J919550J822268j72249
5799F446527j103331l91288J31532k18966k80144L86104O16667j80204o49104
$$ plain form
5860 -11394798 -8284325 -4841817 -3123483 -2380568 -830475 1831061 4543655 6243036
5852 6243036 6269398 4760512 3453358 4409345 6806370 6908682 2919988 -1910697 -3139802
5843 -3139802 -596965 2351022 3764591 4665619 6231786 8035632 9026413 8387975 5751273
5834 5751273 2194923 252111 1067353 2542050 2399325 1792394 3122335 5472103 5715541
5825 5715541 3673824 2456996 3490068 4756494 4556661 3576308 2347264 21761 -3058291
5816 -3058291 -4642184 -3801734 -2030121 96846 4068744 9501278 12492591 10629451
5808 10629451 6873408 5415228 5925785 5295421 3335979 2876958 4796508 6618776 6446527
5799 6446527 5343196 4951908 5083440 4864474 4584330 4970434 5587101 5406897 4757793
5790D757793O51104K752717K986917M53673k455438l080942j962176j401292j429961
5781A272395j55257J963057J952933m57394j498016N34769J832247q61687m333323
5772B49724l517211O81845L209454K658213J942467K210537J522820m64966j567081
5763F925802j306085j554834k395198j686980O03574J909310J554780J485286
5755E535655J910549P89150j537235k080311p08867p07020k279122j276533L006431
5746B652697M779330N58220m403962l758131L12561J321998q50029n97015L291595
5737C307264N216417J579815l674301m788387j621123J426854J622241L08786
5729C377566j09201N61676O23349p79253k336295k430953j380931n39257R1080
$$ plain form
5790 4757793 5408897 8161614 11148531 11602204 9146766 6065824 4103648 2702356 1272395
5781 1272395 1117138 3080195 5033128 4575734 3077718 3612487 5444734 4583047 249724
5772 249724 -3267487 -2585642 623812 3282025 5224492 7435029 8957849 8492883 6925802
5763 6925802 5619717 4064883 1669685 -17295 586279 2495589 4050369 5535655
5755 5535655 7446204 8235354 6698119 4617808 3908941 3201921 922799 -353734 2652697
5746 2652697 7432027 7990247 3586285 -171846 140715 1462713 612684 15669 3307264
5737 3307264 8523681 10103496 6429195 1640808 19685 1446539 3068780 3377566
5729 3377566 3268365 3830041 4453390 3674137 1337842 -1093111 -2474042 -3013299 -2922219
5720b922219J284014K077208P23993j545038j090712K573824N178438L627420
5712I906928L23800r60601m42735l76244n67891K11376M70067j913927n058646
5703A592127m994113j768628O26418N06334M61420K305226L964319K961394m3068
5694E611429k820380m221379l807905j237640K214134L519852J340050j691856
5686a093695k012685L95076K335091J767338J18676q3995J337776K090147N21434
5677E375163k111400l232549k286687j111015q45371k54065J830684L998605L920605
5668E283970J504655j337412l194780l602329j972289J480914M238856L613936
5660F015521N49570j239940l25604Q48408K12234q57893l12754J066137J133772
$$ plain form
5720 -2922219 -1638205 439003 1162996 -382042 -1472754 1101070 6279508 9906928
5712 9906928 10230728 9270127 8827392 8451148 7883257 8094633 8564700 6650773 1592127
5703 1592127 -3401986 -5170614 -4544196 -4037862 -3576442 -1271216 2693103 5654497 5611429
5694 5611429 2791049 -1430330 -5238235 -6475875 -4261741 -741889 598161 -1093695
5686 -1093695 -3106380 -2711304 -376213 1391125 1509801 1425806 2763582 4853729 5375163
5677 5375163 3263763 31214 -2255473 -3366488 -4211859 -4465924 -2635240 1363365 5283970
5668 5283970 6788625 5451213 2256433 -1345896 -3318185 -1837271 2401585 6015521
5660 6015521 6565091 5325151 4999547 5847955 6060189 5202296 4889542 5955679 7089451
5651G089451k26132j441619j903462k004352j304286Q21029K880620K247192r41739
5642E216702l179465k078849M62353J178924j30529j249629j433462j823876k225979
5633e263810o13359L172108N974663N338675K778219R43077m05220k704016m468716
5624D751621k695009J820862M340697K311320j476509l250660l075378l383319
5616f56375m690984n009518k713054J439680M714469M468462Q67702k415465j875792
5607e870875J452353L479586K869018K252028L091186L161217Q94419j484775
5599I844157j757195j293858j819789j832955Q0418J353172p21366l670139l278745
5590c096300n18349L21233q30676j32016K595421L015045J35866j283896J220963
$$ plain form
5651 7089451 6863319 5421700 3518238 1513886 209600 1030629 3911249 6158441 5216702
5642 5216702 2037237 -41612 420741 1599665 1469136 219507 -1213955 -3037831 -5263810
5633 -5263810 -5877169 -2705061 3269602 8608277 11386496 12329573 11924353 9220337 4751621
5624 4751621 2056612 3877474 8218171 10529491 9052982 5802322 2726944 -656375
5616 -656375 -5347359 -10356877 -13069931 -11630251 -6915782 -2447320 -1579618 -3995083 -5870875
5607 -5870875 -4418522 -938936 1930082 4182110 7273296 10434513 11328932 9844157
5599 9844157 8086962 6793104 4973315 3140360 3220778 4573950 3852584 182445 -3096300
5590 -3096300 -3614649 -3293416 -4124092 -4256108 -1660687 1354358 1490224 206328 1427291
5581A427291L045311k95194n608512o423368k161061J886691K370403J225269
5573d533170J326974K493755K769701J437971l37258r73851k07222L60705r76122
5564A361483l316976l462294n394M098835M638185J060136l291622n247763m334434
5555h499844j541969K176153N330582N584337J919949l135213n159506k529563
5547e855074J561276K967152J682404J125475K529125K920534P9824l253390l043687
5538G13639j20014R86250j143648l022313j942852J70066L61391p69356n64610
5529e331447J344916K729102K150494P03203L65833J719981L376578L357627J351368
5520A1767655o12702o93135p3140j446659m525296n433006j798743L497429N452861
$$ plain form
5581 1427291 4472602 4177408 -1431104 -7854472 -10015533 -8128842 -5758439 -4533170
5573 -4533170 -3206196 -712441 2057260 3495231 3157973 2184122 1976900 2337605 1361483
5564 1361483 -1955493 -5417787 -5423181 -1324346 3313839 4373975 1082353 -4165410 -8499844
5555 -8499844 -10041813 -7865660 -2535078 3049259 4969208 1833995 -3325511 -5855074
5547 -5855074 -4293798 -1326646 355758 1481233 4010358 6930892 7010716 3757326 713639
5538 713639 593625 1579875 436227 -2586086 -4528938 -4358872 -3997481 -4766837 -5331447
5529 -5331447 -3986531 -1257429 893065 1596268 1962101 3682082 7058660 10416287 11767655
5520 11767655 11154953 10461818 10388678 8942019 4416723 -1016283 -2815026 682403 6135264
5511F135264K657565j738931l967568l061567q25610L59538j91141q54310K32647
5502a254113K421117L055107J118755j163825j307719K87461J420992J109687
5494E687462R6025p45801j081204q33857m53077q31579j871212j956133j63432
5485b152808J787472J427374r85867k531483j288671J393842K687858J449288
5477A787005q66055j976680j095028M55012Q30415l36360j819346k395601j922860
5468g339498j000499l68396n25590j050153n52234J478910L074017J768603j735098
5459f249938l876286k692102M9693J877583K534044K680209J995979M74307k44558
5450c451069R18622K253357J491131p24436j869954j344972r10022j566131k164012
$$ plain form
5511 6135264 8792829 7053898 3086330 24763 -800847 -441309 -632450 -1486760 -1254113
5502 -1254113 1167004 4222111 5340866 4177041 2869322 3156783 4577775 5687462
5494 5687462 5783487 5037686 3956482 3122625 2669548 1837969 -33243 -1989376 -2152808
5485 -2152808 -365336 1062038 76171 -2455312 -3743983 -2350141 337717 1787005
5477 1787005 920950 -1055730 -2150758 -1695746 -865331 -1201691 -3021037 -5416638 -7339498
5468 -7339498 -8339997 -8708393 -9233983 -10284136 -10836370 -9357460 -6283443 -4514840 -6249938
5459 -6249938 -10126224 -12818326 -12768633 -10891050 -8357006 -5676797 -3680818 -3206511 -3451069
5450 -3451069 -2532447 -279090 1212041 487605 -1382349 -2727321 -3637343 -5203474 -7367486
5441g367486j354737O95855K795065L764228L008435J050464o94004j465490j896090
5432a463760k403605k016379j79854J497828J255678r683j62354O89666O99039
5423b093424j28951K04386J931255K572179Q16066j199828j017832P51899J864852
5414C700602J622130P73792m50075k115933l130838k169523l1833P57082q37820
5405a882416k880000k831242m83327K132819L109476K249981P44436K108N97695
5396G59530J646182J309756j199776l983202l935457n76787K652582K263478p82612
5387a846306k248543k22137K550370K682002N19018j086255r81781n60669q57285
5378b051586r28743L49965K303368L143944K040052j07435j720412k054553j713211
$$ plain form
5441 -7367486 -8722223 -8026368 -5231303 -1467075 1541360 2591824 1897820 432330 -1463760
5432 -1463760 -3867365 -5883744 -6063598 -4565770 -3310092 -3319775 -3482129 -2792463 -2093424
5423 -2093424 -2222375 -2017989 -86734 2485445 3301511 2101683 1083851 1835750 3700602
5414 3700602 5322732 6096524 5646449 3530516 399678 -1769845 -1801678 -1044596 -1882416
5405 -1882416 -4762416 -7593658 -8076985 -5944166 -2834690 -584709 159727 161835 759530
5396 759530 2405712 3715468 2515692 -1467510 -5402967 -5979754 -3327172 -1063694 -1846306
5387 -1846306 -4094849 -4316986 -1766616 915386 1434404 348149 -633632 -1194301 -2051586
5378 -2051586 -2980329 -2630364 -326996 2816948 4857000 4749565 3029153 974600 -738611
5369g38611j747211k354309k738532k210477r13347O18140J930455K470911J810207
5360c872774N40034P9693Q87688J689762J324373M65589L22989M11541p07133
5351A141762k695634l313432j539587P19442J090149j35206o83978L34060J314442
5342c767982P54877m48181m61441N55059O54216q18614k182765k120158j615633
5333i450622j849581j773021J16169K654808L261718J960396J448401K832756
5325g98976L914166K636440j3170j751839j778099o39785Q76080J512192O9950
5316D026959k349694k477824Q47963M103252L068557j566720m956294m088508
5308c392309q14381J328642J419744J337448K581379M065522L434620K12854l272236
$$ plain form
5369 -738611 -2485822 -4840131 -7578663 -9789140 -10702487 -10084347 -8153892 -5682981 -3872774
5360 -3872774 -3332740 -3253047 -2365359 -675597 648776 1114365 1437354 1848895 1141762
5351 1141762 -1553872 -4867304 -6406891 -5687449 -4597300 -4732506 -5416484 -5082424 -3767982
5342 -3767982 -3013105 -3461286 -3922727 -3367668 -2713452 -3532066 -5714831 -7834989 -9450622
5333 -9450622 -11300203 -13073224 -12957055 -10302247 -7040529 -5080133 -3631732 -798976
5325 -798976 3115190 5751630 5738460 3986621 2208522 1568737 2444817 3957009 4026959
5316 4026959 1677265 -800559 47404 4150656 7219213 5652493 696199 -3392309
5308 -3392309 -4206690 -2878048 -1458304 -120856 2460523 6526045 9960665 10173519 6901283
5299F901283m570992l664047j807832P40940L707894M762134J877142k468443
5291E478079l259055J20254K730734J286252j405116j450819M35108J316865Q60660
5282F112962K23674j098985l384682l958886o86980L448009L689064L97413j759052
5273B982537q90378L09061j07603n68076M91299J892035J870956M72160j178602
5264E273389k083934j565314r3009K96846j541622l553775k998374n41391Q99389
5255e907795O25005L13553L88270j47968n85928Q10334K833419K168578j073930
5246e76462k741820q05832J742194J841931N71579K45013N06884j19539j262233
5237e98285j790147j968132k279667j734344N00930L052810L876260K951344J904943
$$ plain form
5299 6901283 2330291 -1333756 -3141588 -2400648 1307246 6069380 7946522 5478079
5291 5478079 2219024 2339278 5070012 6356264 4951148 3500329 3935437 5252302 6112962
5282 6112962 6336636 5237651 1852969 -2105917 -2792897 655112 4344176 4741589 2982537
5273 2982537 2092159 2401220 2293617 1725541 2216840 4108875 5979831 6451991 5273389
5264 5273389 3189455 1624141 1531132 1827978 286356 -3267419 -6265793 -6807184 -5907795
5255 -5907795 -5282790 -4969237 -4580967 -4728935 -5314863 -4504529 -1671110 497468 -576462
5246 -576462 -3318282 -4124114 -2381920 -539989 31590 276603 783487 663948 -598285
5237 -598285 -2388432 -4356564 -6636231 -8370575 -7869645 -4816835 -940575 2010769 3915712
5228C915712J688927J874419J668201P50125m67986j108745r33470r82242k149945
5219D254996l593029l902860l236464k546639j453267Q29478L021850K960344
5211c665591J133840L11128J475773K707338K338029Q32713n32178o24662J385777
5202E362167M226208L970856j108734o210084n225507J48378K164787j490930
5194A837141m276510j136551L851877M210285N31627j816395j155277l74197j021171
5185F50829j375058k25390J080851R50096k77132j013930l53613Q21980P08413
5176I67046q90626j763472o01743K54601j684566m078064k555353J974719L932867
5167d444591J465689j287139j616012j979860l872559l924734O3262M326079M755681
$$ plain form
5228 3915712 5604639 7479058 9147259 9897384 9429398 8320653 7387183 6404941 4254996
5219 4254996 661967 -3240893 -6477357 -9023996 -10477263 -9647785 -6625935 -3665591
5211 -3665591 -2531751 -2220623 -744850 1962488 4300517 5133230 4601052 3976390 5362167
5202 5362167 9588375 13559231 12450497 6240413 1014906 1163284 3328071 1837141
5194 1837141 -2439369 -3575920 275957 4486242 5017869 3201474 2046197 1672000 650829
5185 650829 -724229 -949619 131232 1081328 804196 -209734 -563347 258633 967046
5176 967046 76420 -1687052 -2288795 -2034194 -3718760 -7796824 -10352177 -8377458 -4444591
5167 -4444591 -2978902 -4266041 -5882053 -7861913 -11734472 -15659206 -15595944 -11269865 -6514184
5158f514184L010918K609918K980030K129983J508491K982750M037486J389835
5150A4135227k903160m150361k081587l70887o39985j535609k435283l608863
5142c590508l752488j510815J410755K248883J178755J02936q16585k004106j975848
5133h709021J13195J573355Q6838j614870K67800L817572L913904L84453j841796
5124b008570m74982J400986Q39818j122984k063412j298265K64471J071088j41575
5115c533425k480505l094568j103321P64347O51882O39102K308793K964218N09383
5106b374094j645620Q7376K651427J125650k526217k568233O61778J603928q48517
5097c832522k231926r58755k98842j229221n89229K209157L342900J284291o60149
$$ plain form
5158 -6514184 -3503266 -893348 2086682 4216665 5725156 8707906 12745392 14135227
5150 14135227 11232067 7081706 5000119 4629232 3989247 2453638 18355 -3590508
5142 -3590508 -7342996 -8853811 -7443056 -5194173 -4015418 -3912482 -4729067 -6733173 -8709021
5133 -8709021 -8595826 -7022471 -6935633 -8550503 -8282703 -4465131 -551227 -166774 -2008570
5124 -2008570 -2483552 -1082566 -242748 -1365732 -3429144 -4727409 -4462938 -3391850 -3533425
5115 -3533425 -6013930 -9108498 -10211819 -9447472 -8795590 -8156488 -5847695 -2883477 -2374094
5106 -2374094 -4019714 -3932338 -1280911 -155261 -2681478 -5249711 -4587933 -2984005 -3832522
5097 -3832522 -6064448 -7023203 -7322045 -8551266 -9140495 -6931338 -3588438 -2304147 -2964296
5088b964296l11394M58763L68175Q06536J672747M89682k669315m456041l830784
5079a0435927l270543l347794j666350J601920L026445K252026K924758N525746
5071c389719N690093K026909q69040k28812L86228j965272m109085k519864N63206
5062d415356J281644J20920m63701n42988r81129p90659K73660k3397k345113
5053g886119l579648j722013P36118J211648R24315J444057J466900K22027l2529
5044g215244J725034K620785R49186k84293J365302L105337J687317q50276o10550
5035B492598K043531L831600L313293R20142k805504n933948n479660k022155
5027c640103k44762j876162k581121N07337L127459N82335m279579n211405j277738
$$ plain form
5088 -2964296 -3275690 -2816927 -2448752 -1642216 30531 520213 -2149102 -6605143 -10435927
5079 -10435927 -13706470 -17054264 -18720614 -17118694 -14092249 -11840223 -8915465 -3389719
5071 -3389719 2300374 4327283 3458243 3229431 3615659 1650387 -2458698 -4978562 -4415356
5062 -4415356 -3133712 -3012792 -3476493 -4019481 -5000610 -5791269 -5517609 -5541006 -7886119
5053 -7886119 -11465767 -13187780 -12451662 -11240014 -10315699 -8871642 -7404742 -7182715 -7215244
5044 -7215244 -5490210 -2869425 -1920239 -2204532 -839230 2266107 3953424 3103148 2492598
5035 2492598 4536129 8367729 11681022 12601164 9795660 3861712 -1617948 -3640103
5027 -3640103 -3884865 -5761027 -8342148 -7834811 -4707352 -4125017 -8404596 -13616001 -14893739
5018a4893739L672118O958594P511066L815475l053167p311749n004345j68764
5010h474511Q66732j288138j291934J820971L944424L007369R89914m99225j625870
5001b550268j880705o54661M23088l84275j531220n52825J732550K970972L199966
4992G72622L269596J846886j664856l792298j524384K033346J692724k041197
4984E92439m435587l986917l013016k306011p42155Q28311O49337J35597J748490
4975a0529512L773840K536191r12582j730364J352590M646594N308740L791337
4967H236834P85874l435001o595668n899714k244902P85761J820672J954152J095292
4958c496700j674421m792975n507855l952240k139297k8294L218993N414273L666276
$$ plain form
5018 -14893739 -11221621 -4263027 3248039 7063514 4010347 -3301402 -8305747 -8474511
5010 -8474511 -7607779 -8895917 -10187851 -8366880 -4422456 -1415087 -425173 -924398 -2550268
5001 -2550268 -4430973 -5085634 -4662546 -5046821 -6578041 -7130866 -5398316 -2427344 772622
4992 772622 4042218 5889104 4224248 431950 -1092434 940912 2633636 592439
4984 592439 -3843148 -7830065 -10843081 -13149092 -13891247 -13062936 -12413599 -12278002 -10529512
4975 -10529512 -6755672 -4219481 -5132063 -6862427 -5509837 -863243 4445497 8236834
4967 8236834 9022708 5587707 -1007961 -6907675 -9152577 -8366816 -6546144 -4591992 -3496700
4958 -3496700 -5171121 -9964096 -15471951 -19424191 -21563488 -21591782 -18372789 -12958516 -9292240
4949i292240k31507j595716L20443J874927J154567N7323J85719P49644R11546
4940e865294R35210Q86495O76009P76624R13013k89049k350219k334075L68956
4931f282330K058391M79476j360638n86021P50578K88060o8794J122306P26835
4922b872137k920479n211220k633678M92992o23070k802089j306118J029564n40210
4913a7386445l373118k768275j179754k590115l225919J643044O938708N123311
4905a6818563m87389j491506J095514K94725l281607l909363k491365l157369
4897c0246923l015821J538011M192566j147995o436672k000877M576708Q82097
4889c1658906o912306m869658K013264r84172q971260n727687L846251J289199
$$ plain form
4949 -9292240 -9523747 -11119463 -10799020 -8924093 -7769526 -7712203 -7526484 -6776840 -5865294
4940 -5865294 -4930084 -4043589 -3367580 -2590956 -1677943 -1966992 -4317211 -6651286 -6282330
4931 -6282330 -4223939 -3744463 -5105101 -5691122 -4940544 -4652484 -4721278 -3598972 -2872137
4922 -2872137 -5792616 -11003836 -13637514 -13144522 -13767592 -16569681 -17875799 -16846235 -17386445
4913 -17386445 -20759563 -23527838 -24707592 -27297707 -30523626 -28880582 -21941874 -16818563
4905 -16818563 -17305952 -18797458 -17701944 -17407219 -20688826 -24598189 -27089554 -30246923
4897 -30246923 -33262744 -31724733 -27532167 -28680162 -35116834 -37117711 -32541003 -31658906
4889 -31658906 -38571212 -43440870 -41427606 -42411778 -51383038 -57110725 -53264474 -51975275
4881e1975275r179515p636577P06309p129510k3800333k0310641p528123k7228254
4873a54081919o2503772k9403122R4689477J98872829J66808237L5076895n6421802
4866A93036823m8326719j0284819j0653595k8556915k0800555J74022Q89012j1741251
4858F3736003j1015769m6237Q75197n963771m718559J721420j7800o103455l944530
4849C4522499K275672p6966p062679n198034L422880N221757o95492k986118O93643
4840C0117162J730206j981593l450764q44514K12505j635342j942755k26754k86480
4831B1691671j616473m59978J776057M20656l524851m845893k848879q57405P39780
4822A0474685L289504M342608J104593k967642k472820J321710L070302J891532
$$ plain form
4881 -51975275 -61154790 -68791367 -68085058 -75214568 -99014901 -119325542 -126853665 -154081919
4873 -154081919 -216585691 -245988813 -151299336 47573493 214381730 249458625 193036823
4866 193036823 144710104 134425285 123771690 95214775 74414220 74588242 75477254 63736003
4858 63736003 52720234 52673997 53549194 47585423 42866864 44588284 44570484 38467029 34522499
4849 34522499 36798171 36721205 29658526 24460492 27883372 33105129 32409637 29423519 30117162
4840 30117162 31847368 29865775 26415011 25570497 25783002 24147660 22204905 21978151 21691671
4831 21691671 20075198 19615220 21391277 21811933 18287082 13441189 10592310 9734905 10474685
4822 10474685 13764189 18106797 19211390 16243748 13770928 15092638 18162940 20054472
4814B0054472N93904o22964k803055l582890q26882J978630O53879k420508k569261
4805A0455325q91237j111601j905837J22800K904853K074289q64658j071912J176966
4796A0888988J860112Q43579R26629J338265n96912l163494k710107o52401j086633
4787G648026l140333k640804J92282J591409J251378J724465K316634L69486k685503
4778F627040l082485j134595K89817J635605M387838N375836Q89049n475135o937433
4769B575537l886760k069462k079532M28996M881507N621966K113433K19334K003095
4760I808114K846882N16511j206710l20143k33728k747069m427146l013751j150775
4751G2185r50453p20654M35933N57341m30197K00609K095347J347007j825601
$$ plain form
4814 20054472 20648376 20025412 17222357 13639467 12812585 14791215 15445094 13024586 10455325
4805 10455325 9564088 8452487 6546650 6669450 9574303 11648592 10783934 9712022 10888988
4796 10888988 12749100 13592679 14519308 15857573 15260661 12097167 9387060 8734659 7648026
4787 7648026 4507693 1866889 2059171 3650580 4901958 6626423 8943057 9312543 6627040
4778 6627040 3544555 2409960 2699777 4335382 8723220 14099056 14988105 9512970 2575537
4769 2575537 -1311223 -3380685 -5460217 -5031221 -149714 5472252 7585685 7805019 9808114
4760 9808114 12654996 13171507 11964797 11644654 11410926 8663857 4236711 1222960 72185
4751 72185 -878268 -1598922 -1162989 -605648 -1035845 -835236 1260111 2607118 781517
4742G81517j849595K542000M467060o75780p134834o841654q53236L177363J908402
4733d478757q63827p39841K364086N337935N217265J897710j357970j465444K19547
4724F130704k53223l233018m801056k975931m00158N47803J092593K555364L468286
4715B131364K522836R92141O7124j011069k283022j904091M24711K180852K028000
4706E148846J709892K175514J543117r18894k476751j128798J167144J924637
4698I144707J681285J755504J497986J91900j046822j356854j469786j469619
4690H928301l94127O31232j177078m986019n910354k182188J715085J848618K36910
4681a289620K39037J159969J279711J771212L206367K495907j631290m166511
$$ plain form
4742 781517 -1068078 1473922 5940982 5265202 -1869632 -8711286 -9564522 -6387159 -4478757
4733 -4478757 -5342584 -6082425 -3718339 1619596 6836861 8734571 7376601 5911157 6130704
4724 6130704 5877481 2644463 -2156593 -5132524 -5532682 -4984879 -3892286 -1336922 2131364
4715 2131364 4654200 5646341 5713465 4702396 2419374 515283 939994 3120846 5148846
4706 5148846 6858738 9034252 10577369 9658475 7181724 6052926 7220070 9144707
4698 9144707 10825992 12581496 14079482 14271382 13224560 11867706 10397920 8928301
4690 8928301 8534174 9165406 7988328 3002309 -2908045 -5090233 -3375148 -1526530 -1289620
4681 -1289620 -1050583 109386 1389097 3160309 6366676 8862583 7231293 3064782
4673C064782p32348M414688L874259j721829m918472k653295O32078J132745L91502
4664C484110O07485Q34491o2777r00259o25455j9670M84227J642774K884469K073545
4654A0402940p83287k491375j050490J337894J489294m24465j606001m62909J836812
4645H248413K906930J279395k319102n232067n148417k489168K24350J405253
4637a124413J609931J575831P45462j223452k759136j871140R20863K724976J865546
4628B464468J08144J42872J659107J830939k48023j977020j256661K39126L5236
4619B998188q43056K44033K534540K626883J41268j422778l07112R17299m7927
4610F841338j631055j606643q06092r72641j443861q29178q606n14926j353113
$$ plain form
4673 3064782 2332434 6747122 10621381 8899552 3981080 1327785 1959863 3092608 3484110
4664 3484110 4091595 4926086 4863309 3963050 3337595 3317925 3802152 5444926 8329395 10402940
4654 10402940 9619653 7128278 6077788 7415682 8904976 8480511 6874510 6411601 8248413
4645 8248413 11155343 12434738 10115636 4883569 -264848 -2754016 -2529666 -1124413
4637 -1124413 485518 2061349 2806811 1583359 -1175777 -3046917 -2126054 598922 2464468
4628 2464468 2572612 2715484 4374591 6205530 5957507 3980487 2723826 2962952 2998188
4619 2998188 2155132 2399165 4933705 7560588 7701856 6279078 5971966 6889265 6841338
4610 6841338 5210283 3603640 2797548 1824907 381046 -448132 -456738 -971664 -2324777
4601b324777l39060K160590L364923J749136j165793k565620r96151K155239L507404
4592E545891J320327j647230j164743K311552L774229J100329j546305k50878
4584I443172K468810J869871j450565k888994j259880o8635j460636l160512k416467
4575A076164J75524K115040K148832Q06896q05720j739963j417635J72367K360189
4566D891694L768029K914751p5625k723361k790529j349735j085058j884620j292258
4557C73288N23049L54463k273511l308002m42826K959408L230961J793183J597152
4548D807165J807385K79719j715840j779016q29546p53891r8593K966676N619659
4539A0303718L793873q88639l164451k185946j899622l649827m055702j061977
$$ plain form
4601 -2324777 -2663837 -503247 2861676 4610812 3445019 879399 -116752 2038487 5545891
4592 5545891 6866218 5218988 4054245 6365797 10140026 11240355 9694050 9443172
4584 9443172 11911982 13781853 12331288 9442294 8182414 8113779 6653143 3492631 1076164
4575 1076164 1251688 3366728 5515560 6322456 5516736 3776773 2359138 2531505 4891694
4566 4891694 8659723 11574474 11498849 8775488 5984959 4635224 3550166 1665546 373288
4557 373288 896337 1250800 -1022711 -4330713 -4773539 -1814131 1416830 3210013 4807165
4548 4807165 6614550 6894269 5178429 3399413 2569867 1815976 1717383 4684059 10303718
4539 10303718 14097591 13208952 10044501 7858555 5958933 2309106 -1746596 -2808573
4531b808573K673324L689274J526226j951531m052722k381777K369788N555381
4523D619390L863948J05307j103877l41657j051744k391214r41193J710592O28940
4514E098492l194136l155887J950344N074543J750326l461658m914793l579238
4506d432007k552278r81674K399664M624405K786049o91984j914231j396645j619964
4497c778665j860664j10282K401733K997581J810592N75581n35457j463150m48681
4488d11412K590170L824339Q56278k552790j748237J461402J908390o28544j938954
4479C360642q82136m25248j461872j339550P21789J848765N14913r59991m90002
4470H87310Q07528J323253J478904J840397J383743n53618k612865l295160k940889
$$ plain form
4531 -2808573 -135249 3554025 5080251 3128720 -924002 -3305779 -935991 4619390
4523 4619390 8483338 8588645 7484768 7143111 6091367 3700153 2758960 4469552 5098492
4514 5098492 1904356 -1251531 698813 5773356 7523682 4062024 -852769 -4432007
4506 -4432007 -6984285 -7965959 -5566295 -941890 1844159 1152175 -762056 -2158701 -3778665
4497 -3778665 -5639329 -5749611 -3347878 -350297 1460295 2035876 1500419 37269 -411412
4488 -411412 2178758 6003097 6859375 4306585 2558348 4019750 5928140 5299596 3360642
4479 3360642 2478506 2053258 591386 -748164 -26375 1822390 2337303 1377312 887310
4470 887310 1694838 3018091 4496995 6337392 7721135 7167517 4554652 1259492 -1681397
4461a681397k531614j846934p6185K525447M502328M442687K250192m46410j534823
4452E603291o39616N90120J039001J658068L180855L835088J528380k512445m633854
4443I648888l130891J30192K305109K148557K76377j516337j420367M65824J751224
4434A0658576N97092j794835l058395l000906k996196k932211j418163J137884
4426b807154K313663J065127p70282j076628O6202J177140J312914N68546l90848
4417A458680q02203m19930J83605L41366M6322m13757q93509r10365K41829K028844
4407H60882K537572J066554l34127M46285K319172K375906P0516j871039q78241
4398F593480K367988M544799K987379j405087m673032m135520j802177j502513
$$ plain form
4461 -1681397 -4213011 -6059945 -6136130 -3610683 891645 5334332 7584524 7138114 5603291
4452 5603291 4963675 5553795 6592796 8250864 11431719 15266807 16795187 14282742 9648888
4443 9648888 6517997 6648189 8953298 11101855 11378232 9861895 8441528 8907352 10658576
4434 10658576 11255668 9460833 6402438 3401532 405336 -2526875 -3945038 -2807154
4426 -2807154 -493491 571636 -198646 -1275274 -1209072 -31932 1280982 1849528 1458680
4417 1458680 656477 236547 420152 761518 807840 394083 -499426 -1409791 -1167962 860882
4407 860882 3398454 4465008 4130881 4577166 6896338 9272244 9342760 7471721 6593480
4398 6593480 8961468 13506267 16493646 15088559 10415527 6280007 4477830 2975317
4390B975317k961204k040933K377263N762127M397117P51917q23312n27926j252385
4381H657981k847485k747800p51257J062336K005396K443883J161191k635981
4373F348264n809788m409029L16813L480701L532908K993403K770969J128198
4365A0352439j379049j412621J436678L352114K273612O55748N37324K74655j606157
4356A4484743l214187k461744l95821P44854L15214j185985k716300k182632J423452
4347D811594M897260L747202j038643l566263j443571J223512Q34681q65629j320165
4338G279978j429162k200732j831481L93277J568061R4088j006869O01835K118722
4329E587717N46921j882565j670372J98338R97828J250861K258159K132682n53819
$$ plain form
4390 2975317 14113 -2026820 350443 6112570 10509687 11261604 10438292 9910366 8657981
4381 8657981 5810496 3062696 2311439 3373775 5379171 7823054 8984245 6348264
4373 6348264 538476 -3870553 -3553740 -73039 3459869 6453272 9224241 10352439
4365 10352439 8973390 7560769 8997447 12349561 14623173 15278921 15816245 16090900 14484743
4356 14484743 11270556 8808812 8412991 9157845 9473059 8287074 5570774 3388142 4811594
4347 4811594 9708854 13456056 12417413 8851150 7407579 8631091 9465772 8600143 7279978
4338 7279978 5850816 3650084 1818603 2211880 3779941 3874029 2867160 3468995 5587717
4329 5587717 6134638 4252073 2581701 2780039 3777867 5028728 7286887 9419569 8865750
4320H865750k416282q2323L499263L308356J83104j503466j638707l259689n522642
4311A433364m788468j732416m38317q77301P29643M035626M288167Q25934j249702
4302B226530L12068J367422r29550l081733j433267J658914J788926r99095l224453
4293b314238k894827p09958J581340K221347P67778p86000m19032N25333m93255
4284b521512k229384j284259J472082J560715j375488k495934j7483J669428k66367
4275e488202k368910j415683J19246n71403j104053J241276L733205K727614K05353
4266b921557J77227J757427J557412L30893J260745L472327L172603K67673j571961
4257G502789r36932O4923J71873J43463n5723j132016j972670j097629K00107
$$ plain form
4320 8865750 6449468 6367145 9866408 13174764 13357868 11854402 10215695 6956006 1433364
4311 1433364 -3355104 -5087520 -5525837 -6403138 -5673495 -1637869 2650298 3476232 2226530
4302 2226530 2538598 3906020 2976470 -105263 -1538530 120384 1909310 910215 -2314238
4293 -2314238 -5209065 -5919023 -4337683 -2116336 -1348558 -2134558 -2553590 -2028257 -2521512
4284 -2521512 -4750896 -6035155 -4563073 -3002358 -4377846 -6873780 -6891263 -5221835 -5488202
4275 -5488202 -7857112 -9272795 -9153549 -9724952 -10829005 -9587729 -5854524 -3126910 -2921557
4266 -2921557 -2744330 -986903 570509 901402 2162147 5634474 8807077 9074750 7502789
4257 7502789 6565857 6630780 6802653 6946116 6890393 5758377 3785707 2688078 2888185
4248B888185r453l15216J471478L214040J239849k673195l131878L4038J173274
4239C891122j810136l972107j741862J214880M91750j593659p5231M234932N737483
4230F377172K303166k136689l480272k210803j054446o30281L11259J463167N58642
4221A500915k695745m536351j631453L365538M440117P59290j741479P40466L894538
4212D095836J987938l196946n202426k347295J008614J439799k89405k214936
4204d718821k890560q81060L247335N618993L834391R71929L27390l19096l117741
4195B072760l564111J543356M330475l521050j4041515j3464656q524518k0493646
4187e5662905m6610887n1392270j3411141L7903357N5577719L4032117R327771
$$ plain form
4248 2888185 2878732 2563516 4034994 7249034 8488883 5815688 2683810 2717848 3891122
4239 3891122 2080986 -1891121 -3632983 -2418103 -1926353 -3520012 -3595243 639689 6377172
4230 6377172 8680338 6543649 3063377 852574 -201872 -832153 -520894 942273 1500915
4221 1500915 -1194830 -5731181 -7362634 -3997096 443021 1202311 -539168 201298 4095836
4212 4095836 6083774 2886828 -2315598 -4662893 -3654279 -2214480 -2503885 -4718821
4204 -4718821 -7609381 -8490441 -5243106 375887 4210278 5182207 5509597 5190501 2072760
4195 2072760 -1491351 52005 4382480 861430 -13180085 -26644741 -35169259 -55662905
4187 -55662905 -102273792 -153666062 -167077203 -129173846 -73596127 -39564010 -30236239
4180c0236239O024813J1874492Q590327O02272M08932N177004M551648l39012
4172F654237j385293O53504r28564m796367l646326K105555M485742J275519j178249
4163C239758P38251K791442J045880k262828l593102l070613k009580q2019K509685
4154f93126L618894K178108l8933j261429j848894k300005j665303M51011K277341
4145G17664J937594l6424j467132j089010L82762J317015J012135M93836R27232
4136D195672J317733m74702l739023m380964l75075M447041M923310J292694j799833
4127E406853j835905l81725Q07769J745714K152380J131871m76024p50352l08777
4118G491804j799881m917412n713965k505751J209374K034612J474378K414126
$$ plain form
4180 -30236239 -24211426 -12336934 -3746607 -3144335 -2735403 2441601 6993249 6654237
4172 6654237 5268944 5922448 4993884 197517 -3448809 -1343254 3142488 4418007 3239758
4163 3239758 3978009 6769451 7815331 5552503 1959401 -1111212 -3120792 -3202811 -693126
4154 -693126 2925768 5103876 5064943 3803514 1954620 -345385 -2010688 -1559677 717664
4145 717664 2655258 2618834 1151702 62692 445454 1762469 2774604 3268440 4195672
4136 4195672 5513405 5038703 1299680 -3081284 -3456359 990682 5913992 7206686 5406853
4127 5406853 3570948 3189223 3996992 5742706 7895086 9026957 8550933 7800581 7491804
4118 7491804 5691923 774511 -4939454 -7445205 -6235831 -4201219 -2726841 -312715
4110c12715L721028K333726r16421j825062R83704L952810L507792N07008j422462
4101A0529408m50164J681759J860786q81184l914181l532053N99107M474097M325786
4092A4693361J195653p53861J50331J349004P0197l005669n044906m644346l013930
4083I95834k247951l125827m215207k981040J428125O318369P524217M002124
4075G698644o39191k101245r9755J970825J488745o67458j877031j029017N95135
4066E339652J102115J3828j484690k070585j747589j412265j154950n1193J842420
4057C76743K581515R07322j147391m43068K537531L693832R29639k692137l155107
4048C588879p30854J413530K151660K761031L265950K143182j05111p84351M37699
$$ plain form
4110 -312715 3408313 5742039 4825618 3000556 3984260 7937070 11444862 11951870 10529408
4101 10529408 10079244 11761003 13621789 12740605 8826424 5294371 5893478 10367575 14693361
4092 14693361 15889014 15135153 15285484 16634488 16704685 13699016 8654110 4009764 995834
4083 995834 -1252117 -4377944 -8593151 -11574191 -10146066 -3827697 3696520 7698644
4075 7698644 7059453 4958208 4858453 6829278 8318023 7650565 5773534 4744517 5339652
4066 5339652 6441767 6455595 4970905 2900320 1152731 -259534 -1414484 -1465677 376743
4057 376743 2958258 3865580 2718189 2275121 4812652 8506484 9436123 6743986 3588879
4048 3588879 2858025 4271555 6423215 9184246 12450196 14593378 14488267 13703916 14141615
4039A4141615K58622l040826o205228n537883k335418n35917p69645n03711Q55987
4030c672404J104629k97612p21981J371451L637451L066524l9285k936539l756776
4021b244542k575814n13780R29536P40381l41098m68690O64872J326918P82742
4012a699475Q57980K778472M291006K484012j518773l471584j527465J608330
4004C802503K461856O47050j756154k879679k115063J48332K646634L849122L314737
3995A0119338J983133P78934k51126j095252j277652r08419r89685j609854j065409
3986E684008J624675M273180L709576J40452k909932l318675k720811l199621
3978C282852l904727k854689m69306J093781J269103J288693J419203N80524j051746
$$ plain form
4039 14141615 14400237 11359411 5154183 -383700 -2719118 -3255035 -4024680 -4528391 -3672404
4030 -3672404 -2567775 -2865387 -3587368 -2215917 1421534 4488058 4448773 1512234 -2244542
4021 -2244542 -4820356 -5334136 -4404600 -3664219 -4005317 -4474007 -3809135 -2482217 -1699475
4012 -1699475 -841495 1936977 6227983 8711995 7193222 3721638 2194173 3802503
4004 3802503 6264359 6911409 5155255 2275576 160513 308845 2955479 6804601 10119338
3995 10119338 12102471 12881405 12630279 11535027 10257375 9348956 8359271 6749417 5684008
3986 5684008 7308683 11581863 15291439 15431891 12521959 9203284 6482473 3282852
3978 3282852 -621875 -3476564 -3945870 -2852089 -1582986 -294293 1124910 1705434 653688
3969F53688j620844n32209N36121O01263R01287J912860J436545j796217m730989
3960b638495l654359r2689Q90588j715431l099472J17282M458320M242376n16478
3951b008358m163341k760007J538983M041869L279234J745895J857863K985613
3943F517751L074038J982881J497915K003164J256017k098998n484361n275536
3935C472871j876090R06681J304107J162086J611252Q95065j690258l160194j136351
3926A489169J804280J626536j079678k374942j266706n36312j426495j783082
3918c547230l81035P91195J62953q62187q76252q67150j382201l68847L099890
3909d230864N578356L559557p39680k120202L4381J443494Q3774j141546j4712
$$ plain form
3969 653688 -967156 -1499365 -963244 -361981 539306 2452166 3888711 2092494 -2638495
3960 -2638495 -6292854 -6385543 -5494955 -7210386 -10309858 -10192576 -5734256 -1491880 -2008358
3951 -2008358 -6171699 -8931706 -7392723 -3350854 -71620 1674275 3532138 6517751
3943 6517751 9591789 11574670 13072585 15075749 16331766 14232768 8748407 3472871
3935 3472871 1596781 2503462 3807569 4969655 6580907 7475972 5785714 2625520 1489169
3926 1489169 3293449 4919985 3840307 1465365 198659 -337653 -1764148 -3547230
3918 -3547230 -3928265 -3137070 -2974117 -3836304 -4712556 -5579706 -6961907 -7330754 -4230864
3909 -4230864 1347492 4907049 4167369 2047167 2081548 3525042 3608816 2467270 2452558
3900B452558J322180O29032m39342K61766J180050R391j674091r63405Q86660
3891C664799K00362k621880l259769m53369J987688J402469r0352k51928o09225
3882c1205k545151l291106K9035M910235O388493L896126J030511l89226j642230
3873H355482k941138k524267n32748K52385j233939k623536k023658n41227M26970
3864c385676J357043K432825K158454J19833j452665r58447J39183K51044M59753
3855A121347J774244K092635o72641m197941m252301p14865K535277L311238K996011
3846C993004K604655R21484k078881l330912o16041L591559M665752J365512k986624
3837H129508m365272j660673L097026O599395O348581K347604k588581m948802
$$ plain form
3900 2452558 3774738 4403770 3964428 4226194 5406244 5415635 3741544 2778139 3664799
3891 3664799 3865161 1243281 -2016488 -2469857 -482169 920300 829948 578020 -31205
3882 -31205 -2576356 -5867462 -5838427 -928192 5460301 9356427 10386938 9997712 8355482
3873 8355482 5414344 2890077 2357329 2609714 1375775 -1247761 -3271419 -3812646 -3385676
3864 -3385676 -2028633 404192 2562646 2682479 1229814 271367 410550 661594 1121347
3855 1121347 2895591 4988226 4315585 117644 -4134657 -4849522 -2314245 996993 3993004
3846 3993004 6597659 7519143 5440262 2109350 1493309 5084868 9750620 11116132 8129508
3837 8129508 3764236 2103563 5200589 11799984 18148565 20496169 17907588 12958786
3829A2958786l688994j019836L84331M20439Q94734K216490K421941J63969k835011
3820A1916849l743301k117711M5326R84785L10916j651300l639886l422954n16170
3811a833446J773184J70681l113506k721021J730099M470282K040820j819191
3803F97902k435830q07392j60291L1205J728031L186091J642405r68941o80764
3794B232416J489168J082573j905149k908181q88382j82616k692623m264841j672975
3785i710610J909277K005605n37671j808176p92678N79117J297794J846753K225713
3776b984876K081539J872973J988734J709478L94164j517408l446829m811335
3768d713560l848477P49654O108388O737362J769156k961392k627060L89561J225039
$$ plain form
3829 12958786 9269792 8249956 8634287 9054726 9949460 12165950 14587891 14751860 11916849
3820 11916849 8173548 6055837 6101163 7085948 7396864 5745564 2105678 -1317276 -1833446
3811 -1833446 -60262 110419 -3003087 -5724108 -3994009 476273 2517093 697902
3803 697902 -1737928 -2545320 -2705611 -2674406 -946375 2239716 3882121 2913180 2232416
3794 2232416 3721584 4804157 2899008 -9173 -897555 -1080171 -3772794 -8037635 -9710610
3785 -9710610 -7801333 -5795728 -6333399 -8141575 -8934253 -8355136 -7057342 -5210589 -2984876
3776 -2984876 -903337 969636 2958370 4667848 5062012 3544604 97775 -4713560
3768 -4713560 -8562037 -7812383 -1703995 5033367 6802523 3841131 1214071 1603632 2828671
3759B828671j07623l97577N45459L44168r73321j397811j330580k716446m356814
3750g561874l044160N63367K183119P72999K16042K553110M285895K169733j227574
3741I10657j367403J445752K909208J128486j324963j642202k84147L99121o92892
3732A481617k493318l152008j806137O13908K113493J502049k78341r82232M38148
3723b562821K326089K004412p80814l118520k642359q74363q13743j913523o83799
3714i059441L221533N333278K846779p30281p45537J577813J595694j096526k473905
3705D69407j080283q1164j429215k635560j305983R10262J415663Q00012J158458
3696a778403K323502K441905J067418n84666j692802k309628k310697j380096
$$ plain form
3759 2828671 2721048 2323471 2868930 3213098 2239777 841966 -488614 -3205060 -7561874
3750 -7561874 -10606034 -10042667 -7859548 -7086549 -6870507 -4317397 -31502 2138231 910657
3741 910657 -456746 989006 3898214 5026700 3701737 2059535 1775388 2174509 1481617
3732 1481617 -1011701 -4163709 -5969846 -5355938 -3242445 -1740396 -2018737 -3000969 -2562821
3723 -2562821 -236732 1767680 986866 -2131654 -4774013 -5648376 -6462119 -8375642 -9059441
3714 -9059441 -5837908 -504630 2342149 1611868 866331 2444144 4039838 2943312 469407
3705 469407 -610876 -692040 -2121255 -4756815 -6062798 -5152536 -3736873 -2936861 -1778403
3696 -1778403 545099 2987004 4054422 3469756 1776954 -532674 -2843371 -4223467
3688d223467Q0146R20320J86659j870429l370946k127876J397283L439234J386046
3679d183030j915063j431333K621295M512500J241304k945234k685947J119827
3671c665681L326634J764067j004999k085379j322728j30003N81999J066889K201092
3662G31891L872334L941459O73282l554756m017145l50801K079832j08583l015730
3653B51783j606517K181327K590332q02377k885356j358704M53104k21475j805029
3644c202912k197943j857786j223224Q11691L639081L924491N38594k689904k097085
3635d354997N87970J252331n12667j690682q17225O36711J287499J388798J384492
3626h37770J120529O78726M47947L35562J4284l17753l26552j47346J59571Q51957
$$ plain form
3688 -4223467 -4143321 -3223001 -3036342 -4906771 -8277717 -10405593 -9008310 -5569076 -4183030
3679 -4183030 -6098093 -7529426 -4908131 -395631 845673 -2099561 -4785508 -3665681
3671 -3665681 -339047 1425020 420021 -1665358 -2988086 -3118089 -2536090 -1469201 731891
3662 731891 4604225 8545684 9218966 5664210 1647065 1296264 3376096 3267513 251783
3653 251783 -1354734 826593 3416925 2614548 -270808 -1629512 -1176408 -1397883 -3202912
3644 -3202912 -5400855 -7258641 -8481865 -7670174 -4031093 -106602 431992 -2257912 -4354997
3635 -4354997 -3767027 -2514696 -3027363 -4718045 -5535270 -4898559 -3611060 -2222262 -837770
3626 -837770 282759 961485 1409432 1744994 1759278 1441525 1114973 967627 1127198 1979155
3616A979155J431484O77248j137791j676286J83044K060803J200329j405575k465901
3607H46510j057920P86996J594862J748813J387589j60238k365479l386162k657866
3598c262895j514576p28974L27808J472271J185160n35142j188891O90732L014414
3589e40093L046167J172703l10118p72034j210662j560793o98488R95157J537277
3580A659116L27794p81042k82350P19196K68747j450093k320741j185333P18656
3571b326050J470876P12947m35209j107923j326094j005586L21358K142755K627000
3562A074074J012125o68349j82699J232166M27942k341545k853997R10168M936480
3553C546365M101636r77942m941883m437559r88256K265189L691955L010536Q06703
$$ plain form
3616 1979155 3410639 4087887 2950096 1273810 1456854 3517657 4717986 3312411 846510
3607 846510 -211410 575586 2170448 3919261 5306850 5146612 2781133 -605029 -3262895
3598 -3262895 -4777471 -5506445 -5178637 -3706366 -2521206 -3056348 -4245239 -3554507 -540093
3589 -540093 2506074 3678777 3368659 2596625 1385963 -174830 -873318 121839 1659116
3580 1659116 1986910 1205868 923518 1642714 1911461 461368 -1859373 -3044706 -2326050
3571 -2326050 -855174 -142227 -577436 -1685359 -3011453 -4017039 -3695681 -1552926 1074074
3562 1074074 2086199 1417850 1235151 2467317 2895259 553714 -2300283 -1390115 3546365
3553 3546365 7648001 6670059 1728176 -2709383 -3697639 -1432450 2259505 5270041 6076744
3544F076744j176690j433416q14677j240285k210358j243650J661966L020905
3536B640539P83531k385865k829533q01474P38525O95178N51292J236302J762922
3527B391417J089311l32519j123238k60806J924575L491092K514438k95325j880912
3518G518033p57959R28521P12306o42328j042509q05916j571989k639831j843949
3509a45621K75538P45074j045214k275153j342681k28964o81923j151395K09753
3500e640586J969557J544285p07898k136670j568776j32493J001117J619618J657779
3491b394067J205981J001522J406747J431113L15997n81800O28395L272148M506644
3482A0792680K794409o22442l577311m685298l444438n69957J694977J491137
$$ plain form
3544 6076744 4900054 3466638 2651961 1411676 -798682 -2042332 -380366 2640539
3536 2640539 3424070 1038205 -1791328 -2592802 -1854277 -1159099 -607807 628495 2391417
3527 2391417 3480728 3148209 2024971 1764165 3688740 7179832 9694270 9398945 7518033
3518 7518033 6760074 7688595 8400901 7758573 6716064 5910148 4338159 1698328 -145621
3509 -145621 129917 874991 -170223 -2445376 -3788057 -4017021 -4698944 -5850339 -5640586
3500 -5640586 -3671029 -2126744 -2834642 -4971312 -6540088 -6672581 -5671464 -4051846 -2394067
3491 -2394067 -1188086 -186564 1220183 2651296 2967293 2385493 3013888 6286036 10792680
3482 10792680 13587089 12964647 9387336 4702038 1257600 687643 2382620 3873757
3474C873757k17341r16109k91542m35617j940994k520134p49137J365698J472791
3465c58628M23559M21158J268835J112162j33546q15068m29530J23210P98293
3456B410445K203214L280405K157389l74376j327410k26594m1179j982166k855750
3447C243978j47534L298516L152714j7212k100930j725828j002187p88588J98580
3438D111509J386746J84047k956763l772557n92530K524824J812882p31032j372993
3429E94133q56006k119690m110301l047378R34114L442131K481654R51742J452917
3420b76684K685857K735441K373660K741433K510291P4087l165455m221826k353102
3411C103702L27634J392431O8642k416409l508550j506904K026816L449537J600936
$$ plain form
3474 3873757 3656416 2740307 2448765 2013148 72154 -2447980 -3197117 -1831419 -358628
3465 -358628 64931 486089 1754924 2867086 2733540 1918472 1488942 1612152 2410445
3456 2410445 4613659 7894064 10051453 9677077 8349667 8123073 8081894 6099728 3243978
3447 3243978 3096444 6394960 9547674 9530462 7429532 5703704 4701517 3912929 4111509
3438 4111509 5498255 5682302 2725539 -1047018 -1639548 885276 2698158 1967126 594133
3429 594133 -261873 -2381563 -6491864 -9539242 -8605128 -5162997 -2681343 -1729601 -276684
3420 -276684 2409173 5144614 7518274 10259707 12769998 12844085 9678630 5456804 3103702
3411 3103702 3431336 4823767 4892409 2476000 -1032550 -2539454 -512638 2936899 4537835
3402D537835n43296j24117J601134J541730m83658j821690j043503N09620J070183
3393E244238L00232j243330k808883l489309k897278j801571j029539j63146J391564
3384f497022K656795K137041K77345r78594r31008m79798J99827J977903M216629
3375B579118M365682J551603j368013j314830O88260R51035j616463m029285l470727
3366a663620r35037O94014P40891Q60983J589034J296672n89801j697287j30863
3357A64986J832249N43738l007971l619311P11656N245395M695818K81261k575657
3348D272164j838286m34243q48639j952051j895254r83503k56438M42472J380885
3339b112893J673472P34138k54691J25793J375116J832496J018484j3163l40910
$$ plain form
3402 4537835 3994539 3870422 5471556 7013286 6529628 4707938 3664435 4174055 5244238
3393 5244238 5544470 4301140 1492257 -1997052 -4894330 -6695901 -7725440 -7888586 -6497022
3384 -6497022 -3840227 -1703186 -1425841 -2404435 -3335443 -3815241 -3615414 -1637511 2579118
3375 2579118 6944800 8496403 7128390 5813560 6501820 7452855 5836392 1807107 -1663620
3366 -1663620 -2598657 -1904643 -1163752 -302769 1286265 2582937 1993136 295849 164986
3357 164986 1997235 2540973 -466998 -4086309 -3374653 1870742 6566560 6847821 4272164
3348 4272164 2433878 1999635 1150996 -801055 -2696309 -3679812 -3936250 -3493778 -2112893
3339 -2112893 -439421 294717 40026 165819 1540935 3373431 4391915 4378752 4037842
3330D037842j60388k06543q91826j929061k390738j417527P11470K514858K736349
3321C004436J585171K09581p39813j537057k517464l307861l168728j984487o14108
3312i070330K629m8418J08904Q26602J514307J680349J554396J319394P15991
3303a396176J9005K57572J455273J805375P0869k111479k131289o1414J526044
3294e66220J193989R2764l59189k41572J8470P91364K167907K825749J089010
3285G012272l031741p114079p734044l495933K708153N782977M121673J688625
3277f2097K352381L997493J876363l273326n345996j775932K596909K771682L32226
3268C469703m16548M92128p3901k116024k270197N68628L393322L446200J474265
$$ plain form
3330 4037842 3877454 3670911 2779085 850024 -1540714 -2958241 -2246771 268087 3004436
3321 3004436 4589607 4799188 4059375 2522318 4854 -3303007 -6471735 -8456222 -9070330
3312 -9070330 -9067701 -9116119 -9007215 -8180613 -6666306 -4985957 -3431561 -2112167 -1396176
3303 -1396176 -1377171 -1119599 335674 2141049 2211918 100439 -2030850 -2092264 -566220
3294 -566220 627769 720533 361344 119772 138242 929606 3097513 5923262 7012272
3285 7012272 3980531 -3133548 -10867592 -14363525 -11655372 -5872395 -1750722 -62097
3277 -62097 2290284 6287777 8164140 4890814 -455182 -2231114 365795 3137477 3469703
3268 3469703 3053155 3545283 3471382 1355358 -914839 -346211 3047111 6493311 7967576
3259G967576j83995n68147l31685n02301j531199k622525k166587J15323K082890
3250B259350J693681q4184p13260J48424N74294j31293m03473N49210R97745p52679
3240D137815l597728m811353l226307k42183J896753K142342J201804M91937O06596
3231a400324R70221R81735P65684L88394o70723k345473l208274k157022k10654
3222f886436P46497M70010J95232M88759Q18120R23328J076711J231149J317554
3213C80924J904107K967431K715219j94366l682073m081092j101034J629153J571909
3204B110178K84524L15249J398771J407785m00480k632414l414433j943758P62725
3195b111853K360322J653124N60821J697435L964380L394202p56310m016117k847401
$$ plain form
3259 7967576 7783581 7215434 6883749 6381448 4850249 2227724 61137 176460 2259350
3250 2259350 3953031 3868847 3155587 3304011 3878305 3747012 3343539 3892749 4890494 4137815
3240 4137815 540087 -4271266 -7497573 -7739756 -5843003 -3700661 -2498857 -2006920 -1400324
3231 -1400324 -430103 551632 1317316 1705710 1034987 -1310486 -4518760 -6675782 -6886436
3222 -6886436 -6139939 -5669929 -5474697 -4985938 -4167818 -3244490 -2167779 -936630 380924
3213 380924 2285031 5252462 7967681 7773315 4091242 10150 -1090884 538269 2110178
3204 2110178 2394702 2709951 4108722 5516507 5116027 2483613 -930820 -2874578 -2111853
3195 -2111853 248469 1901593 2462414 4159849 8124229 11518431 10762121 6746004 3898603
3186C898603J43379J66968k697293m039587j724102J641412K897095J999630R13104
3177C199209J071362K515704L840224K805860j198363n226079n369713j679479
3169d1275J563430J178210j254689k067725j51754K379240L042991J334145j112158
3160D870415k038657r21658R8411j093327l025689k030075K078349M492134J665265
3151D095168l282783m543387j529437R96105L82347n01011J406644M279579M284560
3142E587785J211807j739963k610552k312837k095981j930127j563291j169807
3134f622966o66769M0144J82186p82952j446707n2457K169486K037410n70664
3125e713289j823233M19894L103152K564519j3909r82678j1684M00997k8145P72631
$$ plain form
3186 3898603 4041982 4208950 1511657 -2527930 -4252032 -2610620 286475 2286105 3199209
3177 3199209 4270571 6786275 10626499 13432359 12233996 7007917 1638204 -41275
3169 -41275 1522155 2700365 1445676 -622049 -773803 1605437 4648428 5982573 4870415
3160 4870415 2831758 1910100 2008511 915184 -2110505 -4140580 -2062231 2429903 4095168
3151 4095168 812385 -3731002 -5260439 -4264334 -3881987 -4382998 -2976354 1303225 5587785
3142 5587785 6799592 5059629 2449077 136240 -1959741 -3889868 -5453159 -6622966
3134 -6622966 -7289735 -7249591 -7067405 -7850357 -9297064 -9349521 -7180035 -5142625 -5713289
3125 -5713289 -7536522 -7116628 -4013476 -1448957 -1462866 -2445544 -2457228 -2056231 -2084376 -1311745
3115a311745K484962K038225j038668l075511j846571L2214l27632j488127p67857
3106e300710Q15083M60137j300395j426555L79334J113637n95902k364064j754871
3097i974306N18036K203106K305931J219760l25437j465688j546972r11713l54754
3088h332037K74457J522064K483758J561731n72660j080711J019761L118631K679916
3079B674910O38397o13182q30047j305148j983148j684256n60586N1198J8226
3070c593636M68691J431432J532572M16143m72402j78432L87288K45893O8643
3061C06192R42917K385387K765604J315374j048617k681031k635452j463106o83001
3052g95733r94634j226054M5617K078109K632032J199968k11299k23281j27413
$$ plain form
3115 -1311745 1173217 3211442 2172774 -902737 -2749308 -2717094 -3044726 -4532853 -5300710
3106 -5300710 -4485627 -4025490 -5325885 -6752440 -6373106 -5259469 -5855371 -8219435 -9974306
3097 -9974306 -9456270 -7253164 -4947233 -3727473 -4052910 -5518598 -7065570 -7977283 -8332037
3088 -8332037 -8057580 -6535516 -4051758 -2490027 -3062687 -4143398 -3123637 -5006 2674910
3079 2674910 3313307 2700125 1870078 564930 -1418218 -3102474 -3663060 -3611862 -3593636
3070 -3593636 -3124945 -1693513 -160941 255202 -217200 -395632 -8344 237549 306192
3061 306192 1249109 3634496 6400100 7715474 6666857 3985826 1350374 -112732 -795733
3052 -795733 -1790367 -3016421 -2970804 -892695 1739337 2939305 2728006 2504725 2377312
3043B377312j393121k760358j867276J122266L677642M359706M041968L587949
3035A3146088K382875m1175k483083l339842k606719j636202j225339o84234J019302
3026D531671L352724L922885R91002l544454n183364k113108J828506J558613
3018E344475k650911n623042m252149r74540O63212Q15133J534965K510117J700398
3009i32342o69872j770069j15020K332559K786070R93799q17068o38570J238633
3000B408120K635486J889931j71220j205713m54066J95555j035705l125495l610861
2991b473968j851699N66141K174790K735751K258118P30070q66738r09194P46387
2982C109658K152166J627006q2546r28290m14188k67702j942014m119569l707776
$$ plain form
3043 2377312 984191 -1776167 -3643443 -2521177 1156465 5516171 9558139 13146088
3035 13146088 15528963 15487788 13004705 9664863 7058144 5421942 4196603 3512369 4531671
3026 4531671 7884395 11807280 12798282 9253828 4070464 1957356 3785862 5344475
3018 5344475 2693564 -2929478 -7181627 -8156167 -7492955 -6677822 -5142857 -2632740 -932342
3009 -932342 -1602214 -3372283 -3487303 -1154744 1631326 2625125 1808057 1169487 2408120
3000 2408120 5043606 6933537 6762317 5556604 5102538 5298093 4262388 1136893 -2473968
2991 -2473968 -4325667 -3759526 -1584736 1151015 3409133 4139203 3272465 2363271 3109658
2982 3109658 5261824 6888830 6806284 5877994 5463806 5196104 3254090 -865479 -4573255
2973d573255L49606N149991O734796M363885N69627k461468m400132m810695k781819
2964a859464K79409N90971k865623n647251l333213K198479N416533M602839K751561
2955B134241J849714P16038j151512j910638r12121k94439j276928j850377j19481
2946b815503K474418L225136J611128q82933k708460k809076j002589J155248
2938a752631J669221Q92778P91413J075980o70781m030227m842215j410069K175181
2929f101350J928879k36095l07956J270975J345958J08186L53826J815800J395454
2920A573677r54583j454907J376522L989497K913215n82272k849381k543353j047076
2911D21339K02431J029291J761671K247458J750270J5270j528502q64526J572748
$$ plain form
2973 -4573255 -4223649 926342 7661138 12025023 12594650 10133182 5733050 922355 -1859464
2964 -1859464 -1580055 -989084 -3854707 -9501958 -12835171 -10636692 -5220159 -617320 2134241
2955 2134241 3983955 4699993 3548481 1637843 725722 431283 -845645 -2696022 -2815503
2946 -2815503 -341085 2884051 4495179 3612246 903786 -1905290 -2907879 -1752631
2938 -1752631 -83410 809368 1600781 2676761 2005980 -2024247 -6866462 -8276531 -6101350
2929 -6101350 -4172471 -4408566 -4716522 -3445547 -2099589 -1991403 -1637577 178223 1573677
2920 1573677 619094 -835813 540709 4530206 7443421 6861149 4011768 1468415 421339
2911 421339 623770 1653061 3414732 5662190 7412460 7427730 5899228 5034702 6607450
2902F607450K684883R68226j039692p48401K60469q27459k825275k370695J88473
2893B897979J362877N82541P56157K348895K039943j206939l579900k331701p3949
2884B795903k79766k078537k751600k408474k657772k879679j375251J220276
2876a0414900K800795L048413L231505L689975L762716L259629K117117j48135
2868A1347115k821274l472117j194683J330536J397224J54890J91535R67082O0112
2859G960420k159563k809740j159295L68643J8888j403377k664084l359911k811356
2850h019375m73268K072776K174871j59674j955057j298601O69249K371768L749051
2841h68260M537524L251811k99846l414133l396733r11773J178842J406824P06369
$$ plain form
2902 6607450 9292333 10260559 9220867 8472466 8732935 7905476 5080201 2709506 2897979
2893 2897979 4260856 4843397 5599554 7948449 9988392 8781453 5201553 2869852 2795903
2884 2795903 2516137 437600 -2314000 -4722474 -7380246 -10259925 -11635176 -10414900
2876 -10414900 -7614105 -4565692 -1334187 2355788 6118504 9378133 11495250 11347115
2868 11347115 8525841 5053724 3859041 5189577 6586801 6741691 6933226 7900308 7960420
2859 7960420 5800857 2991117 1831822 2200465 2219353 815976 -1848108 -5208019 -8019375
2850 -8019375 -8492643 -6419867 -4244996 -4404670 -6359727 -7658328 -6989079 -4617311 -868260
2841 -868260 3669264 6921075 6621229 3207096 -189637 -1101410 77432 1484256 2190625
2832B190625N36270J299699K314570K491838J275906o47259j900058j765177n24760
2823E271654J189465K395120J642211j368165m181907l713167l19628K413375
2815C328958K536876J860711K077730J631904j186253m276867m108096j051977
2807H12986Q38077o88276l529781m546739l088962m94749J995703L782567M598479
2798c20695M501053L496493J155714k246456m447579l063032P46623K567079o2419
2789B326781m407270o006240l929816p66366J378382K484788K816506K189000
2781c914235J417673K170094M370494N516821L793976N04949j858717k755513
2773I245542l278807l632782k823026p03676J346898K162150K044672J871956
$$ plain form
2832 2190625 2726895 4026594 6341164 8833002 10108908 9461649 7561591 5796414 5271654
2823 5271654 6461119 8856239 10498450 9130285 4948378 1235211 915583 3328958
2815 3328958 5865834 7726545 9804275 11436179 10249926 5973059 1864963 812986
2807 812986 1651063 962787 -2566994 -7113733 -10202695 -10697444 -8701741 -4919174 -320695
2798 -320695 4180358 7676851 8832565 6586109 2138530 -924502 -177879 2389200 2326781
2789 2326781 -2080489 -8086729 -12016545 -12782911 -11404529 -8919741 -6103235 -3914235
2781 -3914235 -2496562 -326468 4044026 9560847 13354823 13859772 12001055 9245542
2773 9245542 5966735 2333953 -489073 -1192749 154149 2316299 4360971 6232927
2765F232927J791882J257693q7237j751641k437329j157446J144984J819995m75911
2756F337917l521402l904601j489892M38970j29505j239982j43720K647321M281081
2747C276187L428613J310838n76382j875561k535889k228555j056926J65828O99436
2738F07589L24635q57460k201806k292997j86595K900233M314773K933349N05647
2729F047368n61395M8727Q29184Q24362N96212Q74496J356910J412623J235424
2720A2663911J348632J280345L4618j809546k008198R9496J589646n60965m577095
2711H060844n445203j938780J173591p8134k807377j470132L629329O410835L590455
2702A1125428j084679k609138j097967R4342j38706l90375m58010j661221l501363
$$ plain form
2765 6232927 8024809 9282502 9195265 7443624 5006295 3848849 4993833 6813828 6337917
2756 6337917 2816515 -1088086 -2577978 -2139008 -2268513 -3508495 -3652215 -1004894 3276187
2747 3276187 6704800 8015638 7439256 5563695 3027806 799251 -257675 -91847 607589
2738 607589 932224 74764 -2127042 -4420039 -4606634 -1706401 2608372 5541721 6047368
2729 6047368 5485973 5534700 6363884 7188246 7784458 8658954 10015864 11428487 12663911
2720 12663911 14012543 15292888 15327506 13517960 11509762 11609258 13198904 12637939 8060844
2711 8060844 2615641 676861 1850452 1772318 -1035059 -2505191 1124138 7534973 11125428
2702 11125428 10040749 7431611 6333644 6427986 6289280 5898905 5440895 3779674 278311
2693B78311l245360R6310L674191M116375J451284j619015l125036k969997j625580
2684b968517L15478J449749M30527j823034k354351K59677L621185M169422J561289
2675D661425j089680j278534Q1119M45078r12601k249710j769983J94354J667489
2666b51043J409736L51485K07229R09165O02542j302969k618151j473619L57187
2657a808438k09597k450706k313905J346781M408494L249774j1270q62505J120906
2648B469534K523824J667797L52713J57877L19378n8286m19285l68241o26091
2639F019220j307880j185640J38233R65984k59354k638033l915849l034021p00382
2630e917722J737727L224397L543671L467556L614887L088839O32139k602783
$$ plain form
2693 278311 -2967049 -2870739 803452 4919827 6371111 4752096 1627060 -1342937 -2968517
2684 -2968517 -2653039 -1203290 -772763 -2595797 -4950148 -4690471 -1069286 3100136 4661425
2675 4661425 3571745 2293211 2374330 2819408 1906807 -342903 -2112886 -1918532 -251043
2666 -251043 1158693 1510178 1717407 2626572 3229114 1926145 -692006 -2165625 -1808438
2657 -1808438 -2018035 -4468741 -6782646 -5435865 -1027371 2222403 2211133 1348628 2469534
2648 2469534 4993358 6661155 7013868 7171745 7491123 7432837 7013552 6645311 6019220
2639 6019220 4711340 3525700 3663933 4629917 4370563 1732530 -2183319 -5217340 -5917722
2630 -5917722 -4179995 -955598 2588073 6055629 9670516 12759355 13391494 10788711
2622A0788711l435445r39322J498178K65392l524764n346032l034750R02390K939903
2613A14261K537468J609440J406455J385824P82380q8803n62844p81697j219058
2604E183426j430414m89674J131466J488051j37711j634789o32078K068715L406225
2595H953217K131873M4918j037946j545481k522447l396662k790237p43267J149905
2586B43873J639995J098064Q46414J447193J759721J45654l093944n349840m668439
2577e931309k159607r8373J305851L121318M497354L244515k03197k433349j647582
2568c04379J9941M4243j050464j319936l24640J171086K473781K475593N0864
2559C236089l436855m383219j684444J209300J337259O65189K306026M794132
$$ plain form
2622 10788711 7353266 6413944 7912122 8177514 4652750 -693282 -3728032 -2825642 114261
2613 114261 2651729 4261169 5667624 7053448 7835828 7747025 7184181 6402484 5183426
2604 5183426 3753012 3263338 4394804 5882855 5745144 4110355 3478277 5546992 8953217
2595 8953217 11085090 11130008 10092062 8546581 6024134 2627472 -162765 -906032 243873
2586 243873 1883868 2981932 3828346 5275539 7035260 7180914 4086970 -1262870 -5931309
2577 -5931309 -8090916 -8189289 -6883438 -3762120 735234 3979749 3776552 1343203 -304379
2568 -304379 -284438 -240195 -1290659 -2610595 -2935235 -1764149 709632 3185225 3236089
2559 3236089 -200766 -4583985 -6268429 -5059129 -3721870 -3056681 -750655 4043477
2551D043477M335818J192513q62277q50911j523447l640445m157092j644359P08587
2542b398136j08375k423808k847160j161162N75512J857598L604911N272677N007385
2533G379442K532147l27992k104156k975775l477912l392097k310572l49196J937790
2524c088321L660248L669176J473364j665201l334155k229183M31499K073114
2516I90541J251273j178552l209210l631666k680294j102032P42086K624104L851185
2507b342565L544715J566132j024207k490335j707303N78770K044811J260380
2499A430398k62006J55420K353269L010908L08507l058079l412251j132195L28951
2490b77078m11931j328007p21383M97713R76352R69188J050434O73887n60936
$$ plain form
2551 4043477 8379295 9571808 8709531 7858620 6335173 2694728 -1462364 -3106723 -2398136
2542 -2398136 -2506511 -4930319 -7777479 -8938641 -8363129 -6505531 -2900620 2372057 7379442
2533 7379442 9911589 9583597 7479441 4503666 1025754 -2366343 -4676915 -5026111 -3088321
2524 -3088321 571927 4241103 5714467 4049266 715111 -1514072 -1082573 990541
2516 990541 2241814 1063262 -2145948 -5777614 -8457908 -9559940 -8817854 -6193750 -2342565
2507 -2342565 1202150 2768282 1744075 -746260 -2453563 -1874793 170018 1430398
2499 1430398 1168392 1323812 3677081 6687989 6996496 3938417 526166 -606029 -277078
2490 -277078 -689009 -2017016 -2738399 -2240686 -1264334 -295146 755288 1429175 868239
2481H68239j578338j226495j37820R9101q86213j894823j633740J32661K485877
2472c771551L841788L031448N46135j606136j833109n83702K94184l52995j804948
2463b238886k336690j163625O13885J297748P00812K02273N48276P81963P7121
2454a517123o42277k15606O59395M88400n70000j041352m01333P03894J906382
2445f29620K842746K090301j100443m216312l498235Q95664M387441L623467L02978
2436D697987j770620j273294M33264J778845J987765R35575n17477j009867m91641
2427D770537m57411j578481k471266j780812j74139P41173L38595r44090k225144
2418c781038k360995r66852L85514j67517j629722j112174J477780K781856J277163
$$ plain form
2481 868239 -710099 -1936594 -2074414 -1975313 -2861526 -4756349 -6390089 -6257428 -3771551
2472 -3771551 70237 3101685 3647820 2041684 208575 -375127 -80943 -433938 -2238886
2463 -2238886 -4575576 -5739201 -5125316 -3827568 -3126756 -2924483 -2376207 -1594244 -1517123
2454 -1517123 -2159400 -2375006 -1715611 -1227211 -1797211 -2838563 -3239896 -2536002 -629620
2445 -629620 2213126 4303427 3202984 -1013328 -4511563 -3615899 771542 4395009 4697987
2436 4697987 2927367 1654073 2087337 3866182 5853947 6789522 6272045 5262178 4770537
2427 4770537 4313126 2734645 263379 -1517433 -1691572 -950399 -611804 -1555894 -3781038
2418 -3781038 -6142033 -7108885 -6723371 -6890888 -8520610 -9632784 -8155004 -5373148 -4095985
2409d095985j95681O29089J348935j032970m661561n337458k678018J47424J625425
2400a4250800K881938M132888M116703L076545K734401K988905J897621o33455
2392F944746k270316j965839j337178j638122k116043k089475j929924j271101
2384g673252Q57243L208640K748011p06867l302842k411078j42034O23833P90199
2375f008147K514539M469806L576677L76487j327034j95460R64374N6573j167813
2366C260002n68907O03106K3063j448819j080247P28857K74518l632714o725358
2357h566499m493407J562282N778285N472349L026299R93257j121539l881828
2349a230801n185076l186199K76588K031453J806986J388288J071982K04290O0815
$$ plain form
2409 -4095985 -4291666 -3662577 -2313642 -3346612 -8008173 -13345631 -16023649 -15876225 -14250800
2400 -14250800 -11368862 -7235974 -3119271 -42726 2691675 5680580 7578201 6944746
2392 6944746 4674430 2708591 1371413 -266709 -2382752 -4472227 -6402151 -7673252
2384 -7673252 -6816009 -3607369 -859358 -1566225 -4869067 -7280145 -7422179 -6798346 -6008147
2375 -6008147 -3493608 976198 4552875 4929362 3602328 3406868 4371242 4427815 3260002
2366 3260002 2691095 3294201 3317264 1868445 788198 1517055 1791573 -1841141 -8566499
2357 -8566499 -13059906 -11497624 -5719339 -246990 2779309 3772566 2651027 -1230801
2349 -1230801 -6415877 -9602076 -9325488 -7294035 -5487049 -4098761 -3026779 -2822489 -2761674
2340b761674K277612M766990L446897j268438l855456j210155K930658L499434
2332G825868Q33518j197090j325491j401324k037270j571392N74997K593249K988272
2323G283337K280812J342314M5253j558624k424628j950516r35306j31982Q75675
2314D826335K165724K166694k62067l163630l246559n22636J172424o30109l454832
2305i48656l414239o60335J360957J181371O21616Q31773N43408n86585k56247
2296a326937K620842M992761L437622r41315m167707m469766k905705l86440K556618
2287e90027L971097K191476p55622r92954J577606K806421K01808l783310n426972
2278h00477l951036r03776K118129L801894L367174J777573R16205P85748l75682
$$ plain form
2340 -2761674 -484062 4282928 7729825 6461387 2605931 1395776 4326434 7825868
2332 7825868 8659386 7462296 6136805 4735481 2698211 1126819 1701816 4295065 7283337
2323 7283337 9564149 10906463 10951716 9393092 6968464 5017948 4082642 3950660 4826335
2314 4826335 6992059 9158753 8896686 5733056 2486497 1963861 3136285 2506176 -948656
2305 -948656 -4362895 -5023230 -3662273 -2480902 -1859286 -1027513 -484105 -1070690 -1326937
2296 -1326937 1293905 6286666 9724288 8782973 4615266 145500 -2760205 -3146645 -590027
2287 -590027 3381070 5572546 4816924 3823970 5401576 8207997 8409805 4626495 -800477
2278 -800477 -4751513 -5655289 -3537160 264734 3631908 5409481 6325686 7111434 6735752
2269F735752k536116l041477n79916K427731K919351P27536k224419m292862m490047
2260d354467k479070N61613K750861L870461M937594N244227K834988j416515
2252A1949692l732635k698292j030928o42192J238J556959J389653j411483l008039
2243B373973q81446J074138j534546n915529n955507j453556K334638K936529
2235g021306K629641K842365K266201P34296l8050j7321p22526j400993J31579
2226e96114K663728K384974r04697l060064j892833L43148J635750K637939L230013
$$ plain form
2269 6735752 4199636 1158159 578243 3005974 5925325 6652861 4428442 135580 -4354467
2260 -4354467 -6833537 -6271924 -3521063 349398 5286992 10531219 13366207 11949692
2252 11949692 8217057 5518765 4487837 3845645 3846883 5403842 6793495 5382012 2373973
2243 2373973 1492527 2566665 1032119 -4883410 -10838917 -12292473 -9957835 -7021306
2235 -7021306 -4391665 -1549300 716901 1451197 1413147 1395826 673300 -727693 -596114
2226 -596114 2067614 4452588 3547891 487827 -1405006 -1061858 573892 3211831 6441844
$$ [...]
##END NTUPLES=NMR SPECTRUM
##END=
