##TITLE=31Pdec_DE-128rm2
 , 24 sc
 17.2.2026
##JCAMPDX= 6.0         $$ Bruker NMR JCAMP-DX V2.0
##DATA TYPE= NMR SPECTRUM
##DATA CLASS= NTUPLES
##ORIGIN= UXNMR, Bruker Analytische Messtechnik GmbH
##OWNER= root
$$ XWIN-NMR		Version 3.5
$$ Tue Feb 17 14:51:28 2026 Russian Standard Time (UT+4h)  she@DPX200
##.OBSERVE FREQUENCY= 81.013821
##.OBSERVE NUCLEUS= ^31P
##.ACQUISITION MODE= SIMULTANEOUS
##.ACQUISITION SCHEME= undefined
##.AVERAGES= 24
##.DIGITISER RES= 17
##SPECTROMETER/DATA SYSTEM= spect
##.PULSE SEQUENCE= zgpg30
##.SOLVENT NAME= DMSO
##.SHIFT REFERENCE= (INTERNAL, DMSO, 0, 198.062)
##AUDIT TRAIL= $$ (NUMBER, WHEN, WHO, WHERE, WHAT)
$$ ##TITLE= Audit trail, XWIN-NMR		Version 3.5
$$ ##JCAMPDX= 5.01
$$ ##ORIGIN= Bruker BioSpin GmbH
$$ ##OWNER= she
$$ F:/spectra/data/she/nmr/P31/2/pdata/1/auditp.txt
$$ ##AUDIT TRAIL=  $$ (NUMBER, WHEN, WHO, WHERE, WHAT)
(   1,<2026-02-17 14:50:16.98 +0400>,<she>,<DPX200>,
      <created by zg, POWCHK disabled, PULCHK disabled
       configuration hash MD5:
       00 E9 B6 7A A2 85 ED C7 34 08 36 98 17 FE 4E 26
       data hash MD5: 32K
       14 ED 48 3C E0 E9 1A 20 C8 7C B3 08 89 ED F2 38>)
(   2,<2026-02-17 14:50:20.32 +0400>,<she>,<DPX200>,
      <Start of raw data processing
       efp BC_mod = 2 LB = 1.5 FT_mod = 6 PKNL = 1 PHC0 = 1449.248 PHC1 = -19.29932 SI = 64K 
       data hash MD5: 64K
       EA 8E CD 6B 7D 4E 66 48 F3 19 AA B7 4D E7 40 AB>)
(   3,<2026-02-17 14:50:38.17 +0400>,<she>,<DPX200>,
      <pk PHC0 = -4.903294 PHC1 = 0 
       data hash MD5: 64K
       F4 27 DE 0D BB FD E5 F0 CB AB A7 8F 03 08 C5 9F>)
$$ ##END=
$$ 
$$ hash MD5
$$ 9B 25 A2 1F 09 EF 36 EB 7A 37 24 7C DD 8D 11 FF
##$RELAX= 
##$RELAX= 
##$RELAX= 
##$RELAX= 
##$RELAX= 
##$RELAX= 
##$RELAX= 
##$RELAX= 
$$ Bruker specific parameters
$$ --------------------------
##$DU= <F:/spectra>
##$EXPNO= 2
##$NAME= <P31>
##$PROCNO= 1
##$TYPE= <nmr>
##$USER= <she>
##$AMP= (0..31)
100 100 100 100 100 100 100 100 100 100 100 100 100 100 100 100 100 100 
100 100 100 100 100 100 100 100 100 100 100 100 100 100 
##$AQSEQ= 0
##$AQ_mod= 1
##$AUNM= <au_zg>
##$AUTOPOS= <>
##$BF1= 81.014009
##$BF2= 200.13
##$BF3= 200.13
##$BF4= 200.13
##$BF5= 200.13
##$BF6= 200.13
##$BF7= 200.13
##$BF8= 200.13
##$BYTORDA= 1
##$CFDGTYP= 0
##$CFRGTYP= 5
##$CHEMSTR= <none>
##$CNST= (0..31)
1 1 145 1 1 1 1 1 1 1 1 1 1 1 1 1 1 1 1 1 1 1 1 1 1 1 1 1 1 1 1 1 
##$CPDPRG= <waltz16>
##$CPDPRG1= <>
##$CPDPRG2= <waltz16>
##$CPDPRG3= <>
##$CPDPRG4= <mlev>
##$CPDPRG5= <mlev>
##$CPDPRG6= <mlev>
##$CPDPRG7= <mlev>
##$CPDPRG8= <mlev>
##$CPDPRGB= <>
##$CPDPRGT= <>
##$D= (0..31)
0 1 0 0 0 0 0 0 0 0.06 0 0.03 2e-05 3e-06 0 0 0.0002 0 0 0 0 0 0 0 0 0 
0 0 0 0 0 0 
##$DATE= 1771325416
##$DBL= (0..7)
120 120 120 11 120 120 24 19 
##$DBP= (0..7)
150 150 150 150 150 150 150 150 
##$DBP07= 0
##$DBPNAM0= <>
##$DBPNAM1= <>
##$DBPNAM2= <>
##$DBPNAM3= <>
##$DBPNAM4= <>
##$DBPNAM5= <>
##$DBPNAM6= <>
##$DBPNAM7= <>
##$DBPOAL= (0..7)
0.5 0.5 0.5 0.5 0.5 0.5 0.5 0.5 
##$DBPOFFS= (0..7)
$$ [...]
##$SUBNAM3= <"">
##$SUBNAM4= <"">
##$SUBNAM5= <"">
##$SUBNAM6= <"">
##$SUBNAM7= <"">
##$SUBNAM8= <"">
##$SUBNAM9= <"">
##$SW= 400.765351723535
##$SWIBOX= (0..15)
0 1 3 0 0 0 0 0 0 0 0 0 0 0 0 0 
##$SW_h= 32467.5324675325
##$TD= 32768
##$TD0= 1
##$TE= 0
##$TE2= 300
##$TE3= 300
##$TEG= 300
##$TL= (0..7)
0 120 53 12 22 120 120 120 
##$TP= (0..7)
150 150 150 150 150 150 150 150 
##$TP07= 0
##$TPNAME0= <>
##$TPNAME1= <>
##$TPNAME2= <>
##$TPNAME3= <>
##$TPNAME4= <>
##$TPNAME5= <>
##$TPNAME6= <>
##$TPNAME7= <>
##$TPOAL= (0..7)
0.5 0.5 0.5 0.5 0.5 0.5 0.5 0.5 
##$TPOFFS= (0..7)
0 0 0 0 0 0 0 0 
##$TUNHIN= 0
##$TUNHOUT= 0
##$TUNXOUT= 0
##$USERA1= <user>
##$USERA2= <user>
##$USERA3= <user>
##$USERA4= <user>
##$USERA5= <user>
##$V9= 5
##$VALIST= <valist>
##$VCLIST= <CCCCCCCCCCCCCCC>
##$VD= 0
##$VDLIST= <DDDDDDDDDDDDDDD>
##$VPLIST= <PPPPPPPPPPPPPPP>
##$VTLIST= <TTTTTTTTTTTTTTT>
##$WBST= 1024
##$WBSW= 4
##$XGAIN= (0..3)
0 0 0 0 
##$XL= 0
##$YL= 0
##$YMAX_a= 78755
##$YMIN_a= -89028
##$ZGOPTNS= <>
##$ZL1= 120
##$ZL2= 120
##$ZL3= 120
##$ZL4= 120
##$ABSF1= 0
##$ABSF2= 0
##$ABSG= 0
##$ABSL= 0
##$ALPHA= 0
##$AQORDER= 0
##$ASSFAC= 0
##$ASSFACI= 0
##$ASSFACX= 0
##$ASSWID= 0
##$AUNMP= <proc_1d>
##$AZFE= 0.1
##$AZFW= 0.5
##$BCFW= 0
##$BC_mod= 2
##$BYTORDP= 0
##$COROFFS= 0
##$CY= -3
##$DATMOD= 1
##$DC= 0
##$DFILT= <>
##$DTYPP= 0
##$F1P= 0
##$F2P= 0
##$FCOR= 1
##$FTSIZE= 65536
##$FT_mod= 6
##$GAMMA= 0
##$GB= 0
##$INTBC= 1
##$INTSCL= 9.790993e-09
##$ISEN= 30
##$LB= 1.5
##$LEV0= 0
##$LPBIN= 0
##$MAXI= 10000
##$MC2= 0
##$MEAN= 0
##$ME_mod= 0
##$MI= 50
##$NCOEF= 0
##$NC_proc= -4
##$NLEV= 6
##$NOISF1= 182.463
##$NOISF2= 159.3651
##$NSP= 0
##$NTH_PI= 0
##$NZP= 0
##$OFFSET= 198.0616
##$PC= 4
##$PHC0= 1444.345
##$PHC1= -19.29932
##$PH_mod= 1
##$PKNL= yes
##$PPARMOD= 0
##$PSCAL= 0
##$PSIGN= 0
##$REVERSE= no
##$SF= 81.0140089999434
##$SI= 65536
##$SIGF1= 159.3651
##$SIGF2= -187.1042
##$SINO= 113.3802
##$SIOLD= 16384
##$SREGLST= <1H.CDCl3>
##$SSB= 0
##$STSI= 65536
##$STSR= 0
##$SW_p= 32467.5324675325
##$SYMM= 0
##$S_DEV= 0
##$TDeff= 32768
##$TDoff= 0
##$TI= <>
##$TILT= no
##$TM1= 0
##$TM2= 0
##$TOPLEV= 0
##$USERP1= <user>
##$USERP2= <user>
##$USERP3= <user>
##$USERP4= <user>
##$USERP5= <user>
##$WDW= 1
##$XDIM= 65536
##$YMAX_p= 338536723
##$YMIN_p= -4965983
$$ End of Bruker specific parameters
$$ ---------------------------------
##NTUPLES= NMR SPECTRUM
##VAR_NAME=  FREQUENCY,     SPECTRUM/REAL,   SPECTRUM/IMAG
##SYMBOL=    X,             R,               I
##VAR_TYPE=  INDEPENDENT,   DEPENDENT,       DEPENDENT
##VAR_FORM=  AFFN,          ASDF,            ASDF
##VAR_DIM=   65536,         65536,           65536
##UNITS=     HZ,            ARBITRARY UNITS, ARBITRARY UNITS
##FACTOR=    0.49542278885378, 1,            1
##FIRST=     16045.7642231865, 0,            0
##LAST=      -16421.768244346, 0,            0
##MIN=       -16421.768244346, -4965983,     0
##MAX=       16045.7642231865, 338536723,    0
$$ Real data points
##PAGE= N=1
##DATA TABLE= (X++(R..R)), XYDATA
$$ [...]
40984B934019j69186q9549j15399k16450k43440j32166J493K2810m3276p6348
$$ 2934019 2764833 2675284 2559885 2343435 2099995 1967829 1969322 1992132 1948856 1872508
40974A872508n5066q6897k36496l99358l93590j67694J11606K11354Q7153n6979
$$ 1872508 1817442 1730545 1494049 1094691 701101 533407 645013 856367 943520 886541
40964H86541j8940J34123J57331k0609j84954j35026M0867J09033J1827j01671
$$ 886541 867601 1001724 1159055 1138446 953492 818466 859333 968366 980193 878522
40954H78522j16102o7194k3841N905K1050n744o2090q4222n5598l8561o0365m6950
$$ 878522 762420 695226 671385 677290 698340 692596 630506 546284 490686 452125 391760 344810
40942C44810N7955J67372J40560j6034j28869o9651P4866J06265l3722j87763
$$ 344810 402765 570137 710697 694663 565794 496143 571009 677274 643552 455789
40932D55789j85411n7062K5258j3281p3111n2956J2886M9426P2096J22084J45267
$$ 455789 270378 213316 238574 225293 152182 99226 112112 161538 233634 355718 500985
40921E00985O8081m1881l8968P0666J10902n114j34978j12677J8347R3735O8657
$$ 500985 569066 527185 488217 558883 669785 664671 529693 417016 435363 529098 597755
40910E97755L1299J9840j8579p9610o6625L7370R4986J2139r1076m3801J01510
$$ 597755 629054 648894 630315 550705 484080 521450 616436 628575 537499 493698 595208
40899E95208J25500k8767j59292j01949L7917P4817L5104Q0354K09368K48921
$$ 595208 720708 691941 532649 430700 468617 543434 578538 658892 868260 1117181
40889A117181J47923P5542J58861L00263L61187L74458M32661M84956M15127K50529
$$ 1117181 1265104 1340646 1499507 1799770 2160957 2535415 2968076 3453032 3868159 4118688
40879D118688J22034N3799l8644j54280j82991r8731j7869j2933m126R3689K25986
$$ 4118688 4240722 4294521 4255877 4101597 3918606 3819875 3802006 3789073 3784947 3878636 4104622
40868D104622K77462K13198P5997q1705k02928k37216k10944k22416l08041l77622
$$ 4104622 4382084 4595282 4671279 4589574 4386646 4149430 3938486 3716070 3408029 3030407
40858C030407l41701k37957j67143j64178j95411k21017j96235q1048P6189J36826
$$ 3030407 2688706 2450749 2283606 2119428 1924017 1703000 1506765 1425717 1501906 1638732
40848A638732M1532q7245j09797o2099o3550j03572p9659q278j4450j05235j37899
$$ 1638732 1680264 1593019 1483222 1421123 1357573 1254001 1174342 1166064 1151614 1046379 908480
40837I08480n9712m378o7062j41512r7533R332M4520J1311O759K9372k416p1555
$$ 908480 848768 844390 777328 635816 538283 547615 592135 603446 610205 639577 637161 565606
40825E65606p1642P9K1409m6800q5889k3137L0739m0346j48915j17229N2385J68125
$$ 565606 493964 494043 515452 468652 382763 359626 390365 350019 201104 83875 136260 304385
40813C04385J09756k7846q5842l5263L5922N8012L3257r850n2559q0169p9125
$$ 304385 414141 386295 300453 265190 301112 359124 392381 382531 329972 249803 170678
40802A70678m7929k256K7328J0009m7938q6020n1307J7644K1479o3051j32306
$$ 170678 122749 120493 147821 157830 109892 23872 -27435 -9791 11688 -51363 -183669
40791a83669q4976M1618J18633Q1106j6356p8182n0946N3025J59450J71265O0525
$$ -183669 -268645 -227027 -108394 -27288 -43644 -121826 -172772 -119747 39703 210968 271493
40780B71493q1503j33631p6456J1892P1305J02008J01060M3366n2350j13071j03348
$$ 271493 189990 56359 -20097 -8205 63100 165108 266168 309534 257184 144113 40765
40769D0765p1926p3806r6460r6889o5674j9902K8062O5305P9013Q4126J08252
$$ 40765 -31161 -104967 -201427 -298316 -363990 -383892 -355830 -290525 -211512 -127386 -19134
40758a9134J32154R9549R097o4265p0927m6065l2654j8046L963j2557p7732j05113
$$ -19134 113020 212569 221666 157401 86474 40409 7755 -10291 -6328 -18885 -96617 -201730
40746b01730l0880O3443N4309l3595n5852L9667J37815J13666j7898j36806j43729
$$ -201730 -232610 -169167 -114858 -148453 -204305 -164638 -26823 86843 68945 -67861 -211590
40735b11590l6583Q9036J11077L16j33974j62138q0782J1109N0404M6701J0787
$$ -211590 -248173 -159137 -48060 -47744 -181718 -343856 -424638 -413529 -363125 -316424 -305637
40724c05637m8389o1414M7872K19083K76447J45498m0240j06994l9617M6864O4403
$$ -305637 -354026 -415440 -367568 -148485 127962 273460 233220 126226 86609 133473 197876
40713A97876R479q3047j66982j93221j52193r1536n2184j6454L9728P9978N0837
$$ 197876 207355 124308 -42674 -235895 -388088 -479624 -531808 -548262 -508534 -428556 -377719
40702c77719k5443n7427J0014J27039J82641J11059l6647j29327q7650K2843O3292
$$ -377719 -403162 -460589 -450575 -323536 -140895 -29836 -66483 -195810 -283460 -260617 -197325
40691a97325j6389j28748j60832q4610M6101J50774J67213J02125M3043N5635
$$ -197325 -213714 -342462 -503294 -587904 -541803 -391029 -223816 -121691 -78648 -23013
40681b3013P6231r71j32677j54068l0572O7939K3706m6667R013J28196J47852
$$ -23013 53218 52247 -80430 -234498 -265070 -197131 -173425 -220092 -211079 -82883 64969
40670F4969P2288L2281L2540m4666j85671k12407o2043Q5527N5886q7698j66985
$$ 64969 137257 169538 202078 157412 -28259 -240666 -302709 -217182 -161296 -248994 -415979
40659d15979j26960l4888O4370J59260J96335J29600K5044l159L9454L2505o9907
$$ -415979 -542939 -577827 -513457 -354197 -157862 -28262 -3218 -6377 33077 65582 -4325
40648d325j61467j42401o5227m3049p1455m3164P4304J79832J85292J28754Q1549
$$ -4325 -165792 -308193 -373420 -416469 -487924 -531088 -456784 -276952 -91660 37094 118643
40637A18643K4207q4242j67974j05370O0529J27910L965j61772j91672j09163
$$ 118643 142850 58608 -109366 -214736 -154207 -26297 -22332 -184104 -375776 -484939
40627d84939m3409j1034N6196J33327J23573L7955q586J3388J6331k5338k2757
$$ -484939 -528348 -539382 -483186 -349859 -226286 -188331 -196917 -183529 -167198 -192536 -215293
40616b15293N1883Q8656J6967p1950p4594l4727m4474p8818n1911K2975N1409
$$ -215293 -163410 -74754 -57787 -129737 -204331 -239058 -283532 -362350 -414261 -391286 -339877
40605c39877L116o3801j01325j04230o5226J6261R2652J11136Q6686O6731M5606
$$ -339877 -336761 -400562 -501887 -606117 -671343 -655082 -562430 -451294 -364608 -297877 -252271
40594b52271j0890p6251q5256m0970j4913l0957k8001L8617J24299J54113J06656
$$ -252271 -263161 -339412 -424668 -465638 -480551 -511508 -539509 -500892 -376593 -222480 -115824
40583a15824J5054p2835j11362p4572R555O3817L0774o6047j43629j41982p8659
$$ -115824 -100770 -173605 -284967 -359539 -349984 -286167 -255393 -321440 -465069 -607051 -685710
40572f85710j5582K4453Q0583J70246K19413J42457k0046j28495j22073p5828
$$ -685710 -701292 -676839 -596256 -426010 -206597 -64140 -84186 -212681 -334754 -410582
40562d10582n1054m051Q6841J21960K8124q1977m4705J10245K00295J48462M9256
$$ -410582 -461636 -465687 -378846 -256886 -228762 -310739 -355444 -245199 -44904 103558 152814
40551A52814j5736o7449j13507j00554l3557n317m5934o8773l0693j5802p6040
$$ 152814 137078 69629 -43878 -144432 -177989 -183306 -229240 -298013 -328706 -344508 -420548
40540d20548j16236m9920L9204K5101n0795m1130Q0212J87382J81126Q4048l0493
$$ -420548 -536784 -586704 -547500 -522399 -573194 -614324 -534112 -346730 -165604 -81556 -112049
40529a12049j01878q5465P799P9561M3719m9123p7452k4911J5790Q111J4559N2598
$$ -112049 -213927 -299392 -291593 -212032 -168313 -217436 -294888 -319799 -304009 -295898 -281339 -228741
40517b28741L8821o2524j44927r9270K6193R3070N3749j3295k0846M0340J14945
$$ -228741 -189920 -252444 -397371 -496641 -470448 -377378 -323629 -336924 -357770 -317430 -202485
40506b02485J33033O4166l7873o8501Q271J00319R3008r640r9390j01107m2270
$$ -202485 -69452 -5286 -43159 -111660 -103389 -3070 89938 80298 -19092 -120199 -162469
40495a62469O122O235l0432o0598m0095K6021O6095J6405q4489j22605m5379O9269
$$ -162469 -156347 -150112 -180544 -241142 -281237 -255216 -189121 -172716 -257205 -379810 -425189 -355920
40483c55920J06082M3492m0134p1171n2872l1276k2171K071N7844J09173J01998
$$ -355920 -249838 -206346 -246480 -317651 -370523 -401799 -423970 -421899 -364055 -254882 -152884
40472a52884L2348m3438o9090l6091L0830R9629J26502P0343m5851j20186p7152
$$ -152884 -120536 -163974 -233064 -269155 -238325 -138696 -12194 58149 12298 -107888 -185040
40461a85040K4809N4093k1384q7793l8093Q4674J42390O7592p1809j57326j29008
$$ -185040 -160231 -106138 -127522 -215315 -253408 -168734 -26344 41248 -30561 -187887 -316895
40450c16895j7369R5056J37217J00696M0335J5127K5402J8016m2438j16267j17354
$$ -316895 -334264 -239208 -101991 -1295 39040 54167 79569 97585 55147 -61120 -178474
40439a78474j1374J21841J53503M7378r3781j49895j17275p4763n2951j7825K7205
$$ -178474 -189848 -68007 85496 132874 39093 -110802 -228077 -302840 -355791 -373616 -346411
40428c46411K5422k0052j6523P6749J61891J35213L7464k1172l0657o4229j21649
$$ -346411 -320989 -341041 -357564 -280815 -118924 16289 53753 32581 1924 -62305 -183954
40417a83954j13357j3942P4002M9937n7428j28001p7160O3097J56760Q1117j14983
$$ -183954 -297311 -311253 -237251 -187314 -244742 -372743 -449903 -386806 -230046 -148929 -263912
40406b63912k12153o8439J72745K44958J04875m0547n8832n1682j20293j65066
$$ -263912 -476065 -544504 -371759 -126801 -21926 -62473 -121305 -172987 -293280 -458346
40396d58346o5091Q5158R9505k0286j03366o5078J8995P3509J02902J07658O0439
$$ -458346 -523437 -438279 -338774 -359060 -462426 -527504 -508509 -435000 -332098 -224440 -164001
40385a64001j3684m7752l9902m6577o3656k7280N4315Q6764L3598l2291m6572
$$ -164001 -177685 -225437 -265339 -311916 -375572 -402852 -348537 -261773 -228175 -260466 -307038
40374c07038j9011L7070J22551J74064J01398m9414j06955j6386O5062L525j14638
$$ -307038 -326049 -288979 -166428 7636 109034 59620 -47335 -63721 1341 4866 -109772
40363a09772j39838r2051q5156j06326m3985J00216J88299J37716J0469r7131
$$ -109772 -249610 -341661 -426817 -533143 -577128 -476912 -288613 -150897 -140428 -237559
40353b37559j47681j38525p9834r740L9558Q4151J33854J33447M6756m6588n4585
$$ -237559 -385240 -523765 -603599 -613339 -573781 -489630 -355776 -222329 -175573 -222161 -276746
40342b76746l2018r2084j85555j44947L8735J72105J45119P4312P2846O3587l9133
$$ -276746 -308764 -400848 -586403 -731350 -692615 -520510 -375391 -301079 -228233 -164646 -203779
40331b03779j22279l6628J36993J83933O7526m2618l5058K6072N3803M6940J9735
$$ -203779 -326058 -362686 -225693 -41760 25766 -16852 -51910 -25838 27965 74905 94640
40320I4640l4013p2715l2654M4620M0225m9906q9470k0604L8180q547p9625p0116
$$ 94640 60627 -12088 -44742 -122 40103 -9803 -99273 -119877 -81697 -90244 -169869 -239985
40308b39985k4802k6659k9846L6554R3032K2046j05013j10101Q393P5617K6949
$$ -239985 -264787 -291446 -321292 -284738 -191706 -169660 -274673 -384774 -376381 -300764 -273815
40297b73815j1323L2671N6829o773n4741l802M3532k7228j33021j21371j1438
$$ -273815 -285138 -252467 -195638 -202411 -257152 -260954 -217422 -244650 -377671 -499042 -510480
40286e10480O1670P1723R5259J26619Q1211k5146p0195j6431M0367M0026L5633
$$ -510480 -448810 -377087 -281828 -155209 -73998 -99144 -169339 -185770 -145403 -105377 -69744
40275f9744O5357P8008L7450j3331m3891q4615j31756j13113j2872O8215M7449
$$ -69744 -4387 73621 111071 97740 53849 -30766 -162522 -275635 -288507 -220292 -172843
40264a72843l1834r0268j18378j23398o9174M1042J09834P4819J7527L8364R3733
$$ -172843 -204677 -294945 -413323 -536721 -605895 -564853 -455019 -380200 -362673 -324309 -230576
40253b30576P6371m81l1629K673K2514j253j1683J2467J8009j7944m5660l0126
$$ -230576 -154205 -154686 -186315 -183642 -161128 -162381 -174064 -161597 -143588 -161532 -207192 -237318
40241b37318O146M5531R2927J13975N1537o4960j19106o1136J9768K6852j6552
$$ -237318 -231172 -185641 -92714 21261 72798 7838 -111268 -172404 -152636 -125784 -142336
40230a42336l1400j0012n800l5993o3093n4895j3356M1217P8152O7837J7926k2730
$$ -142336 -173736 -183748 -189548 -225541 -288634 -343529 -356885 -315668 -237516 -169679 -151753 -174483
40218a74483k5361k0608m3965p0786n1426N291L4855O970k9940j3573M8850R0049
$$ -174483 -199844 -220452 -264417 -335203 -386629 -381338 -346483 -339513 -369453 -383026 -334176 -244127
40206b44127P0013K5114J3842L4725L4923m128m1205n4375q7308j66335k18094
$$ -244127 -174114 -149000 -135158 -100433 -65510 -69638 -110843 -165218 -252526 -418861 -636955
40195f36955j46202K6606J67819J87380J15119K6381l5290m8436n535N0298M3835
$$ -636955 -783157 -756551 -588732 -401352 -286233 -259852 -295142 -343578 -349113 -298815 -254980
40184b54980l5855j07726j05082o0601m3294n6603n0876n557N1748Q9072R0992
$$ -254980 -290835 -398561 -503643 -564244 -607538 -664141 -715017 -720574 -668826 -579754 -488762
40173d88762N2437q392m2080j1545N5360Q4079L3196n3696q5384k2500O2239N4812
$$ -488762 -436325 -444717 -486797 -498342 -442982 -358903 -325707 -379403 -464787 -487287 -425048 -370236
40161c70236n0478j19154m6333Q6404J10347K200r1564o7915J4008O2601Q2094
$$ -370236 -420714 -539868 -586201 -499797 -389450 -387250 -478814 -546729 -532721 -470120 -388026
40150c88026J02885Q9757J4057o0536o2619k3915j2815j5316J7861N9216N1182
$$ -388026 -285141 -195384 -181327 -241863 -304482 -328397 -341212 -356528 -338667 -279451 -228269
40139b28269K1455L1070M2290k4863j20362j00775M4728J54798J27090M6552J5608
$$ -228269 -206814 -175744 -133454 -158317 -278679 -379454 -334726 -179928 -52838 -6286 9322
40128I322k729o7690j10789m9012L3388j4575j56848j89686l9492J16638J00670
$$ 9322 6593 -61097 -171886 -220898 -187510 -202085 -358933 -548619 -588111 -471473 -370803
40117c70803k5373p9718l1324n398n1836o4734L0833J41189J36911M0296j8162
$$ -370803 -396176 -475894 -507218 -512616 -564452 -629186 -598353 -457164 -320253 -279957 -298119
40106b98119J6094Q0257J12203J07369O0977l9306j39453j40627m3647J8103m1833
$$ -298119 -282025 -201768 -89565 17804 78781 39475 -99978 -240605 -284252 -266149 -307982
40095c07982j26461q4862P4426J95659J77468P1568j6912m8318n3160p4792j23981
$$ -307982 -434443 -519305 -444879 -249220 -71752 -184 -17096 -65414 -118574 -193366 -317347
40084c17347j57850j08816L0460J67202J98349J23771K2801n5777j13914j36233
$$ -317347 -475197 -584013 -553553 -386351 -188002 -64231 -41430 -97207 -211121 -347354
40074c47354r1306q643L1141J0444N708O8435J41136J38662O0828k6136p8326
$$ -347354 -438660 -447303 -416162 -405718 -400010 -331575 -190439 -51777 9051 -17085 -95411
40063i5411r2088o7523j3054L0275K4611p135n586M0381P6008N8394J1156k1368
$$ -95411 -187499 -255022 -268076 -237801 -213190 -220325 -225911 -185530 -109522 -51128 -39972 -61340
40051f1340l8688o2695p3320k4017O9519J15049N8868k5588k1016Q2167J75842
$$ -61340 -100028 -162723 -236043 -260060 -190541 -75492 -16624 -42212 -63228 18939 194781
40040A94781J66537O1030p0336j50552j25507j6738N7960R589p7168m4380Q1410
$$ 194781 361318 422348 352012 201460 75953 59215 117175 126764 49596 5216 86626
40029H6626R3294p3722k05554j19437N6482R2987P087k7555j1030q0998j90120
$$ 86626 179920 106198 -99356 -218793 -162311 -69324 -62237 -89792 -100822 -181820 -371940
40018c71940j27124J00810K06562N6664j00580j0312K06894K60899J16053k6138
$$ -371940 -499064 -398254 -191692 -135028 -235608 -245920 -39026 221873 337926 311788
40008C11788o5125q0231j11904r2168j3934J6680m5629r3891k0340J27280K04067
$$ 311788 246663 166432 54528 -37640 -51574 -34894 -80523 -174414 -194754 -67474 136593
39997A36593J38354L297o4904r372Q3621Q3851j8723j02187p8914M650O9373J07901
$$ 136593 274947 278244 213340 203968 287589 371440 352717 250530 171616 176266 245639 353540
39985C53540J23350O7994n5238j21930m5900N9453K3203j25913j95232r8298N8647
$$ 353540 476890 544884 489646 367716 321816 381269 404472 278559 83327 -14971 43676
39974D3676J51942J56825Q7985k5501q7986r805J33439J57726K9855p6652m2921
$$ 43676 195618 352443 440428 414927 326941 317136 450575 608301 638156 561504 518583
39963E18583L1791J8940l1869m625P2023P5396j0116q3285q9199o8705n3607k1930
$$ 518583 550374 569314 537445 532820 604843 680239 670123 586838 497639 428934 375327 353397
39951C53397L0316N7263K4080n2867j32274j73511j47964p0754n339J0297J8822
$$ 353397 383713 440976 465056 412189 279915 106404 -41560 -112314 -117653 -107356 -88534
39940h8534O9647J18294P6779m4225j25802q7374K5211J15136J32079P2693m3298
$$ -88534 -18887 99407 176186 131961 6159 -81215 -56004 59132 191211 263904 220606
39929B20606j52057j61341n1875P0348Q4425k082p7304p6854m3835l4607l6866
$$ 220606 68549 -92792 -144667 -74319 10106 8024 -69280 -146134 -189969 -224576 -261442
39918b61442j3300K8213N3265N5469M9869L7467J4458r536l9798j05794j90578
$$ -261442 -274742 -246529 -193264 -137795 -87926 -50459 -36001 -45537 -85335 -191129 -381707
39907c81707j96505o5466R6912J26773K9776j9195O7742J65731J34513J9647m6964
$$ -381707 -578212 -643678 -546766 -419993 -390217 -409412 -341670 -175939 -41426 -21779 -68743
39896f8743m9144o0106q1990n5126L521J0154m0819o4941k9429N908N340R779
$$ -68743 -117887 -177993 -259983 -315109 -311588 -301434 -342253 -407194 -436623 -430715 -425375 -415596
39884d15596M9287R5548J22491J29277R3646k781r4923q8617j1760N813o9230
$$ -415596 -366309 -270761 -148270 -18993 74653 71872 -23051 -111668 -123428 -117615 -186845
39873a86845j22163q2094l2872o0537j11367r2514j3310O4339J24327J57400J19745
$$ -186845 -309008 -391102 -423974 -484511 -595878 -688392 -701702 -637363 -513036 -355636 -235891
39862b35891K5540j7042L2532N2888m6536j44748q2964O7278J03661J1994k6466
$$ -235891 -210351 -227393 -194861 -141973 -188509 -333257 -416221 -348943 -245282 -233288 -259754
39851b59754N6450J16036N3374k4111J167N8299J4941j00992j42365n7558M8494
$$ -259754 -203304 -87268 -33894 -58005 -56838 1461 16402 -84590 -226955 -284513 -236019
39840b36019N8207k7112j02775p3745M2203J20122O7235n1893r2131k9338P405
$$ -236019 -177812 -204924 -307699 -381444 -339241 -219119 -151884 -203777 -295908 -325246 -317841
39829c17841o3126j42393r5777M9497J47970J33280P0342K7183l593l9357n0882
$$ -317841 -380967 -523360 -619137 -569640 -421670 -288390 -218048 -190865 -194458 -233815 -284697
39818b84697j6605K2708J7753j0105J588N6480Q6251N2471P203J0779L5043J7495
$$ -284697 -301302 -278594 -260841 -270946 -269358 -212878 -126627 -74156 -66953 -56174 -21131 -3636
39806c636j7705R118Q1201Q5945Q907q342R9222J61098P565k27066k51797m3503
$$ -3636 -21341 -12223 68978 154923 163830 155488 254710 415808 423373 196307 -55490 -98993
39794i8993J09732L1919j06388q8235K2546L2517n1559o1538L5043R1686L0343
$$ -98993 10739 42658 -63730 -151965 -129419 -96902 -148461 -209999 -174956 -83270 -52927
39783e2927n1658n3156j94M0847O1656O9260M0460k3307o5745m8883j282L9623
$$ -52927 -104585 -157741 -157935 -117088 -55432 13828 54288 30981 -34764 -83647 -84929 -45306
39771d5306P4683J01342Q6113J8787n4799q9223q6495o3342k2417J9579L1594
$$ -45306 29377 130719 216832 235619 180820 91597 5102 -58240 -80657 -61078 -29484
39760b9484K3220L7497N8550M925j30620k14526j30865N0644J61161J47668R5928
$$ -29484 -6264 31233 89783 94708 -35912 -250438 -381303 -330659 -169498 -21830 74098
39749G4098O1619K218j03422j80885j61812q3465k6811p490J6427O6372J22592
$$ 74098 135717 137935 34513 -146372 -308184 -391649 -418460 -425950 -409523 -343151 -220559
39738b20559J53569J28368L1935r3899j59812j23782m6352q586j0900m821J4862
$$ -220559 -66990 61378 93313 -586 -160398 -284180 -330532 -339118 -350018 -354839 -339977
39727c39977K1014K8197P0932J19518J07033M2912N578O266l5599j39308j90304
$$ -339977 -318963 -290766 -219834 -100316 6717 49629 55207 61473 25874 -113434 -303738
39716c03738r7517N8018J24592P3262l565m0219m0670n070P0831J26808Q0868
$$ -303738 -401255 -343237 -218645 -145383 -148948 -189167 -229837 -234907 -164076 -37268 43600
39705D3600m0925j15705q9752l8628k9929k6266K0700P1626P0060M0090L2845
$$ 43600 2675 -113030 -202782 -241410 -271339 -297605 -276905 -205279 -135219 -95129 -62284
39694f2284L4021J0473j519M5940R8252N1265q4661j75938j39750l8388K8155
$$ -62284 -28263 -17790 -19309 26631 124883 176148 91487 -84451 -224201 -262589 -234434
39683b34434M1041L1830P879k8876m0067L464O1977P4846N1212N0582P7087N8453
$$ -234434 -193393 -161563 -153684 -182560 -222627 -219163 -157186 -82340 -31128 19454 96541 154994
39671A54994m6627j68090j91728r0964L9106P9985P842q7613r5896K874J19626
$$ 154994 108367 -59723 -251451 -342415 -303309 -223324 -215482 -303095 -398991 -396117 -276491
39660b76491J51896Q9818J2381j4135l016l633k7282m7920n3119n1023l5132J0210
$$ -276491 -124595 -34777 -22396 -36531 -39547 -43180 -70462 -118382 -171501 -222524 -257656 -247446
39648b47446O3634P2708K3132l9682p8570j07703j36619j23140l7786O2950R7435
$$ -247446 -183812 -111104 -87972 -127654 -206224 -313927 -450546 -573686 -611472 -548522 -451087
39637d51087P3237O6777R5708R3659K8575l3012k1689L2601M3798j9354j06453
$$ -451087 -377850 -311073 -215365 -121706 -93131 -126143 -147832 -115231 -71433 -90787 -197240
39626a97240j45398j01028j94P9387P5891J8124m405L5901O4674J9067n8959r3966
$$ -197240 -342638 -443666 -443860 -364473 -288582 -270458 -274863 -238962 -174288 -155221 -214180 -308146
39614c08146q4663p0379l7440M9858J46481J53290N7723l4110l2210L3949P4859
$$ -308146 -392809 -463188 -500628 -450770 -304289 -150999 -93276 -127386 -159596 -125647 -50788
39603e0788M9765j4785p0448p9563l8214N184j1299p7320r8736r726J30598J98841
$$ -50788 -1023 -15808 -86256 -165819 -204033 -198849 -210148 -287468 -386204 -395930 -265332 -66491
39591f6491J51550O1408O913k4079q8943j78927k07503j21059K0551J07029R7413
$$ -66491 85059 146467 153380 129301 40358 -138569 -346072 -467131 -446580 -339551 -242138
39580b42138L9682p881k2236M962O3035R0290K5550q1547r7688P629R3033M0858
$$ -242138 -202456 -210337 -232573 -227611 -164576 -74286 -48736 -130283 -227971 -220342 -127309 -86451
39568h6451o5081o9524J6433N3129J1417N191P3327R9198Q695r8398j06505n4978
$$ -86451 -151532 -221056 -204623 -151494 -140077 -134886 -61559 37639 46334 -52064 -158569 -213547
39556b13547m2070n3570j5136M5419K5080q2151j60122j31229n0517j4111m0541
$$ -213547 -255617 -309187 -324323 -278904 -253824 -335975 -496097 -627326 -677843 -691954 -732495
39545g32495p2133n1628K5713J12100J47891J14143M2635k5980o6952n3829K7501
$$ -732495 -804628 -856256 -830543 -718443 -570552 -456409 -413774 -439754 -506706 -560535 -533034
39534e33034J22321J30404L5151n2929m5662n298l4610r6666o5815O4055J52344
$$ -533034 -410713 -280309 -245158 -298087 -343749 -349047 -383657 -480323 -546138 -482083 -329739
39523c29739J07187o657q6127j11836j07496p2277j4869J7201L338j0010J6416
$$ -329739 -222552 -229209 -315336 -427172 -534668 -606945 -621814 -604613 -601275 -611285 -594869
39512e94869N6612P8947R7770J13313P3230l3918j13351q1250M318K6078k1105
$$ -594869 -538257 -459310 -361540 -248227 -174997 -208915 -322266 -403516 -399198 -373120 -394225
39501c94225m8656l2094k5679k9434J9468J00329R8098j043m1611P0730J86485
$$ -394225 -442881 -474975 -500654 -530088 -510620 -410291 -312193 -313236 -354847 -284117 -97632
39490i7632J04599j22774k42706j41319L0674R6550O2907K2193j7294q6545j28438
$$ -97632 6967 -115807 -358513 -499832 -469158 -372608 -309701 -287508 -304802 -391347 -519785
39479e19785n4698R6559J81973J37774M4858p422k8592n9082p6014l4077M3222
$$ -519785 -574483 -477924 -295951 -158177 -113319 -120741 -149333 -208415 -284429 -318506 -275284
39468b75284Q1685N4744J0760l351n395m1599j05847j30832p5202Q180L4767R435
$$ -275284 -193599 -138855 -128095 -131446 -136841 -178440 -284287 -415119 -490321 -482141 -447374 -437939
39456d37939J8014Q0240R8300J4452o6983k7308N9370J9481j37990k07183q6353
$$ -437939 -419925 -339685 -241385 -226933 -293916 -321224 -261854 -242373 -380363 -587546 -673899
39445f73899P8939J28526J00425R8804J00039M5420P243P6413J64758J19755r912
$$ -673899 -594960 -466434 -366009 -267205 -167166 -121746 -114503 -38090 126668 246423 236511
39434B36511l5823N4168O5853p7121j97557j41886k293N8812M3280L1100k496
$$ 236511 200688 254856 320709 243588 46031 -95855 -98148 -39336 3944 35044 32548
39423C2548j07347j89113j13742N4808J03920l0878j73655j49766O563J37920
$$ 32548 -74799 -263912 -377654 -322846 -218926 -249804 -423459 -573225 -566662 -428742
39413d28742J54126P3943m2950j28742j18690n868J23557J60076Q2118k6236o8651
$$ -428742 -274616 -200673 -243623 -372365 -491055 -496923 -373366 -213290 -131172 -157408 -226059
39402b26059k9978K5137L2586m508l2290j8247J3179K0790l51k3352l1784l4950
$$ -226059 -256037 -230900 -198314 -202822 -235112 -253359 -240180 -219390 -219741 -243093 -274877 -309827
39390c09827m4254n3014m7229l2110l7988q4131j33531j12097J923J31949J83897
$$ -309827 -354081 -407095 -454324 -486434 -524422 -608553 -742084 -854181 -852258 -720309 -536412
39379e36412J53165J06212P7833M9063J3304j1037l1551o3627o0211L9721J73701
$$ -536412 -383247 -277035 -199202 -150139 -136835 -147872 -179423 -243050 -303261 -263540 -89839
39368h9839J83333L0095j27245j41380n6451O730L5857P8773J04378O0822J2154
$$ -89839 93494 123589 -3656 -145036 -201487 -194757 -158900 -80127 24251 85073 97227
39357I7227N8226J48544J34722L292r9106q9828m9945o1087q1905n1469j117J3320
$$ 97227 155453 303997 438719 442011 342905 253077 203132 142045 60140 8671 7554 20874
39345B0874O279J9157M6189N8928M9817J4096m9468r0584l7379Q6391J53419R1311
$$ 20874 27153 46310 92499 151427 201244 215340 165872 75288 37909 124300 277719 369030
39333C69030k4128q2587o9783l0318J7840O0179N1001j2989m3344K5183J14669
$$ 369030 344902 262315 192532 162214 180054 240233 291234 278245 234901 260084 374753
39322C74753R3567l9480j51714j47344o2500J3116L8285K6442J641k2687l8291
$$ 374753 468320 428840 277126 129782 67282 80398 118683 145125 146766 124079 85788
39311H5788l1628J0259O6790P2407j2920j22770j41137n8113P208k4956q4612
$$ 85788 54160 64419 131209 203616 190696 67926 -73211 -131324 -124116 -149072 -233684
39300b33684o7080J7742Q7482J14558J22309J02435L2808m9976q4220o9095l8813
$$ -233684 -300764 -283022 -195540 -80982 41327 143762 176570 126594 42374 -26721 -65534
39289f5534J8414J21976K03203J60310J5400q8492p3279j5771j3712m8152m1527
$$ -65534 -47120 74856 278059 438369 453769 365277 291998 276227 262515 214363 172836
39278A72836P646K6463j3255m4672M412J05397J50754Q6526j5413n6095n0158
$$ 172836 180482 206945 193690 149018 153430 258827 409581 496107 480694 424599 374441
39267C74441r0621j73982j68545j4333J42871J22039m4232j49169q2903M8296
$$ 374441 283820 109838 -58707 -73040 69831 191870 147638 -1531 -84434 -36138
39257c6138Q7318J4861o7217p9638m4457l5556p3688q7705q387J10761J38993
$$ -36138 51180 66041 -1176 -80814 -125271 -160827 -234515 -322220 -330607 -219846 -80853
39246h0853N2589k3438j0931l714r6643j93641j34242N3254J87376J89404J41862
$$ -80853 -28264 -51702 -62633 -66347 -162990 -356631 -490873 -437619 -250243 -60839 81023
39235H1023J05681M7740l4345p4514o0513n6053o9635l6689L8316O5071K9047
$$ 81023 186704 234444 200099 125585 65072 9019 -60616 -97305 -58989 6082 35129
39224C5129K0001N2119J5269j22993k22165j69746m1210L9125O8176R0699Q1775
$$ 35129 55130 107249 122518 -475 -222640 -392386 -433596 -394471 -326295 -235596 -153821
39213a53821K2598j5282J6421M2622l045m6217j514O2043L3175m2113l2753N5914
$$ -153821 -131223 -146505 -130084 -87462 -90507 -136724 -138238 -76195 -43020 -85133 -117886 -61972
39201f1972R0891K0222o8171r2886o5468k4620K0424O8511J08815J23329Q2706
$$ -61972 28919 49141 -19030 -111916 -177384 -202004 -181580 -113069 -4254 119075 201781
39190B01781j7500r9830o9071L8185Q2837M0463L5869R8893Q5614l9538p0955
$$ 201781 184281 84451 15380 53565 136402 176865 212734 311627 397241 357703 286748
39179B86748R5635K11351L6222k34343k39564j6197Q9720L827l242J60837K39790
$$ 286748 382383 593734 629956 395613 156049 139852 229572 233399 230157 390994 630784
39168F30784R0913p0236n4989J0971j5309k2529R4068J78405Q6562k3105M0532
$$ 630784 721697 651461 596472 607443 592134 569605 663673 842078 928640 905535 946067
39157I46067J45325O1927j14468j06600P9554J73873Q8531J4845N4044N9516p0494
$$ 946067 1091392 1153319 1038851 932251 1011805 1185678 1274209 1289054 1343098 1402614 1332120
39146A332120j98532j67325k7972P1624R3197R4310R9144P5144m256j15679j77520
$$ 1332120 1133588 966263 938291 1009915 1103112 1197422 1296566 1371710 1367454 1251775 1074255
39135A074255j03590P7129J96429J34359j1481n7899M453K6663m5692r8932m6993
$$ 1074255 970665 1047794 1244223 1378582 1367101 1309202 1313655 1340318 1294626 1195694 1148701
39124A148701M9994J00709Q9532L3260n3297j19048j13785q1167j00268j31743
$$ 1148701 1198695 1299404 1388936 1422196 1368899 1249851 1136066 1054899 954631 822888
39114H22888o2746Q5387J58543J08741N5039N6831K0932q1424j08447P843R5891
$$ 822888 760142 845529 1004072 1112813 1167852 1224683 1245615 1164191 1055744 1063587 1159478
39103A159478m476j77052k07783j05588l6390l2757K522O0559L1770o4812q3887
$$ 1159478 1155002 977950 770167 664579 628189 595432 597954 658513 690283 625471 541584
39092E41584n836K5318m2074p7924o494O0197K1998m7950n6935n2952r5923j06905
$$ 541584 535748 561066 518992 441068 434574 494771 516769 468819 411884 358932 263009 156104
39080A56104p646R8106O4393m7799n2221O5161J23667L2250q4495r2068k2846
$$ 156104 148458 246564 310957 263158 210937 276098 399765 432015 347520 255452 232606
39069B32606K4180L4409M3693M8687L3470J3997p948n9665j10119o5485O7730
$$ 232606 256786 291195 334888 383575 417045 431042 423094 363429 253310 187825 255555
39058B55555J21369j2184j84520j70907R864J28003P5718j9842m2656n3053j19034
$$ 255555 376924 364740 180220 9313 19177 147180 222898 203056 160400 107347 -11687
39047a1687j50711m6094J08199J43353N9721J3881O7481J00807J3685j10366j18671
$$ -11687 -162398 -208492 -100293 43060 102781 116662 184143 284950 298635 188269 69598
39036F9598K39J05874Q9672K900k1594N7149J35142R5546l8389j25349p5446N0535
$$ 69598 69837 175711 265383 268283 246689 303838 438980 534526 496137 370788 295342 345877
39024C45877J23352P9955m6036j79909k52323k24079j09460L3915J54231K24452
$$ 345877 469229 549184 503148 323239 70916 -153163 -262623 -228708 -74477 149975
39014A49975K16969J18551j0703o3949j6996L0993k749o8045p0011j3249K4396
$$ 149975 366944 485495 474792 410843 393847 424840 422091 354046 284035 270786 295182
39003B95182J7552N625P930P446j102j5264m9580r3251q6601j3300L7905n326
$$ 295182 312734 318359 326289 333735 332633 317369 267789 174538 87937 74637 112542 107216
38991A07216p3223o1263o414j7096p0077m2824O4153J13299N6592L659K3541M6928
$$ 107216 33993 -27270 -33684 -50780 -120857 -163681 -99528 13771 70363 74022 97563 144491
38979A44491K5111K1215O3121O2383k2037q4207m5643O595k2206o9189m5792j2970
$$ 144491 169602 190817 253938 316321 294284 210077 164434 171029 148823 79634 33842 20872
38967B0872o2086j21375o2136P1509J22368O4549Q526o099l4695n3531M0048K18462
$$ 20872 -41214 -162589 -224725 -153216 -30848 33701 42227 36128 1433 -52098 -12050 206412
38955B06412K94950J72179k2181j18201r8813m3145O848L7120J5210n3647r2023
$$ 206412 501362 673541 651360 533159 434346 391201 398049 435169 450379 396732 304709
38944C04709n2069O112Q006k3576k5621p053j5227l0368R149Q8487J15800N5204
$$ 304709 252640 258752 266758 243182 217561 210508 195281 164913 174062 262549 378349 433553
38932D33553j3409j616O7588Q7846j139j44150k29954k01854j01396j0542L2792
$$ 433553 420144 418528 486116 573962 572823 428673 198719 -3135 -104531 -115073 -82281
38921h2281N1016O9973P3676L2999l3006n5590M054Q8807R6660O319r0608j12113
$$ -82281 -31265 38708 112384 145383 112377 56787 60841 149648 246308 252627 162019 49906
38909D9906r1726j01099j11039l3791J03755J54695O0302n2144m9323L3222Q4705
$$ 49906 -41820 -142919 -253958 -287749 -183994 -29299 31003 -21141 -70464 -37242 47463
38898D7463R2224J07189J16157P5034J7860L37j7742r3194j48415o7358Q1415
$$ 47463 139687 246876 363033 438067 455927 456264 438522 345328 196913 129555 210970
38887B10970J08256M4m8165M9177J24214L2693j08834j10275P959Q4363P1026
$$ 210970 319226 319270 271105 320282 444496 477189 368355 258080 266039 350402 421428
38876D21428M7954M4471J3921l7620m5481q780K006l5871p1287p0769m4474R270
$$ 421428 469382 513853 527774 490154 444673 435893 437899 402028 330741 259972 215498 224768
38864B24768Q8711J27260N2903q6172j56629j13187m1946j9156k7695l4695m6232
$$ 224768 313479 440739 493642 407470 250841 137654 95708 76552 48857 14162 -32070
38853c2070m7557Q382J00618J24123L9156m9752m0770J7098J4052m5804o6111
$$ -32070 -79627 -71245 29373 153496 192652 142900 102130 119228 133280 87476 21365
38842B1365j5260M8201Q8631J20049J18710K6433j22814j84606q0594P9867J33976
$$ 21365 6105 54306 142937 262986 381696 408129 285315 100709 20115 99982 233958
38831B33958P4606L9030J06158J91588J66785K5355j09147j23741l8559J7162
$$ 233958 308564 347594 453752 645340 812125 837480 728333 604592 566033 583195
38821E83195m7061j69779k04068j02432J8240L2723l0070n1776m431L8403M9829
$$ 583195 536134 366355 162287 59855 78095 110818 80748 28972 24541 62944 112773
38810A12773Q1782J31624J11706R706m9173Q019O5935j505j14197j02624K1626
$$ 112773 194555 326179 437885 447591 398418 406437 472372 470867 356670 254046 275672
38799B75672Q7548L1146m2259o8177j04260j54971j06867O2380J76283R7573n3962
$$ 275672 363220 394366 352107 283930 179670 24699 -82168 -19788 156495 254068 200106
38788B00106p7177J3062L9578m1330q6167p424J01596J31035J03452Q6161O4121
$$ 200106 122929 135991 175569 134239 48072 40648 142244 273279 376731 462892 527013
38777E27013l933p0953n0016M2573Q7463K4541n7731m3753M3405P1564j0218r6965
$$ 527013 523080 452127 402111 444684 532147 556688 498957 455204 498609 570173 559955 462990
38765D62990q6053l0857m6487j14713j10920j8805K6540m4512j11558m5215R4291
$$ 462990 376937 346080 299593 184880 73960 55155 81695 37183 -74375 -119590 -25299
38754b5299J50698Q7085q149p1394r8323p1545J7647R6983Q6219L0959M0955J02092
$$ -25299 125399 212484 204335 132941 34618 -36927 -19280 77703 163922 194881 235836 337928
38742C37928Q7053l1690j23437j00127m1572m6487p4838l7293M3303O9630K2305
$$ 337928 424981 393291 269854 169727 128155 81668 6830 -30463 12840 82470 104775
38731A04775k1840n69P7768J65301J97546J15161o3397k10270k05928q3908J2714
$$ 104775 82935 82366 160134 325435 522981 638142 574745 364475 158547 74639 87353
38720H7353J7613L812M3470R3302P6593J3713j4326l437l0198j06883j29623k8308
$$ 87353 104966 108778 152248 245550 322143 335856 321530 318093 287895 181012 51389 23081
38708B3081J04498J22026K2500n8389m3099M955J0201j0504j6454j8261k1087
$$ 23081 127579 249605 272105 213716 170617 175572 185773 175269 158815 140554 119467
38697A19467J7725R6095J16702K5815p2193n3394L5280N5095m621l7731k6147
$$ 119467 137192 233287 349989 375804 303611 250217 285497 340592 335971 298240 272093
38686B72093o1116j45890j51520k8346Q9706P7328o982l0892K7186J00647J56757
$$ 272093 210977 65087 -86433 -114779 -25073 52255 45273 14381 41567 142214 298971
38675B98971J90726J60621L7267j11835j78043j35574m8232K1434N1932M1783
$$ 298971 489697 650318 687585 575750 397707 262133 213901 235335 287267 329050
38665C29050J0057K70L6352R0096J20539J15756P5420J642o6159o9248j9267j905
$$ 329050 339107 339377 375729 465825 586364 702120 777540 779182 713023 643775 624508 622603
38653F22603m6580p0868j7179L5910j4469j36323k09848j85164j02015J466J01304
$$ 622603 576023 505155 487976 523886 509417 373094 163246 -21918 -123933 -122467 -21163
38642b1163J46413J07684M6335M1812P6418Q0865N8571N8039N4319j4438j05666
$$ -21163 125250 232934 279269 321081 397499 478364 536935 594974 649293 634855 529189
38631E29189j06180j8790K3744l3525q1520l1106L9171J1118q7069j27662o5965
$$ 529189 423009 404219 427963 394438 312918 281812 320983 332101 245032 117370 51405
38620E1405J9504M9164K9042J6206M4902R0340Q8942J0040q6191r9242j0901Q7633
$$ 51405 70909 120073 149115 165321 210223 300563 389505 399545 313354 214112 203211 290844
38608B90844J11883P4474K7537k4755r6602j46812j11464j541R6257J23032J01164
$$ 290844 402727 477201 504738 479983 383381 236569 125105 123564 219821 342853 444017
38597D44017P2326L2319l7636j03702r3569J1016J26654J44406N0094n9788r2107
$$ 444017 516343 548662 511026 407324 313755 324771 451425 595831 645925 586137 494030
38586D94030n9133m0985o6821p8766k5192M7743L9843o5783j50699r1979O4470
$$ 494030 434897 393912 327091 248325 223133 270876 310719 244936 94237 2258 66728
38575F6728J31115J6810j32470j17648L6461J18383M1350l8127K7301J51961J61008
$$ 66728 197843 214653 82183 -35465 996 119379 160729 122602 149903 301864 462872
38564D62872M9143m5939n9238m0603k1554J4047M1141J0705m5712n1088j8393
$$ 462872 512015 466076 406838 366235 344681 358728 399869 410574 364862 313774 295381
38553B95381k6523o6294m9444K1148L9934j4022k8981M9887J25229J07160L8390
$$ 295381 268858 202564 153120 174268 214202 200180 171199 221086 346315 453475 491865
38542D91865q402l0218j8321P9410K24806K50099P3870j50286k23631j45165m3690
$$ 491865 483463 453245 434924 514334 739140 989239 1063109 912823 689192 544027 500337
38531E00337K8741Q7160Q7442j3172j18412r1029L0185P4615k019o3662j6907
$$ 500337 529078 616238 703680 690508 572096 481067 511252 585867 583848 520186 503279
38520E03279O4349Q3305N9703N9413P9528P0115J1457p3461j37554j23872j6796
$$ 503279 567628 650933 710636 770049 849577 919692 931149 857688 720134 596262 579466
38509E79466J10017J55879J10349N0019K3438J2735N439J4684J7125l5836j19521
$$ 579466 689483 845362 955711 1005730 1029168 1041903 1047342 1062026 1079151 1043315 923794
38498I23794j37839n9202L1596N7332M4023M4989M8536K6742J2275M8542J00978
$$ 923794 785955 726753 758349 815681 859704 904693 953229 979971 992246 1040788 1141766
38487A141766R3419K0196l7911j3891O4859J04135M1516p8349j32831n0249R4826
$$ 1141766 1235185 1255381 1217470 1203579 1268438 1372573 1414089 1335740 1202909 1152660 1247486
38476A247486J52673O7543o6428j25769q6598j5362K2595J3034j9608m2756m0979
$$ 1247486 1400159 1467702 1401274 1275505 1188907 1173545 1196140 1209174 1189566 1146810 1105831
38465A105831k1424P229M3600O5398K8452o2983j20968p4760J9153M7540L752
$$ 1105831 1084407 1091636 1135236 1200634 1229086 1166103 1045135 970375 989528 1037068 1040820
38454A040820j3975L4399P5606N3100P845j2747l1307p0056q6306m2516K4800
$$ 1040820 1026845 1061244 1136850 1189950 1197795 1185048 1153741 1083685 997379 954863 979663
38443I79663O5258Q4360R9170Q5872L0185k5052l9847l4827m0213m1798k4053
$$ 979663 1044921 1129281 1228451 1314323 1344508 1319456 1279609 1244782 1204569 1162771 1138718
38432A138718o590O360M1957Q0485N1933l1511m8560L9470Q6690k3170j66059
$$ 1138718 1132128 1138488 1180445 1260930 1312863 1281352 1232792 1272262 1358952 1335782 1169723
38421A169723j42414K2296J23685Q3999J9973J1624j650n7729q1171k3838M4247
$$ 1169723 1027309 1049605 1173290 1257289 1277262 1288886 1287236 1229507 1148336 1124498 1168745
38410A168745N4214L0557N699m0173r5850r6487m8160m9602j15261j11793K7952
$$ 1168745 1222959 1253516 1259215 1219042 1123192 1026705 978545 928943 813682 701889 729841
38399G29841J59477J27531Q49m7590o510J68n1914o6164k3794k4398j04277j68200
$$ 729841 889318 1016849 1017698 970108 963598 963766 911852 845688 821894 797496 693219 525019
38387E25019j43014o9628k305O0094J00319O7638p107p673Q3701J24669L0465
$$ 525019 382005 312377 310072 370166 470485 538123 531016 523343 607044 731713 762178
38376G62178p1170l4810N8416K4266j17535j57178j7472J29046J23582L6008J5508
$$ 762178 691008 656198 714614 738880 621345 464167 446695 575741 699323 735331 750839
38365G50839N6235M7458k1504n5057k4261q476m9457q0672m4989R452J1905j9882
$$ 750839 807074 854532 833028 777971 753710 745234 695777 615105 570116 579568 591473 571591
38353E71591k1676R284K4401J6783K3609L9919J5869l7270k5005Q6842J76694
$$ 571591 549915 559199 583600 600383 623992 663911 679780 642510 617505 704347 881041
38342H81041J11739m4869q8879M7305J89383J57145O189p0067j2036O5267P5840
$$ 881041 992780 947911 859032 906337 1095720 1252865 1259054 1188987 1176951 1242218 1318058
38331A318058N8357M9623J1595n1922m1181P5942J58868Q1627o2526r5625l0009
$$ 1318058 1376415 1426038 1437633 1385711 1344530 1420472 1579340 1660967 1598441 1502816 1472807
38320A472807k6925j03758q9056Q7034K50757K31257R4280O114r920l3566n8496
$$ 1472807 1445882 1342124 1253068 1340102 1590859 1822116 1916396 1922510 1912590 1879024 1820528
38309A820528j5622N5468K9122j01442j83244j07978M6933J28399Q4036j2870
$$ 1820528 1804906 1860374 1889496 1788054 1604810 1496832 1543765 1672164 1756200 1743330
38299A743330o0060j4970P6025J21719Q7910M1904N1012O8085m44j27991j73710
$$ 1743330 1683270 1668300 1744325 1866044 1953954 1995858 2046870 2114955 2114511 1986520 1812810
38288A812810p4057O7817J21801P6487J638n5164p8132n7756j9440k4326q0926
$$ 1812810 1738753 1806570 1928371 2004858 2006496 1951332 1873200 1815444 1796004 1771678 1690752
38277A690752j05327l3616P1131R7765M1380k04K6524O2096K6048p4598j52972
$$ 1690752 1585425 1551809 1622940 1720705 1762085 1761881 1788405 1850501 1876549 1801951 1648979
38266A648979j36141l7238O2038R9779R1937Q2114O0539n344p2029m8608M9541
$$ 1648979 1512838 1475600 1537638 1637417 1729354 1811468 1872007 1866663 1794634 1746026 1795567
38255A795567Q2178j6475j20491r0975J5466M4050j7446m9924k5059m3434j32108
$$ 1795567 1877745 1861270 1740779 1649804 1665270 1709320 1691874 1641950 1616891 1573457 1441349
38244A441349j71817r0749R639J2445m2588m6847L989L3979K2651Q794K78j9088
$$ 1441349 1269532 1178783 1188422 1200867 1158279 1111432 1115421 1149400 1172051 1180845 1181123 1162035
38232A162035k3715J7455O5968O9321O1754J02783J40923P1116p0882j18836k0594
$$ 1162035 1138320 1155775 1221743 1291064 1352818 1455601 1596524 1667640 1596758 1477922 1457328
38221A457328P0869K5146p9157j01923n7911m1712k4969Q8719K39336K38058N0774
$$ 1457328 1528197 1553343 1474186 1372263 1314352 1272640 1247671 1336390 1575726 1813784 1864558
38210A864558j23303j29940o0445o4898j02350l6706J03374J48638N8407j2039
$$ 1864558 1741255 1611315 1550870 1485972 1383622 1346916 1450290 1598928 1657335 1645296
38200A645296M6224J35175J11006o214q7734r0291q1031r5839q3691j1125O1283
$$ 1645296 1691520 1826695 1937701 1931487 1843753 1753462 1672431 1576592 1492901 1481776 1543059
38189A543059N4548j9164p2271n4403n871J1696K771K0268P4069J08890R0503
$$ 1543059 1597607 1578443 1506172 1451769 1445898 1457594 1460365 1480633 1554702 1663592 1754095
38178A754095O2502P2104Q0009J3667j05788j68530j18453j9162M7557Q3476J33073
$$ 1754095 1816597 1888701 1968710 1982377 1876589 1708059 1589606 1570444 1618001 1701477 1834550
38167A834550J91047K01174J26899m801j14303j23298l5742M0619J2990o0542
$$ 1834550 2025597 2226771 2353670 2348869 2234566 2111268 2075526 2116145 2129135 2068593
38157B068593l9290Q7007J66127J05541K639k5258j7616n9392j01189m7686M5938
$$ 2068593 2029303 2116310 2282437 2387978 2390617 2365359 2347743 2288351 2187162 2139476 2185414
38146B185414M2058m6949p0997J4813R2040Q6603O8215R5052J12876P5154K9439
$$ 2185414 2227472 2180523 2109526 2124339 2216379 2302982 2371197 2466249 2579125 2654279 2683718
38135B683718J4813k578k6580M356P7464P6323j3443k4758J29867K65469J72520
$$ 2683718 2698531 2695953 2669373 2673729 2751193 2827516 2814073 2789315 2919182 3184651 3357171
38124C357171n6674j56930o9101L5162O8310J20510K18693K34486J15688M622
$$ 3357171 3300497 3143567 3074466 3109628 3177938 3298448 3517141 3751627 3867315 3871937
38114C871937J0353L5628l0988r9938l0525J09087J27435Q792o7394j2350M7191
$$ 3871937 3882290 3917918 3886930 3786992 3756467 3865554 3992989 4001781 3934387 3922037 3969228
38103C969228j1180j08637r1410L6200J20312O5980n7970j21357p1407L9071J11653
$$ 3969228 3958048 3849411 3758001 3794201 3914513 3980493 3922523 3801166 3729759 3768830 3880483
38092C880483Q2789j3225o0057J4170J27241J27681K872q8422m3102K6543l2052
$$ 3880483 3963272 3950047 3889990 3904160 4031401 4159082 4161954 4073532 4030430 4056973 4024921
38081D024921j54107j37101M0241J62502R0611m1941m8874L9042O9849K7540J6757
$$ 4024921 3870814 3733713 3773954 3936456 4027067 3985126 3936252 3975294 4045143 4072683 4089440
38070D089440M9985L6883k3741j7241R4251K02663K17124J61848P2028o2360j84637
$$ 4089440 4139425 4176308 4152567 4135326 4229577 4432240 4649364 4811212 4883240 4820880 4636243
38059D636243j52159O1296K57111K33063L9275j05195r1808L435Q2185J25495
$$ 4636243 4484084 4545380 4802491 5035554 5074829 4969634 4877826 4881261 4963446 5088941
38049E088941J36462J00260L2951p239J1872O4382J13613J47050J57261J30429
$$ 5088941 5225403 5325663 5358614 5351375 5363247 5427629 5541242 5688292 5845553 5975982
38039E975982O7520n432n2280m7646l654K1582j2763m8363J9993J76118K52423
$$ 5975982 6043502 6038070 5985790 5938144 5934490 5956072 5943309 5894946 5914939 6091057 6343480
38028F343480J38893n3245j29557n3161N7525J19065J46226J55633J39589J30897
$$ 6343480 6482373 6429128 6299571 6246410 6303935 6423000 6569226 6724859 6864448 6995345
38018F995345J69922K06749J60529P6492Q2520J74084K00649J08851L2036O0033
$$ 6995345 7165267 7372016 7532545 7609037 7691557 7865641 8066290 8175141 8207177 8267210
38008H267210Q7926J6954m3967N3637K31653K78569J61258N9217R2701J85489
$$ 8267210 8355136 8372090 8328123 8381760 8613413 8891982 9053240 9112457 9205158 9390647
37998I390647K27281K25728K37433K56838K43985J96171J40202J00007R9073J44159
$$ 9390647 9617928 9843656 10081089 10337927 10581912 10778083 10918285 11018292 11117365 11261524
37988A1261524J89093J73688J17782J13781K01575L13314L70737L74639L62570
$$ 11261524 11450617 11624305 11742087 11855868 12057443 12370757 12741494 13116133 13478703
37979A3478703L38861K93724K45645K19694K17234K35769K75554L02098K63132
$$ 13478703 13817564 14111288 14356933 14576627 14793861 15029630 15305184 15607282 15870414
37970A5870414J82475J69304K72370L85677L79934K83187K38083L04014L97775
$$ 15870414 16052889 16222193 16494563 16880240 17260174 17543361 17781444 18085458 18483233
37961A8483233M26115L85571L22426K81344L11077M32355N67889N89374M80644
$$ 18483233 18909348 19294919 19617345 19898689 20209766 20642121 21210010 21799384 22280028
37952B2280028L77529L92693M79353N37429N72668O46052P24711P15108O28181
$$ 22280028 22657557 23050250 23529603 24067032 24639700 25285752 26010463 26725571 27353752
37943B7353752N82872O33425P12456P70929Q50693R67968J048532J059701J095585
$$ 27353752 27936624 28570049 29282505 30053434 30904127 31872095 32920627 33980328 35075913
37934C5075913J224772J348909J343177J262412J256354J332255J375619J385857
$$ 35075913 36300685 37649594 38992771 40255183 41511537 42843792 44219411 45605268
37926D5605268J495303J723883J908490J953845J981473K123030K320130K461101
$$ 45605268 47100571 48824454 50732944 52686789 54668262 56791292 59111422 61572523
37918F1572523K577970K747640K914428K999756L102353L375882L751153M004911
$$ 61572523 64150493 66898133 69812561 72812317 75914670 79290552 83041705 87046616
37910H7046616M105044M262433M597816M977149N265539N543224N936331O393516
$$ 87046616 91151660 95414093 100011909 104989058 110254597 115797821 121734152 128127668
37902A28127668O787723P126196P504343P934545Q370148Q833887R371100R916042
$$ 128127668 134915391 142041587 149545930 157480475 165850623 174684510 184055610 193971652
37894A93971652J0347648J0655758J0923552J1166396J1318883J1367798J1355714
$$ 193971652 204319300 214975058 225898610 237065006 248383889 259751687 271107401
37887B71107401J1238192J0870501J0176011R222922Q097058O796881N299910
$$ 271107401 282345593 293216094 303392105 312615027 320712085 327508966 332808876
37880C32808876L648524J918129J61194j580945l267832m887553o436716p854738
$$ 332808876 336457400 338375529 338536723 336955778 333687946 328800393 322363677 314508939
37872C14508939r041355r954068j0620092j1047277j1218768j1198966j1133493
$$ 314508939 305467584 295513516 284893424 273846147 262627379 251428413 240294920
37865B40294920j1082944j0946888j0623880j0170891r727594r347053q982912
$$ 240294920 229211976 218265088 207641208 197470317 187742723 178395670 169412758
37858A69412758q594038q179874p745892p305762o892820o515931o139764n757393
$$ 169412758 160818720 152638846 144892954 137587192 130694372 124178441 118038677 112281284
37850A12281284n429047n184208m940887m607155m223497l913806l717396l554834
$$ 112281284 106852237 101668029 96727142 92119987 87896490 83982684 80265288 76710454
37842G6710454l348737l102996k870338k704278k625892k579133k452456k216777
$$ 76710454 73361717 70258721 67388383 64684105 62058213 59479080 57026624 54809847
37834E4809847k001817j943243j988240j961797j804084j619816j497285j412505
$$ 54809847 52808030 50864787 48876547 46914750 45110666 43490850 41993565 40581060
37826D0581060j334054j289116j275754j226215j120074j034594j018828j011059
$$ 40581060 39247006 37957890 36682136 35455921 34335847 33301253 32282425 31271366
37818C1271366r50742q83079q71305q81985q44863p65227o93133o35383n78128
$$ 31271366 30320624 29437545 28566240 27684255 26839392 26074165 25381032 24745649 24167521
37809B4167521n43539n43175n29045m74811m46066m92196n29584m56453l39203
$$ 24167521 23623982 23080807 22551762 22076951 21630885 21138689 20609105 20152652 19813449
37800A9813449l37209m53950n18133m37990l26074l10586l52153l39168k68554
$$ 19813449 19476240 19022290 18504157 18066167 17740093 17429507 17077354 16738186 16469632
37791A6469632k25211k40413k73900l06694l57363m11626m14454l45346k48968
$$ 16469632 16244421 16004008 15730108 15423414 15066051 14654425 14239971 13894625 13645657
37782A3645657j79593j53916j64219j99086k37662k53199k41018k28509k43666
$$ 13645657 13466064 13312148 13147929 12948843 12711181 12457982 12216964 11988455 11744789
37773A1744789k78829k93292k55115j82815j38852j66362k34759k71656k51735
$$ 11744789 11465960 11172668 10917553 10734738 10595886 10429524 10194765 9923109 9671374
37764I671374k21032k19081k19291j85396j51444j78919k39505k17616o6931R2592
$$ 9671374 9450342 9231261 9011970 8826574 8675130 8496211 8256706 8039090 7972159 8064751
37754H064751R9118n1136j96642k08623j29509q0860r4046j02202p3905o7145
$$ 8064751 8163869 8112733 7916091 7707468 7577959 7497099 7403053 7300851 7226946 7159801
37744G159801j27881k03798k09700j41680p3542n6685p1677p4321m6982j268L3166
$$ 7159801 7031920 6828122 6618422 6476742 6403200 6346515 6274838 6200517 6153535 6152267 6185433
37733F185433J5898p2250j88799k48746k05181r7314n125L0467K8394J9279j959
$$ 6185433 6201331 6129081 5940282 5691536 5486355 5389041 5383916 5414383 5442777 5462056 5460097
37722E460097o3474j58773k21382j86255p9915j2483n1768j32578j32692k5183
$$ 5460097 5396623 5237850 5016468 4830213 4750298 4737815 4686047 4553469 4420777 4395594
37712D395594R0925J10436K8003q0934j39985j17063l2168N1097O8921K0203k9895
$$ 4395594 4486519 4596955 4624958 4544024 4404039 4286976 4254808 4305905 4374826 4395029 4365134
37701D365134k8423J369m884o8319j39775j51466q2466K1396Q5035O9721P212
$$ 4365134 4336711 4338080 4333196 4264877 4125102 3973636 3891170 3912566 3997601 4067322 4074534
37690D074534l9169m6205m7402p6877j18051j20170n6662L8296Q8862M4897n6388
$$ 4074534 4035365 3989160 3941758 3864881 3746830 3626660 3569998 3608294 3697156 3742053 3685665
37679C685665j13991p3113P332L1264j2201n2807m9540l1444k9354l7948n7033
$$ 3685665 3571674 3498561 3505893 3537157 3524956 3472149 3422609 3391165 3361811 3323863 3266830
37668C266830r6793j22824p9168j19m655j16290j81919p2189J05763J27421l9437
$$ 3266830 3170037 3047213 2968045 2967926 2963271 2846981 2665062 2592873 2698636 2826057 2786620
37657B786620j79805j14194P4835J63041O4203q6341j11529K234J04813P2247
$$ 2786620 2606815 2492621 2567456 2730497 2794700 2708359 2596830 2599064 2703877 2776124
37647B776124m5449j06994q2761q1279j50019j69115l9254J22289J23215j5758
$$ 2776124 2730675 2623681 2540920 2459641 2309622 2140507 2101253 2223542 2346757 2330999
37637B330999q7606j1101O7372L0413l2927n912N5685M3250k751K1474P1111J1386
$$ 2330999 2243393 2232292 2299664 2330077 2297150 2291238 2346923 2390173 2387422 2408896 2480007 2491393
37625B491393j37827k00727j12614k2025o2608j59834j57360l6700R3815J64595
$$ 2491393 2353566 2152839 2040225 2018200 1955592 1795758 1638398 1601698 1695513 1860108
37615A860108J89957J77039R6272m1596j51636j53497n6588N0743Q4799L7191
$$ 1860108 2050065 2227104 2323376 2281780 2130144 1976647 1920059 1970802 2055601 2092792
37605B092792k8706n3392m6848n3106n7722O294J32915J97505J09833m0396r2001
$$ 2092792 2064086 2010694 1963846 1910740 1853018 1859312 1992227 2189732 2299565 2259169 2167168
37594B167168m0095l1624j22178j78411r4299K0659j967j20221j27718M1556K07927
$$ 2167168 2127073 2095449 1973271 1794860 1700561 1721220 1719253 1599032 1471314 1512870 1720797
37583A720797J92657N0849k2131N5776J76320J83891L4104j71274k70005j86356
$$ 1720797 1913454 1964303 1942172 1997948 2174268 2358159 2392263 2220989 1950984 1764628
37573A764628k0498M6774l6905j38574j27389m0386J0397J9428O2010J29634J25314
$$ 1764628 1744130 1790904 1753999 1615425 1488036 1447650 1458047 1477475 1539485 1669119 1794433
37562A794433K7311o3522o9871k9663m607P726K1799J2048k4697k9607K4690O3676
$$ 1794433 1821744 1758222 1688351 1658688 1654081 1661807 1683606 1695654 1670957 1641350 1666040 1729716
37550A729716J3409p3288p8917J3806R9495R0698J8908j3296N6890J90362K72263
$$ 1729716 1743125 1669837 1590920 1604726 1704221 1794919 1813827 1800531 1857421 2047783 2320046
37539B320046K16344O5683l8477j4549P0630J04501P0558L2647K3430K3654K6123
$$ 2320046 2536390 2602073 2563596 2549047 2619677 2724178 2794736 2827383 2850813 2874467 2900590
37528B900590M1009M7350J4090l1856l0140J4449K5976l5478j19593j55879j28702
$$ 2900590 2941599 2988949 3003039 2971183 2941043 2955492 2981468 2945990 2826397 2670518 2541816
37517B541816p0375k5843l1491q2345j17926q9686l5573k4714l8006P389J05302
$$ 2541816 2471441 2445598 2414107 2331762 2213836 2124150 2088577 2063863 2025857 2033246 2138548
37506B138548J37392M5909o8015q8449m5443m2504q2405p0867K7228J31536J53027
$$ 2138548 2275940 2321849 2253834 2165385 2119942 2077438 1995033 1924166 1951394 2082930 2235957
37495B235957Q6398j5503j02640j46916j41530r9311l6075L7587R3183Q4947J2671
$$ 2235957 2322355 2306852 2204212 2057296 1915766 1816455 1780380 1817967 1911150 1996097 2008768
37484B008768m7543l2749P682k8490j43412k19758j67113k0747J23996K05322
$$ 2008768 1961225 1928476 1936158 1907668 1764256 1544498 1377385 1356638 1480634 1685956
37474A685956J93166P3622r8835j91416j23569J3564N2706l4165r9891k6985J11279
$$ 1685956 1879122 1952744 1853909 1662493 1538924 1552488 1605194 1571029 1471138 1444153 1555432
37463A555432J55465P4547n143K4864J26716J83236J35579J8716r7943j58320
$$ 1555432 1710897 1785444 1780301 1805165 1931881 2115117 2250696 2269412 2171469 2013149
37453B013149j33254m1272M2535M0681m8254j44607j65098r0749L1703J26756
$$ 2013149 1879895 1838623 1881158 1921839 1873585 1728978 1563880 1473131 1504834 1631590
37443A631590J34621N6327l8319p4839m6388M825O1951J32942J78002J17645m8166
$$ 1631590 1766211 1822538 1784219 1709380 1662992 1667817 1729768 1862710 2040712 2158357 2110191
37432B110191j93767k00575r6239m176J0626j9862n5233r2519j20765j03984l8142
$$ 2110191 1916424 1715849 1619610 1615434 1626060 1606198 1550965 1458446 1337681 1233697 1195555
37421A195555K2361K5397j9365o1683o9040m8008k5497k1927l2779l2796p765
$$ 1195555 1217916 1243313 1223948 1162265 1093225 1045217 1019720 997793 965014 932218 924453
37410I24453K2358K5073o514m9026o9593m0800L8241J13417J01995j2305j37025
$$ 924453 946811 971884 965370 916344 846751 805951 844192 957609 1059604 1047299 910274
37399I10274j69247j11497l9742J1626N9300Q7532N0815l0021o5475k1643L1132
$$ 910274 741027 629530 589788 601414 660714 748246 799061 769040 703565 681922 713054
37388G13054K9824L877K653Q870j3546l9048j6087M7583R0140O6677j6832j08665
$$ 713054 742878 746755 749408 758278 744732 705684 689597 737180 827320 893997 877165 768500
37376G68500j28994l5763R8195J40280O7772K00J1004J4120o7651j32710n0229
$$ 768500 639506 603743 701938 842218 909990 910190 921194 935314 867663 734953 684724
37365F84724R7666J10948j8487r0900j0651Q5705P5489L2589N5339P8294K838
$$ 684724 782390 893338 874851 783951 773300 859005 934494 967083 1022422 1100716 1103554
37354A103554j11520j49902j39903j70479j84675n4767J59045K33501R8248n8510
$$ 1103554 992034 842132 702229 531750 347075 292308 451353 684854 783102 724592
37344G24592o5108J8601N2529L0749J6996j1707r6656j50414n5263J18608J68363
$$ 724592 659484 678085 730614 761363 778359 766652 669996 519582 464319 582927 751290
37333G51290M7299o7644m8217O686l4148j00871m3297R5584J16822k7773j46605
$$ 751290 798589 730945 682728 689414 655266 554395 511098 606682 723504 695731 549126
37322E49126q4664N9861R7241J5735m0158R50O7615Q7352P0173L8268j4953o5225
$$ 549126 464462 524323 621564 637299 597141 598091 665706 753058 823231 861499 846546 781321
37310G81321n6063K297K1760k9984p2467m3340M847R968J0154N1880P2431j021
$$ 781321 725258 727555 749315 719331 646864 603524 608371 618339 628493 680373 752804 751783
37298G51783r7542r2829j6927j1598q8548j05209j3138M8540j3114q1237k1831
$$ 751783 654241 561412 544485 532887 444339 339130 325992 374532 361418 280181 258350
37287B58350R0932R5223l27m4990J1738O9449O2583M7308P7318J17170J20233
$$ 258350 349282 444505 444178 399188 410926 480375 542958 590266 667584 784754 904987
37276I04987R4358N0199k8080j19641j56051j19460p9390q4138q4239j9531P6424
$$ 904987 999345 1049544 1021464 901823 745772 626312 546922 462784 378545 359014 435438
37265D35438J20443Q6601J6464m1368n7492k6216J3098n41o4299r8351o4098l4397
$$ 435438 555881 642482 658946 617578 560086 533870 546968 546427 482128 383777 319679 285282
37253B85282p7386j29692q2743L9946J02640M9277l2954n9989n6379o8565o2820
$$ 285282 207896 78204 -4539 35407 138047 187324 154370 94381 38002 -30563 -93383
37242i3383J4167J23143J60528Q8381k0543p3270n5790k7882l5502m9556r702
$$ -93383 -79216 43927 204455 292836 272293 199023 143233 115351 79849 30293 20591
37231B0591P2708R6250n658j47885j68289k6479J34330J53163L3061p8293n8855
$$ 20591 93299 189549 183891 36006 -132283 -158762 -24432 128731 161792 83499 24644
37220B4644P0275J79104J56281J4275j22181j43640o3029K8653Q3827J13143J02162
$$ 24644 94919 274023 430304 444579 322398 178758 115729 144382 228209 341352 443514
37209D43514J6737r2835j09118k2327K6311l9635q7768J9618J71567J40805o5164
$$ 443514 460251 367416 258298 235971 262282 222647 134879 154497 326064 466869 401705
37198D01705j86989q0377Q5243Q1844p1228j76046j28660O218J29818J90504J59106
$$ 401705 214716 134339 219582 301426 230198 54152 -74508 -68290 61528 252032 411138
37187D11138M1181q1761j11365m5910K5250L9097J1763j9251l8030k9490K0087
$$ 411138 452319 370558 259193 213283 238533 277630 289393 270142 232112 202622 222709
37176B22709Q2632R8218M8590j2970k3363J9694N6360K2513q0690j63963j28955
$$ 222709 305341 403559 452149 439179 415816 435510 491870 514383 433693 269730 140775
37165A40775L963R4189N5027k5132j3565O5580P6955R24k4520Q2496K20498K52461
$$ 140775 144738 238927 293954 268822 255257 320837 397792 398716 374196 456692 677190 929651
37153I29651J75164O7903l3574j21584j50326q6631J9399J00475J61975K21648
$$ 929651 1104815 1172718 1139144 1017560 867234 780603 800002 900477 1062452 1284100
37143A284100K17751R0650p9138j38849o4851J4974M366o2433j14362j25774q2537
$$ 1284100 1501851 1592501 1513363 1374514 1309663 1324637 1329003 1266570 1152208 1026434 943897
37132I43897K2692J21653J02812l2967j43328j30594o4624n0288o7105l6438K9502
$$ 943897 966589 1088242 1191054 1158087 1014759 884165 819541 769253 702148 665710 695212
37121F95212N9095M9114M4560K6286n7525j59933j62177n1626L8311N945r0467
$$ 695212 754307 803421 847981 874267 816742 656809 494632 443006 481317 487262 396795
37110C96795j28915p5663Q103N4305L6061k6374o8979l6242L8258N3161k4440
$$ 396795 267880 192217 200320 254625 290686 264312 195333 159091 197349 250510 226070
37099B26070j01002q1828J465N0547M0324K4330K9927K6765r784o9707j34446
$$ 226070 125068 43240 44705 95252 135576 159906 189833 216598 206814 137107 2661
37088B661j72412j28696L502J16002Q8544l3835p4283L1330J35677R3541k9707
$$ 2661 -169751 -298447 -294945 -178943 -90399 -124234 -198517 -167187 -31510 62031 32324
37077C2324o7282P943P9233Q0697N7264L6622j7723r3911j00823j2703N9922K2753
$$ 32324 -34958 -27015 52218 132915 190179 226801 209078 115167 14344 1641 61563 84316
37065H4316o2087p6253j8949J6471o846m0794m5445j7130N1760J42670J60593
$$ 84316 22229 -54024 -72973 -56502 -63348 -104142 -149587 -166717 -114957 27713 188306
37054A88306K8522j64916k30963j20326J6652N1340L8958Q3230J45773J07834
$$ 188306 216828 51912 -179051 -299377 -282725 -231385 -192427 -109197 36576 144410
37044A44410l4306j52967j52908o1267L8581Q4951N3746k7746p4475j5734J10081
$$ 144410 110104 -42863 -195771 -257038 -218457 -133506 -79760 -107506 -181981 -197715 -87634
37033h7634J82432J35595K9421k8719o27N4835N0867l2445j16782j11104l4890
$$ -87634 94798 230393 259814 231095 230468 285303 336170 303725 186943 75839 40949
37022D0949l704o3004j09795m8914M4917L3689o1834r0369j4817L0081l0567p5827
$$ 40949 37245 -25759 -135554 -184468 -139551 -105862 -167696 -258065 -272882 -242801 -273368 -349195
37010c49195J6166J54002J48712j5375j59665j48595l3352N8895Q5581R0967J02142
$$ -349195 -333029 -179027 -30315 -45690 -205355 -353950 -387302 -328407 -242826 -151859 -49717
36999d9717Q4642N517r1006j07063r483J02596R9657j3045r6084n7322L7283P2465
$$ -49717 34925 40442 -50564 -157627 -167110 -64514 35143 22098 -73986 -131308 -94025 -21560
36987b1560L6703N738K0256M7819M2868p959p9299j08055l8527Q9336J43379N0015
$$ -21560 15143 20881 41137 88956 131824 123865 44566 -63489 -102016 -12680 130699 180714
36975A80714r9334j55059q2792L3043J08798J06952J6943j07342j36067r267J37782
$$ 180714 81380 -73679 -156471 -123428 -14630 92322 109265 1923 -134144 -143411 -5629
36964e629J28953N047l2319O2640J06998j0342j42516j14722J3092O5743K3764
$$ -5629 123324 128371 96052 158692 265690 255348 112832 -1890 11202 76945 100709
36953A00709L375L2757K7308l0145m9975L058M6264J7285l2094k7544K5490P4827
$$ 100709 104084 136841 164149 134004 84029 87087 133351 150636 118542 90998 116488 191315
36941A91315Q9764N9496j7126j06783j56881j57136j34536q0584L7399J69737
$$ 191315 281079 340575 323449 216666 59785 -97351 -231887 -312471 -275072 -105335
36931a05335J86053M6402j07238j14374R40P8396L7349n1128r5160q5790n2191
$$ -105335 80718 127120 19882 -94492 -93552 -15156 22193 -28935 -124095 -209885 -262076
36920b62076n05N7999P7888L3015l1860m8161m964N2051Q7373J02657J01629O7932
$$ -262076 -262581 -204582 -126694 -93679 -125539 -173700 -178664 -126613 -39240 63417 165046 232978
36908B32978n673q6558j21645q8874k3268J2411j3167p0379j03469r1466n9729
$$ 232978 227305 140747 19102 -69772 -93040 -80629 -93796 -164175 -267644 -359110 -418839
36897d18839l1273M906N7371R0685O1050j2669n7666l7338P930L1110M8838J01391
$$ -418839 -450112 -445206 -387835 -297150 -236100 -248769 -306435 -343773 -335843 -304733 -255895 -154504
36885a54504J70237J89657J37126O3322K1426P071j3522m9208q1650r4147q1133
$$ -154504 15733 205390 342516 405838 427264 434335 420813 371605 289955 195808 114675
36874A14675m7796j8481k4014n9216p4870l9611R241J0753l5774p0590n5151j5078
$$ 114675 66879 48398 24384 -34832 -109702 -149313 -140072 -129319 -165093 -235683 -290834 -305912
36862c05912P247O845J818q711m0051q0561q3899j9014P9571J31249R2301J0398
$$ -305912 -298665 -291820 -290002 -298713 -338764 -419325 -503224 -522238 -442667 -311418 -219117 -208719
36850b08719k5547J1317O3892Q2204R1795J30742J55265Q2218p1978j71778j23374
$$ -208719 -234266 -222949 -159057 -76853 14942 145684 300949 383167 311189 139411 16037
36839A6037j824M2678k1910p9524l2436O9319J03430L9076l2805k9423J8278J9671
$$ 16037 14213 56891 34981 -44543 -76979 -7660 95770 134846 102041 72618 90896 110567
36827A10567m7775j12021j06074m9063o402j237r42K2459N5269O6894M4499j162
$$ 110567 62792 -49229 -155303 -204366 -210768 -212005 -212947 -190488 -135219 -68325 -23826 -24988
36815b4988m3560n2535k0283K1135K6568j5746p6961j15740r3209J5054J72703
$$ -24988 -68548 -121083 -141366 -120231 -93663 -109409 -186370 -302110 -395319 -380265 -207562
36804b07562K61905J81824j2634j38443r0910L3765P1001j0598j05949j29887
$$ -207562 54343 236167 223533 85090 -5820 27945 98946 88348 -17601 -147488
36794a47488r4125m4748o340N097j5276k9394J4336J03510J65601J61419J20878
$$ -147488 -241613 -286361 -292701 -287604 -302880 -332274 -317938 -214428 -48827 112592 233470
36783B33470P6686K7502j5264j6478J4846J8780j3168o108O9012J13841L8102
$$ 233470 310156 337658 322394 305916 320762 339542 326374 320266 389278 503119 541221
36772E41221q6524j16862m4293P996k0102n7037l9475k099J0120J4293K4061Q005
$$ 541221 454697 337835 293542 301538 281436 224399 184924 182825 192945 207238 231299 239304
36760B39304k7067p883P1352Q0181p2099k61694k86516j43276k5180m2064q9938
$$ 239304 212237 204354 275706 355887 283788 22094 -264422 -407698 -432878 -474942 -564880
36749e64880m2730O2413J19089J27200J56562J93012J49789K4149p4313q0711
$$ -564880 -607610 -545197 -426108 -298908 -142346 50666 200455 224604 150291 69580
36739F9580o5037j10166j71166j37029j242J15848J24186P0330M8036N7109J9326
$$ 69580 4543 -105623 -276789 -413818 -415060 -299212 -175026 -104696 -56660 449 19775
36728A9775q0927j47720r4937L3406J12620Q4621O795l8808l1765N127O0392J29099
$$ 19775 -61152 -208872 -303809 -270403 -157783 -73162 -66367 -105175 -136940 -131813 -71421 57678
36716E7678J77290J57992O7509m1694j09468j08845m1810O7336J57234J49226
$$ 57678 234968 392960 460469 418775 309307 200462 158652 225988 383222 532448
36706E32448K9741j03691j36148p9770o2205j43959k16401j48766J3105R5555
$$ 532448 562189 458498 322350 242580 180375 36416 -179985 -328751 -315646 -220091
36696b20091L6659l1989K1323J48473K04238J43327N2601K1803N7188J03865R1152
$$ -220091 -183432 -215421 -194098 -45625 158613 301940 354541 376344 433532 537397 628549
36685F28549k1330j79778k47579j56188j6299J4119n0546n5311M3964J06596L6143
$$ 628549 607219 427441 179862 23674 7375 21494 -29052 -84363 -40399 66197 102340
36674A02340n7358k7493Q2199J15208M3161j3376J3890N7516N2547L7248O1111
$$ 102340 44982 17489 99688 214896 258057 244681 258571 316087 368634 405882 466993
36663D66993Q1354K7410p6289j25616o9591K2287M3730j6078n0627L5287J88582
$$ 466993 548347 575757 499468 373852 304261 326548 370278 354200 303573 338860 527442
36652E27442K47715J39781j6719o0571M244L3826l7889j08856o5599N6927J31801
$$ 527442 775157 914938 898219 837648 841892 875718 837829 728973 663374 720301 852102
36641H52102J01202J7150m5543n4429j2679N4820J03836R8508M6285j3123m7139
$$ 852102 953304 970454 924911 870482 857803 912623 1016459 1114967 1161252 1148129 1100990
36630A100990l9848J6324R8112J32711N8794p8097j43275o5568O1935Q6920r901
$$ 1100990 1061142 1077466 1175578 1308289 1367083 1288986 1145711 1080143 1142078 1228998 1219097
36619A219097r0959m6004O2081Q7154l693r9243j07537o8667o5134q5199n1768
$$ 1219097 1128138 1082134 1144215 1231369 1227676 1128433 1020896 952229 887095 801896 750128
36608G50128L5810P4145m636j24816j49658n0854N5153M8972n2538j29866j11866
$$ 750128 785938 860083 855447 730631 580973 530119 585272 634244 581706 451840 339974
36597C39974m2191J1536N1280J02573J27803P4913n349n01Q3358R6308l8128j85050
$$ 339974 297783 309319 360599 463172 590975 665888 660539 660038 743396 839704 801576 616526
36585F16526j76753m8631K7505o870n5448n3907m6164n6694l3874K6485K9539
$$ 616526 439773 391142 418647 411777 356329 302422 256258 199564 165690 192175 221714
36574B21714o9630j68825j57739p1740j6642r162R433N1078P3398O6416N6330
$$ 221714 152084 -16741 -174480 -246220 -262862 -272024 -262591 -211513 -138115 -71699 -15369
36563a5369M0079k798m5276l6129J6837N3025M4106J5168q538j8945m604K7078
$$ -15369 24710 21912 -23364 -59493 -42656 10369 54475 69643 61105 42160 37556 64634
36551F4634K5769l7216j00222q2649p500L1833J3006l571L981J11J018O9533J64757
$$ 64634 90403 53187 -47035 -129684 -137184 -105351 -92345 -95916 -91935 -91824 -90806 -21273 143484
36538A43484J41063k5332j46977q0465M9019L6752p8231q1452N7451J22431p73
$$ 143484 284547 259215 112238 31773 80792 117544 39313 -42139 15312 137743 136970
36527A36970j27527n4347J23761J54105n184j50743j43750o6018l3220k1218L3587
$$ 136970 9443 -44904 78857 232962 227778 77035 -66715 -132733 -165953 -187171 -153584
36516a53584Q7407O3175k422r573M1382N4084k603m7215k1407K1730R895l8330
$$ -153584 -66177 -3002 -5424 -14997 26385 80469 77866 30651 9244 30974 40869 2539
36504B539n1394p862N1837Q9796R9268Q2922M3902p25k3265r061K8225N3634L8994
$$ 2539 -48855 -56717 -4880 84916 184184 267106 311008 310283 287018 277957 306182 359816 398810
36491C98810l754k8194j3535k706m4919j14990j38814r1951j7536M8816J03470
$$ 398810 395056 366862 353327 350621 305702 190712 51898 -40053 -57589 -8773 94697
36480I4697J21198O0864m8994j10135p9558k2353p91Q784L6802M3923l881n8050
$$ 94697 215895 276759 227765 117630 38072 15719 14928 23712 60514 104437 100556 42506
36468D2506o5312n5512o9269o9006j7476K5524k433l8705Q570Q8435P5664k1618
$$ 42506 -22806 -78318 -147587 -216593 -234069 -208545 -210978 -249683 -241113 -152678 -77014 -98632
36456i8632p6353n1108l5055o7235p9949m1708o247J3693P4796J67677K00295
$$ -98632 -174985 -226093 -261148 -328383 -408332 -450040 -456287 -442594 -367798 -200121 174
36445A74J58002J25465J04789q944j99018k69211j30516L9333O9534N0369J27201
$$ 174 158176 283641 388430 379486 180468 -88743 -219259 -179926 -110392 -60023 67178
36434F7178K05285J03576j05000j76404p6199j3663q4767j30718j8970J43499
$$ 67178 272463 376039 271039 94635 18436 4773 -79994 -210712 -229682 -86183
36424h6183J79069P1917o2485j27205q7875L4767J52031J69834J04526N0523J8788
$$ -86183 92886 164803 102318 -24887 -112762 -77995 74036 243870 348396 398919 417707
36413D17707o7137j85642j85780k1143J31189J03463k5714o3381J2788N2387k4354
$$ 417707 350570 164928 -20852 -41995 89194 192657 166943 103562 116350 168737 144383
36402A44383j25591j36114n7196K7770N6188K8103j6361m3218n4130o0337m1042
$$ 144383 18792 -117322 -174518 -146748 -90560 -62457 -78818 -122036 -176166 -236503 -277545
36391b77545K0481O5678J3330r6990j22261k8540L2488m9684j55407j06440O0134
$$ -277545 -257064 -191386 -178056 -275046 -397307 -425847 -393359 -443043 -598450 -704890 -644756
36380f44756J50549R5913K646n7884j23713j83044j26884N9996K09990J81271
$$ -644756 -494207 -398294 -395648 -453532 -577245 -760289 -887173 -827177 -617187 -435916
36370d35916M8749k0210O057L6968L7608N9517J10839J18759M6245m2216p1933
$$ -435916 -387167 -407377 -401320 -364352 -326744 -267227 -156388 -37629 8616 -33600 -105533
36359a05533n6218n7768q6204q5847k5742L8909K6676n8825j18473p7033K3044
$$ -105533 -161751 -219519 -305723 -391570 -417312 -378403 -351727 -410552 -529025 -606058 -583014
36348e83014Q3887P5966M4664J9023r410k3970J0626O4338N8571j592j4546M4524
$$ -583014 -499127 -423161 -378497 -359474 -368884 -392854 -382228 -317890 -259319 -260911 -275457 -230933
36336b30933N1353o9853j81148j07705Q4961J62899N8098m8517j3543P1363N5141
$$ -230933 -179580 -249433 -430581 -538286 -453325 -290426 -232328 -280845 -294388 -223025 -167884
36325a67884m1300r3064p3536n1856m5363j1195L9396M6753J9890K6691N6281
$$ -167884 -209184 -302248 -375784 -427640 -473003 -484198 -444802 -398049 -378159 -351468 -295187
36314b95187J7444q7243j12580K3505J86620J89368M5771o0849l8872J1534k2369
$$ -295187 -277743 -364986 -477566 -454061 -267441 -78073 -32302 -93151 -132023 -120489 -142858
36303a42858j03343j21138n1627L6830Q9061R9413O8340Q94n1914k2051Q1257
$$ -142858 -246201 -367339 -418966 -382136 -293075 -193662 -125322 -124428 -176342 -198393 -117136
36292a17136J57354J26091K0094o3971p8065n3486l9186m8005o1740o0778m2800
$$ -117136 40218 166309 186403 122432 44367 -9119 -48305 -96310 -158050 -218828 -261628
36281b61628k5308k7711m1977l2512J9164Q0615R7540M8804l9908j20287j43570
$$ -261628 -286936 -314647 -356624 -389136 -369972 -289357 -191817 -143013 -182921 -303208 -446778
36270d46778q7342P058N0912P580m7152k1659N5007P3174J6353n955O5437J30270
$$ -446778 -534120 -527062 -476150 -468570 -515722 -537381 -482374 -409200 -392847 -398802 -333365 -203095
36258b03095P2293n9523j09169j8058J17548J77401J28130J4254q8053j13947
$$ -203095 -130802 -190325 -299494 -317552 -200004 -22603 105527 119781 31728 -82219
36248h2219p3390o0474j30829j93142j17450O1041J63902J10271J1638j4724J068
$$ -82219 -155609 -216083 -346912 -540054 -657504 -596463 -432561 -322290 -310652 -325376 -324308
36237c24308j3047l4639k1975k3663q1961j06023J890J40220J06672r2915k12843
$$ -324308 -337355 -371994 -393969 -417632 -499593 -605616 -603726 -463506 -356834 -449749 -662592
36226f62592j02102Q4736J11428k2886j20941p4999K2970M9603Q424j5809J6268
$$ -662592 -764694 -679958 -568530 -591416 -712357 -787356 -764386 -714783 -706359 -722168 -705900
36215g05900O7552Q4729N1980j663k8094l585M0800M4037j5003q1193p6722O443
$$ -705900 -638348 -553619 -501639 -503302 -531396 -534981 -494181 -450144 -465147 -546340 -623062 -616619
36203f16619Q7824Q8039K2790k1273m75L7689L7342J9511L8334Q1266P9345J8585
$$ -616619 -528795 -440756 -417966 -439239 -439714 -402025 -364683 -345172 -306838 -225572 -146227 -127642
36191a27642k3741J7748J04970J47687J15156N1700j628m8101r0696r6053m1762
$$ -127642 -151383 -133635 -28665 119022 234178 285878 284250 236149 145453 49400 7638
36180G638K3150J8423n6378j02924n5699J2349j1202r6639r4980L5185J38962
$$ 7638 30788 49211 -7167 -110091 -165790 -153441 -164643 -261282 -356262 -321077 -182115
36169a82115P8439o2167r9292j2421N6132L5213M671K5607L8271j5962r1574j25127
$$ -182115 -103676 -165843 -265135 -277556 -221424 -186211 -181540 -155933 -117662 -133624 -225198 -350325
36157c50325j23317r8801k0039R6446J45091Q0788J7281O1163J32448R2497j4688
$$ -350325 -473642 -572443 -592482 -496036 -350945 -270157 -252876 -191713 -59265 33232 18544
36146A8544k2174Q0663J14659p646j35372r9324M7380J18888M9673n4509q5111
$$ 18544 -3630 77033 191692 184046 48674 -50650 -3270 115618 165291 110782 25671
36135B5671m8763r467J4043N3400J13522J29706L5853j23039k00169j16203K2896
$$ 25671 -23092 -32559 -18516 34884 148406 278112 313965 190926 -9243 -125446 -102550
36124a02550N2254l4398r1205l9693L4798L8541N301P332K6084M159m0113m6428
$$ -102550 -50296 -84694 -175899 -215592 -180794 -142253 -136952 -129620 -103536 -99377 -139490 -185918
36112a85918j5824J0205L5060P7352Q8932J0681j01336j16242p452J07519J28592
$$ -185918 -201742 -191537 -156477 -79125 9807 20488 -80848 -197090 -204542 -97023 31569
36101C1569Q0714L0212r756m0900l6126k129j2379j00130j78436j51155n4194
$$ 31569 112283 142495 132739 91839 55713 53584 41205 -58925 -237361 -388516 -442710
36090d42710O976J9706N4702J15815J23582O0167R442J4696J0014m7768q6337
$$ -442710 -435734 -416028 -361326 -245511 -121929 -61762 -52320 -37624 -27610 -75378 -161715
36079a61715m0386K7133K9027j477P274Q090q4152j91578j37445P1826K11547
$$ -161715 -202101 -174968 -145941 -147418 -140144 -132054 -216206 -407784 -545229 -473403 -261856
36068b61856J48871J9681k162M4995L2003k0054k682N6934L6120m9289n1567N1217
$$ -261856 -112985 -93304 -95466 -50471 -18468 -38522 -41204 15730 51850 2561 -49006 2211
36056B211R4234j6089j46461j32472m530Q5552P0375k707p5394j13636r1126k6242
$$ 2211 96445 80356 -66105 -198577 -203107 -117555 -47180 -49887 -125281 -238917 -330043 -356285
36044c56285N258l2246p0886m3876N324M427j5942J9495Q2760P6283k222n3603
$$ -356285 -351027 -383273 -454159 -498035 -492711 -488284 -504226 -484731 -401971 -325688 -327910 -381513
36032c81513m0355l0706n3418l4191O1315J27050N3256r7500j48377k5706J55168
$$ -381513 -421868 -452574 -505992 -540183 -478868 -351818 -298562 -396062 -544439 -570145 -414977
36021d14977K26387J42564P252m9295k580N6601L9373l7138q2737m6919L8858
$$ -414977 -188590 -46026 -38774 -88069 -90649 -34048 5325 -31813 -114550 -161469 -122611
36010a22611J11067J16149K3133j34711k37752j85564l7381M3975J3122n07Q9730
$$ -122611 -11544 104605 127738 -6973 -244725 -430289 -467670 -423695 -410573 -411080 -321350
35999c21350J72804J10959k9632p0514L435L1090n3714j09945j9524J11094R9784
$$ -321350 -148546 -37587 -67219 -137733 -134298 -103208 -156922 -266867 -286391 -175297 -75513
35988g5513m5015j43277r9484q054J6649J910M1004J25757J48987O5694l0376
$$ -75513 -120528 -263805 -363289 -371343 -354694 -352784 -311780 -186023 -37036 28658 -1718
35977a718k8650N0010Q7980L8772j2562J5908P3046M8763n2770j05476m2847L9056
$$ -1718 -30368 19642 107622 146394 133832 149740 222786 271549 218779 113303 70456 109512
35965A09512J8019p3961r2425J3297J24001J07789j2524j01809q7108k7280j0893
$$ 109512 127531 53570 -38855 -25558 98443 206232 193708 91899 4791 -22489 -33382
35954c3382m2958o2679l8816l205L373k1060n3965p6220o8677j2763P5116J32231
$$ -33382 -76340 -139019 -177835 -181040 -177667 -198727 -252692 -328912 -397589 -410352 -335236 -203005
35942b03005J10076L5209k4952m3959m2252k7179R979L7082j531q4692j08910
$$ -203005 -92929 -57720 -82672 -126631 -168883 -196062 -186083 -149001 -150532 -235224 -344134
35931c44134l2598M6057K5814m5889n0834J6693N8343M4064M9611J06158J35113
$$ -344134 -376732 -330675 -304861 -350750 -401584 -384891 -326548 -282484 -232873 -126715 8398
35920H398Q0061o90l4580l7375m7235m2274n856N014m5297p6196o425Q8018O4516
$$ 8398 88459 87769 53189 15814 -31421 -73695 -79551 -74537 -119834 -196030 -202455 -114437 -49921
35907d9921o4195j40378r4620k4821j2554l382O3134J27568J10706N0969L7481
$$ -49921 -114116 -254494 -349114 -373935 -386489 -389871 -326737 -199169 -88463 -37494 -13
35896a3O3229M7045k8336q9789p4618P054R6344J21293L8769j00023j60718p5343
$$ -13 63216 110261 81925 -7864 -82482 -75428 20916 142209 180978 80955 -79763 -155106
35884a55106M8400N2724n3240j01868j006J40095J58421L3799j14066j71436j21998
$$ -155106 -106706 -53982 -107222 -209090 -210096 -70001 88420 122219 8153 -163283 -285281
35873b85281k9622K2554j941n3970m8473K1253N5131k5078j49619j66616l3471
$$ -285281 -314903 -292349 -294290 -348260 -396733 -375480 -320349 -345427 -495046 -661662 -695133
35862f95133J18310J38065L5025m4232n254Q1773Q4855j2780r4800o9470J5747
$$ -695133 -576823 -438758 -403733 -447965 -453219 -371446 -286591 -299371 -394171 -463641 -447894
35851d47894N2484K1663P960P5020J79634K22095J49025l074j39948j78672j11180
$$ -447894 -395410 -373747 -365787 -290767 -111133 110962 259987 256913 116965 -61707 -172887
35840a72887j0444M0306K3698j9147n2699o7392m8586J9762J06412J34793O4946
$$ -172887 -183331 -143025 -119327 -138474 -191173 -258565 -307151 -287389 -180977 -46184 18762
35829A8762n0772j19038r9327l1740J7127K5816L8510J05537J96963K09401R6385
$$ 18762 -32010 -151048 -250375 -282115 -264988 -239172 -200662 -95125 101838 311239 407624
35818D07624m2049o6814K0346Q8104O7855L3050N2181O8304K974r9958j35908
$$ 407624 365575 298761 319107 407211 475066 508116 560297 628601 631575 531617 395709
35807C95709r8542p1882q3374o8823Q463R3612J19999Q3903J4959o5475j27935
$$ 395709 297167 225285 141911 73088 81551 175163 295162 379065 394024 328549 200614
35796B00614j33573q5085l4833j0643K1516Q3950J23280P7189k1132o9306k6028
$$ 200614 67041 -18044 -52877 -63520 -42004 41946 165226 242415 221283 151977 125949
35785A25949M0512N1390J8635J1860M6859N6001j8310j34425j88926j35820l5507
$$ 125949 166461 217851 236486 248346 295205 351206 332896 198471 9545 -126275 -161782
35774a61782K3628K3094J2426L1314O7678R0544R2832Q6280O9669K4074n1951
$$ -161782 -138154 -115060 -102634 -71320 -3642 86902 179734 266014 335683 359757 307806
35763C07806j12906r8187j0958N7565K3646p5324j15996n0514K6809R545p9887
$$ 307806 194900 96713 85755 143320 166966 91642 -24354 -74868 -48059 -38514 -118401
35752a18401j35787j12965n4908m444L6642O6208P3433P5583R5976J02020L9631
$$ -118401 -254188 -367153 -422061 -426505 -389863 -323655 -250222 -174639 -78663 23357 62988
35741F2988n8373q1980K669Q5666N1222p6391j80531j93457j27782j3858J14003
$$ 62988 4615 -77365 -74696 10970 62192 -14199 -194730 -388187 -515969 -529827 -415824
35730d15824J90182J58840N2704k6600k2088K5482M8071L3606J8432K4311L0441
$$ -415824 -225642 -66802 -14098 -40698 -62786 -37304 10767 44373 62805 87116 117557
35719A17557N299m7365q3318o4002l039M5975M5077j11n9199r7021q4380k8741
$$ 117557 122856 75491 -7827 -71829 -74868 -28893 16184 16073 -43126 -140147 -224527 -253268
35707b53268J1376o213k8118L5886J61786K06443R7536n5724j09401o8308l7052
$$ -253268 -241892 -248105 -276223 -240337 -78551 127892 225428 169704 60303 -8005 -45057
35696d5057n0352n7711l9831l0748l7351l3595k6009l5989l2319K2300P4952M4038
$$ -45057 -95409 -153120 -192951 -223699 -261050 -294645 -320654 -356643 -388962 -366662 -291710 -247672
35684b47672l3327m1435K3280M1345k5533o6432p637P6207J05776J10655J12998
$$ -247672 -280999 -322434 -299154 -257809 -283342 -349774 -357411 -281204 -175428 -64773 48225
35673D8225M1576j20151k28851j65885k3265M0322L0993M5960O2819j194q2553
$$ 48225 89801 -30350 -259201 -425086 -448351 -408029 -377036 -331076 -268257 -269451 -352004
35662c52004m1583Q2349J04595m757p2437j6121K7789m8209j43187j27578l7526
$$ -352004 -393587 -311238 -206643 -211400 -283837 -299958 -272169 -320378 -463565 -591143 -628669
35651f28669L2289Q4904J40397J30735J8797q7601q6486m8130p9526j17377l3553
$$ -628669 -596380 -511476 -371079 -240344 -221547 -309148 -395634 -443764 -523290 -640667 -674220
35640f74220J19720J63170O4649k1744M800P6754J04218Q9446O0834J6739k8518
$$ -674220 -554500 -391330 -326681 -348425 -343625 -266871 -162653 -73207 -12373 4366 -24152
35629b4152m4881n2754r1021j18454o2894L4261O0661K5327M7197J26477J13465
$$ -24152 -69033 -121787 -212808 -331262 -394156 -359895 -299234 -273907 -226710 -100233 13232
35618A3232k7179j13048k1302J04415Q0160l2062n4846l101l9354j69671k09609
$$ 13232 -13947 -126995 -148297 -43882 36278 4216 -50630 -53731 -93085 -262756 -472365
35607d72365p2879R5292J28143L5918o6198j10849r3904k9431M6557R0875J11882
$$ -472365 -545244 -449952 -321809 -285891 -352089 -462938 -556842 -586273 -539716 -448841 -336959
35596c36959J51284J86481J37065N094q4762m7565L8104M4903k6076o8976l5364
$$ -336959 -185675 806 137871 142965 58203 10638 48742 93645 67569 -1407 -36771
35585c6771J6742K6208M074p431Q30J926k9219q1565j02223m1402P6250J47628
$$ -36771 -20029 6179 10253 2822 3652 5578 -23641 -105206 -207429 -248831 -172581 -24953
35573b4953R5379l2748j06773o0540L5710O0749k0504j22793j36769m2731P9239
$$ -24953 70426 37678 -69095 -129635 -93925 -33176 -53680 -176473 -313242 -355973 -276734
35562b76734J41191J26257P2416J1715m3582p7358p8169o6959p3267q3186n5344
$$ -276734 -135543 -9286 63130 74845 31263 -46095 -124264 -191223 -264490 -347676 -403020
35551d03020P645N2958N3102L5605K1984l710l8405l5661J7540N8256M0356J7339
$$ -403020 -395375 -342417 -289315 -253710 -231726 -235436 -273841 -309502 -291962 -233706 -193350 -176011
35539a76011N8455J23393J12419K4721l1303K377N3589L4063m0400r2506r1541
$$ -176011 -117556 5837 118256 142977 111674 114051 167640 201703 161303 68797 -22744
35528b2744o4860m0030l2117o3354j34011j79333j16570M4896J84365J93859R6461
$$ -22744 -87604 -127634 -159751 -223105 -357116 -536449 -653019 -608123 -423758 -229899 -133438
35517a33438L906k7389m3644q7203j08653m4591N6641P8027O165l6126K9692J16594
$$ -133438 -129532 -156921 -200565 -287768 -396421 -441012 -384371 -306344 -300179 -336305 -306613 -190019
35505a90019J07800L7002K3211P4638R1369M9953L7048P1878M8064p2704j49061
$$ -190019 -82219 -45217 -22006 52632 144001 193954 231002 302880 350944 278240 129179
35494A29179o3789O8210N2363q7413j39863k7379Q2189L2957j03793j63274j19539
$$ 129179 65390 133600 185963 98550 -41313 -68692 13497 46454 -57339 -220613 -340152
35483c40152o6014l6726K0801J13887J63652J17471K2231m5376o6183o6043n7861
$$ -340152 -406166 -442892 -422091 -308204 -144552 -27081 -4850 -50226 -116409 -182452 -240313
35472b40313l2064J3206N8686P9597O9563N1029N1449N9390K6700n7960j20886
$$ -240313 -272377 -259171 -200485 -120888 -51325 -296 51153 110543 137243 79283 -41603
35461d1603p8549M1492J09689M5088q4337j41157p2034M6693J01662N7275j6732
$$ -41603 -120152 -78660 31029 76117 -8220 -149377 -221411 -174718 -73056 -15781 -32513
35450c2513k2651N5059J24933R6898L030l8749J3986O6578J9561r7132j78290
$$ -32513 -55164 -105 124828 221726 224756 186007 199993 266571 286132 189000 10710
35439A0710j85451j59747j17787k4517J16712K22656K18215J22576J3666o1866
$$ 10710 -174741 -334488 -452275 -476792 -360080 -137424 80791 203367 217033 155167
35429A55167j11304j51199j73527j54642q4783J0670Q3193J03833Q1159K1885
$$ 155167 43863 -107336 -280863 -435505 -520288 -509618 -426425 -322592 -241433 -219548
35419b19548r1592k35720k91993j53442J02959K50770J75157J7669j5897P7170
$$ -219548 -311140 -546860 -838853 -992295 -889336 -638566 -463409 -445740 -461637 -384467
35409c84467J26672M8395n2974n2585L2911R9629R3236L2258n1690j32693j74587
$$ -384467 -257795 -209400 -262374 -314959 -282048 -182419 -89183 -56925 -108615 -241308 -415895
35398d15895j49552o8955K9298J10404J44151J08111K0510n3413o1299j5525L6839
$$ -415895 -565447 -634402 -605104 -494700 -350549 -242438 -221928 -275341 -336640 -352165 -315326
35387c15326P0791Q2419O2020R377m5768p8366r9826j14251q0149J8257R4560
$$ -315326 -244535 -162116 -100096 -90719 -136487 -214853 -314679 -428930 -509079 -490822 -396262
35376c96262N0239o5885r8164o255P1175L2171k7263K8288J47286J65891O1507
$$ -396262 -346023 -411908 -510072 -516327 -445152 -412981 -440244 -411956 -264670 -98779 -37272
35365c7272k4537j5848Q38n4527j24530j24560p3677l0316J2817P5615J08181
$$ -37272 -61809 -77657 -76819 -131346 -255876 -380436 -454113 -484429 -471612 -395997 -287816
35354b87816O7438J8172M3309R3653N0878p6092j44177p7385L7912Q6158N2814
$$ -287816 -220378 -202206 -158897 -65244 -14366 -90458 -234635 -312020 -274108 -187950 -135136
35343a35136r905n5950m8877J9815P8031K8301j00593j52927n5335P1024Q6027
$$ -135136 -145041 -200991 -249868 -230053 -152022 -123721 -224314 -377241 -432576 -361552 -275525
35332b75525K4372J1207O2980R6578Q5145P2742N9362K282p2292q3790l5528k2184
$$ -275525 -251153 -239946 -176966 -80388 4757 77499 136861 139143 66851 -16939 -52467 -74651
35320g4651p7027j22217j01273n2817j4731L3717Q1876N3738n9356j34375q0909
$$ -74651 -151678 -273895 -375168 -427985 -442716 -408999 -327123 -273385 -332741 -467116 -548025
35309e48025J5216K0142m7532o6408r725M2464O0805R1440J20013N8586q8192
$$ -548025 -532809 -512667 -560199 -626607 -636332 -593868 -533063 -441623 -321610 -263024 -351216
35298c51216j73210r6506N3049J25745J00618N9401L9196J8077Q093M7002J00912
$$ -351216 -524426 -620932 -567883 -442138 -341520 -282119 -242923 -224846 -216753 -169751 -68839
35287f8839Q0846k1315j02058q7203k7070k958o994J6865O0734O4937K2992q445
$$ -68839 12007 -9308 -111366 -198569 -225639 -228597 -235591 -218726 -157992 -93055 -70063 -78508
35275g8508r326k7713q5308j22016q5284k3220k1247p0268p1013K3988J34111
$$ -78508 -87834 -115547 -200855 -322871 -408155 -431375 -452622 -522890 -593903 -569915 -435804
35264d35804J44805M2172p4929r8077p042J16222J56131O7513p0320j22605m1777
$$ -435804 -290999 -248827 -323756 -421833 -428875 -312653 -156522 -89009 -159329 -281934 -323711
35253c23711P7591J07297K7966o5832q4395k8126L9217O1750K9996j9175l2418
$$ -323711 -246120 -138823 -110857 -176689 -261084 -289210 -249993 -188243 -158247 -177422 -209840
35242b09840M207L7642Q778n9221q1901l4635R120l135j2770M7052J08943M3837
$$ -209840 -205633 -167991 -159213 -218434 -300335 -334970 -325850 -328985 -341755 -294703 -185760 -141923
35230a41923j27733k18715j17982N3031J08324M2856j942K7703L7390k9760q0505
$$ -141923 -269656 -488371 -606353 -553322 -444998 -402142 -404084 -376381 -338991 -368751 -449256
35219d49256j5666J02265J21379K559j36604j72883j02479m405O4111J02230J20491
$$ -449256 -464922 -362657 -241278 -238719 -375323 -548206 -650685 -655090 -590979 -488749 -368258
35208c68258J00372J9958q2684j07013M246J65481K15866J05389m7316j13960
$$ -368258 -267886 -247928 -330612 -437625 -433379 -267898 -52032 53357 6041 -107919
35198a07919j02531q7618p0482r393N6305L8708m3840o6644J7412J04216R8063
$$ -107919 -210450 -298068 -368550 -377943 -321638 -282930 -326770 -393414 -376002 -271786 -173723
35187a73723M3119K3232J9071l5746j13493j19559m3521J7526l589o3671q7634
$$ -173723 -130604 -107372 -88301 -124047 -237540 -357099 -400620 -383094 -386683 -450354 -537988
35176e37988o2112j8868K6938Q0987J34751J60305J38751P8997O380o2087j23382
$$ -537988 -600100 -618968 -592030 -511043 -376292 -215987 -77236 1761 8141 -53946 -177328
35165a77328j63555j44494m9960N8855Q6648K3233l5426k2355M966l0893q2752
$$ -177328 -340883 -485377 -535337 -476482 -389834 -366601 -402027 -424382 -419416 -450309 -533061
35154e33061m1224P7295J22463J8766j17397j27831p574J19074J65768J48441
$$ -533061 -574285 -496990 -374527 -355761 -473158 -600989 -608563 -489489 -323721 -175280
35144a75280J08890N7711L369k4648j2104J0904J599m6857r9731j14738p6984
$$ -175280 -66390 -8679 -5310 -29958 -42062 -31158 -29559 -76416 -176147 -290885 -367869
35133c67869r429M6915O7545N9136L8884J0563k7168n7547n1228q25N9931P9740
$$ -367869 -377298 -330383 -262838 -203702 -164818 -154255 -181423 -238970 -290198 -291023 -231092 -151352
35121a51352L5972l7573p1041k2239P1040J18414P4362o052l6559j3375j3118
$$ -151352 -115380 -152953 -223994 -246233 -175193 -56779 17583 11531 -25028 -38403 -51521
35110e1521o7854j01432m0841N2042M6082o3157j22092l2729R0015P1704o2263
$$ -51521 -119375 -220807 -261648 -209606 -163524 -226681 -348773 -381502 -291487 -219783 -282046
35099b82046j11933N945J27414P0995j05770j89689r8102M0493Q6347N2703K9945
$$ -282046 -393979 -388034 -260620 -189625 -295395 -485084 -583186 -542693 -456346 -403643 -373698
35088c73698L5200J4503m2055o7227j4007O2619O4043j8993p7646k0101R6742
$$ -373698 -338498 -323995 -366050 -433277 -447284 -384665 -320622 -339615 -417261 -437362 -340620
35077c40620J31818M9434l6718l5725n444l7069r1677o0731N1413J26911J08680
$$ -340620 -208802 -159368 -196086 -231811 -237255 -274324 -366001 -426732 -375319 -248408 -139728
35066a39728N8093K7026j0943o9073r8597q2338p7474j06463j01729k8115L5841
$$ -139728 -81635 -54609 -65552 -134625 -233222 -315560 -393034 -499497 -601226 -629341 -593500
35055e93500K4447J06L7663Q0581M4302n877N8403J93464K07596L8384j49368
$$ -593500 -569053 -568947 -531284 -450703 -406401 -412278 -353875 -160411 47185 85569 -63799
35044f3799j90138j08077j9815K9958N3527M2759L223p134L6362O2587J3831m5841
$$ -63799 -253937 -362014 -381829 -351871 -298344 -255585 -252362 -259496 -223134 -160547 -146716 -192557
35032a92557l0578J5852j1253r2776j05585k5529K7940j4792o3532k1474N6963
$$ -192557 -223135 -207283 -218536 -311312 -416897 -442426 -414486 -429278 -492810 -514284 -457321
35021d57321N9986N80q219O7364J34571J12830L1249l7842p0601p8230n8304j0782
$$ -457321 -397335 -396755 -404974 -337610 -203039 -90209 -58960 -96802 -167403 -245633 -303937 -314719
35009c14719L1072L6740K8292M9290R4186J12538Q0041K1561l7568r3069j22648
$$ -314719 -283647 -246907 -218615 -169325 -75139 37399 117440 139001 101433 8364 -114284
34998a14284q3305J5480Q4768N8585q721j4615M0160N4369j2020o9500l6768L2273
$$ -114284 -197589 -182109 -97341 -38756 -47477 -62092 -21932 32437 20417 -49083 -85851 -53578
34986e3578L5505j7042k7534K4503M7430j1989p8694o2999M914K3662l5901j05082
$$ -53578 -18073 -35115 -62649 -38146 9284 -2705 -81399 -144398 -139484 -115822 -151723 -256805
34974b56805j17704p6806k8432j7260n8348j04967o1180J08548K88140L06715
$$ -256805 -374509 -451315 -479747 -497007 -555355 -660322 -721502 -612954 -324814 -18099
34964a8099J44857l0367o8447J7M8381K7332k2858p3581j20748j25038m7220N3940
$$ -18099 126758 96391 27944 27961 76342 103674 80816 7235 -113513 -238551 -285771 -231831
34952b31831O1017l6933j06602m1570J01023J85072J53852M6650q4838k01636
$$ -231831 -170814 -207747 -314349 -355919 -254896 -69824 84028 130678 45840 -155796
34942a55796k54653k17336j34324p7308n7302l1301J6171N6310P3725P9827P0040
$$ -155796 -410449 -627785 -762109 -839417 -896719 -928020 -911849 -855539 -781814 -701987 -631947
34931f31947L2167K067L9202J27276J70726J23184N1626L0069L9913L7099M8053
$$ -631947 -599780 -597713 -558511 -431235 -260509 -137325 -85699 -55630 -15717 21382 69435
34920F9435J04732J32439K4524j73868k77767j94313m0085K9986J7561J9625M7513
$$ 69435 174167 306606 331130 157262 -120505 -314818 -354903 -324917 -307356 -287731 -240218
34909b40218K6792m9929r4191o1881j5742q299K954N8872R4921K6313j03160j53645
$$ -240218 -213426 -263355 -357546 -419427 -435169 -443468 -440514 -381642 -286721 -260408 -363568 -517213
34897e17213o5894P4327J56207J55223J05231L1929l9873o2791j1874O1801P1330
$$ -517213 -583107 -508780 -352573 -197350 -92119 -60190 -100063 -162854 -174728 -112927 -41597
34886d1597n789r4439j00039j2301P5920O1260n3881j54020j38987m0214K7708
$$ -41597 -47386 -141825 -241864 -254165 -178245 -116985 -170866 -324886 -463873 -504087 -476379
34875d76379J5538j8008j3933O281j689k6738l0389j0459J4927N3607J14681J60417
$$ -476379 -460841 -478849 -492782 -486501 -488190 -514928 -545317 -555776 -540849 -487242 -372561 -212144
34863b12144J37374M4714o8839j55861j78275j02366M6931J52734J12758k0501
$$ -212144 -74770 -30056 -98895 -254756 -433031 -535397 -488466 -335732 -222974 -243475
34853b43475q7454k3072O8394O6506j6156q4195r2681o8207m0047j4413L283J2033
$$ -243475 -330929 -354001 -285607 -219101 -235257 -319452 -412133 -480340 -520387 -534800 -531517 -519484
34841e19484K9479O5129R4600R3353P6454P0095O5377M0035O787m323J951l381
$$ -519484 -490005 -424876 -330276 -236923 -160469 -90374 -24997 15038 21825 17502 19453 16072
34829A6072k1570l1716l9494o7075r6522q3693l7867k1335m3376k5489P1643J45536
$$ 16072 -5498 -37214 -76708 -143783 -240305 -323998 -361865 -383200 -426576 -452065 -380422 -234886
34817b34886O5866j27015k34113j34955O1679J53397P9252m1794p8081k1958M0820
$$ -234886 -169020 -296035 -530148 -665103 -603424 -450027 -370775 -412569 -490650 -512608 -471788
34806d71788M0223j8875p2285n7972J4378N9597J9575m1841j0661J03831J51172
$$ -471788 -431565 -450440 -522725 -580697 -566319 -506722 -487147 -528988 -539649 -435818 -284646
34795b84646L9073j25756j70222p3712L5167O9176O9655J02122J54523J66747
$$ -284646 -245573 -371329 -541551 -615263 -580096 -510920 -441265 -339143 -184620 -17873
34785a7873J04395j4363j22308j37131m6652M8657M4662k5865m4068J1786M0609
$$ -17873 86522 72159 -50149 -187280 -233932 -185275 -140613 -166478 -210546 -198760 -158151
34774a58151j0530o9438p4925p0774r6161r3516j6060O7621P7897N1620N9772
$$ -158151 -168681 -238119 -313044 -383818 -479979 -573495 -589555 -521934 -444037 -392417 -332645
34763c32645P6157M6113J1856L3217M8694k7294j18689q0137M8578Q0931j0884
$$ -332645 -256488 -210375 -198519 -165302 -116608 -143902 -262591 -342728 -294150 -213219 -224103
34752b24103m2081P3180J66445Q2885p8710j40851j09495q7755n2040P7333K14075
$$ -224103 -266184 -193004 -26559 56326 -22384 -163235 -272730 -360485 -412525 -335192 -121117
$$ [...]
##END NTUPLES=NMR SPECTRUM
##END=
