##TITLE=31Pdec_11P63
 D2O, 64 sc
 18.5.2023
##JCAMPDX= 6.0         $$ Bruker NMR JCAMP-DX V2.0
##DATA TYPE= NMR SPECTRUM
##DATA CLASS= NTUPLES
##ORIGIN= UXNMR, Bruker Analytische Messtechnik GmbH
##OWNER= root
$$ XWIN-NMR		Version 3.5
$$ Thu May 18 14:46:40 2023 Russian Standard Time (UT+4h)  she@DPX200
##.OBSERVE FREQUENCY= 81.013821
##.OBSERVE NUCLEUS= ^31P
##.ACQUISITION MODE= SIMULTANEOUS
##.ACQUISITION SCHEME= undefined
##.AVERAGES= 64
##.DIGITISER RES= 16
##SPECTROMETER/DATA SYSTEM= spect
##.PULSE SEQUENCE= zgpg30
##.SOLVENT NAME= D2O
##.SHIFT REFERENCE= (INTERNAL, D2O, 0, 248.564)
##AUDIT TRAIL= $$ (NUMBER, WHEN, WHO, WHERE, WHAT)
$$ ##TITLE= Audit trail, XWIN-NMR		Version 3.5
$$ ##JCAMPDX= 5.01
$$ ##ORIGIN= Bruker BioSpin GmbH
$$ ##OWNER= she
$$ F:/spectra/data/she/nmr/P31/1/pdata/1/auditp.txt
$$ ##AUDIT TRAIL=  $$ (NUMBER, WHEN, WHO, WHERE, WHAT)
(   1,<2023-05-18 14:45:25.71 +0400>,<she>,<DPX200>,
      <continue with go, POWCHK disabled, PULCHK disabled
       configuration hash MD5:
       00 E9 B6 7A A2 85 ED C7 34 08 36 98 17 FE 4E 26
       data hash MD5: 32K
       89 D6 4F 48 19 BE 79 BD EE 00 78 E1 52 42 FE 06>)
(   2,<2023-05-18 14:45:41.65 +0400>,<she>,<DPX200>,
      <Start of raw data processing
       efp BC_mod = 2 LB = 1 FT_mod = 6 PKNL = 1 PHC0 = -10887.53 PHC1 = 501.2849 SI = 64K 
       data hash MD5: 64K
       C2 D3 78 CE 92 D5 B8 CA F9 BF 23 F8 D0 EF CB 8D>)
(   3,<2023-05-18 14:46:06.17 +0400>,<she>,<DPX200>,
      <pk PHC0 = 18.90546 PHC1 = -31.20001 
       data hash MD5: 64K
       12 37 63 1F F2 19 DF 62 C8 A7 92 60 25 6B 5F 43>)
$$ ##END=
$$ 
$$ hash MD5
$$ 3D 47 14 47 47 1A 8A D7 9F 10 31 F5 29 16 3E 77
##$RELAX= 
##$RELAX= 
##$RELAX= 
##$RELAX= 
##$RELAX= 
##$RELAX= 
##$RELAX= 
##$RELAX= 
##$RELAX= 
$$ Bruker specific parameters
$$ --------------------------
##$DU= <F:/spectra>
##$EXPNO= 1
##$NAME= <P31>
##$PROCNO= 1
##$TYPE= <nmr>
##$USER= <she>
##$AMP= (0..31)
100 100 100 100 100 100 100 100 100 100 100 100 100 100 100 100 100 100 
100 100 100 100 100 100 100 100 100 100 100 100 100 100 
##$AQSEQ= 0
##$AQ_mod= 1
##$AUNM= <au_zg>
##$AUTOPOS= <>
##$BF1= 81.014009
##$BF2= 200.13
##$BF3= 200.13
##$BF4= 200.13
##$BF5= 200.13
##$BF6= 200.13
##$BF7= 200.13
##$BF8= 200.13
##$BYTORDA= 1
##$CFDGTYP= 0
##$CFRGTYP= 5
##$CHEMSTR= <none>
##$CNST= (0..31)
1 1 145 1 1 1 1 1 1 1 1 1 1 1 1 1 1 1 1 1 1 1 1 1 1 1 1 1 1 1 1 1 
##$CPDPRG= <waltz16>
##$CPDPRG1= <>
##$CPDPRG2= <waltz16>
##$CPDPRG3= <>
##$CPDPRG4= <mlev>
##$CPDPRG5= <mlev>
##$CPDPRG6= <mlev>
##$CPDPRG7= <mlev>
##$CPDPRG8= <mlev>
##$CPDPRGB= <>
##$CPDPRGT= <>
##$D= (0..31)
0 1 0 0 0 0 0 0 0 0 0 0.03 2e-05 3e-06 0 0 0 0 0 0 0 0 0 0 0 0 0 0 0 0 
0 0 
##$DATE= 1684406628
##$DBL= (0..7)
120 120 120 11 120 120 24 19 
##$DBP= (0..7)
150 150 150 150 150 150 150 150 
##$DBP07= 0
##$DBPNAM0= <>
##$DBPNAM1= <>
##$DBPNAM2= <>
##$DBPNAM3= <>
##$DBPNAM4= <>
##$DBPNAM5= <>
##$DBPNAM6= <>
##$DBPNAM7= <>
##$DBPOAL= (0..7)
0.5 0.5 0.5 0.5 0.5 0.5 0.5 0.5 
##$DBPOFFS= (0..7)
$$ [...]
##$SUBNAM2= <"">
##$SUBNAM3= <"">
##$SUBNAM4= <"">
##$SUBNAM5= <"">
##$SUBNAM6= <"">
##$SUBNAM7= <"">
##$SUBNAM8= <"">
##$SUBNAM9= <"">
##$SW= 501.771253377433
##$SWIBOX= (0..15)
0 1 3 0 0 0 0 0 0 0 0 0 0 0 0 0 
##$SW_h= 40650.406504065
##$TD= 32768
##$TD0= 1
##$TE= 0
##$TE2= 300
##$TE3= 300
##$TEG= 300
##$TL= (0..7)
0 120 53 12 22 120 120 120 
##$TP= (0..7)
150 150 150 150 150 150 150 150 
##$TP07= 0
##$TPNAME0= <>
##$TPNAME1= <>
##$TPNAME2= <>
##$TPNAME3= <>
##$TPNAME4= <>
##$TPNAME5= <>
##$TPNAME6= <>
##$TPNAME7= <>
##$TPOAL= (0..7)
0.5 0.5 0.5 0.5 0.5 0.5 0.5 0.5 
##$TPOFFS= (0..7)
0 0 0 0 0 0 0 0 
##$TUNHIN= 0
##$TUNHOUT= 0
##$TUNXOUT= 0
##$USERA1= <user>
##$USERA2= <user>
##$USERA3= <user>
##$USERA4= <user>
##$USERA5= <user>
##$V9= 5
##$VALIST= <valist>
##$VCLIST= <CCCCCCCCCCCCCCC>
##$VD= 0
##$VDLIST= <DDDDDDDDDDDDDDD>
##$VPLIST= <PPPPPPPPPPPPPPP>
##$VTLIST= <TTTTTTTTTTTTTTT>
##$WBST= 1024
##$WBSW= 4
##$XGAIN= (0..3)
0 0 0 0 
##$XL= 0
##$YL= 0
##$YMAX_a= 4036
##$YMIN_a= -5029
##$ZGOPTNS= <>
##$ZL1= 120
##$ZL2= 120
##$ZL3= 120
##$ZL4= 120
##$ABSF1= 0
##$ABSF2= 0
##$ABSG= 0
##$ABSL= 0
##$ALPHA= 0
##$AQORDER= 0
##$ASSFAC= 0
##$ASSFACI= 0
##$ASSFACX= 0
##$ASSWID= 0
##$AUNMP= <proc_1d>
##$AZFE= 0.1
##$AZFW= 0.5
##$BCFW= 0
##$BC_mod= 2
##$BYTORDP= 0
##$COROFFS= 0
##$CY= -3
##$DATMOD= 1
##$DC= 0
##$DFILT= <>
##$DTYPP= 0
##$F1P= 0
##$F2P= 0
##$FCOR= 1
##$FTSIZE= 65536
##$FT_mod= 6
##$GAMMA= 0
##$GB= 0
##$INTBC= 1
##$INTSCL= 6.047779e-11
##$ISEN= 30
##$LB= 1
##$LEV0= 0
##$LPBIN= 0
##$MAXI= 10000
##$MC2= 0
##$MEAN= 0
##$ME_mod= 0
##$MI= 50
##$NCOEF= 0
##$NC_proc= -5
##$NLEV= 6
##$NOISF1= 182.463
##$NOISF2= 159.3651
##$NSP= 0
##$NTH_PI= 0
##$NZP= 0
##$OFFSET= 248.5645
##$PC= 4
##$PHC0= -10868.62
##$PHC1= 470.0849
##$PH_mod= 1
##$PKNL= yes
##$PPARMOD= 0
##$PSCAL= 0
##$PSIGN= 0
##$REVERSE= no
##$SF= 81.0140089999694
##$SI= 65536
##$SIGF1= 159.3651
##$SIGF2= -187.1042
##$SINO= 113.3802
##$SIOLD= 16384
##$SREGLST= <1H.CDCl3>
##$SSB= 0
##$STSI= 65536
##$STSR= 0
##$SW_p= 40650.406504065
##$SYMM= 0
##$S_DEV= 0
##$TDeff= 32768
##$TDoff= 0
##$TI= <>
##$TILT= no
##$TM1= 0
##$TM2= 0
##$TOPLEV= 0
##$USERP1= <user>
##$USERP2= <user>
##$USERP3= <user>
##$USERP4= <user>
##$USERP5= <user>
##$WDW= 1
##$XDIM= 65536
##$YMAX_p= 227488944
##$YMIN_p= -142571890
$$ End of Bruker specific parameters
$$ ---------------------------------
##NTUPLES= NMR SPECTRUM
##VAR_NAME=  FREQUENCY,     SPECTRUM/REAL,   SPECTRUM/IMAG
##SYMBOL=    X,             R,               I
##VAR_TYPE=  INDEPENDENT,   DEPENDENT,       DEPENDENT
##VAR_FORM=  AFFN,          ASDF,            ASDF
##VAR_DIM=   65536,         65536,           65536
##UNITS=     HZ,            ARBITRARY UNITS, ARBITRARY UNITS
##FACTOR=    0.620285442955139, 1,           1
##FIRST=     20137.2065510682, 0,            0
##LAST=      -20513.1999529968, 0,           0
##MIN=       -20513.1999529968, -142571890,  0
##MAX=       20137.2065510682, 227488944,    0
$$ Real data points
##PAGE= N=1
##DATA TABLE= (X++(R..R)), XYDATA
$$ [...]
15576 -169615 -417147 -1065854 -1174123 -437302 359681 220526 -854455 -1842088 -1832032 -797553
15566 -797553 725142 2096365 2543654 1468849 -636532 -2185969 -2144066 -1243017 -800978
15557 -800978 -823893 -358054 562045 697724 -445404 -1729898 -2009151 -1581085 -1302650
15548 -1302650 -1187643 -833515 -551806 -965107 -1810278 -2177684 -1838879 -1435484 -1359339 -1298491
15538 -1298491 -1003926 -712902 -571061 -319402 116950 300371 -66411 -597308 -749438
15529 -749438 -580539 -566440 -858300 -1116788 -1017921 -612547 -189195 -11660 -194216 -622457
15519 -622457 -957299 -924992 -717344 -915555 -1777328 -2689530 -2685600 -1620762 -488979 -295673
15509 -295673 -905933 -1416759 -1424736 -1326458 -1428599 -1457820 -1133129 -607857 -59855 599414
15499 599414 1273276 1493645 1115604 692062 674840 739217 473306 253314 688002 1500817
15489 1500817 1751556 1062904 -26204 -821210 -965930 -320826 923569 1985147 1996909
15480 1996909 932388 -381470 -1161709 -1201800 -714106 -213404 -397394 -1467197 -2614908
15471 -2614908 -2842207 -2253945 -1850218 -2042353 -2147874 -1501966 -354008 584285 901776
15462 901776 588119 -105225 -708359 -865920 -728291 -653832 -644580 -572322 -706626 -1275013
15452 -1275013 -1728296 -1403412 -809349 -1130264 -2367559 -3178283 -2838288 -2136708 -1844875
15443 -1844875 -1525508 -601333 453466 873604 737815 526898 288195 13969 90605
15434 90605 525525 451631 -662020 -1924422 -2109779 -1313523 -577979 -334513 -191758 103724
15424 103724 468470 970376 1625893 1960333 1602832 1044053 967439 1126446 792375 75012
15414 75012 -173380 312236 859615 853191 370043 -147996 -282996 134451 667286 485729
15404 485729 -488279 -1187911 -893172 -421241 -764288 -1237862 -478752 1102299 1610340
15395 1610340 490070 -637935 -434458 366484 376062 -440401 -1073674 -951006 -262647
15386 -262647 607963 1254582 1249414 562164 -243215 -559704 -300121 147775 228626 -403558
15376 -403558 -1366105 -1635428 -768045 297474 496037 286707 853714 1949753 2100363
15367 2100363 1032652 186059 340303 458012 -262044 -791652 33470 1502199 2101851
15358 2101851 1663989 1062816 533490 -263721 -994054 -888603 -65779 550317 550471 343868
15348 343868 284956 340682 449465 457281 -18480 -907987 -1285680 -536289 499577 575855
15338 575855 -123774 -359150 200596 660101 513141 275804 305663 209709 -165522 -208307
15328 -208307 465029 1313142 1652970 1450059 938101 164356 -659958 -1048941 -972409 -1086939
15318 -1086939 -1739960 -2320035 -2154464 -1550486 -1330356 -1704171 -2196351 -2397280 -2211688
15309 -2211688 -1604067 -710765 -78033 -175433 -654123 -630811 178267 1087799 1399200 1258070
15299 1258070 1168438 998927 125000 -1391541 -2423443 -2041169 -764446 95449 189274
15290 189274 429912 1390387 2266429 2011219 867071 -30121 -217953 -230849 -492426 -738355
15280 -738355 -654413 -382202 -169441 -48540 -35949 -180071 -306269 -218676 -229948 -883460
15270 -883460 -1995898 -2637182 -2326487 -1586238 -971089 -281432 716497 1495590 1490831 1118509
15260 1118509 1154578 1390471 934701 -166185 -678066 92258 1204637 1349649 605570
15251 605570 158106 540735 979152 615734 -260234 -634202 -132384 513375 419082 -381658
15241 -381658 -1098140 -1276132 -1310653 -1666709 -1944472 -1279392 291220 1445966 985030
15232 985030 -676620 -1900443 -1592627 -136630 1341790 2057852 1835872 938749 -6394
15223 -6394 -352402 -86746 176587 99172 559 9913 -415246 -1418021 -1941959 -1130490
15213 -1130490 9837 -180393 -1338401 -1372706 274217 1558043 949088 -170731 225413
15204 225413 1556585 1694502 457623 -261803 274179 605495 -210579 -912957 -180975
15195 -180975 1116828 1273815 371636 68123 1182651 2744683 3357007 2594789 1087533
15186 1087533 -94033 -203059 463779 755047 56824 -830230 -830925 -209808 -128584 -798507
15176 -798507 -1172662 -611859 215317 516776 512558 733402 961658 742088 430099 713732
15166 713732 1286938 1061961 -137289 -1080073 -824349 -125641 -372604 -1571290 -2323587
15157 -2323587 -1762074 -621512 -100796 -368807 -707709 -649893 -328875 62865 487717
15148 487717 720934 391663 -429482 -1112594 -1192274 -895315 -694706 -629960 -419286 -71855
15138 -71855 22588 -355332 -913777 -1175123 -971070 -513933 -102651 126980 233220 366480
15128 366480 610438 823924 657867 -119365 -1226128 -1912797 -1593819 -470187 601785
15119 601785 929876 604417 257673 303937 534282 463423 -20680 -471812 -411516 61743
15109 61743 409748 406783 405569 645495 697389 94613 -744410 -923034 -370258 23363 -245846
15098 -245846 -598817 -426916 -70259 -80993 -145922 354585 1077994 1018931 48308 -767165
15088 -767165 -606268 73918 295825 -169339 -698316 -712998 -341388 -197313 -574894 -924550
15078 -924550 -394247 992525 2138540 2195986 1585131 1132678 757756 -71956 -992490
15069 -992490 -1076977 -448004 -250904 -782243 -966082 -232982 366985 -170329 -1095752 -1042763
15059 -1042763 -140519 309418 -101710 -446708 -71206 508879 593055 286407 81056 50086
15049 50086 -93789 -454146 -796339 -803623 -351046 376358 1025332 1414461 1617460 1612217
15039 1612217 1140239 211149 -523480 -355504 607949 1545163 1855920 1681761 1538303
15030 1538303 1707309 1956767 1698393 600107 -781752 -1318298 -595725 460343 711213
15021 711213 221516 -57383 237126 483151 128585 -587806 -1119719 -1236639 -993763 -573353
15011 -573353 -308460 -410567 -546952 -145319 758470 1450891 1462547 1077661 747272 485087
15001 485087 93000 -440854 -1012545 -1486247 -1542147 -927487 -88143 1509 -982508 -2172745
14991 -2172745 -2548136 -2054793 -1250155 -349524 702758 1564411 1690946 1139653 542193
14982 542193 283031 251806 352035 612292 755505 364001 -321103 -456454 170077 597713
14972 597713 -28536 -1111914 -1297232 -298463 782403 1014013 702424 562986 549237
14963 549237 178562 -388613 -420253 273189 1027042 1286096 1229976 1146802 834402 160375
14953 160375 -309655 -9232 573971 402970 -544959 -1081656 -444014 640256 1006524
14944 1006524 558701 73856 -77091 -233371 -592843 -807650 -595344 -224528 -143793 -458743
14934 -458743 -969700 -1455757 -1741869 -1714073 -1452189 -1186854 -1003485 -769390 -458258 -297094
14924 -297094 -385988 -396201 29504 654041 761611 -10525 -1175355 -1890293 -1853373 -1544113
14914 -1544113 -1562304 -1885894 -1958329 -1493116 -932694 -894369 -1316007 -1506607 -1074810 -449245
14904 -449245 -301484 -739749 -1311221 -1560929 -1310585 -613858 207299 659849 621170 634495
14894 634495 1173855 1733784 1327160 -14290 -979668 -595334 528869 1117848 881783
14885 881783 531590 475163 361569 -78323 -528684 -663958 -625418 -604263 -416252 123164
14875 123164 711268 846866 478805 68042 38199 341788 569355 436482 182092 383980
14865 383980 1209268 1991481 1922234 1138044 641388 979522 1476192 1140134 -3675 -989899
14855 -989899 -1212382 -1134178 -1512232 -2246682 -2425601 -1576784 -482771 -296741 -959693 -1172353
14845 -1172353 -214100 923792 900688 -26167 -413656 251963 1007397 1068523 850665 920368
14835 920368 1001558 681027 237225 45005 -117741 -471180 -665573 -538795 -664554 -1305342
14825 -1305342 -1652964 -1149359 -691232 -1153888 -1497652 -144715 2145176 2841142 1270108
14816 1270108 -331755 -61151 1177633 1491487 749160 122155 -24869 -257223 -690585
14807 -690585 -872686 -741765 -559260 -130218 849883 1866214 2054606 1515801 1162411
14798 1162411 1283388 1275987 876656 587831 604290 369239 -266790 -382864 694925 2039412
14788 2039412 2048847 502914 -1158455 -1607813 -933441 -24977 616682 1021504 1211136
14779 1211136 1133519 963425 928565 859366 385796 -380988 -840949 -688261 -226269 231354
14769 231354 684614 915990 372641 -832784 -1464506 -587680 966236 1541850 836385
14760 836385 90661 198389 771188 1203573 1465582 1462387 762647 -430851 -1056375 -660042
14750 -660042 -188872 -533813 -1136334 -970278 -164686 392882 478745 473186 350970 -134370
14740 -134370 -581745 -387669 143035 218080 -77623 35326 572749 706622 218713 -144213
14730 -144213 6874 143547 -81290 -230565 -25614 66156 -287655 -643123 -544857 -192873
14720 -192873 129923 546693 1021625 1093815 732919 677081 1283776 1822301 1634007 1200108
14710 1200108 1160406 1034264 75451 -1149305 -1372583 -592353 -77115 -354219 -533199
14701 -533199 -13887 377717 -268329 -1367031 -1581526 -692702 209892 275667 -200142 -544735
14691 -544735 -675740 -883919 -1067889 -771195 31090 671671 582814 81302 -7472 555986
14681 555986 1075804 757006 -390181 -1610469 -2125850 -1662067 -521618 628406 1203050
14672 1203050 1157214 916212 761128 495783 -132051 -962287 -1641979 -2059865 -2207473 -1823362
14662 -1823362 -688149 723249 1394015 830529 -292216 -821508 -349198 485866 871220
14653 871220 717925 524319 530605 380109 -267378 -1109473 -1491897 -1148255 -332566 614090
14643 614090 1412410 1697002 1286796 643977 505402 926660 1232217 1051874 759378 624197
14633 624197 269980 -511044 -1056150 -648016 393239 1110713 1072165 509180 -328479 -1228993
14623 -1228993 -1730893 -1569010 -1215965 -1232303 -1306649 -789078 34446 236022 -209623 -281425
14613 -281425 485408 1324994 1541076 1453113 1490433 1294135 505441 -265518 -145416 729566
14603 729566 1400549 1283817 582887 -234177 -817118 -1015421 -1037486 -1281879 -1652553 -1460280
14593 -1460280 -460020 525769 667061 351288 548893 1288092 1674943 1295058 671071
14584 671071 282120 -4039 -333584 -461695 -220175 216661 758361 1500434 2179730 2161235
14574 2161235 1314612 366723 -870 47682 -28008 -308864 -472670 -353291 -44411 303594
14564 303594 484339 312691 -38064 -131902 19220 -198435 -1030726 -1722745 -1464960 -589164
14554 -589164 -82034 -149735 -115557 295939 489515 71880 -396150 -202412 501812 1006232
14544 1006232 994139 692207 332945 -11173 -165966 98151 709516 1272349 1423878 1057698
14534 1057698 335500 -269414 -126437 938319 2221986 2737685 2249627 1363007 636873
14525 636873 143293 -24617 470882 1484338 2027175 1351731 97952 -414400 40400
14516 40400 331564 -349354 -1302793 -1256551 34533 1654612 2684279 2969458 2868542
14507 2868542 2692103 2439286 1884543 972215 183458 201688 1004296 1677108 1502938 845929
14497 845929 453788 300585 -110294 -554947 -201236 972151 1793971 1315346 -87885
14488 -87885 -1388679 -2014677 -1880647 -1041752 59390 550648 28875 -853442 -1255566
14479 -1255566 -1180297 -1057334 -823557 -233900 320324 272582 -42269 246861 1160699 1808517
14469 1808517 1750815 1449572 1212021 683510 -284438 -1173585 -1622723 -1901793 -2156838 -2016400
14459 -2016400 -1434908 -1087351 -1324302 -1517957 -1095162 -429734 18753 602677 1591726
14450 1591726 2197507 1679296 794112 786665 1337332 1000783 -418446 -1429255 -994328
14441 -994328 242014 1221777 1729998 1906409 1644680 1092103 787881 718792 159922 -965290
14431 -965290 -1567819 -978143 -82632 38914 -252743 49650 889157 1415971 1444518 1399011
14421 1399011 1167190 321225 -665323 -760286 -41354 232458 -482707 -1212650 -1050311 -503335
14411 -503335 -548063 -1117228 -1338828 -816059 52254 751492 1052619 912453 475835 90886
14401 90886 -35298 -100074 -367760 -743377 -960077 -1010116 -1080682 -1196122 -1218995 -1098567
14391 -1098567 -844342 -376234 268490 651637 269671 -707292 -1370837 -1031570 -84907
14382 -84907 409937 17798 -571090 -527908 -12713 168485 -151117 -271033 176807 577016
14372 577016 386448 176564 797346 1887648 2195140 1306869 98498 -675253 -1266022
14363 -1266022 -2003323 -2360987 -1675779 -285357 789496 1071779 944102 871413 848067
14354 848067 637417 177755 -331661 -569183 -348293 120180 317856 -75527 -833804 -1404975
14344 -1404975 -1347441 -550033 689472 1704607 1909658 1428181 1033038 1263437 1826632
14335 1826632 2053731 1702770 1107102 752791 907940 1462623 1949743 1902252 1315751 580258
14325 580258 -48077 -575792 -862469 -573381 277700 1181076 1738781 2008792 2090485 1898637
14315 1898637 1583765 1584562 1912804 1967419 1480215 1066527 1320798 1875242 1887814 1019974
14305 1019974 -483701 -2079262 -2829449 -1858690 336114 1812544 1379976 186446 50678
14296 50678 907116 1232609 460193 -590820 -1397577 -2170459 -2628035 -2052513 -838555
14287 -838555 -342666 -743645 -682578 345992 945688 141243 -848959 -547649 339664 64870
14277 64870 -1374604 -2257172 -1611111 -229245 683124 690990 15311 -742509 -805664 -31574
14267 -31574 611107 218920 -649767 -749104 -70539 215748 -294052 -667284 -276441 245455
14257 245455 228908 60800 321174 686996 541966 75043 -90238 14825 -197440 -853773
14247 -853773 -1395729 -1339010 -741439 35599 582278 537986 -84545 -689194 -671357 -225637
14237 -225637 -115692 -569948 -920390 -544330 338210 1154223 1785863 2334628 2437212 1620977
14227 1620977 323155 -276261 263677 1028447 1054231 588758 389767 343663 -256837 -1317726
14217 -1317726 -1877721 -1501421 -789965 -299265 121900 562159 555805 -24782 -351611 311343
14207 311343 1454491 1958951 1521839 777645 317495 242473 438759 681839 663685 415371
14197 415371 429791 920762 1399807 1511016 1671295 2117267 2008604 635191 -974806
14188 -974806 -1091486 197876 1010993 418774 -319740 167386 1391444 1974233 1566886
14179 1566886 811669 131349 -417024 -544551 25797 877037 1201456 739310 -48161
14170 -48161 -584902 -590270 -147826 263365 102639 -518419 -814751 -374052 224406 279890
14160 279890 -22937 -44401 303612 632680 813552 952054 903136 512456 139110 233844
14150 233844 550765 489718 108166 43909 461407 827505 789726 541179 195494 -430336
14140 -430336 -1127609 -1096788 80903 1701169 2597323 2295188 1246055 207669 -293445
14131 -293445 -101324 592372 1351759 1706809 1400788 614687 -33205 -36441 278647 1425
14121 1425 -1069156 -1912228 -1648180 -861346 -667259 -909393 -518210 490781 851368 164564
14111 164564 -304372 338495 1122558 825810 -7644 -17650 737737 1010547 502382 247382
14101 247382 754156 1145283 637756 -162173 -143729 729002 1381278 964585 -170573 -849076
14091 -849076 -391496 434878 131281 -1576623 -3008983 -2439296 -336815 1227037 1189553
14082 1189553 390299 -143819 -477879 -880902 -892607 -139297 763222 1030023 846136 873384
14072 873384 1151635 1315022 1396979 1503225 1128159 -116126 -1330834 -1090138 537177
14063 537177 1822069 1553299 437138 -157761 -40349 -80716 -743979 -1488677 -1530555 -715766
14053 -715766 380981 960371 636405 -214119 -743173 -407257 511877 1158082 861294
14044 861294 -246817 -1268691 -1315332 -401773 571273 890768 832286 1095765 1736090 2142734
14034 2142734 1908979 1184807 284079 -472561 -623493 4425 701804 499093 -435623
14025 -435623 -828096 -57292 928462 973039 246893 -278882 -291848 -229798 -286534 -190385
14015 -190385 161160 564646 918870 1147751 880394 -64091 -973779 -876753 17479 358490
14005 358490 -538694 -1680039 -1702914 -631558 314115 320010 -287420 -792761 -926663 -815865
13995 -815865 -603638 -424066 -466275 -725652 -823145 -409068 279866 621709 444586 256808
13985 256808 393633 365307 -403444 -1436151 -1550904 -416548 937315 1434022 1153831
13976 1153831 846115 826372 904829 958568 943035 634178 -34068 -619726 -754644 -819988
13966 -819988 -1362040 -2043732 -1970382 -995658 101677 767274 1150708 1308397 868001 -104996
13956 -104996 -730986 -413030 276452 408702 -69763 -512160 -565320 -346470 52798 553584
13946 553584 775544 419961 -108175 -103251 422589 753143 556027 288155 309387 259462
13936 259462 -241529 -779254 -635848 138590 729156 601566 63238 -277188 -180806 228024
13926 228024 744460 1116133 1098629 769635 548972 593650 423799 -400711 -1398221 -1556336
13916 -1556336 -663591 334425 544916 179162 40105 405811 909032 1221272 1304651 1124224
13906 1124224 635405 45999 -336772 -536404 -828714 -1249312 -1538800 -1567401 -1442535 -1180944
13896 -1180944 -651793 89468 732951 1032494 925439 388888 -462014 -1179063 -1318631
13887 -1318631 -984866 -613011 -264473 288971 781857 541862 -353745 -777127 36216
13878 36216 1348895 1852871 1311725 564444 222809 198432 387866 905470 1472699 1418236
13868 1418236 685117 150789 402112 771348 343141 -464556 -320621 984313 1943936
13859 1943936 1289484 -229411 -827822 -38286 840136 581256 -560730 -1497617 -1628343
13850 -1628343 -1139682 -527270 -202099 -182066 60322 958471 1889974 1602560 -5336
13841 -5336 -1386298 -1305951 -463723 -196205 -345129 228208 1449478 1934367 1130789 91445
13831 91445 -238078 -205148 -412434 -661948 -615482 -549600 -722649 -771843 -431121 -147153
13821 -147153 -323039 -625998 -697166 -849918 -1341773 -1638613 -1236194 -630161 -594093 -979772
13811 -979772 -1108105 -908300 -762327 -612180 -183430 212082 89407 -213680 42263 723609
13801 723609 1001969 761266 753692 1238441 1527607 1191665 753485 724626 761927 357402
13791 357402 -221926 -280335 341268 1072357 1196937 455633 -660914 -1164553 -528922 558582
13781 558582 933693 501036 320211 908431 1325943 598521 -638239 -868735 206459
13772 206459 1263985 1109191 1825 -1052782 -1614759 -1864982 -1846899 -1436973 -989116
13763 -989116 -1227279 -2187564 -2840126 -2282546 -964830 -126623 -206099 -501711 -396927 -128561
13753 -128561 -79378 -48489 274384 670108 806417 858713 1099918 1240889 888146 407286
13743 407286 535443 1184573 1409364 711703 -296576 -817913 -923948 -1276483 -2078697
13734 -2078697 -2724457 -2515410 -1521012 -558045 -270743 -437081 -484450 -494614 -1038349 -1944714
13724 -1944714 -2113468 -1045797 223891 456925 -205508 -862438 -1376421 -2075844 -2427029
13715 -2427029 -1532452 76268 687681 -183368 -1015940 -487167 791191 1501849 1464193
13706 1464193 1284013 1088984 733517 593351 980947 1217337 475701 -709281 -983129
13697 -983129 -159116 570997 598378 803432 1896907 2914220 2377808 424621 -1274920
13688 -1274920 -1612078 -1145677 -966219 -1252459 -1398292 -1039508 -372877 300061 802189
13679 802189 944342 660105 284757 245044 428610 325751 -134808 -436625 -336159 -277408
13669 -277408 -604087 -915983 -707887 -214815 -65281 -406862 -897404 -1271096 -1382633 -978359
13659 -978359 -20384 943885 1269961 935616 396735 31779 98017 707811 1296968 771921
13649 771921 -1000596 -2491893 -2328326 -1215205 -799412 -1160146 -1018653 -151510 261563
13640 261563 -169154 -378461 137119 424002 -61780 -401685 -31912 -7773 -1153703 -2327921
13630 -2327921 -2052656 -815797 -180090 -434600 -731130 -892236 -1381934 -1851056 -1400344
13621 -1400344 -231999 459747 322013 219930 637170 970141 693372 116551 -349029
13612 -349029 -723878 -962091 -800754 -407941 -387384 -862681 -1284214 -1356739 -1411578 -1643727
13602 -1643727 -1736412 -1498637 -1173660 -899658 -584885 -499798 -1155953 -2297587 -2874676 -2459329
13592 -2459329 -1887926 -1966447 -2296507 -2044580 -1227328 -472786 -256 344239 366600 -284669
13582 -284669 -1252093 -1543868 -660231 807304 1850551 2007009 1557859 1044940 748051
13573 748051 530204 104659 -554384 -1109663 -1173846 -638314 296375 1257025 1840033 1813172
13563 1813172 1285400 592368 6386 -336489 -320107 72809 561457 721550 419724 -89290
13553 -89290 -501669 -681702 -570024 -170672 337687 749472 1110545 1570159 1974210 1968535
13543 1968535 1535572 1026895 589747 15112 -675683 -960346 -442013 601729 1620361
13534 1620361 2445164 3178790 3657094 3460693 2461222 1078480 -54377 -561453 -491072
13525 -491072 -131464 299954 735613 1005643 750702 -91789 -857769 -709080 311042
13516 311042 1227446 1283722 718481 229054 130224 297196 483153 377117 -208082 -861256
13506 -861256 -785975 61844 584058 -80061 -1255868 -1612352 -982028 -352936 -237559 -156601
13496 -156601 165341 248264 -88927 -185664 278405 474881 -300060 -1256232 -1115644 -77850
13486 -77850 405125 -279938 -1202614 -1437634 -1208424 -1048567 -811253 -231870 241201 41507
13476 41507 -485792 -478339 181036 721733 585151 52339 -298099 -266126 -53934 36222
13466 36222 -117111 -211751 319840 1540251 2572554 2469864 1424564 499603 191957
13457 191957 -21 -474388 -847483 -770424 -649955 -931056 -1241828 -987399 -407685 -264367
13447 -264367 -664984 -937971 -629715 32495 672440 1115330 1145513 583604 -193336 -427505
13437 -427505 13924 365402 95242 -220392 256958 1290320 1814083 1387297 641492
13428 641492 209613 1184 -123184 268270 1412400 2465436 2320555 1196949 471420
13419 471420 742853 970323 44142 -1504868 -2114191 -1137072 524555 1568099 1478454
13410 1478454 663758 -64112 -143386 246440 409944 49742 -375509 -488631 -622478 -1048794
13400 -1048794 -1198699 -530013 320184 327553 -310225 -557524 -314346 -430176 -966356 -963423
13390 -963423 -207297 311519 207499 426454 1392100 1907511 972995 -557945 -1324661
13381 -1324661 -1368527 -1446911 -1449963 -919236 -349970 -498150 -957760 -834717 -359369 -446100
13371 -446100 -1061282 -1405984 -1355144 -1325292 -1069558 -108038 890664 749290 -267870 -724372
13361 -724372 -280371 -86877 -687412 -1119324 -582154 403399 1081324 1502242 1910300 2135134
13351 2135134 2099457 2000111 1629448 494223 -1090987 -2056976 -2003750 -1539296 -1052076 -378832
13341 -378832 147838 -196125 -1020178 -995133 -46070 321269 -408608 -720219 300739 1139952
13331 1139952 239673 -1338732 -1517032 -298693 726820 1124727 1756395 2638561 2757490
13322 2757490 2008436 1466210 1481249 1109751 -156923 -1440402 -1743232 -1125761 -209120
13313 -209120 606708 1078465 1049105 765664 687083 847465 950691 1004325 1162401 1083855
13303 1083855 315398 -735924 -1129930 -732706 -331145 -360397 -475492 -507164 -802063 -1305776
13293 -1305776 -1287958 -429667 635516 1279314 1569063 1586126 968354 -209797 -898653
13284 -898653 -277740 1001276 1593000 1133799 378863 -33977 -93383 210306 1085504 2245588
13274 2245588 2755004 2104850 1036211 693561 1106305 1158179 209312 -905364 -1034435
13265 -1034435 -411961 -310663 -1029937 -1277449 -66229 1645963 2130355 1210451 347455
13256 347455 517245 1071623 990497 388284 197985 830171 1703391 1954512 1280390 149291
13246 149291 -637809 -646852 -144489 289716 375408 220734 545 -147368 -40826 364653
13236 364653 776681 876495 719014 474590 -18117 -908123 -1698938 -1678136 -1039926 -839484
13226 -839484 -1563421 -2404491 -2362509 -1522573 -749364 -536872 -709686 -961518 -1088156 -829629
13216 -829629 -91734 634544 618435 -152585 -797687 -631270 -80612 -58854 -615907 -857950
13206 -857950 -342608 140030 -266276 -1038804 -901088 206821 815541 -56662 -1474960
13197 -1474960 -1865081 -1075362 -309811 -378480 -921443 -1264439 -1206522 -864235 -403711 -80073
13187 -80073 -38079 -7717 325883 683392 513064 -49573 -248823 123289 364790 -8745
13177 -8745 -458878 -251969 428886 808906 645098 400989 415246 492441 427180 449329 819550
13166 819550 1225610 1038354 265384 -156308 563083 1866444 2289392 1185116 -545211
13157 -545211 -1653315 -1858001 -1581190 -1048610 -331009 228349 428451 690771 1312575
13148 1312575 1613569 818658 -475539 -896831 -330558 -105171 -919361 -1825526 -1774568
13139 -1774568 -1057743 -527267 -325844 -179823 -175774 -391901 -363152 233924 831049 719254
13129 719254 170954 9574 340261 493322 80406 -580213 -1013631 -1019208 -668773 -333096
13119 -333096 -508559 -1169697 -1583152 -1266093 -766648 -857575 -1309304 -1256425 -537874 223028
13109 223028 761973 1402707 2037071 1906948 846176 -84305 162439 1259673 1992178
13100 1992178 1754050 988605 353606 31120 -135227 -260987 -303028 -108325 436108 1130420
13090 1130420 1427448 972468 171668 -149636 199863 442519 -127217 -1091639 -1443389
13081 -1443389 -1008134 -588224 -571565 -297089 628748 1205949 262590 -1642337 -2766721
13072 -2766721 -2564183 -2224971 -2589814 -2871278 -2155944 -1015776 -576867 -812180 -915065
13063 -915065 -767096 -775216 -642882 287895 1516088 1622867 371452 -676332 -254203
13054 -254203 891868 1153582 188898 -967857 -1459993 -1372581 -1095160 -728648 -289890
13045 -289890 -7976 -165161 -796012 -1592947 -2032789 -1731440 -866760 -132549 -35087 -299878
13035 -299878 -209625 498110 1311848 1572315 1215163 748341 583272 591632 423988 121988
13025 121988 119270 555287 912483 646460 -26491 -398974 -259022 -110133 -319025 -560941
13015 -560941 -398618 -7743 60729 -410096 -1167493 -1814225 -1918928 -1102574 462687 1815739
13005 1815739 2061029 1422515 863479 694413 334760 -375615 -583945 227032 1087413
12996 1087413 726488 -528831 -1182628 -778769 -435516 -904967 -1352150 -813876 143963
12987 143963 341902 -58676 187461 1359047 2261278 2041965 1416070 1471663 2044933 2090079
12977 2090079 1270629 373559 160111 427618 444255 -20741 -426302 -186346 601956 1367453
12967 1367453 1844850 2191093 2250732 1378896 -453295 -1922234 -1650693 -78760 941118
12958 941118 490918 -464122 -719860 -344727 34835 463769 1242055 1947847 1920615 1386344
12948 1386344 1148630 1327129 1285980 771802 294671 269815 453920 397582 -34594 -672875
12938 -672875 -1155954 -1083496 -502956 -107596 -396426 -802031 -367479 794717 1572979 1467615
12928 1467615 1197185 1365246 1433920 670572 -540437 -1121794 -726744 -64847 56935
12919 56935 -504180 -1320452 -1790552 -1508797 -648949 42557 -17832 -550285 -777509 -451393
12909 -451393 -100108 -153002 -240949 291771 1373766 2121885 1859268 927454 250030 242873
12899 242873 476322 398339 6449 -367186 -582513 -665833 -498828 29632 637713 840060
12889 840060 556816 167408 -108417 -496473 -1149103 -1667659 -1482718 -625820 167201 236191
12879 236191 -233778 -415600 115207 766638 678439 -60367 -513231 -314123 -259159 -1011251
12869 -1011251 -1877853 -1703863 -604836 148062 -117616 -776954 -1071484 -1068927 -1149529 -1310135
12859 -1310135 -1423565 -1601005 -1855856 -1881908 -1562301 -1273263 -1320244 -1479949 -1437246 -1255419
12849 -1255419 -1076365 -802642 -458396 -418185 -833019 -1221894 -1091243 -612976 -253431 -93222
12839 -93222 19907 7162 -227166 -420105 -310283 -108040 -113446 -166114 -16530 69566 -261230
12828 -261230 -620678 -182889 1197692 2721485 3475266 3094930 1773597 178409 -748355
12819 -748355 -524815 283353 647806 203405 -589931 -1192339 -1367563 -1044170 -423883 -78316
12809 -78316 -315060 -615875 -334966 319635 756083 1070044 1617339 1855552 970656 -441286
12799 -441286 -884977 -316367 -225400 -902403 -654500 1144578 2255550 713642 -1790643
12790 -1790643 -2067884 -37363 1467598 1176017 814305 1596658 2051619 719561 -1169529
12781 -1169529 -1599703 -877693 -812140 -1682331 -2092097 -1513049 -1018638 -1302022 -1605925 -1127697
12771 -1127697 -227902 343210 427236 110118 -688108 -1614148 -1661685 -361669 1312115
12762 1312115 1971204 1394347 459200 -104959 -175301 206613 856362 1152409 619460 -125248
12752 -125248 108417 1369376 2247875 1771147 822063 858757 1768726 2074748 1170120 202982
12742 202982 313211 922681 653269 -515487 -1079150 -128419 1279382 1461364 299604
12733 299604 -694227 -402537 580320 922978 263754 -579879 -817343 -497321 -98985 168809
12723 168809 403727 643043 781491 774763 690228 562153 385188 288022 511648 1043559
12713 1043559 1397532 1063486 237407 -244004 36370 408537 22412 -780858 -801575 173328
12703 173328 774340 -88781 -1510991 -1705188 -440482 737311 679891 -67419 -394209
12694 -394209 -43643 581901 1184927 1508410 1182437 342228 -121464 345721 1038973 903656
12684 903656 10571 -679814 -756086 -654130 -602377 -218036 639837 1387626 1440217 909031
12674 909031 314432 23369 154727 597040 906689 605175 -169609 -638276 -229414 805840
12664 805840 1764348 2186076 2061205 1660943 1328217 1207614 1089470 708695 141417 -371557
12654 -371557 -831285 -1259097 -1258701 -495534 424853 409795 -582598 -1312045 -953838 -192716
12644 -192716 -30528 -276333 -67962 647258 1134155 1134390 1166027 1530697 1805937 1523478
12634 1523478 800752 92200 -307582 -374362 -264729 -208430 -287719 -336113 -225344 -104043
12624 -104043 -99549 14056 475567 998697 985137 245151 -804248 -1583551 -1714447 -1119452
12614 -1119452 -154158 480936 376494 -104660 -339517 -287098 -364830 -619920 -613995 -182323
12604 -182323 236912 212489 -137773 -388363 -288499 118739 591916 807544 608268 205998
12594 205998 -28894 28043 207222 296694 172079 -149385 -398334 -274858 -11748 -280936
12584 -280936 -1129095 -1531774 -701933 580059 839963 -109816 -1011794 -903587 -50516
12575 -50516 858223 1405064 1215393 153016 -935501 -784757 474125 1123208 153883
12566 153883 -1254954 -1440677 -582440 -235447 -1091442 -2301855 -2763501 -2135565 -757791
12557 -757791 590065 977190 169379 -888381 -1144178 -846048 -1080756 -2017255 -2581862
12548 -2581862 -2076967 -1222098 -1106347 -1734686 -2189890 -1883955 -1091685 -360188 125896
12539 125896 472471 677978 598676 289829 101194 243120 454174 399224 236380 353607
12529 353607 640045 605742 264922 208971 578282 686342 94196 -593715 -572182 57725
12519 57725 631199 915648 1122841 1295293 1317996 1255059 1135502 758376 229902 194204
12509 194204 853643 1283386 582961 -714302 -1340930 -1078977 -823687 -1103542 -1630460
12500 -1630460 -2199542 -2873020 -3232046 -2626469 -1400451 -794288 -1311190 -2147316 -2517718
12491 -2517718 -2512323 -2280509 -1493818 -227397 639986 679551 720388 1547468 2488897 2270935
12481 2270935 848557 -559546 -1071398 -962478 -911923 -1098781 -1213685 -1003959 -622224
12472 -622224 -457975 -599900 -620886 -189214 296514 220888 -235075 -342538 -61495 -79947
12462 -79947 -445862 -273182 688728 1298999 656909 -452188 -765142 -436555 -525920 -1094308
12452 -1094308 -1141510 -329282 441231 342718 -429959 -1243837 -1766326 -1851114 -1353060 -421027
12442 -421027 407561 631345 103188 -985756 -2069419 -2315055 -1345368 123149 875905
12433 875905 506540 -301248 -795082 -929535 -1004399 -1032299 -753607 -31148 954090 1773463
12423 1773463 2013537 1664643 1239133 1326572 2054215 3058099 3786511 3719403 2650634
12414 2650634 1041249 -242176 -852336 -1240205 -1703563 -1771954 -1127192 -477240 -580124
12405 -580124 -885834 -319780 818199 1057233 -46674 -1208631 -1274560 -597803 -31972
12396 -31972 308651 521625 167368 -935254 -1874146 -1670388 -684059 -2383 185967 516488
12386 516488 972728 710485 -466875 -1527471 -1557222 -901660 -450562 -407225 -377787 -253856
12376 -253856 -310680 -564502 -648394 -416840 -227132 -418987 -805099 -941951 -764972 -651262
12366 -651262 -810651 -887455 -403875 518110 1206205 1277399 1098280 1160454 1276308 864480
12356 864480 -20499 -515523 -77929 656769 652923 -91853 -503789 99670 1096932 1470390
12346 1470390 1169186 987192 1284286 1510590 1122979 388277 -70021 -132339 -168397 -382485
12336 -382485 -594616 -595301 -365113 32340 474104 720383 639694 484772 620607 962660
12326 962660 1067828 879109 930726 1522244 2071030 1762561 659226 -372166 -829038
12317 -829038 -1102032 -1621491 -2002419 -1546340 -342667 709349 979161 697922 361737
12308 361737 58551 -304731 -531171 -372422 -29582 64718 -101145 -109229 240468 655115
12298 655115 772876 548044 186978 -5156 248764 849099 1140685 582819 -358283 -592131
12288 -592131 112684 687185 260706 -485941 -206165 1162414 2181859 1752679 481352
12279 481352 -150755 433572 1419534 1742881 1251711 582486 218189 68365 -71120 -114416
12269 -114416 25493 131735 80342 267773 1099759 2181897 2623325 2169332 1459410 1084877
12259 1084877 981146 888801 794760 691792 499600 461468 955663 1607977 1363566 -30835
12249 -30835 -1333375 -1305424 -343721 169196 -279767 -967623 -1161576 -865847 -387151 148662
12239 148662 750224 1433274 2113378 2414402 1892571 716529 -366653 -1087995 -1971134
12230 -1971134 -3041741 -3143502 -1569278 390632 887193 34070 -482232 -43740 307106
12221 307106 -19930 -210424 274776 636512 176186 -491789 -597820 -494272 -771563 -1043136
12211 -1043136 -709057 -159639 -62150 -65120 557588 1406717 1407719 588568 121838 504586
12201 504586 902931 648857 315189 692216 1488083 1794483 1374381 755804 290199 -162501
12191 -162501 -618296 -708948 -300964 113271 82639 -30309 480705 1455553 1776255 792118
12181 792118 -683464 -1330059 -946601 -481812 -599512 -961816 -1040364 -910233 -872937 -836578
12171 -836578 -558338 -178355 -46365 -192700 -358458 -430735 -490876 -485919 -187921 451267
12161 451267 1092513 1231283 599009 -568173 -1570351 -1692937 -847846 220780 571045
12152 571045 25427 -614273 -488859 250143 609974 88947 -601298 -559305 -44572 -42315
12142 -42315 -624983 -752919 55188 902574 955456 731318 1040560 1438348 904753 -417624
12132 -417624 -1397655 -1573204 -1429980 -1168554 -470902 435733 733766 293299 -111641 -129055
12122 -129055 -265582 -701221 -855800 -595573 -677031 -1350673 -1675953 -1061880 -446437 -909997
12112 -909997 -1945187 -2261986 -1764985 -1562585 -2238346 -3103345 -3155523 -2118218 -594385
12103 -594385 340995 -69583 -1415022 -2320463 -1925402 -818081 -99350 -691 14153 227596
12093 227596 436194 493607 516559 689241 1157007 1786545 1862063 694959 -1098946 -1770407
12083 -1770407 -529750 1328671 2187929 2175574 2432366 3062047 3176591 2605981 2147796
12074 2147796 2155322 2140385 1868926 1664894 1438430 603120 -639695 -1040810 11980 1382668
12064 1382668 1543092 515882 -321545 -124985 483959 466404 -239033 -790296 -684493
12055 -684493 -346005 -280417 -222816 261617 772409 657757 427125 1280087 2987837 3685800
12045 3685800 2457761 707130 -77609 -493493 -1646640 -2671483 -1899249 192695 1440365
12036 1440365 1210947 958350 1430713 1588320 905106 577543 1354815 2009893 1341134
12027 1341134 182235 -128578 -49656 -850768 -2165837 -2414396 -1355428 -462159 -639770
12018 -639770 -1073484 -742518 135962 748631 865863 747710 513992 241798 251766 669668
12008 669668 964126 541805 -286297 -551707 44962 631751 323576 -596109 -1191905 -1230956
11998 -1230956 -1257570 -1418012 -1146404 -281635 418674 435166 343677 737971 1008964 248514
11988 248514 -1080585 -1566321 -807358 174424 526312 489534 523968 527120 337466 214513
11978 214513 357426 514761 409423 85912 -333231 -744646 -868241 -519484 -53988 89910
11968 89910 145531 510525 724619 83386 -852610 -785772 136871 270261 -910593 -1787952
11958 -1787952 -1054784 355190 921959 702068 471264 19459 -1012292 -1645150 -849893
11949 -849893 365797 196467 -997533 -1104579 330158 1296779 477943 -772261 -623343
11940 -623343 650600 1569467 1763629 1961440 2344587 2321537 1730732 1118205 779774 429048
11930 429048 -34864 -187430 187010 560914 273534 -589889 -1294147 -1334704 -907465 -476478
11920 -476478 -190467 52691 187455 23432 -314943 -416054 -181368 -2478 -120669 -209052
11910 -209052 72167 459182 463813 130710 -26940 308702 1035289 1871175 2423778 2244359
11900 2244359 1303750 279386 -84177 215330 647806 922675 1055504 932897 461386
11891 461386 1638 -11388 214236 164827 -20334 302664 1178985 1910407 2109585 2086823
11881 2086823 2031015 1675497 1075749 854460 1209578 1431607 944281 179202 -139963 -7359
11871 -7359 132133 130726 47953 -206434 -580696 -689594 -443924 -368004 -736262 -984219 -668844
11860 -668844 -391517 -844475 -1431630 -943676 606832 1896658 2007121 1271098 406248
11851 406248 -225700 -384457 69534 698904 783814 328247 52955 244837 432912 382746
11841 382746 479300 793989 721504 40271 -537480 -463063 -204450 -354395 -620077 -420990
11831 -420990 147654 682081 1210604 1826035 2140534 1872280 1454782 1334626 1252191 966469
11821 966469 938303 1334351 1184336 -184489 -1601107 -1505566 -420961 -175576 -941105
11812 -941105 -1086963 -102622 493428 -226990 -1102192 -974993 -472076 -486840 -531666 -20652
11802 -20652 286966 -254188 -591457 315797 1329973 760609 -704112 -1002974 -115444
11793 -115444 62810 -809733 -871911 540163 1438210 346198 -1295390 -1534279 -907260
11784 -907260 -1035730 -1549617 -750217 1235806 2269075 1283708 -369197 -1146634 -1260593
11775 -1260593 -1621416 -2127983 -2068431 -1435519 -799917 -303566 282521 721883 455555 -365252
11765 -365252 -793279 -330035 339250 283571 -403482 -783437 -327479 528323 1062107 1026475
11755 1026475 634281 215463 83042 374967 780500 743469 212323 -133494 257966 1040696
11745 1040696 1469309 1358175 1012161 466905 -489401 -1584608 -2080427 -1681677 -860160
11736 -860160 -149829 285926 273795 -401208 -1289781 -1331254 -257703 682580 240038 -1028524
11726 -1028524 -1471428 -714173 -191665 -1014414 -2327416 -2539777 -1537186 -683333 -795123
11717 -795123 -1124400 -664699 316865 721357 204198 -441329 -464463 -45664 196810 28474
11707 28474 -408453 -942392 -1242619 -737476 688642 2090221 2247693 1112696 -126691
11698 -126691 -519456 -255210 106322 554775 1213701 1587521 1086785 138535 -81603 808663
11688 808663 1808842 1802770 843711 -262014 -1129069 -1856236 -2215022 -1678205 -394326
11679 -394326 646432 799961 525180 525842 737466 777946 841630 1263623 1554891 944633
11669 944633 -180605 -510836 284872 962517 469767 -656954 -1283271 -1199159 -877078
11660 -877078 -449698 142988 508426 272334 -98961 190526 1116954 1907461 2032728 1496587
11650 1496587 498663 -479740 -698284 -128642 54280 -1014366 -2317483 -2169460 -724461
11641 -724461 208311 -157826 -703326 -512856 -219737 -499675 -695671 -44690 837355 924319
11631 924319 451326 393111 806013 895695 443669 29539 -90515 -306917 -747431 -886378
11621 -886378 -328338 572180 1116737 980250 458539 233913 783663 1725044 1942324 786578
11611 786578 -988915 -1949418 -1558365 -582317 24129 100540 43856 93839 162298 107629
11601 107629 -116521 -479102 -819942 -833622 -325314 451253 884275 622807 43935 -154489
11591 -154489 138882 289717 -146006 -715446 -709135 -192394 202452 344909 710530 1337230
11581 1337230 1483265 731794 -200346 -363494 98225 195438 -452266 -1073905 -847777 -69910
11571 -69910 202594 -452729 -1239613 -1167194 -341077 234936 63095 -257324 -51197 451887
11561 451887 666607 690388 1074571 1791528 2168831 1841554 1162852 619459 342741 245091
11551 245091 213665 144028 97119 305394 727669 907845 685941 600667 982983 1161156
11541 1161156 413493 -739053 -1225903 -1057365 -1065257 -1242443 -722482 545189 1497114
11532 1497114 1589689 1426083 1428904 1217625 759704 783898 1385077 1477951 447091 -781572
11522 -781572 -1184637 -1128154 -1464366 -2033350 -2067191 -1408488 -434655 636777 1595940 1992919
11512 1992919 1740558 1375508 1170535 744112 93748 43446 908479 1686714 1473603 773640
11502 773640 470395 429504 177750 40404 382014 528016 -240757 -1278024 -1465519 -941407
11492 -941407 -644749 -683208 -489820 -114089 18590 203001 900381 1480695 1014816 43232
11482 43232 -8971 933006 1503379 1073353 495489 485750 690412 659935 453147 -35634
11472 -35634 -1103458 -2256875 -2423208 -1551126 -852613 -1003294 -1207760 -576747 585472
11463 585472 1437196 1640283 1213897 231223 -754793 -801026 251750 1334592 1450934
11454 1450934 826786 247012 -117088 -575513 -1110036 -1383385 -1308575 -1090220 -860947 -631439
11444 -631439 -423193 -180539 249220 811214 1109831 811094 76451 -552132 -674248 -427969
11434 -427969 -353987 -708602 -938143 -254366 1123749 1887272 1208791 -165153 -976144
11425 -976144 -1078088 -1244540 -1786433 -2266174 -2377965 -2270094 -2106107 -2026354 -2352978 -3098139
11415 -3098139 -3522252 -2981641 -1926932 -1189459 -664086 179371 809471 105184 -1651105
11406 -1651105 -2731458 -2288381 -1392258 -1192208 -1295219 -812115 -13065 115234 -586738
11397 -586738 -1308047 -1445383 -1195373 -1027190 -1092519 -1237898 -1321078 -1373865 -1445099 -1357138
11387 -1357138 -868351 -177264 95235 -320318 -961865 -1304328 -1306795 -964311 -58396 1034425
11377 1034425 1118558 -266944 -1753131 -1748564 -606267 46981 -340308 -961512 -1332308
11368 -1332308 -1654481 -1640694 -671939 697922 996377 -37094 -1005892 -943953 -475670
11359 -475670 -445202 -733369 -963208 -1115210 -924402 54697 1245317 1267211 34323 -714520
11349 -714520 186309 1673894 2151061 1639633 1134570 851058 377536 -158663 -300217
11340 -300217 -172816 -189221 -243613 -62109 48941 -368056 -1067187 -1402473 -1236402 -972037
11330 -972037 -929109 -1118259 -1347798 -1276088 -764689 -362493 -856311 -2120880 -3068987 -2969747
11320 -2969747 -2122976 -1081084 -77564 571463 503374 53436 -47653 38337 -520951
11311 -520951 -1452569 -1371388 -148005 408936 -740081 -2098301 -1948140 -971587 -854151
11302 -854151 -1463140 -1404075 -629681 -413735 -1023799 -1393565 -1172623 -1305885 -2205323 -2877766
11292 -2877766 -2473551 -1532994 -1024699 -987357 -779317 -140021 561580 895590 832862 671977
11282 671977 580506 276614 -579644 -1671870 -2199862 -1947648 -1596308 -1672833 -1831430 -1579461
11272 -1579461 -1030846 -461189 145983 565366 191352 -860872 -1404952 -814278 -100969
11263 -100969 -284319 -591780 282790 1800948 2140342 874398 -557244 -1089265 -1165181
11254 -1165181 -1340449 -1229084 -468988 397852 740793 758850 972497 1403929 1772933 2003014
11244 2003014 2096072 1929714 1547394 1289798 1344376 1479001 1420995 1152567 653512 -247776
11234 -247776 -1472167 -2412348 -2389283 -1355376 -23240 701304 456186 -317281 -867340
11225 -867340 -853807 -425923 278840 1206483 1886367 1569467 314444 -665810 -398303 549241
11215 549241 900326 449842 106891 282025 234687 -705416 -2069093 -2887815 -2897380 -2575407
11205 -2575407 -2255939 -1765118 -966590 -239696 -121522 -582064 -943169 -626872 170230
11196 170230 670386 272374 -930956 -2158097 -2388309 -1223556 434423 1035603 135481
11187 135481 -982172 -962958 -58904 638015 980444 1580048 2253047 2103176 1102588
11178 1102588 175141 -368653 -1021372 -1575145 -1110243 96349 422396 -586395 -1279161
11169 -1279161 -500019 544067 345834 -506103 -642996 -356013 -802089 -1632612 -1447431
11160 -1447431 -260491 347076 -457479 -1800211 -2537137 -2378762 -1521599 -323134 535021
11151 535021 540294 99899 14057 293399 297828 -138806 -593511 -881656 -1122221 -1159004 -806589
11140 -806589 -500244 -794132 -1354056 -1358103 -802251 -514749 -899338 -1471480 -1643522 -1294232
11130 -1294232 -621733 -1598 198747 162477 565482 1412902 1592001 437168 -940075
11121 -940075 -1010097 27477 720269 569238 348016 431141 299628 -203714 -518820 -531346
11111 -531346 -839231 -1487384 -1571296 -608283 604212 1004235 438836 -544492 -1397287 -1693426
11101 -1693426 -1177282 -131414 678417 719472 133559 -561245 -911216 -753515 -373827
11092 -373827 -336666 -821626 -1332514 -1404104 -1236642 -1168906 -959922 -229103 748690 1355250
11082 1355250 1418841 1063317 183093 -1160457 -2174590 -2045192 -1059048 -282198 -249691
11073 -249691 -585077 -724389 -460370 1992 101015 -582777 -1525262 -1593311 -608407 273870
11063 273870 297709 134603 366514 205089 -1012731 -2187398 -1906992 -691404 -122483
11054 -122483 -400599 -478536 -86507 150847 219255 556039 691981 -148040 -1302843 -1362861
11044 -1362861 -487316 -197876 -886197 -1384476 -1094938 -685531 -489922 -57768 453396
11035 453396 261321 -386456 -376659 172383 -53999 -1052551 -1182844 -56564 459788 -757040
11025 -757040 -2090518 -1620964 73150 1094559 935438 494919 367374 518748 940801
11016 940801 1415393 1222928 99860 -1050717 -1210578 -436047 611979 1552504 2055250
11007 2055250 1617686 387065 -543733 -445475 90340 131779 -384902 -1010575 -1526202 -1725615
10997 -1725615 -1342955 -834827 -1251612 -2578374 -3259206 -2329937 -998617 -906080 -1685238
10988 -1685238 -1687787 -607679 150944 -341433 -1320160 -1593045 -1103228 -786704 -1315186 -2277801
10978 -2277801 -2531262 -1430631 261315 1055016 461051 -495586 -785554 -753596 -1386436
10969 -1386436 -2697942 -3651334 -3544303 -2753501 -2026597 -1605604 -1298844 -1046980 -1016485
10960 -1016485 -1171248 -1112673 -593713 250 76835 -307085 -500147 -218359 141727 311339
10950 311339 548526 894586 825586 181607 -325796 -186058 94398 -23102 -137544 188866
10940 188866 393601 -145718 -882330 -966485 -643569 -597958 -635127 -312868 -122829 -603785
10930 -603785 -1046227 -674473 -332702 -1157438 -2276167 -1915508 -311583 676064 516622
10921 516622 299760 325045 -140002 -730136 -210366 929692 755730 -749996 -1287139
10912 -1287139 35671 1242778 843781 63055 304349 762508 277814 -447164 -320910
10903 -320910 94760 -196714 -731206 -578104 -73804 -59697 -417579 -652612 -888305 -1139581
10893 -1139581 -749089 338675 976365 597420 255607 698760 891610 -79479 -1061329
10884 -1061329 -558080 742771 1068460 397974 293293 1254132 1947644 1141678 -770449
10875 -770449 -2316950 -2389853 -1229915 -246288 -468887 -1200928 -1070425 -306359 -503838
10866 -503838 -1921181 -2818885 -2154775 -1111552 -967333 -1233401 -1135527 -1216104 -1957978 -2359416
10856 -2359416 -1569323 -646960 -952575 -1880245 -1949087 -1231185 -914738 -1144497 -1039153 -449220
10846 -449220 -149420 -452911 -819997 -727232 -154396 506638 592292 -165227 -872361 -431517
10836 -431517 513973 146358 -1539375 -2257149 -891530 611977 244329 -1126521 -1601858
10827 -1601858 -1272585 -1285973 -1365682 -612204 242950 -277847 -1865707 -2857870 -2759369 -2475203
10817 -2475203 -2429970 -2207369 -1780066 -1569568 -1538228 -1443091 -1504459 -1710481 -1239977 182658
10807 182658 1272804 916463 -23500 -121340 361179 264884 -365170 -725879 -967992 -1654165
10797 -1654165 -2266114 -2093367 -1892124 -2731130 -3811839 -3462126 -1867214 -809530 -956592
10788 -956592 -1317617 -1233138 -1080247 -1054258 -909662 -867121 -1274843 -1515914 -734086 538437
10778 538437 936965 236206 -641573 -1272923 -1889891 -2200157 -1647238 -688285 -304696 -390646
10768 -390646 -95742 422646 160038 -867547 -1445746 -987397 -236342 -21613 -419160
10759 -419160 -1168146 -1890206 -1967969 -1179682 -299651 -162788 -445199 -329971 36571 -133590
10749 -133590 -813354 -1146747 -736501 -40080 346249 132766 -571886 -1093561 -742050 2000
10739 2000 -207803 -1526614 -2401697 -1913179 -1216179 -1536786 -2184983 -2001935 -1477045 -1782382
10729 -1782382 -2748409 -3395704 -3556216 -3501866 -2949475 -1891802 -1391622 -2103737 -3073483
10720 -3073483 -3353791 -3493201 -3953816 -3652153 -1934639 -433309 -768594 -1786782 -1430705
10711 -1430705 -130386 169500 -658575 -1139842 -956074 -955225 -1017871 -376730 410691 148336
10701 148336 -775685 -1079809 -1001102 -1738609 -2936071 -3062039 -2065904 -1474826 -1982941 -2862261
10691 -2862261 -3506743 -3770625 -3213954 -1807928 -853507 -1432983 -2614746 -2918712 -2618255
10682 -2618255 -2689951 -2649572 -1722110 -1062039 -2192646 -4030179 -4120096 -2290534 -556456
10673 -556456 91173 304576 294341 -332264 -973604 -653132 38520 -244818 -1309009 -1983411
10663 -1983411 -2281117 -2859767 -3183058 -2526827 -1929258 -2703879 -3882451 -3634254 -2336939
10654 -2336939 -1673329 -1615854 -1001764 -196776 -407793 -1182813 -1327889 -1393064 -2474649 -3585461
10644 -3585461 -3152696 -2086135 -2311307 -3307351 -3237488 -2406786 -2312808 -2415721 -1337443
10635 -1337443 -141428 -744574 -2124064 -1912862 -743919 -1030277 -2410656 -2610928 -1967151
10626 -1967151 -2674183 -4207126 -4051879 -2539764 -2338920 -3432348 -3291007 -1893815 -1779565
10617 -1779565 -3031276 -3036635 -1529100 -1072751 -2088336 -2184124 -1040011 -1170874 -3001121
10608 -3001121 -3856042 -2852114 -2286734 -3104881 -3372210 -2390547 -2097676 -3191747 -3852676
10599 -3852676 -3372443 -3236474 -3783990 -3606330 -2853315 -3239243 -4363155 -4067849 -2692737
10590 -2692737 -2710187 -4013079 -4100118 -3021174 -3261803 -4545969 -3960019 -1662997 -1092993
10581 -1092993 -2798934 -3479047 -2056302 -1326839 -2514446 -3476780 -3406558 -4085432 -5432698
10572 -5432698 -5040724 -3099600 -2550608 -3573897 -3318231 -1695345 -1713968 -3472141 -3826292
10563 -3826292 -2635130 -3050110 -4980678 -4895784 -2856920 -2829663 -5138244 -5797610 -4304470
10554 -4304470 -4554454 -6877072 -7043232 -4590923 -3998717 -5977601 -6039375 -3563435 -3481282
10545 -3481282 -6709787 -7926237 -5465492 -4308197 -6377078 -7158105 -5065101 -4676204
10537 -4676204 -7306016 -7989712 -5342400 -4556505 -7006719 -7158850 -3635079 -2616391 -6077732
10528 -6077732 -7765226 -5347423 -4969062 -8842261 -10377891 -7028813 -5556528 -8805825
10520 -8805825 -10129220 -6981130 -6470463 -10921273 -12280171 -7933867 -6872873 -12409247
10512 -12409247 -14948120 -10461580 -8860964 -14499583 -16907148 -11666135 -10555926 -18602626
10504 -18602626 -22431000 -15625021 -12688867 -21445353 -26495277 -19261330 -17215870 -30349497
10496 -30349497 -38402803 -29310741 -27247633 -47402646 -59804804 -45242678 -47700214 -102660603
10488 -102660603 -142571890 -64460033 108731841 227488944 202209174 107636540 60431854
10481 60431854 69544091 69904929 43919660 29707151 38643516 41002259 26897403 19992933
10473 19992933 28330573 31329679 21152503 15236804 20877083 23247413 15993828 12201804
10465 12201804 17336034 19305867 13049925 9771349 14249440 15984109 10286744 7022650
10457 7022650 11056812 13508800 9660456 7472653 11184764 13243767 9515335 6921667
10449 6921667 9286609 10279550 6811332 5380074 8808811 10164740 6176217 3763018
10441 3763018 6815791 8872375 5581709 2735965 5023054 7652240 6126686 4363855
10433 4363855 6195067 7881432 5773055 3222617 3720970 4717705 3773757 3552933 5665793
10424 5665793 6705566 5026791 4337986 6287227 6820210 4159819 2889031 5576257
10416 5576257 7739226 5908399 3577111 4209105 5148120 3561554 2045303 3181750
10408 3181750 4394823 3162512 1872121 2867952 3967150 3252030 3054975 4953432 6036790
10399 6036790 4328287 2776055 3766298 4801481 3697855 2904169 4444296 5654768
10391 5654768 4331957 3232770 4935867 6811272 5688965 3345217 2882337 3513005
10383 3513005 3178468 2699633 3334137 3701340 2795749 2548047 4038231 4874996 3553020
10374 3553020 2450718 3281560 3809640 2478075 1817048 3474991 4394198 2177185 -71214
10365 -71214 1106224 3487232 3167849 1117331 775995 2063556 2640251 2628986 3467802
10356 3467802 4256647 3535128 2651696 3416282 4504310 3960783 3041179 3758894 4853732
10347 4853732 4086118 2434055 2135371 2557922 1880515 973611 1690073 2987904 2630370
10338 2630370 1290012 1248853 2334552 2698469 2383567 2679280 3108589 2408250 1428604
10329 1428604 1830385 2888898 2685529 1547735 1336491 2157239 2570932 2288512 2101989
10320 2101989 1971316 1511223 1395335 2094577 2440717 1627975 1186325 2582350 4358581
10311 4358581 4252156 2780747 2031337 2125228 1675636 781956 815248 1848696 2692696
10302 2692696 2927350 2871381 2270298 936502 -94691 206211 1334149 2366017 3346125
10293 3346125 4169165 3768128 2093896 1087513 1795526 2434020 1424926 321247 1207360
10284 1207360 3085454 3669238 3158791 3230625 3583777 2659570 988408 743709 2238933
10275 2238933 3479470 3138262 1883480 878071 680322 1368276 2373758 2702226 2388431
10266 2388431 2750171 4147116 4943469 4031115 2737559 2612091 2984373 2538343 1694951
10257 1694951 1485640 1556558 1207703 944110 1182901 1037093 191524 143072 1610823 2730957
10247 2730957 2049112 1195408 2022160 3162448 2393488 614398 286040 1357303 1921595
10238 1921595 1703331 1735008 1625090 318381 -1243840 -1257934 -156414 250810 -58094
10229 -58094 168731 637756 170025 -566652 2944 1314658 1552063 992521 1386845 2467140
10219 2467140 2274797 794792 134479 1007347 1954556 2207300 2524118 2961099 2508484
10210 2508484 1306094 775965 1226243 1556423 1490211 1867108 2628273 2747942 2245414
10201 2245414 2097222 2187379 1573761 685486 869682 1769993 1630643 350926 -234256
10192 -234256 574589 1377122 1228885 944801 1308719 1944115 2453395 2950723 3182266 2747870
10182 2747870 2218259 2364501 2527366 1644523 506282 769174 2052054 2492470 2012345
10173 2012345 2315890 3558358 3903096 2881427 2358420 3292430 4138832 3569782 2455714
10164 2455714 1951548 1693725 1136872 839900 1193591 1472778 1271171 1405132 2366384
10155 2366384 3267315 3291587 2890418 2642313 2187875 1201207 288867 72391 333836 710853
10145 710853 1268280 1856403 1923300 1473278 1235398 1452723 1481710 965017 421136 329768
10135 329768 572948 1029045 1743404 2301819 2053030 1204523 765206 1202131 2002727 2622967
10125 2622967 2979996 3001384 2579627 1970226 1488064 1030387 620180 885705 2061897
10116 2061897 3173205 3326335 3072220 3215707 3184433 2206533 1237911 1738151 3138459
10107 3138459 3627903 3040978 2776340 3083100 2720835 1398102 379404 381824 788095
10098 788095 1196147 1927970 2791997 3100057 3058638 3422121 3765265 2971107 1452547 892681
10088 892681 1627891 2251515 1976035 1398539 762819 -421640 -1710810 -1777653 -607831
10079 -607831 268896 147932 -108002 16011 4430 -112228 497756 1717965 2381544 2257194
10069 2257194 2248811 2464849 2206444 1988656 3111347 4866968 4824125 2598960 757839
10060 757839 1044297 2215592 2696911 2876394 3411197 3582603 2909614 2419707 2805003
10051 2805003 3112876 2669459 2502804 3368078 4043034 3181685 1484495 561479 798236
10042 798236 1558010 2371131 2886767 2731498 2218810 2091881 2111079 1329155 94510 -57325
10032 -57325 1015990 1648115 1167242 903849 1566273 1937376 1281180 745535 1104793 1374665
10022 1374665 1030811 1259791 2434429 2733489 1168258 -275381 322760 1673073 1521146
10013 1521146 264181 -175500 330810 454477 31719 -15815 369334 598179 925196
10004 925196 1825835 2565643 2218806 1503104 1825822 2961030 3314546 2232740 730127
9995 730127 144632 983496 2678006 3824889 3354364 1940528 1269962 1584462 1432254
9986 1432254 339727 -177406 818792 2076427 2345743 2319437 2983216 3792613 3972995
9977 3972995 3958392 4077490 3523517 2117266 1297661 1775916 2054893 977667 -154831
9968 -154831 136486 1019652 1158702 1145994 1936061 2602844 2018127 1246712 1902379 3416764
9958 3416764 4150071 3971718 3698541 3306175 2670304 2653116 3549784 4045477 3557812 3696290
9948 3696290 5374569 6658758 5860533 4529400 4692108 5347140 4683243 3653364 4094013
9939 4094013 5182243 5055747 4191267 3942153 3593599 2211868 1425032 2796430 4458685
9930 4458685 4121138 3302246 4501274 6344172 6058357 4737161 5259449 6764358 6305162
9921 6305162 4446120 4031684 4864188 4819364 4596810 5913998 6931154 5416388 4215252
9912 4215252 6872812 10288442 9468654 7026376 8835253 12627072 11773934 8622904 11089393
9903 11089393 16489464 14149540 5788265 4961767 10056455 -1756591 -39753379 -76198431
9895 -76198431 -77538644 -48302366 -22715876 -18744359 -22903938 -19727318 -13162479 -12166126
9887 -12166126 -13754273 -11253480 -7119778 -6988786 -9192815 -9143366 -7859018 -8405511 -9080377
9878 -9080377 -7142720 -4938948 -5888389 -8072761 -7700388 -5665734 -5116271 -5447243 -4168177
9869 -4168177 -2293964 -2569170 -4186809 -4249753 -3048863 -3204280 -4615741 -4701127 -3067652
9860 -3067652 -1945411 -2230144 -2577904 -2308367 -2159879 -2230042 -1813104 -1184413 -1271856 -1816935
9850 -1816935 -1903560 -1835626 -2489165 -3367456 -3283926 -2415381 -1799367 -1426269 -660821 136956
9840 136956 221690 -31023 60419 43936 -556226 -765391 247498 1185990 402215 -1329555
9830 -1329555 -2102092 -2003537 -2459428 -3212286 -2683756 -987662 98848 122287 405948 1406626
9820 1406626 1984863 1582697 965563 482352 -393620 -1468417 -1703802 -1060531 -703158
9811 -703158 -1050502 -1280097 -989833 -712751 -641420 -490020 -647475 -1673621 -2625378 -1856859
9801 -1856859 323105 1767575 1522386 737787 259191 -508059 -1729018 -2260161 -1536847
9792 -1536847 -560576 -185802 -57891 89240 -191447 -729604 -578882 121191 -4 -1079947
9782 -1079947 -1432105 -371268 445069 -268353 -1344471 -1242626 -398512 73107 378585
9773 378585 1092924 1669830 1551559 1420510 1750081 1493456 -85749 -1651625 -1730423 -1131355
9763 -1131355 -1414180 -2087424 -1582395 -185051 350977 -318103 -855474 -682844 -625917 -1042572
9753 -1042572 -1149014 -529068 126020 118406 -423272 -892953 -651975 559924 1943235 2044982
9743 2044982 698772 -393439 -65301 569976 198449 -303655 437270 1479815 936970
9734 936970 -720438 -1428809 -1039973 -1208634 -2042488 -1908382 -723807 -340283 -1103229
9725 -1103229 -1110891 193840 742117 -556378 -1858909 -1691654 -1387227 -2144938 -2305375
9716 -2305375 -221056 2279256 2319720 415100 -575840 30356 372649 -243967 -385929
9707 -385929 503745 926797 -49927 -1237907 -1373868 -903008 -663813 -343960 525138 1215961
9697 1215961 785082 -305208 -773916 -363880 -26035 -373281 -894260 -899292 -548983 -506501
9687 -506501 -898380 -1121700 -723503 -84524 69953 -339808 -649488 -364045 211194 409762
9677 409762 5907 -574484 -666099 35000 1053273 1401464 637341 -458802 -773351 -290259
9667 -290259 96555 125325 484934 1349606 1758164 1125775 365576 556962 1270581 1312651
9657 1312651 593466 72898 136742 223536 37721 15500 375555 635504 402681 -60050
9647 -60050 -345638 -358598 -8750 894489 2053429 2555718 1882148 728522 303448 920005
9637 920005 1699649 1665883 780803 -217758 -739796 -827230 -782610 -669450 -403905 -111852
9627 -111852 -11360 540 230389 624509 775074 610057 563854 795861 782894 173098
9617 173098 -400206 -43132 1056720 1744014 1419312 798960 861756 1515278 1780064 1122208
9607 1122208 134228 -213014 321374 1142624 1655875 1827227 1863995 1757641 1448979 1161198
9597 1161198 1160667 1342511 1447181 1520417 1678037 1584448 847988 -55353 -61543 955532 1660625
9586 1660625 857288 -857194 -1762532 -1182696 -258173 -359213 -1275539 -1523614 -364776
9577 -364776 1080734 1159348 -187062 -1322545 -1013488 146132 795912 569389 130643
9568 130643 30812 337551 961000 1481406 1065406 -444820 -1708854 -1309352 227947
9559 227947 1098802 787332 541934 1184354 1963207 1997516 1447031 697542 -276728 -1113027
9549 -1113027 -972168 -16772 323627 -563156 -1401075 -1031895 -222541 -286885 -1076573 -1674804
9539 -1674804 -2021755 -2376952 -2126101 -789285 510140 330214 -826008 -1253626 -683360
9530 -683360 -370737 -719220 -728956 -30512 343636 -213924 -805356 -512543 233034 517121
9520 517121 237007 -151102 -387980 -308222 305738 1178459 1468183 800712 -146021 -589766
9510 -589766 -660531 -924850 -1343422 -1360433 -832112 -265619 -102294 -193141 -155780 4554
9500 4554 -67936 -428076 -573004 -141635 399374 334581 -132838 -63839 703152 1093314 336153
9489 336153 -815024 -1114138 -485410 110291 24977 -611363 -1396013 -1878712 -1597927 -608323
9479 -608323 285860 434122 146210 24772 -34673 -471930 -1143295 -1540026 -1532493 -1198372
9469 -1198372 -407051 672598 1248002 977489 750635 1373449 2104073 1716388 502100
9460 502100 -138846 243250 856862 1183364 1414342 1534774 1317414 1141968 1528455 1968109
9450 1968109 1527682 477656 -55738 89408 113169 -67494 220384 791063 699777 106609
9440 106609 250707 1253447 1736123 1083851 343860 320136 483512 373140 365037 422924
9430 422924 -119096 -851734 -341733 1232037 1607824 -163334 -1943346 -1687414 -391624
9421 -391624 31378 -61864 676194 1630003 1221897 -53239 -283641 605331 821631 -144041
9411 -144041 -790016 -329123 86999 -485373 -1286148 -1346185 -999956 -1003884 -1221568 -984613
9401 -984613 -26325 1432100 2838962 3304350 2280246 550121 -303112 232714 1040910
9392 1040910 1024909 509057 505087 1231432 1949812 1946073 1246105 471233 129442 17914
9382 17914 -450661 -1163373 -1117420 92304 1196662 705455 -875210 -1524021 -427875
9373 -427875 1054593 1485799 1161442 1118238 1321051 877183 -370491 -1408231 -1253047
9364 -1253047 -81184 972128 985117 178251 -419427 -321740 -253666 -1030965 -2166045 -2454562
9354 -2454562 -1823310 -1483087 -1966075 -2170168 -1115513 266942 243621 -1231134 -2317137
9345 -2317137 -1667924 -41560 861881 484194 -273074 -472764 -175655 68578 220113
9336 220113 741260 1703044 2428641 2281762 1484948 782514 481403 292390 86580 252880
9326 252880 1031169 1870130 1892079 929316 -235984 -723452 -420368 91025 247103 -80642
9316 -80642 -739192 -1477411 -1894790 -1621357 -858754 -412244 -736802 -1224571 -1039663 -435888
9306 -435888 -383894 -892924 -791162 405446 1480675 1208170 204639 -23740 657427
9297 657427 995569 429131 -129210 193737 1053866 1655137 1789682 1612998 1153355 620045
9287 620045 554863 1045230 1305207 697696 -243938 -500655 50280 657081 863489 866276
9277 866276 785787 431690 -41441 -33264 574589 1028691 726537 101320 -111707 -54187
9267 -54187 -396041 -1022019 -1011938 -84700 832013 932288 686720 978625 1648460 1805518
9257 1805518 1317957 984865 1183769 1349660 1132988 1133102 1818885 2458136 2061007 1013261
9247 1013261 720524 1588910 2338859 1753857 376569 -238748 410484 1275825 1335855 877719
9237 877719 772644 1055568 989316 347871 -236847 -383603 -573461 -1159878 -1502382 -879731
9227 -879731 223517 675650 275354 -209723 -438088 -797925 -1209177 -841601 481719
9218 481719 1639339 1654365 957754 500714 366155 83137 -325105 -527097 -636932 -868232
9208 -868232 -819419 -38922 975132 1277155 808691 358396 346845 535438 789646 1144905
9198 1144905 1168103 321378 -922808 -1394984 -920920 -661952 -1350711 -2194773 -2157679 -1445591
9188 -1445591 -907152 -622293 -31957 872515 1396895 1158066 597810 385261 685844 1066830
9178 1066830 925831 107541 -761857 -797812 86148 957956 978556 392486 39789 206784
9168 206784 449171 357748 8713 -265282 -177828 309234 760021 511636 -389135 -821567
9158 -821567 116529 1625108 1927024 612202 -680047 -383786 985178 1658418 898823
9149 898823 -399643 -1115312 -999673 -372242 430525 1010881 954927 337363 -218430 -326945
9139 -326945 -329019 -650704 -1047629 -966436 -402583 157618 544160 1060878 1751980 2061651
9129 2061651 1533055 518112 -156439 -106804 270584 325426 -157798 -792234 -1024927 -745316
9119 -745316 -441336 -645820 -1246337 -1550841 -1121158 -318530 186333 283464 458162 912633
9109 912633 1031022 99157 -1533814 -2505503 -1935076 -540825 218065 -29960 -251194
9100 -251194 345613 1072154 732004 -636763 -1740949 -1621867 -577994 519117 1154817
9091 1154817 1214738 702429 -166625 -912278 -1207905 -1204969 -1219558 -1269319 -1144914 -817223
9081 -817223 -560171 -672382 -1119637 -1412191 -949870 263169 1303777 1122396 -202960
9072 -202960 -1336818 -1081698 274489 1270320 861715 -526753 -1575192 -1519357 -840128
9063 -840128 -481617 -645640 -711987 -267162 344134 701108 970659 1417545 1701765 1307175
9053 1307175 410712 -326779 -666986 -854507 -947880 -820706 -724110 -1036269 -1443197 -1216457
9043 -1216457 -425753 -3974 -350455 -720119 -402867 245684 450197 92802 -336677 -393171
9033 -393171 87370 923989 1476372 1144605 246814 -240801 -86799 -153125 -940727 -1693039
9023 -1693039 -1615329 -1146987 -1130813 -1386650 -1152035 -512103 -293467 -662718 -796546 -26296
9013 -26296 1394453 2710189 3270791 2763152 1467782 338868 264250 1097726 1815853
9004 1815853 1715065 1106142 746253 902268 1158525 1040994 663590 585675 975330 1255749
8994 1255749 964371 609473 945279 1599741 1436607 370065 -323580 92515 734007
8985 734007 590753 73779 163626 835482 1320546 1312118 976304 331075 -463612 -751393
8975 -751393 -258872 211292 -68266 -486263 -76347 775723 873070 114096 -419282 -109317
8965 -109317 635321 1310719 1663224 1276348 36157 -1085636 -969984 -55095 170565
8956 170565 -585222 -1044731 -443689 383946 440238 -133288 -702953 -1006754 -828426 174672
8946 174672 1689565 2637221 2430927 1636254 954212 357451 -304057 -704894 -656203 -571957
8936 -571957 -705311 -579899 192363 1110828 1443648 1228156 1029539 1051387 982145 491630
8926 491630 -411692 -1279889 -1442647 -773521 -172743 -556612 -1363503 -1044865 723535 2393456
8916 2393456 2585522 1738446 1055538 817623 663810 699654 1170800 1532635 997432 -170081
8906 -170081 -858184 -545513 257315 947664 1445072 1792939 1813374 1399953 780012 301816
8896 301816 111039 48996 -186655 -637384 -856460 -455923 104305 -88374 -965801 -1206213
8886 -1206213 14467 1656468 2038935 992168 -162656 -554539 -621898 -937114 -1205339
8877 -1205339 -928279 -356610 -132110 -329399 -436137 -150044 306074 673575 1011889 1365147
8867 1365147 1386421 655303 -667930 -1800354 -2049956 -1409535 -401658 421108 705351
8858 705351 340800 -403699 -941222 -885159 -448890 -93085 98080 383460 812022 1081540
8848 1081540 975004 629946 293704 19013 -318521 -785425 -1170116 -1025892 -143289 996307
8838 996307 1576408 1352679 786883 169370 -734036 -1809735 -2134651 -1112045 456763
8829 456763 1228765 870632 22383 -829379 -1530774 -1687065 -983735 30509 438616 177694
8819 177694 -74555 -54592 -9853 152684 703303 1163193 727177 -341484 -916482 -703439
8809 -703439 -502763 -623608 -386704 417005 910455 560269 30744 -49624 -68349 -445355
8799 -445355 -702347 -362284 74518 -81410 -601847 -785907 -475103 -16117 279275 188951
8789 188951 -326666 -754104 -452951 268840 364482 -375574 -975400 -862902 -623910 -648549
8779 -648549 -335851 566273 1112074 652236 6701 22819 65115 -769590 -1882555 -2013204
8769 -2013204 -1111605 -44301 867270 1656417 1758904 784093 -261153 -92768 816390
8760 816390 865321 -202715 -1027801 -842863 -419514 -550400 -942504 -1032076 -798746 -369302
8750 -369302 260711 790038 752108 349108 310079 704453 796426 361654 191546 792628
8740 792628 1428809 1150018 191524 -411792 -321669 -280624 -956523 -1936237 -2176833 -1258753
8730 -1258753 172007 1261833 1856325 2239264 2350888 1917157 1209702 892676 1041072
8721 1041072 1077772 802401 624474 588087 169145 -598587 -878909 -473580 -424323 -1426517
8711 -1426517 -2647592 -2984456 -2558573 -2051257 -1503359 -802005 -437318 -636123 -610244 130175
8701 130175 598500 -177462 -1323912 -1324334 -377140 94466 -227062 -431121 -255316 -339224
8691 -339224 -708563 -646849 -108015 220928 263196 528393 813362 437229 -237886 -84430
8681 -84430 892114 1446360 1007758 213192 -539214 -1442810 -2054209 -1493865 -238406 64956
8671 64956 -874399 -1374880 -387724 971625 1372632 1144905 1118894 1008392 217369 -805323
8661 -805323 -1222107 -1010414 -530382 299161 1459718 2255316 2213303 1870918 1796882 1526226
8651 1526226 403531 -1069662 -1673421 -976795 255987 953260 679407 19135 127076
8642 127076 1343778 2328678 1499586 -665857 -2009250 -1575784 -670027 -560881 -746534
8633 -746534 -403271 -27434 -340294 -764086 -418505 257623 263021 -314095 -728940 -1018198
8623 -1018198 -1641664 -2183428 -1782445 -593550 361590 568044 220132 -565723 -1593780
8614 -1593780 -1971767 -925816 833904 1696234 1124028 62434 -603960 -971815 -1380526
8605 -1380526 -1713517 -1740322 -1491467 -1069026 -566129 -225080 -215775 -313074 -256126 -265658 -659686
8594 -659686 -1139881 -1101900 -562482 -148848 -182103 -321685 -131178 445184 1136375 1527116
8584 1527116 1336054 832223 691369 1072721 1250542 663722 -140775 -303143 24654 7903
8574 7903 -466669 -665829 -283178 53788 -240050 -922836 -1413326 -1568377 -1668404 -1903863
8564 -1903863 -2096478 -1869538 -1126813 -391379 -378963 -1053548 -1497159 -1062450 -268159 -76368
8554 -76368 -598581 -1081049 -999903 -636927 -604961 -1171004 -2010824 -2429687 -1984396 -1018815
8544 -1018815 -308520 -113604 -42391 97031 29011 -198251 -31117 546765 714687 189590
8534 189590 -43254 761171 1740789 1641699 687222 45123 -5637 -91845 -321298 -185182
8524 -185182 261637 369933 49267 -126675 39845 229739 451694 996464 1569402 1500328
8514 1500328 846529 306661 39736 -418138 -1048754 -1219800 -761435 -211378 75437 141686
8504 141686 -160333 -908353 -1388050 -882537 -107283 -397774 -1398683 -1248332 540938
8495 540938 2138485 2082933 1249683 1061032 1239257 769328 -44680 -118235 456968 523782
8485 523782 -316826 -1229938 -1404123 -815896 160452 1059275 1323176 751671 -65456 -329106
8475 -329106 30026 422663 401338 -30180 -631158 -1030948 -933768 -590633 -660324 -1224421
8465 -1224421 -1477598 -877245 -5410 311593 139853 5118 -51649 -153798 79174 869617
8455 869617 1413601 798734 -484445 -1078298 -653693 -137235 -112791 -209947 -210058 -519912
8445 -519912 -1141497 -1269554 -518456 311331 349172 -119913 -186450 414597 1146210 1423843
8435 1423843 1063430 291508 -324799 -288400 190225 363897 26196 -131152 346095 808807
8425 808807 486657 -129515 158745 1418712 2263789 1651996 248764 -530154 -333708
8416 -333708 -32995 -233171 -438778 -50354 411930 -124283 -1568920 -2403735 -1590101 -80225
8406 -80225 370262 -472178 -1200384 -963435 -615465 -1135435 -1884060 -1447899 231530 1636289
8396 1636289 1581045 508034 -294860 -99167 882656 1922466 2207129 1307443 -282605
8387 -282605 -1294062 -835355 631205 1780730 1869223 1374511 1161240 1375154 1457857 1085056
8377 1085056 655457 682721 1012539 1030271 580712 245527 529856 1107844 1197234 530469
8367 530469 -342859 -665583 -179881 687391 1156780 744695 -191744 -690422 -207394 750955
8357 750955 1273321 1069714 468193 -304560 -1180628 -1712526 -1286676 -66318 958932
8348 958932 1155494 887435 692771 493985 98582 -149527 93223 396928 55018 -843603
8338 -843603 -1474784 -1305441 -536999 343136 930384 938719 404096 -176509 -327403 -118945
8328 -118945 157206 566117 1230408 1703756 1370613 410094 -333959 -455270 -299006 -174872
8318 -174872 5139 194390 59707 -403492 -741331 -757913 -765907 -919874 -922328 -612362 -209514
8307 -209514 234204 896870 1443131 1075605 -199810 -1184230 -1003806 -302706 -189881 -640189
8297 -640189 -806135 -422776 50083 397040 827979 1293557 1434486 1215643 955661 755710
8287 755710 488355 262570 272264 253053 -255755 -1105213 -1593268 -1345706 -612042 245593
8277 245593 961137 1163455 705289 211923 524927 1461966 1895560 1280357 317429 -220754
8267 -220754 -497523 -905260 -1102250 -549826 442612 1030120 970610 709027 446651 -102933
8257 -102933 -957975 -1592739 -1694120 -1630804 -1798602 -1939147 -1562034 -728667 103381 815545
8247 815545 1587309 2135704 1702811 127676 -1596201 -2314983 -1951728 -1304664 -917656
8238 -917656 -710231 -508608 -267062 185919 935420 1460546 1034215 -177063 -1088791 -1027826
8228 -1027826 -429168 75078 512237 1067008 1470807 1524988 1596675 1891431 1839767 1035326
8218 1035326 225767 364644 1086360 1255277 792815 697992 1230257 1397608 632208 -217678
8208 -217678 -217904 300123 526800 554601 996835 1669479 1699085 919395 284794 615771 1498706
8197 1498706 1812656 1069670 -113969 -777127 -538278 254176 969208 1066420 294108 -1005397
8187 -1005397 -1825776 -1315902 118233 1086445 941913 642666 1314832 2537367 2954267
8178 2954267 2255589 1475070 1339560 1416640 1171086 850934 791507 668580 149418 -290890
8168 -290890 37915 950001 1559624 1403978 855964 503584 562293 857756 1025435 747201
8158 747201 82409 -442202 -288330 548561 1550348 2145780 2105252 1642303 1216131 1052295
8148 1052295 828003 132827 -721947 -852556 -17138 836050 715385 -127850 -689945 -708667
8138 -708667 -860440 -1477383 -1937340 -1683928 -1145761 -1037171 -1198132 -864321 80128 869716
8128 869716 954065 637749 357598 -42088 -814083 -1562519 -1655501 -1158045 -699807 -504391
8118 -504391 -208240 331772 719739 678411 443603 290754 192941 141214 246387 312833
8108 312833 -65978 -711244 -833890 -179058 495408 535087 257377 163936 85931 -154814
8098 -154814 -36542 745023 1339769 868292 -35870 -66736 713184 1009495 334216 -455256
8088 -455256 -723149 -819871 -992355 -770581 58187 856129 1047777 863855 770996 853394
8078 853394 1059705 1367255 1465946 994682 271628 43203 405541 812228 1171864 1865645
8068 1865645 2555323 2246032 924276 -105918 -55228 369801 408507 422974 844646 1120481
8058 1120481 673427 -60279 -469708 -704148 -901633 -554900 319267 490280 -711007
8049 -711007 -1902301 -1411502 246185 1214430 1010233 728965 916812 962429 559687 200828
8039 200828 68945 -195867 -466994 -147641 589494 790747 192629 -407895 -468584 -294967
8029 -294967 -125525 224678 537557 185418 -666355 -991628 -495341 -126129 -419859 -498866
8019 -498866 433128 1601811 1733302 938165 425693 700117 1070421 885415 402591 245562
8009 245562 521544 736351 435183 -177372 -342569 368569 1402872 1820611 1453637 952357
7999 952357 708277 417950 -126387 -547001 -526003 -290389 -59432 328824 747641 461284
7989 461284 -747704 -1681131 -963389 1000452 2286734 1802203 533735 109645 793224
7980 793224 1484467 1333400 634156 71320 -295734 -838168 -1416076 -1280449 -141375 1129355
7970 1129355 1352024 429982 -590511 -814691 -367734 103323 276551 221808 2180 -396695
7960 -396695 -887210 -1310528 -1555316 -1478512 -910112 -27152 426119 -264999 -1829861 -2973856
7950 -2973856 -2622133 -1133103 37530 -58197 -918570 -1454796 -1406077 -1362791 -1574614 -1517019
7940 -1517019 -851307 -91856 177746 210917 585854 1152005 1206455 577330 -141552 -441712
7930 -441712 -411782 -327043 -215977 28634 433096 890596 1084354 585060 -610595 -1759518
7920 -1759518 -2032087 -1443026 -711132 -260072 175594 943602 1908441 2573849 2508385 1696944
7910 1696944 680377 134015 54103 -267853 -1105575 -1683098 -1314635 -568736 -380014 -495509
7900 -495509 2406 908949 1041890 234757 -246686 344809 1204255 1477495 1555598 2046617
7890 2046617 2506563 2198293 1371998 815178 662980 526351 345911 294197 210639 -101094
7880 -101094 -357055 -283689 -259811 -729503 -1307423 -1252509 -583254 65358 515846 1164322
7870 1164322 2058806 2618174 2392780 1556190 563613 -215430 -515263 -323225 -87936 -334300
7860 -334300 -931631 -1098023 -329875 874228 1426795 809103 -266363 -535810 358594
7851 358594 1370315 1359078 584257 222920 585728 766380 200325 -446026 -371836 279202
7841 279202 983844 1636777 2146802 2049320 1265854 532938 352203 274649 -34174 34160
7831 34160 804460 1261767 551792 -322576 96604 1283185 1531326 817221 785838 1816661
7821 1816661 2236325 1039618 -544839 -1155943 -1282516 -1896876 -2458817 -1785044 -80914
7812 -80914 1323373 1796913 1738218 1428908 784514 170841 335859 1278338 1989031 1665758
7802 1665758 676860 10675 126304 684778 1225712 1683067 2083177 2084407 1352659 372707
7792 372707 153864 758884 895673 -275541 -1634740 -1553792 -393189 -75066 -1222604
7783 -1222604 -2328232 -2147651 -1372929 -1169027 -1396081 -1301109 -919098 -704833 -594759 -447058
7773 -447058 -648677 -1282211 -1477051 -705146 34727 -394475 -1345447 -1305871 -301242 197453
7763 197453 -375420 -998495 -883008 -498146 -359929 -67031 828607 1906631 2412847 2069654
7753 2069654 1041282 -218021 -870828 -285799 960660 1486639 879153 265074 680672
7744 680672 1669112 2057228 1447840 350677 -590416 -914536 -400732 596509 1257688 1230139
7734 1230139 1062972 1315189 1724902 1729264 1299281 730752 97386 -529283 -814901 -725413
7724 -725413 -833011 -1360517 -1473853 -433341 993956 1355816 516140 -314587 -489780
7715 -489780 -606245 -1049599 -1169986 -549636 22565 -212190 -599193 -67635 991831 1135001
7705 1135001 60013 -880042 -659907 88479 382067 499366 1185449 1879156 1206995
7696 1206995 -693855 -1780479 -725884 1139819 1575464 448495 -296196 490969 1692263
7687 1692263 1700847 543804 -521052 -784287 -562390 -255749 188701 845818 1448578 1623087
7677 1623087 1211720 354165 -545434 -1023830 -940668 -540183 -17117 660648 1282199 1238814
7667 1238814 355206 -524442 -500073 54428 -45535 -1012432 -1655933 -1016023 339212 1120866
7657 1120866 845246 6832 -828220 -1449181 -1734641 -1596525 -1217427 -903985 -661025 -264151
7647 -264151 231453 448620 256359 -467 -57272 -190444 -764776 -1503846 -1682494 -1120433
7637 -1120433 -561685 -766723 -1483184 -1736881 -1088202 -148188 306971 342341 625330 1352657
7627 1352657 1834561 1284073 -152042 -1334746 -1207649 39048 1025632 619138 -779417
7618 -779417 -1728680 -1498145 -802934 -617310 -883758 -913887 -573781 -293057 -90647 561564
7608 561564 1752743 2672122 2458735 1158637 -349141 -1103928 -723089 279604 786639
7599 786639 151986 -925377 -1099872 -54961 1133688 1542309 1585578 2123776 2980187
7590 2980187 3159180 2321388 1266223 878406 1178974 1610244 1848192 2054474 2477656
7581 2477656 2993590 3089713 2379966 1149733 188768 -37802 172672 313997 359871 581327
7571 581327 934623 1084998 940046 716477 491685 120690 -338747 -535409 -327744 -54409
7561 -54409 -88280 -337190 -385867 7922 708009 1371836 1717046 1737881 1752637 2102786 2696334
7550 2696334 2989896 2579156 1713531 1054585 960481 1162907 1149629 721737 130542 -218451
7540 -218451 -123109 259976 515789 302164 -265161 -583015 -115163 961659 1863070 2069163
7530 2069163 1865304 1771423 1658450 911686 -496914 -1621388 -1580131 -708921 -233676 -806699
7520 -806699 -1747454 -1922371 -1144839 -360632 -402237 -894549 -747737 368845 1538472 1764852
7510 1764852 1157714 529177 187818 -201737 -710725 -888215 -560966 -182248 -63996 115721
7500 115721 609796 978720 746366 225989 7917 -58999 -588550 -1480103 -1846104 -1255873
7490 -1255873 -346074 97302 84668 60679 61713 -235296 -828863 -1259638 -1193483 -830983
7480 -830983 -651004 -900638 -1391036 -1726396 -1724710 -1617078 -1747126 -2062592 -2097866 -1596960
7470 -1596960 -961970 -810321 -1171278 -1457740 -1280805 -941417 -921265 -1188791 -1331561 -1169850
7460 -1169850 -833634 -348078 345845 909666 712208 -289901 -1215727 -1223571 -533588 -64027
7450 -64027 -252683 -717362 -1015934 -1254438 -1784374 -2559500 -2999133 -2541105 -1366169 -417218
7440 -417218 -385976 -806157 -718379 -183842 -225641 -1014157 -1274443 -253574 860465 693034
7430 693034 -94245 90491 1102969 1361284 530951 -75136 140815 329973 217778 781653
7420 781653 2133516 2697252 1594262 86375 -565829 -938093 -1721696 -1936253 -700904
7411 -700904 710251 677628 -104593 -6208 519511 -208238 -1855130 -2337226 -1201968 -208954
7401 -208954 -324462 -534272 -129596 93079 -329496 -519669 -8047 273592 -308590 -983719
7391 -983719 -1076936 -1087453 -1341105 -1105947 -119646 470136 -89554 -738180 -303551 560728
7381 560728 554294 -151099 -446005 -156742 73850 186069 566824 925452 644494 23596
7371 23596 -7681 691263 1299773 1163053 336882 -728342 -1358281 -940054 204201 737172
7361 737172 -55827 -1115775 -1077080 -280714 -68120 -499832 -289298 972639 1969737 1474740
7351 1474740 -51177 -1220856 -1344780 -766418 -83593 412875 650051 476117 -316252
7342 -316252 -1505909 -2178435 -1537382 -68707 841710 717509 515503 851586 808773 -492684
7332 -492684 -2066144 -2154897 -643912 959851 1643519 1668307 1428216 917032 421619 503544
7322 503544 1037786 1258924 927834 541553 338490 90614 -66390 313682 952834 956268
7312 956268 188090 -500736 -643277 -664242 -757511 -458012 227474 460654 -42299 -375126
7302 -375126 95968 696252 703530 623266 1155004 1733615 1342255 259633 -251275 212691
7292 212691 773704 681718 185332 -154164 -260216 -394129 -692113 -1058184 -1268551 -1152388
7282 -1152388 -834018 -641057 -587842 -271893 395370 744216 155643 -948647 -1508932 -1096037
7272 -1096037 -257821 287005 272408 -192587 -726142 -708496 161291 1235805 1445933 656092
7262 656092 -91767 8851 469308 372067 -203886 -387222 67184 432942 229117 -23688
7252 -23688 273153 726677 492693 -435650 -1222362 -1394036 -1344024 -1542535 -1891840 -2078482
7242 -2078482 -1997208 -1570599 -699596 296376 741029 491454 248712 553116 1008763 1023214
7232 1023214 766164 734156 847100 742804 582329 732876 940810 687408 165235 15065
7222 15065 222808 187044 -172351 -303747 -56460 87357 -81442 -235553 -279544 -494295
7212 -494295 -735907 -394592 560931 1315249 1276783 679078 -75169 -830442 -1225400 -761930
7202 -761930 313539 1049556 1040924 789535 582383 75411 -633314 -704741 67392 711790
7192 711790 582359 256528 192341 -207836 -1171903 -1531453 -518310 554905 78126 -1264201
7182 -1264201 -1520462 -499569 196180 -89889 -325909 58802 204776 -460416 -1160212
7173 -1160212 -1135962 -755305 -546267 -289286 199270 418699 75233 -274640 -180673 -58794
7163 -58794 -319404 -601112 -611386 -836577 -1499831 -1641238 -398483 1345692 1843270 782971
7153 782971 -442736 -747461 -526781 -596225 -915617 -897318 -411260 77425 176868 13108
7143 13108 13080 363689 737670 683714 317133 299584 889585 1378558 948637 -161347 -965052
7132 -965052 -1099393 -1159068 -1540232 -1718305 -1130896 -199933 190578 -52406 -200184 128018
7122 128018 463325 363036 177355 462747 990778 958009 149517 -649530 -589935 263834
7112 263834 1131483 1418606 1135653 604046 88586 -282583 -457527 -378628 59713 827255
7102 827255 1473484 1357310 474278 -212259 232419 1453531 2063937 1262255 -254676
7093 -254676 -1161773 -877264 147617 1089700 1353711 822741 -59827 -579958 -446183 -97314
7083 -97314 -82585 -335520 -399147 -173406 36750 142318 387946 737817 683419 2891
7073 2891 -660493 -455624 539948 1263532 864184 -285180 -966112 -450891 718801 1403505
7063 1403505 1206459 833088 987489 1303632 879024 -287566 -1096060 -788643 35350
7054 35350 287494 -218799 -828856 -1139128 -1302460 -1372346 -1088961 -425591 246226 685332
7044 685332 973921 1090489 847164 384881 131756 83985 -216625 -736592 -748295 -22938
7034 -22938 547893 198864 -511430 -585205 -117176 49303 -176950 -96331 427794 692493
7024 692493 381026 80317 278716 681067 878964 987530 1218747 1403242 1309354 979058
7014 979058 501332 -75552 -445184 -214555 451507 929597 1001931 959420 773007 63424
7004 63424 -867643 -1020178 -210367 406761 6401 -685358 -680635 -296426 -361894 -679724
6994 -679724 -574626 -385106 -952580 -1906153 -1950709 -910408 -105107 -416203 -1195670 -1506142
6984 -1506142 -1352445 -1139451 -845840 -403933 -207752 -589020 -1259099 -1768274 -2077362 -2248493
6974 -2248493 -2037306 -1275220 -299950 420412 793934 911792 720443 266427 -65210 27476
6964 27476 328095 412077 166992 -249714 -664729 -803992 -304103 768176 1650160 1590965
6954 1590965 728169 -85523 -234594 180132 694741 972545 968468 884907 989773 1305364
6944 1305364 1494403 1199080 469354 -247090 -499388 -172235 449648 872125 767899 276031
6934 276031 -121055 -47773 474567 1077326 1227415 536949 -762852 -1749212 -1658203 -831351
6924 -831351 -348844 -654523 -1096020 -1007420 -616261 -471430 -526595 -381721 -67092 63854
6914 63854 43140 267644 792638 1167757 1047287 575588 95682 -227704 -450232 -731581
6904 -731581 -1150500 -1469197 -1251151 -474614 182408 33912 -813718 -1732208 -2388801 -2752379
6894 -2752379 -2530712 -1420620 32663 676575 174805 -523515 -556745 -295042 -488019
6885 -488019 -867451 -506015 657423 1563477 1405647 531932 -259813 -720137 -1072089 -1378933
6875 -1378933 -1461116 -1271096 -977394 -714455 -490190 -317608 -242825 -218020 -74903 300324
6865 300324 769512 975074 694469 204579 85223 475527 767557 413903 -146795 44472
6855 44472 1048641 1735549 1192815 -137734 -1136862 -1320785 -966014 -366945 353630 924477
6845 924477 1078160 944117 777346 465399 -133547 -587303 -346162 324405 647412 495467
6835 495467 376829 286220 -361472 -1438185 -1888653 -1299879 -595983 -481043 -268556 755755
6825 755755 1761808 1477995 253484 -424615 -207397 -207802 -983407 -1623517 -1297212 -528699
6815 -528699 -249457 -450598 -517111 -271565 61124 489842 1109346 1546883 1261125 394138
6805 394138 -216976 -7908 686141 1109943 932225 422882 -31418 -277894 -233115 278231
6795 278231 1181966 1836537 1583353 685410 167851 469906 806776 311739 -695815 -1220534
6785 -1220534 -1009301 -702608 -726923 -812993 -666348 -434332 -328349 -317344 -403117 -778947
6775 -778947 -1485733 -2160248 -2280227 -1602110 -470633 234125 -171194 -1241553 -1674346
6766 -1674346 -906508 118778 326996 -26174 -83641 117884 13975 -182693 94816 423967
6756 423967 11546 -563422 15622 1372153 1563966 65217 -1313625 -1231903 -635190
6747 -635190 -705097 -860847 -279860 227475 -327308 -1049638 -501059 831521 1368059 1033177
6737 1033177 1022044 1462304 1368779 704613 446819 601274 157609 -802034 -962790 -142294
6727 -142294 195758 -569617 -1171684 -808871 -626542 -1544629 -2312711 -1444259 167681 470755
6717 470755 -684792 -1609635 -1524473 -1357405 -1722452 -1850053 -1080588 -66514 307972 276940
6707 276940 625798 1367541 1802104 1604270 1133159 732763 338733 -103010 -304720 -5372
6697 -5372 592428 1064553 1322739 1607923 1942587 1941405 1305132 235822 -787481 -1371919
6687 -1371919 -1217097 -203865 1160468 1815548 1254995 303690 159657 860934 1432963
6678 1432963 1408105 1256899 1221286 785519 -217455 -903836 -499658 447691 856826 668060
6668 668060 719518 1306829 1809747 1816480 1778125 2209944 2818076 2851091 2021201 723043
6658 723043 -487037 -1299723 -1588527 -1257328 -349465 762645 1512695 1597751 1222169 778855
6648 778855 420966 138877 61373 261264 341350 -196994 -1015700 -1003947 278987 1731317
6638 1731317 1923239 900330 56827 290449 1043160 1343125 1070488 717898 402895
6629 402895 -204530 -1106812 -1750150 -1707931 -1178333 -613601 -201228 17785 -176192 -943810
6619 -943810 -1922508 -2445694 -2275269 -1746399 -1152373 -466691 171512 275847 -271878 -801868
6609 -801868 -706636 -339964 -410549 -773159 -649350 34402 424972 23587 -621626 -816380
6599 -816380 -611431 -414467 -338456 -356158 -528185 -643185 -222319 613686 894591 61874
6589 61874 -1073881 -1396974 -1023077 -878950 -1134678 -1147680 -859616 -1085606 -2144748 -3159254
6579 -3159254 -3164057 -2223654 -1053997 -163157 236528 89431 -222311 18611 923167 1568536
6569 1568536 1074206 -235236 -1308987 -1691129 -1709698 -1587471 -1160355 -506123 -111277
6560 -111277 -172215 -294695 -175111 -103608 -440455 -979412 -1244776 -1160776 -1016985 -959986
6550 -959986 -948155 -1080658 -1476990 -1830435 -1612227 -910700 -589916 -1222741 -2168943 -2213804
6540 -2213804 -1053105 322992 812232 366340 -217959 -318839 56458 634888 1220306
6531 1220306 1600652 1504817 933223 364566 335212 799397 1114608 751692 -89998 -671911
6521 -671911 -492300 176490 538251 91092 -787163 -1173935 -637203 185621 306118 -356999
6511 -356999 -827517 -324503 747460 1403720 1323907 972135 710363 496502 481486 1128053
6501 1128053 2368870 3229134 2818686 1394163 2884 -669785 -695543 -426263 -126892
6492 -126892 37373 71315 139582 216125 -4541 -480426 -474474 541112 1868625 2232406
6482 2232406 1397118 373034 -48023 -109560 -185980 42883 888042 1752356 1739650 908585
6472 908585 208123 208015 499730 472358 171188 57110 179887 42244 -614985 -1245575
6462 -1245575 -1115138 -383075 -15410 -446605 -940492 -738086 -241610 -284954 -672265 -476282
6452 -476282 375906 956167 870167 784733 1104589 1264598 877819 515539 634418 721848
6442 721848 364139 229866 946304 1801151 1760440 1145570 1006721 1323901 1246690 806779
6432 806779 839956 1239265 885995 -384978 -1261321 -946721 -298686 -193346 2561 1242699
6422 1242699 2996919 3885412 3649038 3321518 3570893 3863060 3408131 2233912 1079551
6413 1079551 609968 879430 1348797 1390203 895898 321084 69156 55586 -8095 -182432
6403 -182432 -327136 -295996 28699 567606 806705 232819 -747880 -933384 138857 1327442
6393 1327442 1270147 247670 -213191 528350 1434358 1308760 249631 -856681 -1567656
6384 -1567656 -1908339 -1639659 -456457 1072962 1669990 904153 -22255 291357 1575368
6375 1575368 2252678 1570357 441881 -79185 -197366 -578190 -946655 -525604 509568
6366 509568 1138849 1020879 863425 1119901 1313891 1005143 523334 252625 -21775 -465052
6356 -465052 -581471 39468 847783 903412 41737 -1051447 -1645678 -1442062 -635134 75342
6346 75342 -33639 -782801 -1148429 -695635 -293111 -750239 -1452807 -1284656 -344178 342175
6336 342175 426184 399348 410681 177323 -2519 539362 1475657 1621188 771370 174399
6326 174399 680351 1587364 1949536 1875353 1691933 927056 -696680 -2049128 -1746424 -185637
6316 -185637 814582 337075 -737823 -1195757 -837720 -154383 443438 655442 224873
6307 224873 -661766 -1306537 -1240600 -776628 -520500 -563639 -468585 77273 876202 1471895
6297 1471895 1605139 1379328 1064654 825981 672675 588083 553060 461817 230390 13919
6287 13919 36489 136978 -125155 -709350 -896885 -272020 484822 372445 -588619 -1435670
6277 -1435670 -1580311 -1341179 -1127070 -848243 -407585 -108149 -143813 -196773 -6960 101158
6267 101158 -192761 -443201 57453 1124042 1677277 1032462 -241317 -929562 -404058
6258 -404058 837674 1699320 1551451 877499 698645 1218411 1444506 611521 -454671
6249 -454671 -278770 1048537 1679651 440176 -1483330 -2032390 -827488 630500 948466
6240 948466 168063 -727277 -805209 297398 2087060 3351838 3233228 2239121 1586934
6231 1586934 1567682 1351590 483947 -393217 -649282 -549221 -479027 -160532 605279 1147757
6221 1147757 812271 132447 136404 778397 1026422 397155 -489844 -912790 -827799 -544894
6211 -544894 -248566 30454 372535 855161 1177907 753574 -353452 -1101636 -799916 -174727
6201 -174727 -142708 -155977 850015 2308221 2545490 1381693 360346 169781 -179533
6192 -179533 -1035935 -1083270 265637 1434701 1172056 712306 1561243 2623429 1842776
6183 1842776 -305281 -1450347 -944605 -356057 -465640 -285124 552329 789924 -196978
6174 -196978 -1079567 -559175 846996 1953306 2454193 2422287 1662083 620550 635691 2061946
6164 2061946 3269369 2781482 1402935 860484 1245516 1375088 1027005 1070742 1595613
6155 1595613 1573688 591823 -402125 -448379 295102 1063316 1324474 885666 -107463 -1022559
6145 -1022559 -1165122 -539545 229378 688513 764122 352238 -550150 -1306762 -1023110 310585
6135 310585 1621224 1874975 979294 -403828 -1392709 -1281263 -91588 1165114 1409058
6126 1409058 790338 463179 994550 1725660 1907126 1687463 1575058 1594391 1525808 1512565
6116 1512565 1843882 2353695 2474599 1817230 526069 -757226 -1223421 -542716 664745
6107 664745 1335802 1078044 458781 151531 274515 669659 1227926 1656997 1501430 809355
6097 809355 323930 576895 1161600 1307095 817806 59824 -587950 -823418 -385648 471168
6087 471168 769514 -221853 -1860362 -2569422 -1514753 526958 2007351 2008261 838662
6078 838662 -412912 -849627 -517203 -246315 -673791 -1545674 -2123725 -2073924 -1700184 -1443761
6068 -1443761 -1422335 -1408173 -1096326 -464171 101955 259411 281469 728928 1427422 1397366
6058 1397366 219418 -1107279 -1308620 -427400 433272 640267 495055 340668 102987
6049 102987 -186481 -203447 83576 239180 2761 -392345 -692274 -898178 -936793 -631571
6039 -631571 -194162 -156528 -559923 -785249 -465872 42360 419115 883024 1429442 1332818
6029 1332818 248811 -753932 -333106 1177372 2040909 1393617 205750 -309675 -234626
6020 -234626 -294857 -506774 -371225 31603 86390 -331469 -699365 -754777 -785489 -848194 -481385
6009 -481385 414900 1109517 1032594 693932 906351 1509599 1714091 1462303 1443784 1731865
5999 1731865 1472718 300884 -876443 -1112795 -694457 -479163 -591502 -598439 -491580 -544304
5989 -544304 -487358 147891 935152 838999 -230913 -1105883 -978093 -509059 -747712 -1552640
5979 -1552640 -1809636 -967044 268773 797146 328402 -375305 -371599 389887 987405 662388
5969 662388 -179310 -484234 67708 737007 797577 360594 -31859 -98441 143921 571629
5959 571629 913804 906936 687239 605228 515707 -136428 -1235636 -1702631 -851551 490603
5949 490603 901455 64099 -1098791 -1731752 -1803649 -1682896 -1626059 -1735244 -1896974 -1677690
5939 -1677690 -709606 713953 1769922 1950734 1551839 1245821 1333972 1468497 1060053
5930 1060053 -432 -1063424 -1376303 -993639 -660700 -734332 -739887 -245849 351398 336043
5920 336043 -415944 -1401797 -1994312 -1703966 -500050 747768 843851 -144715 -637349 323264
5910 323264 1503006 1215495 -59422 -378287 619926 1168349 166556 -1171971 -1243169
5901 -1243169 -272324 406898 301286 -109435 -503481 -889886 -1060633 -850210 -682083 -964572
5891 -964572 -1139531 -286156 1293220 2015063 923777 -944464 -1622308 -411119 1393644
5882 1393644 1977672 900446 -695391 -1607083 -1843208 -2137404 -2635584 -2719696 -2068629
5873 -2068629 -1207344 -792327 -882570 -1168540 -1426716 -1433640 -905063 39220 673103 371748
5863 371748 -636019 -1518247 -1681378 -1170007 -487751 -252013 -757628 -1608784 -1987602 -1508251
5853 -1508251 -608797 45210 257479 235253 180739 232664 552923 1157741 1763991 1968124
5843 1968124 1527300 524775 -558362 -1108827 -1046458 -969448 -1167747 -920902 359470
5834 359470 1665614 1396207 -164740 -894770 195145 1568673 1563846 701531 361642
5825 361642 425670 -136444 -1146314 -1421508 -742660 -43219 240467 590194 1170551 1462375
5815 1462375 1251953 897871 545579 76912 -209636 52070 340326 -158807 -998957 -841422
5805 -841422 430346 1308599 798060 -264193 -585981 -61442 576027 843525 653625
5796 653625 130138 -214809 176311 994760 1251315 714899 308566 668235 1211618 1145679
5786 1145679 532576 -185641 -860969 -1260215 -894477 80904 592154 3779 -952529 -1291381
5776 -1291381 -1095688 -994042 -1016379 -785814 -292557 266508 902668 1445284 1327570 414787
5766 414787 -554690 -949976 -959713 -762913 25569 1250353 1634832 508561 -779306 -570376
5756 -570376 670926 1134606 353777 -492810 -676536 -658790 -750539 -613957 -301724 -363725
5746 -363725 -633238 -257026 710092 1083225 441035 -24233 709496 1897235 2078517 1013575
5736 1013575 -226424 -639904 -141635 639547 964481 621815 145455 101313 241956 -46979
5726 -46979 -582138 -560204 25754 197209 -429469 -909144 -429683 377340 388184 -387530
5716 -387530 -986799 -926420 -665353 -756505 -1129701 -1264072 -805688 -17839 396663 141023
5706 141023 -161244 212246 906740 907702 118437 -458124 -344881 -332278 -1074762 -1943728
5696 -1943728 -2033888 -1490854 -996917 -642762 -226456 -67335 -506167 -1032723 -937959 -518247
5686 -518247 -591392 -1034383 -920829 -110338 397077 -61331 -899038 -1213297 -901107 -445527
5676 -445527 -176625 -159035 -356598 -503607 -163423 687401 1364941 1127265 18310 -1173498
5666 -1173498 -1722396 -1568195 -1204294 -1138344 -1447815 -1745803 -1543548 -705448 358781 925191
5656 925191 520862 -570389 -1462543 -1568061 -1257098 -1275720 -1595266 -1420375 -497158 237272
5646 237272 -203153 -1492852 -2349525 -2014532 -851137 351304 1086149 1192213 810046
5637 810046 443240 623321 1260171 1590117 1013181 -160092 -1011080 -1007970 -486502 -77767
5627 -77767 97771 334720 535134 106034 -995376 -1690975 -996700 477477 1114704 324481
5617 324481 -917558 -1636710 -1931819 -2144100 -2005370 -1287574 -498891 -190074 -178316 -111441
5607 -111441 -157408 -431948 -410036 257970 912511 730270 -89552 -795942 -1175345 -1292678
5597 -1292678 -809448 326988 1090380 549839 -589015 -946894 -581929 -621264 -1038024
5588 -1038024 -561795 1042305 2330675 2299269 1643924 1312275 1156597 709835 102780
5579 102780 -463801 -1073639 -1388844 -807292 126532 -105763 -1629413 -2489218 -1420018
5570 -1420018 165315 377918 -280157 -21458 1238088 1991398 1726187 1414870 1523387
5561 1523387 1357358 609286 -4073 -25842 86906 -58803 -254889 -392390 -639517 -706701
5551 -706701 -29595 1065526 1500993 1062438 730595 1013893 1156293 577503 -89223 -186895
5541 -186895 -187417 -682945 -1124941 -703795 146891 317284 -250297 -531187 -28858 564744
5531 564744 424577 -423289 -1303568 -1552029 -941158 84411 609677 123318 -838544 -1294898
5521 -1294898 -948401 -318208 66386 114002 -32641 -121730 162846 758326 1000253 462968
5511 462968 -175151 75912 945571 1140465 338081 -177851 545430 1567828 1393753 191927
5501 191927 -500121 -41838 535339 200575 -652181 -994894 -712259 -636444 -1238731 -1895631
5491 -1895631 -1626807 -304903 1110292 1590536 1147714 689734 788572 1014747 752955
5482 752955 224547 119863 466704 587285 154172 -435008 -826819 -1094463 -1141463 -563903
5472 -563903 448701 879925 218314 -643209 -610389 92646 488723 401837 371986 410192
5462 410192 115996 -105155 649856 2082030 2716440 2096001 1571180 2135673 2774880 2103037
5452 2103037 612438 -99913 304328 763583 695520 570278 654936 567393 304638 480078
5442 480078 1118662 1273283 388728 -798753 -1273540 -929766 -232387 586154 1360016 1639251
5432 1639251 1227121 649193 448239 398255 48916 -356482 -275233 96331 31395 -524878
5422 -524878 -761480 -164458 762696 1172941 800853 23843 -587444 -605414 -33419 533530
5412 533530 396831 -356924 -769163 -84076 1333873 2423101 2544255 1869530 836911
5403 836911 -343179 -1549732 -2440109 -2570275 -1862098 -837328 -258605 -473014 -1150568
5394 -1150568 -1717737 -1958388 -2064201 -2183193 -2150425 -1699871 -764777 464344 1592667
5385 1592667 2107728 1696446 656695 -205220 -329989 16947 109893 -348644 -891287 -853340
5375 -853340 -151752 567306 576097 -115439 -683522 -412764 387915 741571 294859 -267494
5365 -267494 -350391 -371248 -927400 -1523689 -1110073 210577 1090952 831570 345193 651994
5355 651994 1322362 1306705 647567 269828 418386 458174 157027 38948 304617 452105
$$ [...]
##END NTUPLES=NMR SPECTRUM
##END=
