##TITLE=31Pdec_11P50
 D2O, 24 sc
 18.5.2023
##JCAMPDX= 6.0         $$ Bruker NMR JCAMP-DX V2.0
##DATA TYPE= NMR SPECTRUM
##DATA CLASS= NTUPLES
##ORIGIN= UXNMR, Bruker Analytische Messtechnik GmbH
##OWNER= root
$$ XWIN-NMR		Version 3.5
$$ Thu May 18 14:54:48 2023 Russian Standard Time (UT+4h)  she@DPX200
##.OBSERVE FREQUENCY= 81.013821
##.OBSERVE NUCLEUS= ^31P
##.ACQUISITION MODE= SIMULTANEOUS
##.ACQUISITION SCHEME= undefined
##.AVERAGES= 24
##.DIGITISER RES= 16
##SPECTROMETER/DATA SYSTEM= spect
##.PULSE SEQUENCE= zgpg30
##.SOLVENT NAME= D2O
##.SHIFT REFERENCE= (INTERNAL, D2O, 0, 248.564)
##AUDIT TRAIL= $$ (NUMBER, WHEN, WHO, WHERE, WHAT)
$$ ##TITLE= Audit trail, XWIN-NMR		Version 3.5
$$ ##JCAMPDX= 5.01
$$ ##ORIGIN= Bruker BioSpin GmbH
$$ ##OWNER= she
$$ F:/spectra/data/she/nmr/P31/1/pdata/1/auditp.txt
$$ ##AUDIT TRAIL=  $$ (NUMBER, WHEN, WHO, WHERE, WHAT)
(   1,<2023-05-18 14:53:58.59 +0400>,<she>,<DPX200>,
      <created by zg, POWCHK disabled, PULCHK disabled
       configuration hash MD5:
       00 E9 B6 7A A2 85 ED C7 34 08 36 98 17 FE 4E 26
       data hash MD5: 32K
       00 2F 4C 7A AF 7F 44 14 72 5A 69 00 80 23 A9 8A>)
(   2,<2023-05-18 14:54:01.00 +0400>,<she>,<DPX200>,
      <Start of raw data processing
       efp BC_mod = 2 LB = 1 FT_mod = 6 PKNL = 1 PHC0 = -10868.62 PHC1 = 470.0849 SI = 64K 
       data hash MD5: 64K
       E4 6C 9E 0A 54 87 28 03 60 BE CC 60 F8 2A 70 DE>)
(   3,<2023-05-18 14:54:15.96 +0400>,<she>,<DPX200>,
      <pk PHC0 = -2.446167 PHC1 = 0 
       data hash MD5: 64K
       03 8A 4E 3F 04 4C B6 9C 76 EF 0C E6 91 9B 69 9B>)
$$ ##END=
$$ 
$$ hash MD5
$$ 89 8A 3E 34 FC 82 F5 CB C0 30 C4 79 05 60 8F 4B
##$RELAX= 
##$RELAX= 
##$RELAX= 
##$RELAX= 
##$RELAX= 
##$RELAX= 
##$RELAX= 
##$RELAX= 
##$RELAX= 
$$ Bruker specific parameters
$$ --------------------------
##$DU= <F:/spectra>
##$EXPNO= 1
##$NAME= <P31>
##$PROCNO= 1
##$TYPE= <nmr>
##$USER= <she>
##$AMP= (0..31)
100 100 100 100 100 100 100 100 100 100 100 100 100 100 100 100 100 100 
100 100 100 100 100 100 100 100 100 100 100 100 100 100 
##$AQSEQ= 0
##$AQ_mod= 1
##$AUNM= <au_zg>
##$AUTOPOS= <>
##$BF1= 81.014009
##$BF2= 200.13
##$BF3= 200.13
##$BF4= 200.13
##$BF5= 200.13
##$BF6= 200.13
##$BF7= 200.13
##$BF8= 200.13
##$BYTORDA= 1
##$CFDGTYP= 0
##$CFRGTYP= 5
##$CHEMSTR= <none>
##$CNST= (0..31)
1 1 145 1 1 1 1 1 1 1 1 1 1 1 1 1 1 1 1 1 1 1 1 1 1 1 1 1 1 1 1 1 
##$CPDPRG= <waltz16>
##$CPDPRG1= <>
##$CPDPRG2= <waltz16>
##$CPDPRG3= <>
##$CPDPRG4= <mlev>
##$CPDPRG5= <mlev>
##$CPDPRG6= <mlev>
##$CPDPRG7= <mlev>
##$CPDPRG8= <mlev>
##$CPDPRGB= <>
##$CPDPRGT= <>
##$D= (0..31)
0 1 0 0 0 0 0 0 0 0 0 0.03 2e-05 3e-06 0 0 0 0 0 0 0 0 0 0 0 0 0 0 0 0 
0 0 
##$DATE= 1684407238
##$DBL= (0..7)
120 120 120 11 120 120 24 19 
##$DBP= (0..7)
150 150 150 150 150 150 150 150 
##$DBP07= 0
##$DBPNAM0= <>
##$DBPNAM1= <>
##$DBPNAM2= <>
##$DBPNAM3= <>
##$DBPNAM4= <>
##$DBPNAM5= <>
##$DBPNAM6= <>
##$DBPNAM7= <>
##$DBPOAL= (0..7)
0.5 0.5 0.5 0.5 0.5 0.5 0.5 0.5 
##$DBPOFFS= (0..7)
0 0 0 0 0 0 0 0 
$$ [...]
##$SUBNAM2= <"">
##$SUBNAM3= <"">
##$SUBNAM4= <"">
##$SUBNAM5= <"">
##$SUBNAM6= <"">
##$SUBNAM7= <"">
##$SUBNAM8= <"">
##$SUBNAM9= <"">
##$SW= 501.771253377433
##$SWIBOX= (0..15)
0 1 3 0 0 0 0 0 0 0 0 0 0 0 0 0 
##$SW_h= 40650.406504065
##$TD= 32768
##$TD0= 1
##$TE= 0
##$TE2= 300
##$TE3= 300
##$TEG= 300
##$TL= (0..7)
0 120 53 12 22 120 120 120 
##$TP= (0..7)
150 150 150 150 150 150 150 150 
##$TP07= 0
##$TPNAME0= <>
##$TPNAME1= <>
##$TPNAME2= <>
##$TPNAME3= <>
##$TPNAME4= <>
##$TPNAME5= <>
##$TPNAME6= <>
##$TPNAME7= <>
##$TPOAL= (0..7)
0.5 0.5 0.5 0.5 0.5 0.5 0.5 0.5 
##$TPOFFS= (0..7)
0 0 0 0 0 0 0 0 
##$TUNHIN= 0
##$TUNHOUT= 0
##$TUNXOUT= 0
##$USERA1= <user>
##$USERA2= <user>
##$USERA3= <user>
##$USERA4= <user>
##$USERA5= <user>
##$V9= 5
##$VALIST= <valist>
##$VCLIST= <CCCCCCCCCCCCCCC>
##$VD= 0
##$VDLIST= <DDDDDDDDDDDDDDD>
##$VPLIST= <PPPPPPPPPPPPPPP>
##$VTLIST= <TTTTTTTTTTTTTTT>
##$WBST= 1024
##$WBSW= 4
##$XGAIN= (0..3)
0 0 0 0 
##$XL= 0
##$YL= 0
##$YMAX_a= 3033
##$YMIN_a= -3174
##$ZGOPTNS= <>
##$ZL1= 120
##$ZL2= 120
##$ZL3= 120
##$ZL4= 120
##$ABSF1= 0
##$ABSF2= 0
##$ABSG= 0
##$ABSL= 0
##$ALPHA= 0
##$AQORDER= 0
##$ASSFAC= 0
##$ASSFACI= 0
##$ASSFACX= 0
##$ASSWID= 0
##$AUNMP= <proc_1d>
##$AZFE= 0.1
##$AZFW= 0.5
##$BCFW= 0
##$BC_mod= 2
##$BYTORDP= 0
##$COROFFS= 0
##$CY= -3
##$DATMOD= 1
##$DC= 0
##$DFILT= <>
##$DTYPP= 0
##$F1P= 0
##$F2P= 0
##$FCOR= 1
##$FTSIZE= 65536
##$FT_mod= 6
##$GAMMA= 0
##$GB= 0
##$INTBC= 1
##$INTSCL= 6.047779e-11
##$ISEN= 30
##$LB= 1
##$LEV0= 0
##$LPBIN= 0
##$MAXI= 10000
##$MC2= 0
##$MEAN= 0
##$ME_mod= 0
##$MI= 50
##$NCOEF= 0
##$NC_proc= -6
##$NLEV= 6
##$NOISF1= 182.463
##$NOISF2= 159.3651
##$NSP= 0
##$NTH_PI= 0
##$NZP= 0
##$OFFSET= 248.5645
##$PC= 4
##$PHC0= -10871.07
##$PHC1= 470.0849
##$PH_mod= 1
##$PKNL= yes
##$PPARMOD= 0
##$PSCAL= 0
##$PSIGN= 0
##$REVERSE= no
##$SF= 81.0140089999694
##$SI= 65536
##$SIGF1= 159.3651
##$SIGF2= -187.1042
##$SINO= 113.3802
##$SIOLD= 16384
##$SREGLST= <1H.CDCl3>
##$SSB= 0
##$STSI= 65536
##$STSR= 0
##$SW_p= 40650.406504065
##$SYMM= 0
##$S_DEV= 0
##$TDeff= 32768
##$TDoff= 0
##$TI= <>
##$TILT= no
##$TM1= 0
##$TM2= 0
##$TOPLEV= 0
##$USERP1= <user>
##$USERP2= <user>
##$USERP3= <user>
##$USERP4= <user>
##$USERP5= <user>
##$WDW= 1
##$XDIM= 65536
##$YMAX_p= 482926068
##$YMIN_p= -231576004
$$ End of Bruker specific parameters
$$ ---------------------------------
##NTUPLES= NMR SPECTRUM
##VAR_NAME=  FREQUENCY,     SPECTRUM/REAL,   SPECTRUM/IMAG
##SYMBOL=    X,             R,               I
##VAR_TYPE=  INDEPENDENT,   DEPENDENT,       DEPENDENT
##VAR_FORM=  AFFN,          ASDF,            ASDF
##VAR_DIM=   65536,         65536,           65536
##UNITS=     HZ,            ARBITRARY UNITS, ARBITRARY UNITS
##FACTOR=    0.620285442955139, 1,           1
##FIRST=     20137.2065510682, 0,            0
##LAST=      -20513.1999529968, 0,           0
##MIN=       -20513.1999529968, -231576004,  0
##MAX=       20137.2065510682, 482926068,    0
$$ Real data points
##PAGE= N=1
##DATA TABLE= (X++(R..R)), XYDATA
$$ [...]
13235A772576j227116l25000l6410n43161o06335L1207L53660j3131k83119N4341
$$ 1772576 545460 220460 184050 -359111 -965446 -934239 -580579 -593710 -876829 -822488
13225h22488N77562P77959N61232o6021r25793j353644p85672L47764J006072
$$ -822488 -244926 533033 1094265 1028244 102451 -1251193 -2036865 -1689101 -683029
13216f83029Q01326K99179J12432K50759L95732L65989J85819o8563l60486o15517
$$ -683029 118297 417476 529908 780667 1176399 1542388 1728207 1659644 1299158 683641
13206F83641n81155k5490P15972P83956j17657j046048r38344j04178K78250n7693
$$ 683641 102486 76996 792968 1576924 1459267 413219 -525125 -629303 -351053 -408746
13196d08746k48420J48610M95883K10284l80845o24379k72348M97724J133910
$$ -408746 -657166 -508556 -12673 197611 -183234 -807613 -1079961 -582237 551673
13187E51673Q89391k60560j133053p25221K88411O30247M79770Q44124J299813
$$ 551673 1441064 1180504 47451 -677770 -389359 240888 720658 1564782 2864595
13178B864595M82087j164338j473614P7293J372876Q95525k13616m56801k55886
$$ 2864595 3346682 2182344 708730 786023 2158899 3054424 2840808 2384007 2128121
13169B128121m91652o40664m2900N08946J32458m97961m50717k14872m93577n98482
$$ 2128121 1636469 995805 952905 1461851 1594309 1096348 645631 430759 -62818 -661300
13159f61300K32085J087527P77706o3468j29678K41099j35949r46976q75951M1416
$$ -661300 -429215 658312 1436018 1372550 1242872 1483971 1348022 401046 -474905 -433489
13149d33489N09483J35217k54872k32056j12250N3578L72021L67550k19690m49663
$$ -433489 75994 211211 -43661 -275717 -387967 -334389 37632 405182 185492 -264171
13139b64171M43704J359271Q21460m65326o40983J98566K56446p49086j116869
$$ -264171 179533 1538804 2360264 1894938 1253955 1452521 1708967 959881 -156988
13130a56988j93270N61201J95210k83992j1062K21564k84943o36851L5364Q74137
$$ -156988 -350258 210943 406153 122161 111099 332663 47720 -589131 -553767 320370
13120C20370O44034k64805n72528j21329J31472k78592p78404o63408J32833J048766
$$ 320370 964404 699599 127071 5742 137214 -141378 -919782 -1583190 -1450357 -401591
13110d01591J330766P27648r1647k39185K28319M50342P2032l88024n59539o77035
$$ -401591 929175 1656823 1565176 1325991 1554310 2004652 2076684 1688660 1129121 452086
13100D52086p96209n19751J43243N50670M46169L31452M51709L48067j30906l51431
$$ 452086 -344123 -863874 -720631 -169961 276208 607660 1059369 1407436 1276530 925099
13090I25099j3959J85982k76844p75003n13267K08366N48824L73756J31121n6405
$$ 925099 911140 1097122 820278 45275 -467992 -259626 289198 662954 794075 737670
13080G37670l58703o08562m37426J22098O78863R23904O88857m6021q31351r30488
$$ 737670 378967 -229595 -667021 -544923 133940 1057844 1746701 1700680 869329 -61159
13070f1159k84753K15045n8520n38657l83109K24433M90477K88978J08240J5501
$$ -61159 -345912 -130867 -189387 -728044 -1111153 -886720 -396243 -107265 975 16476
13060A6476l16994o44461k67059P02560J161138N16131m39196o92987l68089j92179
$$ 16476 -300518 -944979 -1212038 -509478 651660 1167791 728595 35608 -332481 -524660
13050e24660j49694L65859J203662J302127J97842j134357j503464r52199l07458
$$ -524660 -674354 -308495 895167 2197294 2395136 1260779 -242685 -1194884 -1502342
13041a502342J89712Q45534J368461R55334k68008j003678n20515K90474L04619
$$ -1502342 -1312630 -467096 901365 1856699 1588691 585013 64498 354972 659591
13032F59591k17097l10008M7593P7286l59572n77545k36870K60679N31346N29085
$$ 659591 442494 132486 180079 257365 -102207 -679752 -916622 -655943 -124597 404488
13022D04488J90685l65183m19185N24846J543371J144598m90071j410781n36335
$$ 404488 595173 229990 -189195 335651 1879022 3023620 2533549 1122768 586433
13013E86433Q45805R81691k3723p85051p13927l55202j29405R3647K98383J82444
$$ 586433 1432238 2413929 2390206 1605155 891228 536026 406621 500268 798651 981095
13003I81095k14589m51789l28576n6416J73872K83672P0812n15575r10003m16507
$$ 981095 766506 314717 -13859 -70275 103597 387269 458081 -57494 -967497 -1384004
12993a384004P14304J321421P32711l55942p65146k56300L54403L61032J2465
$$ -1384004 -669700 651721 1384432 1028490 263344 7044 361447 722479 734944
12984G34944N8061O81744J181396Q08893k57708j072755j049828n75851l40451
$$ 734944 793005 1474749 2656145 3465038 3207330 2134575 1084747 508896 168445
12975A68445m29644m49694k68894j19394n9607J24160M27387N30534L14437K0037
$$ 168445 -261199 -710893 -979787 -1099181 -1158788 -1034628 -607241 -76707 237730 257767
12965B57767k22838m94011n42099J44824J294615J644339N86767n93437k68368
$$ 257767 34929 -459082 -1001181 -856357 438258 2082597 2669364 2075927 1807559
12956A807559J080569J363771o4160j379857r56165L49911O97657k4562m63502
$$ 1807559 2888128 4251899 4187739 2807882 1851717 2201628 2899285 2874723 2411221
12947B411221j80371j45848q84605j542364j170812K7737J085580J235643M01123
$$ 2411221 2230850 2085002 1200397 -341967 -1512779 -1485042 -399462 836181 1237304
12938A237304o36810o92772M14028J206359L94103r75574p68283R25580J678798
$$ 1237304 600494 -92278 321750 1528109 1922212 946638 178355 1103935 2782733
12929B782733L65057j177442j140348l89167n00057q75903k659J515295J607167
$$ 2782733 3147790 1970348 830000 440833 -59224 -935127 -937786 577509 2184676
12920B184676N8053j086042n87233M53147N74104j49606p88765q53289l05758
$$ 2184676 2242729 1156687 569454 1022601 1596705 1447099 658334 -194955 -500713
12911e00713O81600J450867J206493P6419r04317j105336q17087l65732K92975
$$ -500713 180887 1631754 2838247 2914666 2010349 905013 87926 -277806 15169
12902A5169Q91641Q22311J34451m07240n47785p74622j063489o73932L32899P78834
$$ 15169 906810 1729121 1863572 1456332 908547 133925 -929564 -1603496 -1270597 -491763
12892d91763L02328J27275Q48557J005855n22548k049101j210536J174954J915089
$$ -491763 -189435 -62160 786397 1792252 1269704 -779397 -1989933 -814979 1100110
12883A100110J04181j583274r87512N35961O83782j68740m4269J085559J277725
$$ 1100110 1204291 -378983 -1366495 -830534 -146752 -315492 -359761 725798 2003523
12874B003523p4953j218526q23700J31988K26525k17380j16140L40082K00192
$$ 2003523 1928570 710044 -113656 18332 244857 27477 -88663 251419 451611
12865D51611l56858k87288L79140M79647k46053n88179J61096J019487Q66915
$$ 451611 94753 -192535 186605 666252 420199 -167980 -6884 1012603 1879518
12856A879518N9487m26314n03377n64426l70805L91006R87951M43707p72553j192774
$$ 1879518 1939005 1512691 1009314 444888 74083 465089 1453040 1896747 1124194 -68580
12846f8580m54950L32457M34935L42982M33799J79023n94273q97614p2504Q75285
$$ -68580 -523530 -191073 243862 586844 1020643 1199666 605393 -292221 -364725 510560
12836E10560O49243l11769n15942K70902Q17111M57122q3932j53679j44566m64294
$$ 510560 1159803 848034 332092 602994 1420105 1877227 1793295 1639616 1495050 1030756
12826A030756o66593l30771J10652J73864J14646J58423j32518p75952o64603
$$ 1030756 364163 33392 144044 317908 432554 590977 458459 -317493 -982096
12817i82096P38008J908980J173173n82983j139813m72374n88337j744712j655736
$$ -982096 -244088 1664892 2838065 2255082 1115269 642895 54558 -1690154 -3345890
12808c345890N69554K430673J686231k97784r63038l69550j39717k20509M65612
$$ -3345890 -2776336 -345663 1340568 1042784 79746 -289804 -429521 -650030 -184418
12799a84418J256635O49426o62022o41522N17336P22398j79990j44278J112480
$$ -184418 1072217 1721643 1059621 418099 935435 1657833 1477843 1333565 2446045
12790B446045J239545o55941k196413j482108J47378P71481P09323Q04801L57991
$$ 2446045 3685590 3029649 833236 -648872 -501494 269987 979310 1784111 2142102
12781B142102j026711j693889m53298R91768O10544o00256m46895P07040Q55228
$$ 2142102 1115391 -578498 -1031796 -40028 570516 -29740 -476635 230405 1085633
12772A085633m0754k92604K91673K93501m74438o96380q0150L23417L33382P36946
$$ 1085633 1044879 752275 1043948 1337449 863011 166631 86481 409898 743280 1480226
12762A480226J122226J73927j555613j788629j13527J087982L25946p65908k95948
$$ 1480226 2602452 2776379 1220766 -567863 -681390 406592 732538 -33370 -329318
12753c29318Q94221R20114o4404m88852m0096K68830J48164K76016O41478L71210
$$ -329318 564903 1485017 1420613 931761 891665 1160495 1308659 1584675 2226153 2597363
12743B597363n46821q89832j39384N00550l8596q52006m44795O58895M79988j158675
$$ 2597363 2050542 1160710 1021326 1521876 1483280 631274 186479 845374 1325362 166687
12733A66687j936801n26323J113816O78739p69933n09332J318012J880201L08835
$$ 166687 -1770114 -2296437 -1182621 -503882 -1273815 -1783147 -465135 1415066 1723901
12724A723901r75322l45985O34257K95896m02040r3153M15905l8906n90320p2330
$$ 1723901 748579 402594 1036851 1332747 930707 837554 1253459 1214553 624233 551903
12714E51903N93446J11745o49411k74277M98008K31051m07458l826O85368O8739
$$ 551903 1145349 1257094 607683 333406 831414 1062465 655007 651181 1336549 1405288
12704A405288j086474q43268L79505O30429O8472M24675J298061N98152j347934
$$ 1405288 318814 -524454 -144949 485480 553952 978627 2276688 2874840 1526906
12695A526906j806685j90611R48314K54338n16499k6808M24892l13078j102016
$$ 1526906 -279779 -470390 477924 732262 215763 188955 613847 300769 -801247
12686h01247p99777k44556l29305k62103O66402J490726J229330M64176K5555
$$ -801247 -1601024 -1845580 -2174885 -2436988 -1770586 -279860 949470 1413646 1439201
12677A439201k68332n11333p8500Q67526R63139k29759j311258j148426k75582
$$ 1439201 1170869 659536 581036 1448562 2411701 2181942 870684 -277742 -553324
12668e53324M90463J052597J081479P4110j062699o94753P06207Q91423l85513
$$ -553324 -62861 989736 2071215 2145325 1082626 387873 1094080 1985503 1599990
12659A599990q07705L72496Q89551l88826j243038j00357J001021P4629j156541
$$ 1599990 792285 1164781 2054332 1665506 422468 322111 1323132 1397761 241220
12650B41220l67257J146520Q00126p29367q88913K82769O68291M1967R076N72271
$$ 241220 -126037 1020483 1820609 1091242 202329 485098 1153389 1195356 1204432 1776703
12640A776703J55548j112870j290446K9176J028951O68326o7564k98823m22161
$$ 1776703 1932251 819381 -471065 -441889 587062 1255388 1187824 889001 466840
12631D66840o94786n95825r7070P5607j54364m847O84672J092522P53303Q6956
$$ 466840 -227946 -823771 -920841 -845234 -999598 -1004445 -319773 772749 1526052 1613008
12621A613008m82364q42172p07178N4029P15873M17807n23225j009325o58820
$$ 1613008 1130644 288472 -418706 -364677 351196 769003 245778 -763547 -1422367
12612a422367R769N36322P33341L90075k96195n10304N3561N21415K18617j64977
$$ -1422367 -1412598 -876276 -142935 247140 -49055 -559359 -505798 15617 234234 69257
12602F9257J11526L82414j79820q27871l76056O91600R46422K67128k76099k77815
$$ 69257 180783 563197 383377 -444494 -820550 -128950 817472 1084600 808501 530686
12592E30686j37289J54828P52827R51945R4537r32522p55938K91129O88149J28085
$$ 530686 393397 548225 1301052 2252997 2347534 1415012 659074 950203 1638352 1766437
12582A766437k85451o2261R2693k74183p30125p90504l28980N91909J371636R85431
$$ 1766437 1480986 1418725 1511418 1237235 507110 -283394 -612374 -20465 1351171 2336602
12572B336602m97509j398147o84330L38549J04829o89187n43632J12552j7986
$$ 2336602 1839093 440946 -243384 95165 199994 -489193 -1032825 -920273 -938259
12563i38259l67927M73079J731661J362898l35318r82351q708O42874K7164m64912
$$ -938259 -1306186 -833107 898554 2261452 1926134 943783 935075 1577949 1605113 1140201
12553A140201Q7340O62600M65851J49880L4676n67098j401683j010080N90670
$$ 1140201 1227541 1890141 2355992 2505872 2540548 1973450 571767 -438313 152357
12544A52357J281474Q5427j154150o80953O20492J037421N55532M7389m26417
$$ 152357 1433831 1519258 365108 -315845 304647 1342068 1897600 1944989 1518572
12535A518572r63853r08212o3153M78942P2705k35071M51755J136984N38416p36552
$$ 1518572 554719 -353493 -416646 62296 135001 -100070 351685 1488669 2027085 1290533
12525A290533j158968m72388M57761J073440J149529L89260p49670q93143K75412
$$ 1290533 131565 -340823 116938 1190378 2339907 2729167 1979497 1086354 1361766
12516A361766J039215J07941j188073r45423K16396K66034q28496j189575k22175
$$ 1361766 2400981 2508922 1320849 375426 591822 857856 29360 -1160215 -1382390
12507a382390O66928O52158N17784O60075K41938q21882j029487L15158J519907
$$ -1382390 -715462 -63304 454480 1114555 1356493 534611 -494876 -179718 1340189
12498A340189Q56494p39246j057909J00026R20435N35448K1059J71989J52796
$$ 1340189 2196683 1457437 399528 499554 1419989 1955437 1976496 2148485 2301281
12489B301281p37310j462843p75860O28158J021716K18140l53734l3592K32933
$$ 2301281 1563971 101128 -674732 -46574 975142 1193282 839548 805956 1038889
12480A038889k36162o48717j15925R05872J359365R10601j21169j261793j706678
$$ 1038889 802727 154010 38085 943957 2303322 3213923 3092754 1830961 124283
12471A24283p24717R80533J470397J30094j167696p12682M62808L31154q53125
$$ 124283 -600434 380099 1850496 1980590 812894 100212 563020 894174 41049
12462D1049j136000j54220M44297j33538o92815k11694O98167J116224J078665
$$ 41049 -1094951 -1249171 -804874 -938412 -1631227 -1842921 -1144754 -28530 1050135
12453A050135Q64346L12930m89615r20407p61982n07606l75655J1614O83256J040994
$$ 1050135 1914481 2227411 1737796 817389 55407 -452199 -827854 -816240 -132984 908010
12443I08010P66861R8280p92972j618141j405916L41839K037990J483543q01173
$$ 908010 1674871 1773151 980179 -637962 -2043878 -1702039 335951 1819494 1018321
12434A018321j846245m64301J053086O21684m94437m7837J489752J873396O55471
$$ 1018321 -827924 -1292225 -239139 382545 -111892 -159729 1330023 3203419 3858890
12425C858890m80180m87487m2481L6446k21332n69977q27334n65234K77525O68737
$$ 3858890 3378710 2891223 2848742 2885188 2663856 2093879 1266545 701311 978836 1647573
12415A647573l02595j649594j441111L82958J718802J210925o0059n08716k61345
$$ 1647573 1344978 -304616 -1745727 -1362769 356033 1566958 1506899 998183 736838
12406G36838l25254n98759j67398Q51615J201290L54321o42683o51776K1910K17819
$$ 736838 411584 -187175 -354573 497042 1698332 2052653 1409970 758194 780104 997923
12396I97923l90933r01595m58629N88776J056922L04088r73912j442315o16341
$$ 997923 606990 -294605 -753234 -164458 892464 1196552 222640 -1219675 -1836016
12387a836016N88276J039751Q26607Q63569J185458P24034p71729j782578j055398
$$ -1836016 -1247740 -207989 618618 1482187 2667645 3391679 2619950 837372 -218026
12378b18026L52312N53467k99850m86487K39950L09622o66623r54849K59062J155656
$$ -218026 134286 687753 387903 -98584 141366 450988 -215635 -1170484 -911422 244234
12368B44234K09369j123881p07135Q28454J313037O12721L53926O94104J76429
$$ 244234 453603 -670278 -1377413 -548959 764078 1376799 1730725 2424829 2601258
12359B601258j180975j429454J1395J065616J71424j277208j144521K92038J064592
$$ 2601258 1420283 -9171 2224 1067840 1239264 -37944 -1182465 -890427 174165
12350A74165M78121k86333k00100L58777N10459J04306l06305k65774J52364N96681
$$ 174165 652286 365953 165853 524630 1035089 1139395 833090 567316 719680 1316361
12340A316361Q11890O05302k42493j475252j943508o92654J287473J647725k14021
$$ 1316361 2128251 2733553 2491060 1015808 -927700 -1620354 -332881 1314844 1100823
12331A100823j886925j064204J172640J947245P27317k82597K41696R81725M08001
$$ 1100823 -786102 -1850306 -677666 1269579 1996896 1714299 1955995 2937720 3345721
12322C345721r37542j612765j335143p40203o3656P89684J441781J339542O44757
$$ 3345721 2408179 795414 -539729 -1279932 -1343588 -553904 887877 2227419 2872176
12313B872176R1027K9196J37621P4543j8391J24727K55996k10919j198520j656132
$$ 2872176 2963203 2992399 3130020 3204563 3186172 3310899 3566895 3355976 2157456 501324
12303E01324q86333K36621L77139k15354j54116O60875Q61822J70010J9451Q07363
$$ 501324 -385009 -148388 228751 13397 -140719 520156 1381978 1551988 1571439 2378802
12293B378802Q23508o77477j661866n66009Q17930K29515j193946r22998O25128
$$ 2378802 3202310 2524833 862967 296958 1114888 1344403 150457 -772541 -147413
12284a47413J089095L99971M28441J053987L70961j300398j431042K87692J217461
$$ -147413 941682 1341653 1770094 2824081 3195042 1894644 463602 751294 1968755
12275A968755K52866n37577J13980N05350o40426j714703j073189K55847O44694
$$ 1968755 2221621 1684044 1798024 2303374 1662948 -51755 -1124944 -869097 -224403
12266b24403M10164M56474M09448j36970l71414J01528J60110p77628j387767
$$ -224403 185761 642235 1051683 914713 543299 644827 804937 27309 -1360458
12257a360458o29833M79967P45477O20858P16845M06861n12446p45543K03013
$$ -1360458 -1990291 -1510324 -764847 -143989 572856 979717 467271 -278272 -75259
12248g5259O33135n63210j678680q83006O84442Q82644P1586J09112J008398J139801
$$ -75259 557876 -5334 -1684014 -2567020 -1882578 -999934 -928348 -819236 189162 1328963
12238A328963R1927q85054q91432j36197Q13898J247570N85511m90637m44271
$$ 1328963 1420890 535836 -355596 -491793 322105 1569675 2155186 1664549 1220278
12229A220278N66166M09879j385720k114055j07989K002861J179169j079388j281760
$$ 1220278 1786444 2196323 810603 -1303452 -1411441 591420 1770589 691201 -590559
12220e90559K53836L56114j152731j158888J024769K121068K98732j744426j049862
$$ -590559 -336723 19391 -1133340 -2292228 -1267459 853609 1152341 -592085 -1641947
12211a641947J264752K168594J028829m46246j059529r07772k87039M88418P43401
$$ -1641947 -377195 1791399 2820228 2373982 1314453 406681 119642 608060 1351461
12202A351461J61300n80023p09885l67710q7298M7067J25938m165k82753k37940
$$ 1351461 1512761 932738 222853 -144857 -232155 -185088 -59150 -63315 -346068 -584008
12192e84008J67428J86459n61213j237863q64703K16693P95688M82538J21294
$$ -584008 -416580 -230121 -791334 -2029197 -2893900 -2677207 -1881519 -1398981 -1277687
12183a277687M25248R01134N94774m08651q83746p3552J123799J179333o9697
$$ -1277687 -852439 48695 643469 234818 -648928 -722480 401319 1580652 1510955
12174A510955j203857j072594r6021N58917M05641j56870m94306k09158N58108
$$ 1510955 307098 -765496 -861517 -302600 103041 -53829 -548135 -757293 -199185
12165a99185J071488P90545K64999M01003Q14657J96013j350740j908769n78624
$$ -199185 872303 1662848 1927847 2328850 3143507 3339520 1988780 80011 -498613
12156d98613Q30351L58919j083847j074969O75114J993271J425936n2574q36792
$$ -498613 331738 690657 -393190 -1468159 -793045 1200226 2626162 2573588 1736796
12147A736796p16138m65564m53371m47114k93216j30391m5449R9144M09651O62571
$$ 1736796 1020658 555094 101723 -345391 -638607 -768998 -814447 -715303 -305652 356919
12137C56919M72993j12256m53172j13021M31849M26741m1027k70111j04543R813
$$ 356919 829912 717656 264484 151463 583312 1010053 969026 698915 594372 604185
12127F04185J658J88303L53582m6717o80119n51591L71558R48323N43538k23269
$$ 604185 605843 794146 1147728 1101011 420892 -130699 240859 1189182 1732720 1509451
12117A509451o08603m74538J54675R54640Q17463q55747k455009j750148P02261
$$ 1509451 900848 426310 580985 1535625 2353088 1497341 -957668 -2707816 -2005555
12108b005555J981803R56541m51140o87226n06851n71201j8824J162584J199953
$$ -2005555 -23752 932789 481649 -205577 -712428 -1283629 -1302453 -139869 1060084
12099A060084k99582j054306O5982Q45676k85990j117813M40205K164104R94093
$$ 1060084 760502 -293804 -227822 617854 331864 -785949 -345744 1818360 2812453
12090B812453j574612j805928J58418R36819k18532o79887N47095J333851M83432
$$ 2812453 1237841 -568087 -409669 527150 308618 -371269 175826 1509677 1993109
12081A993109m66917l44084j6710j00984J22728O83334N02922k79785k39423M35915
$$ 1993109 1526192 1182108 1165398 1064414 1187142 1870476 2373398 2093613 1854190 2290105
12071B290105j62878k008474k384208j49801K069717J752147P8235m07697L09901
$$ 2290105 2127227 118753 -2265455 -2415256 -345539 1406608 1484843 1077146 1387047
12062A387047M83452k16342o56028n25230n12025n88193k159J037042J239106
$$ 1387047 1870499 1654157 998129 472899 -39126 -627319 -629478 407564 1646670
12053A646670J11683j170049j252972k46645O61980Q20603O50965N63664J53204
$$ 1646670 1758353 588304 -664668 -911313 -249333 571270 1222235 1785899 1939103
12044A939103q43918j407234l58342J452717J714936p0484j562798q74395O83859
$$ 1939103 1095185 -312049 -670391 782326 2497262 2426778 863980 -10415 673444
12035F73444O77148q93740j924697j280892K46419J517076J947658J264116j78107
$$ 673444 1350592 456852 -1467845 -2748737 -2502318 -985242 962416 2226532 2048425
12026B048425j194758j088465n71950l47264J45106J234841J659975M98360q76561
$$ 2048425 853667 -234798 -806748 -1154012 -1008906 225935 1885910 2384270 1507709
12017A507709q71170l65201q89404j463257k66959J565018J333050n00369p25018
$$ 1507709 636539 271338 -618066 -2081323 -2348282 -783264 549786 49417 -675601
12008f75601J273989K377517Q44197j010573q11695K85224M2200j212567j598573
$$ -675601 598388 2975905 3820102 2809529 1997834 2283058 2325258 1112691 -485882
11999d85882p19689L05950P65448P05305K02427m56370n53409J38083Q11074O74661
$$ -485882 -1205571 -899621 -134173 571132 773559 317189 -236220 -98137 712937 1387598
11989A387598l9656n52337m40184J24315M89284K8039q55071p96890N29694J400713
$$ 1387598 1347942 795605 355421 479736 969020 997059 141988 -654902 -125208 1275505
11979A275505M21497j103790j101385n8710J0104p89117n18468Q83186J291794
$$ 1275505 1697002 593212 -508173 -566883 -556779 -1345896 -1864364 -981178 310616
11970C10616J38639n66640K82965J179613P79437j15747m27596l75460k07828
$$ 310616 449255 -117385 165580 1345193 2124630 2008883 1581287 1205827 997999
11961I97999M32754J037940M38171p66366n69010Q08346O49246j584326k570037
$$ 997999 1430753 2468693 2906864 2140498 1571488 2379834 3029080 1444754 -1125283
11952a125283k08992K625302K211301n43844j899222q54271L36228K62502j51534
$$ -1125283 -1334275 1291027 3502328 2958484 1059262 204991 541219 803721 652187
11943F52187l6472J64067L9258j17174j91169l60575l35807K40746P91073M48297
$$ 652187 615715 779782 819040 701866 510697 150122 -185685 55061 846134 1294431
11933A294431m32856o33193R6966P04420M70238j6980Q7483N23555K25633j079875
$$ 1294431 861575 228382 325348 1029768 1500006 1483026 1570509 2094064 2319697 1239822
11923A239822k092992j314773Q63600K313973J790530L79308l85042n88845q73635
$$ 1239822 -853170 -2167943 -1304343 1009630 2800160 3179468 2794426 2205581 1331946
11914A331946o55984O47870J679990Q02128r75916j282911j30843M05360n4226
$$ 1331946 675962 1323832 3003822 3805950 2830034 1547123 1416280 1821640 1767414
11905A767414R2827R02724N28673j011253j262589L53093J173075j76963j334501
$$ 1767414 1860241 2762965 3291638 2280385 1017796 1370889 2543964 2367001 1032500
11896A032500l67050Q74378J82677j104539o76028O06448M01084r72010j306262
$$ 1032500 665450 1539828 1722505 617966 -58062 548386 949470 -22540 -1328802
11887a328802k57300O70445J001635J349218J298659n714j551720j365492L21635
$$ -1328802 -1586102 -915657 85978 1435196 2733855 2728141 1176421 -189071 132564
11878A32564J157876J12861j201705j051730K30856J139003R45109K22847o6180
$$ 132564 1290440 1403301 201596 -850134 -619278 519725 1464834 1687681 1621501
11869A621501K43363K80594n56240j332772p23326O96316R79900j26939o99218
$$ 1621501 1864864 2145458 1589218 256446 -466880 229436 1209336 1082397 383179
11860C83179J44491Q16700J85193m39969J36472P12262J254q10697j75515R13621
$$ 383179 527670 1344370 1529563 1089594 1226066 1938328 1939582 1128885 953370 1866991
11850A866991O89907j99946l320Q22052M56484r08666j398448p38894m78609j017836
$$ 1866991 2556898 2356952 2353632 3175684 3632168 2723502 1325054 586160 107551 -910285
11840i10285r77651K09730J272551J095325N9745q78642j089316k78346J103530
$$ -910285 -1887936 -1678206 -405655 689670 749415 -129227 -1218543 -1496889 -393359
11831c93359J723741R19674j14707o3878L78212j48170j037478o70605N10515
$$ -393359 1330382 2250056 2135349 2071471 2449683 2301513 1264035 593430 1103945
11822A103945M23311j119296j831597n16764J050505Q54596n05923r88679m04
$$ 1103945 1527256 407960 -1423637 -1940401 -889896 -35300 -541223 -1529902 -1530306
11813a530306J150429J197245L50895k22950N7449M69065P2034p26426o36249
$$ -1530306 -379877 817368 1168263 945313 1002762 1471827 1543861 817435 181186
11804A81186L32717N27887p48944j765770q25767J036327J553062N20673l09426
$$ 181186 513903 1041790 292846 -1472924 -2298691 -1262364 290698 811371 501945
11795E01945p6868M05502M89847M42054L12644k48266q58218n97657L92004Q58365
$$ 501945 425077 830579 1320426 1762480 2075124 1826858 968640 370983 762987 1621352
11785A621352L08846k77345M836P52160J001020M55839l93586q91370p72132l89147
$$ 1621352 1930198 1652853 1657689 2409849 3410869 3866708 3473122 2581752 1809620 1420473
11775A420473l09451n29009n22783k39194k31425m37565N3445J295485J771974
$$ 1420473 1111022 582013 59230 -179964 -411389 -848954 -795509 499976 2271950
11766B271950N28718j067079j116824J16563Q59812N41162J88626M13133N93186
$$ 2271950 2800668 1733589 616765 733328 1593140 2134302 2322928 2736061 3329247
11757C329247J57557n43436q47405n04773J76027M37083k63657j265182j160956
$$ 3329247 3486804 2943368 2095963 1591190 1767217 2204300 1940643 675461 -485495
11748d85495J85254J140529O42713k08320q3342L43149k51782j264648r42495
$$ -485495 -300241 840288 1483001 1274681 1191339 1534488 1282706 18058 -924437
11739i24437P05704J681446P42500j078939j916166j059749N75699J393377P07664
$$ -924437 -218733 1462713 2205213 1126274 -789892 -1849641 -1273942 119435 827099
11730H27099l39350j11185J128047J428352J66656q91698m33946L99030K13091
$$ 827099 487749 376564 1504611 2932963 3099619 2207921 1773975 2173005 2386096
11721B386096l14773o6092K91813k63921r65672o67218r190j4826K4108R05633
$$ 2386096 2071323 2005231 2297044 2033123 1067451 400233 391043 376217 400325 1305958
11711A305958J273092k58237k066111j648389K56359Q72671p8496m20726L73228
$$ 1305958 2579050 2320813 254702 -1393687 -1137328 -264657 -343153 -763879 -390651
11702c90651O03860j84626n51210j97813m06239j086251o23657Q17983J111676
$$ -390651 213209 28583 -522627 -720440 -1126679 -2212930 -2836587 -2018604 -906928
11693i06928l053k12289J235757J979812N44212j196377j261427m72132k44649
$$ -906928 -909981 -1122270 113487 2093299 2637511 1441134 179707 -292425 -537074
11684e37074p5142O96569R50761j24641r97836j47076J242464J219488K00478
$$ -537074 -612216 84353 1035114 910473 -87363 -234439 1008025 2227513 2427991
11675B427991j75356j2103m86686j176515o41333P88926J246635K97265m85878
$$ 2427991 2252635 2240532 1753846 577331 -64002 724924 1971559 2268824 1782946
11666A782946j32262M59890L25648j47795k88926l23530o58401r06437n03608
$$ 1782946 1650684 2110574 2436222 2288427 1999501 1675971 1017570 111133 -392475
11657c92475K33779M65192J9384m13652k70176K21005N00192L96740J08119k21610
$$ -392475 -158696 306496 325880 -87772 -357948 -136943 363249 759989 868108 646498
11647F46498m80804l71407K28576P93195O97041J91259M3433K17845l6360o36992
$$ 646498 165694 -205713 22863 816058 1513099 1704358 1747791 1965636 1929276 1292284
11637A292284n42610L50179O73835j77848q16807j38660O48222R341j154756q93013
$$ 1292284 749674 1099853 1773688 1595840 779033 640373 1288595 1297936 143180 -749833
11627g49833M73289Q11890l30523j114656m93088L47146K65100p0934L10509R15915
$$ -749833 -276544 535346 204823 -909833 -1402921 -1055775 -790675 -861609 -551100 364815
11617C64815O81659k97419r61326p26514j9595M04252K70567m8356j11248l0830
$$ 364815 1046474 749055 -212271 -938785 -958380 -554128 -283561 -331917 -443165 -473995
11607d73995j11688J0263Q95330J815621J178774q95605k037538q43436R59459
$$ -473995 -585683 -575420 319910 2135531 3314305 2418700 381162 -462274 497185
11598D97185J128671J27258k38773M9472j36591m70774O9499O63192k15893j605382
$$ 497185 1625856 1753114 1514341 1563813 1427222 956448 1025947 1689139 1473246 -132136
11588a32136j090016J055720J935484N86838o82833k80125M25285P3609k94387
$$ -132136 -1222152 -166432 1769052 2355890 1673057 1392932 1818217 1891826 1597439
11579A597439M63261J224954N06713r72676j516687j024822o69808q65699r61420
$$ 1597439 2060700 3285654 3792367 2819691 1303004 278182 -391626 -1257325 -2218745
11570b218745m19749O37828J593108J607397M67314o76493m77989N93507P80684
$$ -2218745 -2638494 -2000666 -407558 1199839 1667153 990660 512671 1106178 1886862
11561A886862k59907r55523m34565J81291j09565n24168n6530P25031O67070k09649
$$ 1886862 1626955 671432 236867 418158 308593 -215575 -272105 452926 1119996 910347
11551I10347r59306r02310Q8519J537990K132751P83368j486106k114257l02676
$$ 910347 -48959 -951269 -862750 675240 2807991 3591359 2105253 -9004 -311680
11542c11680J640853J330671n66389j537644o45561O91825R40241K15512l01657
$$ -311680 1329173 2659844 2093455 555811 -89750 602075 1542316 1757828 1456171
11533A456171j0654M04630k0906r53114q98242N79647J745096R70417p34901j173331
$$ 1456171 1445517 1850147 1829241 876127 -22115 557532 2302628 3273045 2538144 1364813
11523A364813l10029k1345p11375o71720P38246J702232P60197r96846j750436
$$ 1364813 1054784 1033439 322064 -349656 388590 2090822 2851019 1854173 103737
11514A03737j318506n11862L68946J133223J080425P1386p54502m35392M57997
$$ 103737 -1214769 -1726631 -1357685 -224462 855963 927349 172847 -262545 195452
11505A95452P80586K97386m70394r81273p10575M96574J609586J183984m76862
$$ 195452 976038 1273424 803030 -178243 -888818 -392244 1217342 2401326 1924464
11496A924464j297958k88419J017419Q89032k50573r31024p98298l84616J89774
$$ 1924464 626506 338087 1355506 2244538 1993965 1062941 264643 -119973 69801
11487F9801R02094J059262K17713p26738o20402K27414N44869k6419o36700o42318
$$ 69801 971895 2031157 2248870 1522132 901730 1129144 1674013 1647594 1010894 368576
11477C68576l50431k86857m17225l22349J54734O42996P09511N60005Q67013J628158
$$ 368576 18145 -268712 -685937 -1008286 -853552 -210556 498955 1058960 1925973 3554131
11467C554131J790686O55912r14759j579515j290075r64403r00224p19907m43188
$$ 3554131 5344817 6000729 5085970 3506455 2216380 1251977 351753 -368154 -811342
11458h11342k92644J29562J034085J332512O6640j482382j165390P03462J595973
$$ -811342 -1103986 -974424 59661 1392173 1458813 -23569 -1188959 -485497 1110476
11449A110476N15203p62503o73149R6706L41977J31999q5469m67795r01103o33600
$$ 1110476 1625679 863176 190027 286733 628710 760709 675240 207445 -693658 -1327258
11439a327258L31439Q35809L24327l00803k27794J74326L66601L96743J73253
$$ -1327258 -995819 -160010 164317 -136486 -364280 -189954 176647 573390 746643
11430G46643n97315j316982q43064O40315J628748J524390J195966J026769L35849
$$ 746643 149328 -1167654 -2010718 -1370403 258345 1782735 2978701 4005470 4341319
11421D341319p90380j143193n26901k09571n33700k51511Q72418J110000l21387
$$ 4341319 3550939 2407746 1880845 1671274 1137574 886063 1758481 2868481 2547094
11412B547094j582060r80187M88590R86492N09130N8851l05051q47728q90590
$$ 2547094 965034 -15153 473437 1459929 1969059 2027910 1722859 875131 -15459
11403a5459R6433J123785R61758l826n06785k51329J10238J88454J11233J09867
$$ -15459 80974 1204759 2166517 2162691 1655906 1404577 1514815 1703269 1814502 1924369
11393A924369L77490P11799K64955j252812k303392j169763J135099J759721J29830
$$ 1924369 2301859 3013658 3278613 2025801 -277591 -1447354 -312255 1447466 1577296
11384A577296j230099o51360M71567N10499O9179J10992M805p44237r16117K93093
$$ 1577296 347197 -304163 167404 677903 747082 858074 862879 118642 -797475 -504382
11374e04382J379129Q02374m13762m02972N49119P63661q6742q59679q51107l19434
$$ -504382 874747 1677121 1263359 860387 1409506 2173167 2086425 1226746 375639 56205
11364E6205K70935M45587r1396p45304n48064J58875O6464o70038l92047R98463
$$ 56205 327140 772727 681331 -63973 -612037 -453162 -386698 -1056736 -1448783 -450320
11354d50320J387076j1782j066639k73369P22223J93788n66885K45160J484826
$$ -450320 936756 924974 -141665 -415034 307189 500977 -65908 179252 1664078
11345A664078R92314n97517r47663J27701P05857J7198q46454j115247j059337
$$ 1664078 2656392 2058875 1111212 1238913 1944770 1961968 1115514 267 -1059070
11336a059070p48966P0439J003705J318487J005726N31852O6700k55553j53450
$$ -1059070 -1808036 -1737597 -733892 584595 1590321 2122173 2188873 1933320 1779870
11327A779870M2784m17044j174007r34656K26906O56124m2337k47423N75142O68762
$$ 1779870 1822654 1405610 231603 -703053 -476147 179977 137640 -109783 465359 1134121
11317A134121o31578j164674L50129J665256O38967j043824p55188P10382R09714
$$ 1134121 502543 -662131 -312002 1353254 1992221 948397 193209 903591 1813305
11308A813305L1147l2579N32171O6554j144129j335249m64545L0121M0115N38468
$$ 1813305 1844452 1811873 2344044 2410598 1266469 -68780 -533325 -503204 -463089 75379
11298G5379J166287Q16322J1104K3368K87863n79445j815576j409198M55485J606787
$$ 75379 1241666 2057988 2069092 2092460 2380323 1800878 -14698 -1423896 -968411 638376
11288F38376J243256M85029j04109r30937j531514q74176N44934J163438P35363
$$ 638376 1881632 2366661 2262552 1331615 -199899 -1074075 -529141 634297 1369660
11279A369660K03826k83521j027793j155959J51468J454463P88954r02650r63979
$$ 1369660 1573486 1289965 262172 -893787 -742319 712144 1501098 598448 -365531
11270c65531O60572J351101J10475j079629o68137M20020Q36710N92787J19419
$$ -365531 295041 1646142 1756617 676988 8851 428871 1265581 1858368 1977787
11261A977787m77864p47206k43482K57208l22952j286081r90681L25201P57701
$$ 1977787 1499923 752717 509235 766443 443491 -842590 -1833271 -1508070 -750369
11252g50369j40646p24246p1643P05904M89501l62385j025229j107142k92175
$$ -750369 -891015 -1615261 -1686904 -981000 -491499 -853884 -1879113 -2986255 -3278430
11243c278430J340734K525328J914635M4911j277587j379391r68664m01063M46313
$$ -3278430 -1937696 587632 2502267 2547178 1269591 -109800 -1078464 -1479527 -1033214
11234a033214R29295L17262m83845L1086J353730J542883L57685m45786q8196
$$ -1033214 -103919 213343 -270502 -239416 1114314 2657197 3014882 2569096 2480900
11225B480900K27550l17865q85340o57971l3925M00208O00234M44364k24472q04462
$$ 2480900 2708450 2390585 1505245 847274 813349 1213557 1813791 2258155 2033683 1229221
11215A229221n46513J03762J75544r5344K03529P55969M68352m23271o16383K0396
$$ 1229221 682708 786470 962014 866670 1070199 1826168 2294520 1871249 1254866 1275262
11205A275262L90275K61497M63444R75019P57511l24420j145898j048197m35287
$$ 1275262 1665537 1927034 2390478 3365497 4123008 3798588 2652690 1604493 1169206
11196A169206K67949Q06397N84650m93791j202683o43023P5268k99022o63440
$$ 1169206 1437155 2243552 2828202 2334411 1131728 488705 563973 264951 -398489
11187c98489N88600K178742J472971j046636k139556p28050Q11629P77471L40992
$$ -398489 190111 2368853 3841824 2795188 655632 -72418 739211 1516682 1857674
11178A857674O55140P57322k11179j150939r27900k36384j46889l75268j96392
$$ 1857674 2512814 3270136 3058957 1908018 980118 743734 596845 221577 25185
11169B5185K48506N00582M89377J29504n83201q32394J86785J529082J321586
$$ 25185 273691 774273 1263650 1393154 809953 -22441 164344 1693426 3015012
11160C015012l98366j516664r30018R8968K59111k4623N6380K53377J43724R0648
$$ 3015012 2616646 1099982 169964 268932 528043 503420 559800 813177 956901 1047549
11150A047549M04440O12634K82749k94761o73053o98099k71783M57239P59947
$$ 1047549 1451989 2064623 2347372 2052611 1379558 681459 409676 866915 1626862
11141A626862J65197o18250o66578k54303r0183J47786R40147J335862J97126
$$ 1626862 1792059 1173809 507231 252928 162745 310531 1250678 2586540 2783666
11132B783666j491203j682711l33343P22984P16654N43243N66345J50020n21699
$$ 2783666 1292463 -390248 -723591 -607 716047 1259290 1825635 1975655 1453956
11123A453956m10815L62421N56475J5365k15092l5087l81713j091868r54668o6043
$$ 1453956 1043141 1405562 1962037 1977402 1762310 1727223 1345510 253642 -701026 -767069
11113g67069J99682k19523L9155R67201Q86411m50176j074867l9872J022890P05224
$$ -767069 -567387 -786910 -747755 219446 1105857 655681 -419186 -459058 563832 1269056
11103A269056q4129j29622M0328m10835q45534l33583O59026J094577Q74221M66110
$$ 1269056 1184927 1055305 1095633 684798 -160736 -494319 164707 1259284 2133505 2599615
11093B599615n4694o77669r60769o27220n4640K79909K60140j09588o88266r26628
$$ 2599615 2544921 1867252 906483 279263 224623 504532 764672 655084 -33182 -959810
11083i59810l98538M56763Q66517P37782L80502k41598j009383j051768J41703
$$ -959810 -1358348 -901585 -35068 702714 1083216 841618 -167765 -1219533 -1077830
11074a077830J568092J858541J007568r8437j035579j584745j195205l8779N51392
$$ -1077830 490262 2348803 3356371 3257934 2222355 637610 -557595 -596374 -44982
11065d4982O1545j74428O03135R13953l16124j422874p19674M17183K4065p77562
$$ -44982 16563 -157865 445270 1359223 1043099 -379775 -1099449 -682266 -658201 -1435763
11055a435763R2858J538457J040946o86386q08219O60876J079401j3011l96914
$$ -1435763 -1342905 195552 1236498 550112 -258107 402769 1482170 1469159 1072245
11046A072245M82789O14992p00510j624052j013318J62342R95490J439745R89292
$$ 1072245 1555034 2170026 1469516 -154536 -1167854 -1005512 -10022 1429723 2419015
11037B419015o01440j646311n81640R76257N55118p38798o1165J795951J524084
$$ 2419015 1817575 171264 -410376 565881 1120999 382201 321036 2116987 3641071
11028C641071o43691j103917O78396J187821p86636k013921n74521J091950Q40581
$$ 3641071 2997380 1893463 2571859 3759680 2973044 959123 384602 1476552 2317133
11019B317133J24272M97219P83837n4453p56701m96041m91743j124499p36412
$$ 2317133 2441405 2938624 3722461 3668008 2911307 2415266 1923523 799024 62612
11010F2612J014200J909364R22609p9005N1458j77932j537694k181831r41556
$$ 62612 1076812 2986176 3908785 3829780 3881238 3703306 2165612 -16219 -957775
11001i57775N85437Q95447N81540K07687o52656j206600J79176K344092K017690
$$ -957775 -372338 523109 1104649 1312336 659680 -546920 -367744 1976348 3994038
10992C994038o70966j712695K19495J440919l38597k068402p84298J390852J188558
$$ 3994038 3323072 1610377 1829872 3270791 2932194 863792 79494 1470346 2658904
10983B658904n21849j005407k29267K15798K41669L79083R2772o09245l39327
$$ 2658904 2137055 1131648 902381 1118179 1359848 1738931 1831703 1222458 883131
10974H83131R01363R79862m95188r34966N64375J138539p44218k080125l59431
$$ 883131 1784494 2764356 2269168 1334202 1898577 3037116 2292898 212773 -146658
10965a46658J957662J560832m44052j100351m82109k95882k36881O25055J168073
$$ -146658 1811004 3371836 2927784 1827433 1345324 1049442 812561 1437616 2605689
10956B605689L16651m44744K24469P36399m18973j491993n51207Q70513O02464
$$ 2605689 2922340 2477596 2702065 3438464 3019491 1527498 976291 1846804 2449268
10947B449268k61033J93427Q70457p938j112051l88435R04120M33675q71584o44659
$$ 2449268 2188235 2381662 3252119 3244181 2132130 1743695 2647815 3081490 2209906 1565247
10937A565247N06612L33657p97977q35561M7476J48320k98572J17354Q25849K89758
$$ 1565247 2071859 2405516 1607539 771978 819454 967774 669202 786556 1612405 1902163
10927A902163q30147q00000j01125l87449j144885o04400Q49592J274701M50871
$$ 1902163 1072016 272016 170891 -216558 -1361443 -1965843 -1116251 158450 609321
10918F09321k76630o18341j057544q69620P49902K386606K005161J80975q05258
$$ 609321 332691 -285650 -1343194 -2212814 -1462912 923694 2928855 3109830 2304572
10909B304572l89466J68143L04349L96674K28175n32433j024968m11141M21916
$$ 2304572 1915106 2083249 2387598 2784272 3012447 2480014 1455046 1043905 1465821
10900A465821K48516l97690l48902Q0936o3517n37116n98555l94561j68348N14388
$$ 1465821 1714337 1316647 967745 1048681 985164 448048 -150507 -545068 -713416 -199028
10890a99028J421141J274300M4759m39755M21542P31109m75655j249027j69045
$$ -199028 1222113 2496413 2541172 2101417 2522959 3254068 2778413 1529386 1360341
10881A360341J048706P18012J15519O26866Q03887p17925k024899r63716R52925
$$ 1360341 2409047 3127059 3242578 3869444 4673331 3955406 1930507 966791 1919716
10872A919716J065851q5996l29967J55116j29920o71943p7977Q58958M67946o60906
$$ 1919716 2985567 2899571 2569604 2724720 2594800 1922857 1844880 2703838 3171784 2510878
10862B510878q12616j68193O9632J89792R24157J362248N77222k04492L03555
$$ 2510878 1698262 1530069 1599701 1789493 2713650 4075898 4653120 4448628 4752183
10853D752183Q24119l01245j922662j830373k27523J092105J521431J268601o022
$$ 4752183 5576302 5275057 3352395 1522022 1294499 2386604 3908035 5176636 5170614
10844E170614j842851k231069n60779P95351J86139n11385O05710J853883R33703
$$ 5170614 3327763 1096694 535915 1331266 1517405 1006020 1611730 3465613 4399316
10835D399316r97804j517695r24528p57492n45412O36771J481469O36018m45075
$$ 4399316 3401512 1883817 959289 201797 -343615 293156 1774625 2410643 1965568
10826A965568m511P91932K58147n06067M1130O59965j47346q67845J98143J344502
$$ 1965568 1961057 2752989 3011136 2505069 2546199 3206164 3058818 2190973 2389116 3733618
10816C733618M45831r41595m10291P86495K08962j066214n70691P62274L74072
$$ 3733618 4179449 3237854 2827563 3614058 3823020 2756806 2186115 2948389 3322461
10807C322461j079309j034632L08272P75673K93371K68862L73965l08030n72909
$$ 3322461 2243152 1208520 1516792 2292465 2585836 2854698 3228663 2920633 2347724
10798B347724P44315J744472M08345j434250j065407K83865j81514j620468j256882
$$ 2347724 3092039 4836511 5244856 3810606 2745199 3029064 2847550 1227082 -29800
10789b9800M83746J088625O34891Q81739J233787J10721j154277l59242J044387
$$ -29800 453946 1542571 2177462 3059201 4292988 4403709 3249432 2890190 3934577
10780C934577J45035j978649j789237O47836J841819N89096q31475q45107j16656
$$ 3934577 4079612 2100963 311726 959562 2801381 3390477 2559002 1713895 1597239
10771A597239P18587J489794J294974j57008j098546l42890L24103p63980j877053
$$ 1597239 2315826 3805620 5100594 4943586 3845040 3502150 3826253 3062273 1185220
10762A185220q90774Q48677J091956N80530Q31468Q06876m71792j012459M57571
$$ 1185220 294446 1143123 2235079 2815609 3647077 4453953 3982161 2969702 3427273
10753C427273J188916q52222k500319n74228K042393J078156j684093j705436
$$ 3427273 4616189 3763967 1263648 689420 2731813 3809969 2125876 420440
10745D20440M39269Q18007n92373p28461L90881L93290k98680K02855O90607p30954
$$ 420440 859709 1677716 1085343 356882 747763 1141053 842373 1045228 1735835 1004881
10735A004881j890570O9K547330J882504l63236j79621J338626N05208j433703
$$ 1004881 -885689 -885620 1661710 3544214 3180978 3001357 4339983 4845191 3411488
10726C411488o52136J480136O42710k077257j881452R24230J639878j79170n69324
$$ 3411488 2759352 4239488 4882198 2804941 923489 1847719 3487597 3308427 2739103
10717B739103R13303Q30156q43732o36467J239697J004237j286636j645764L50813
$$ 2739103 3652406 4482562 3638830 3002363 4242060 5246297 3959661 2313897 2664710
10708B664710J001044l95960p48031L23953J0966j501073j118709Q01495Q74805
$$ 2664710 3665754 3269794 2521763 2845716 2856682 1355609 236900 1038395 1913200
10699A913200o07677k08807J595249R73438j662329j869521P52670J890357L37480
$$ 1913200 1305523 1096716 2691965 3665403 2003074 133553 886223 2776580 3114060
10690C114060n85658Q7846k82906j732691j168554J229533J781442R8778m00474
$$ 3114060 2528402 2616248 2333342 600651 -567903 661630 2443072 2541850 2141376
10681B141376Q53714R27194m17306m25423O91609J27235j350382m08833J966513
$$ 2141376 2995090 3922284 3504978 3079555 3771164 3898399 2548017 2139184 4105697
10672D105697J669736p77475r86546J096731J301327o61635r17593Q08177R10841
$$ 4105697 5775433 4997958 4011412 5108143 6409470 5747835 4830242 5638419 6549260
10663F549260o27736k92488J514973R84787j305440j202472O88520n8646k665248
$$ 6549260 5921524 5629036 7144009 8128796 6823356 5620884 6309404 6250758 3585510
10654C585510j967605J681440K489665l88141j739070j57565K64327j136247m07712
$$ 3585510 1617905 3299345 5789010 5400869 3661799 3504234 3768561 2632314 2224602
10645B224602K248379J961854j308469k096775M91258J399151m42893m17298K101692
$$ 2224602 4472981 6434835 5126366 3029591 3520849 4920000 4477107 4059809 6161501
10636F161501K133617j074304k265245j30389N28649j492955j574692J214742
$$ 6161501 8295118 7220814 4955569 4825180 5353829 3860874 2286182 3500924
10628C500924J995824l81876j156788R40964J549836k24324j92944J746188P64030
$$ 3500924 5496748 5114872 3958084 4899048 6448884 6224560 6031616 7777804 8541834
10619H541834k879191l205653L12113J459718j005100j250928J901257K393091
$$ 8541834 5662643 2456990 2769103 4228821 3223721 1972793 3874050 6267141
10611F267141j285434k901532n6063J953627P76007O31829K486549J649213j967218
$$ 6267141 4981707 2080175 2024112 3977739 4753746 5385575 7872124 9521337 7554119
10602G554119k358265J005005J485136k130981l087453M72692K159401j41849
$$ 7554119 5195854 6200859 7685995 5555014 2467561 2940253 5099654 4957805
10594D957805p22600J815740J521468k374150k734325J897825L839299K88650
$$ 4957805 4235205 6050945 7572413 5198263 2463938 4361763 8201062 8489712
10586H489712k050710j78515M67660j748688j153903K663690K571380j935787
$$ 8489712 6439002 6260487 6728147 4979459 3825556 6489246 9060626 7124839
10578G124839k493227K289462L550771j120765l123980M81292J671426k153845
$$ 7124839 4631612 6921074 10471845 9351080 6227100 6708392 8379818 6225973
10570F225973k834594J950201L373526j256892k775298J954848L657986j126132
$$ 6225973 3391379 5341580 8715106 7458214 4682916 6637764 10295750 9169618
10562I169618l057189J546239L230947j845341l919483J324591M086791m47812
$$ 9169618 6112429 7658668 10889615 9044274 5124791 6449382 10536173 10088361
10554A0088361k883478J482731L353865j626495l766577J226422L254426j864015
$$ 10088361 7204883 8687614 12041479 10414984 6648407 7874829 11129255 9265240
10546I265240l316342L167970N629433j273528n177395N41994M154780j242901
$$ 9265240 5948898 9116868 14746301 13472773 8295378 8837372 12992152 11749251
10538A1749251m322700J618910N097732o10001l933150J668517M404922j734152
$$ 11749251 7426551 9045461 14143193 13533192 9600042 11268559 15673481 13939329
10530A3939329m103470K957529N397170k685349n701116L141727P072352j861528
$$ 13939329 9835859 12793388 18190558 15505209 9804093 12945820 20018172 18156644
10522A8156644o203960K878645P290642k367063o961594L545754Q533608l190983
$$ 18156644 11952684 14831329 22121971 19754908 12793314 16339068 24872676 21681693
10514B1681693r427639K885181J0729038m85964p223810N561131J2413933k698338
$$ 21681693 12254054 15139235 25868273 25382309 18158499 23719630 36133563 33435225
10506C3435225j1469079M424163J4221219k713245j2650545P519166J9724643
$$ 33435225 21966146 26390309 40611528 37898283 25247738 32766904 52491547
10499E2491547k867960j6585172J1122091L0035326j28623k0404273K1085388
$$ 52491547 49623587 33038415 44160506 74195832 74067209 53662936 74748324
10492G4748324N3301858O497024k5184294P5561356J95620842J02380958j79667104
$$ 74748324 128050182 134547206 109362912 184924268 380545110 482926068 303258964
10485C03258964l38048939j96786029M1536278J04093745J2093719l3003789J6856052
$$ 303258964 -34789975 -231576004 -190039726 -85945981 -73852262 -106856051 -89999999
10478h9999999M2781763J901448k1497330Q481198K5922745k74615j6217910N273082
$$ -89999999 -47218236 -45316788 -66814118 -58332920 -32410175 -32684790 -48902700 -43629618
10470d3629618J8441991r00506j2816901M651364J5754599m06511j2057043R93473
$$ -43629618 -25187627 -26088133 -38905034 -34253670 -18499071 -18905582 -30962625 -29969152
10462b9969152J1282970L22600p921287K588928R693321q43662p818291K124578
$$ -29969152 -18686182 -18363582 -26284869 -23695941 -14002620 -14846282 -22664573 -20539995
10454b0539995Q716552r78877p730804J283958Q230173N36888n663539J193363
$$ -20539995 -11823443 -12802320 -20533124 -19249166 -11018993 -10482105 -16145644 -14952281
10446a4952281O050860j432764o295746J408379O764266n10428o232190Q7473
$$ -14952281 -8901421 -10334185 -16629931 -15221552 -8457286 -8967714 -15199904 -15112431
10438a5112431N430832k57626m759478J365224O134148K42801m654996Q00754
$$ -15112431 -9681599 -9939225 -14698703 -13333479 -7199331 -6956530 -11611526 -10810772
10430a0810772N440626j98997n528623p93197M569302J043294l249040J932L016319
$$ -10810772 -5370146 -5569143 -11097766 -11890963 -7321661 -6278367 -9527407 -9525475 -6509156
10421f509156j297281m398889Q10101N299362J094335l542181m97838K886505
$$ -6509156 -7806437 -12205326 -11395225 -6095863 -5001528 -8543709 -9041547 -6155042
10413f155042q39239m324812j63174M337850J268150k961718n26631L186405J091577
$$ -6155042 -6994281 -11319093 -11482267 -7144417 -5876267 -8837985 -9364616 -6178211 -5086634
10404e086634j987742R0395K536501m496k400269L18159K676064j29799k356656
$$ -5086634 -7074376 -6983981 -4447480 -4451976 -6852245 -6534086 -3858022 -3987821 -6344477
10395f344477O38129K595731j373194m442527o20299L767970J825660j693292
$$ -6344477 -5706348 -3110617 -4483811 -8926338 -9546637 -5778667 -3953007 -5646299
10387e646299n02037J540555n99667k689178r2170K615859P23733j425388M20527
$$ -5646299 -6148336 -4607781 -5207448 -7896626 -7988796 -5372937 -4649204 -6074592 -5654065
10378e654065J793620r59386k524444Q93620L132877m88019l537251j28666L805951
$$ -5654065 -3860445 -4819831 -7344275 -6450655 -3317778 -3805797 -7343048 -7471714 -3665763
10369c665763J290269l064691j918693J853303J730915o22796l50334P95888p36916
$$ -3665763 -2375494 -5440185 -7358878 -5505575 -3774660 -4397456 -4747790 -3951902 -4688818
10360d688818k270727n15625J306798L6245o66747K119130L700814L51155k867209
$$ -4688818 -6959545 -7475170 -6168372 -6132127 -6798874 -4679744 -978930 -627775 -3494984
10351c494984r73489J854474L75284k083080o40229J728546M93347j523797j21552
$$ -3494984 -4468473 -2613999 -2238715 -4321795 -4962024 -3233478 -2740131 -4263928 -4385480
10342d385480J863123M63197j359090K75347K209428L32636k300242j246949J144637
$$ -4385480 -2522357 -2059160 -3418250 -3142903 -933475 -600839 -2901081 -4148030 -3003393
10333c003393Q14701m27752M37782J141372q13886k391263r12600L41803j238418
$$ -3003393 -2188692 -2616444 -2178662 -1037290 -1851176 -4242439 -5155039 -4813236 -6051654
10324f051654j900251J102543L348170J184187j211913L23999K176048K65603
$$ -6051654 -7951905 -6849362 -3501192 -2317005 -3528918 -3204919 -1028871 -763268
10316g63268k013209o83188J041828m92694j901118K17956J920324m28780k398188
$$ -763268 -2776477 -3459665 -2417837 -2910531 -4811649 -4593693 -2673369 -3102149 -5500337
10307e500337K46333K856935L82025k724788o21081K827190J237222k357442j415199
$$ -5500337 -5254004 -2397069 -2015044 -4739832 -5360913 -2533723 -1296501 -3653943 -5069142
10298e069142J894282J304786j538762p07247K375839J831385j349585j462762
$$ -5069142 -3174860 -1870074 -3408836 -4116083 -1740244 91141 -1258444 -2721206
10290b721206R98691P75560j858955j957802N33695J205864j82865p7695J191030
$$ -2721206 -1722515 -946955 -2805910 -4763712 -4230017 -3024153 -3207018 -3284713 -2093683
10281b093683K83032j860825j416325Q75333J088969m05584o3951J652901J322491
$$ -2093683 -1810651 -3671476 -5087801 -4212468 -3123499 -3529083 -3593034 -1940133 -617642
10272f17642n63147o60095N87547K3616j799405j703151r6145O0607q52667j89002
$$ -617642 -1180789 -1840884 -1253337 -1229721 -3029126 -4732277 -4828422 -4767815 -5620482 -5809484
10262e809484J428551J351772J67552K90984J051311M04860n14556K64262J027898
$$ -5809484 -4380933 -3029161 -2861609 -2570625 -1519314 -1114454 -1629010 -1364748 -336850
10253c36850n54191k404087j421802P77453Q81125k08092R7266O89913m67892
$$ -336850 -891041 -3295128 -4716930 -3939477 -3058352 -3266444 -3169178 -2479265 -2947157
10244b947157j388771L18934K132048Q87241j018883M1807J888271N11981k239576
$$ -2947157 -4335928 -4016994 -1884946 -997705 -2016588 -1974781 -86510 425471 -1814105
10235a814105k017760M3440l1026j233727J01373K579047J985164p04820j075250
$$ -1814105 -3831865 -3788425 -3819451 -5053178 -4951805 -2372758 -387594 -1092414 -2167664
10226b167664O31161N46931j156588r81164P11650M41686j368471j087304J123045
$$ -2167664 -1536503 -989572 -2146160 -3127324 -2415674 -1973988 -3342459 -4429763 -3306718
10217c306718J664481K20034k28126O37826N88982j9264P49255J477257m02572
$$ -3306718 -1642237 -1422203 -1650329 -1012503 -423521 -442785 306470 1783727 1381155
10208A381155k809519j771246J342627J868903j46043p49375K63736m07087k371114
$$ 1381155 -1428364 -3199610 -1856983 11920 -134123 -883498 -619762 -1026849 -3397963
10199c397963j789262J276469K599194J072735j40811J10505k24904j192624n73401
$$ -3397963 -5187225 -3910756 -1311562 -238827 -379638 -269133 -494037 -1686661 -2260062
10190b260062R82395N45202j252024r28860J212573J300568r66202j578852O62713
$$ -2260062 -1277667 -732465 -1984489 -2913349 -1700776 -400208 -1366410 -2945262 -2282549
10181b282549K221449J063009o14041r89180j007685j197485o30725K66739M9111
$$ -2282549 -61100 1001909 387868 -601312 -1608997 -2806482 -3437207 -3170468 -3121357
10172c121357m80975N05069J798225Q20311j299604j222245O63246R91144m12774
$$ -3121357 -3602332 -3097263 -1299038 -478727 -1778331 -3000576 -2337330 -1346186 -1758960
10163a758960n45964Q70761J033808l89804p53609L53268N80438l51759l49073
$$ -1758960 -2304924 -1434163 -400355 -790159 -1543768 -1190500 -610062 -961821 -1310894
10154a310894N32810K96150m80515M58826J971687Q74448j888403k264252j99108
$$ -1310894 -778084 -481934 -962449 -503623 1468064 2342512 454109 -1810143 -2009251
10145b009251L95833j016394p58448J757793K447750j17679j962675m70653J604077
$$ -2009251 -1613418 -2629812 -3388260 -1630467 817283 699604 -1263071 -1733724 -129647
10136a29647J305780j70602p06243o54775q37762p44411l82276o43273q91215
$$ -129647 1176133 1005531 299288 -355487 -1193249 -1937660 -2319936 -2963209 -3854424
10127c854424L73406K039883J478149o63963j094602M10104O86659q66414j100838
$$ -3854424 -3481018 -1441135 37014 -626949 -1721551 -1311447 -624788 -1491202 -2592040
10118b592040J004572K298248R21304q08480q30830m20021q76027r86561J98903
$$ -2592040 -1587468 710780 1632084 823604 -7226 -427247 -1303274 -2289835 -2090932
10109b090932J337966J251617N84466j01822j091937j750892r77397K61529J7262
$$ -2090932 -752966 498651 1083117 981295 -110642 -1861534 -2838931 -2577402 -2560140
10100b560140j014787m72286J235585J442497J04144j79513Q24569N60010j221655
$$ -2560140 -3574927 -4047213 -2811628 -1369131 -1264987 -1444500 -619931 -59921 -1281576
10091a281576j641883J18832J353861O67226o2121K70655K18404o89109p37168
$$ -1281576 -2923459 -2804627 -1450766 -783540 -845661 -575006 -356602 -1045711 -1782879
10082a782879L59846N73181n04558p35405M21630Q06621k34337n47535O34800
$$ -1782879 -1423033 -849852 -1354410 -2089815 -1668185 -861564 -1095901 -1643436 -1008636
10073a008636J168399P8441o64072R6184Q23528N52323M35094P66442R4317j443849
$$ -1008636 159763 238204 -425868 -329684 493844 1046167 1481261 2247703 2342020 898171
10063H98171j578321J791O92472n54478j487996o93673J91429p6205k42886N02101
$$ 898171 -680150 -678359 14113 -540365 -2028361 -2722034 -2530605 -2606810 -2849696 -2347595
10053b347595Q54563K10288o7208M42630K88124o47144m41054J070837J369799
$$ -2347595 -1493032 -1282744 -1349952 -907322 -619198 -1266342 -1707396 -636559 733240
10044G33240l74075j573482n91747O21822K01110n91645j27166O87933M72289
$$ 733240 359165 -1214317 -1806064 -1184242 -983132 -1574777 -1701943 -1014010 -541721
10035e41721j27631m8476J76717j89280n10264q3905N54976P10636M57777o3208
$$ -541721 -669352 -717828 -541111 -730391 -1240655 -1324560 -769584 -58948 398829 335621
10025C35621p67108r47400j92471L34656m41407j210157j32955J735109J808786
$$ 335621 -431487 -1378887 -1571358 -1236702 -1678109 -2888266 -3021221 -1286112 522674
10016E22674J42897r05122o45850m17754n02452p3402L08691l93029r77837J69499
$$ 522674 665571 -239551 -885401 -1303155 -1805607 -1879009 -1570318 -1963347 -2941184 -2771685
10006b771685J484717N01927j322928o93646J506809J457252q14536j439472M19986
$$ -2771685 -1286968 -785041 -2107969 -2801615 -1294806 162446 -652090 -2091562 -1671576
9997a671576J380127J19065p55166j11098r2220j203679r15485J230996K160083
$$ -1671576 -291449 -172384 -927550 -1038648 -1130868 -2334547 -3250032 -2019036 141047
9988A41047O27276p02678k06441K93944l09946m24888M60242M77752o24011o53796
$$ 141047 768323 65645 -140796 153148 -156798 -581686 -121444 356308 -267703 -921499
9978i21499N25942L57076j249037j107070J305191K260191R9494j895833j189352
$$ -921499 -395557 -38481 -1287518 -2394588 -1089397 1170794 1270288 -625545 -1814897
9969a814897K56285K53374j43090K16678K77450k15743L69260J754146J242191
$$ -1814897 -1558612 -1305238 -1448328 -1231650 -954200 -1169943 -800683 953463 2195654
9960B195654j234186k148871k38097J411698Q84481J00424J92669n26822k017102
$$ 2195654 961468 -1187403 -1425500 -13802 870679 971103 1163772 636950 -1380152
9951a380152j418631J256057J985781k49348j210976J000879K235424k60048k687233
$$ -1380152 -2798783 -1542726 443055 193707 -1017269 -16390 2219034 1958986 -728247
9942g28247j302302J258292R76212r33961j189552k04340j26345n34152j60988
$$ -728247 -2030549 -772257 203955 -730006 -1919558 -2123898 -2250243 -2784395 -2945383
9933b945383J60555l16038k16261J007028J463983M95606J17315P68560Q0116
$$ -2945383 -2784828 -3100866 -3317127 -2310099 -846116 -350510 -233195 535365 615481
9924F15481k073017k310490J85649J684755M30935m74796P22724J311730n0641
$$ 615481 -1457536 -3768026 -3582377 -1897622 -1466687 -1941483 -1218759 92971 42330
9915D2330n80015P34516R34526n27480k66040J643666Q00385k342153j789333
$$ 42330 -537685 196831 1131357 603877 337837 1981503 2781888 439735 -1349598
9906a349598K352110K475914k165421k507421L118815L944026j958465J487060
$$ -1349598 1002512 3478426 1313005 -1194416 1924399 5868425 3909960 5397020
9898E397020K1069219L3869515J5944221j9017489l4493967k0204744j353849
$$ 5397020 26466239 60335754 76279975 57262486 22768519 2563775 1209926
9891A209926J529807l368671j788486K974339J623837k763932k182471J411506
$$ 1209926 2739733 -628938 -2417424 556915 2180752 -583180 -2765651 -1354145
9883a354145J367172j155326q78417J247859R03325j020377r03592M28130J16823
$$ -1354145 13027 -1142299 -2020716 -772857 130468 -889909 -1793501 -1365371 -1248548
9874a248548p11553L25888J525832L14579j422761o92848J001114O10222q20839
$$ -1248548 -1960101 -1634213 -108381 206198 -1216563 -1909411 -908297 -298075 -1118914
9865a118914n13922P32999M97483m43735K0615Q70997j5257j360293n88316J229514
$$ -1118914 -1632836 -899837 -402354 -846089 -825474 45523 30266 -1330027 -1918343 -688829
9855f88829J033202q73903j456938j16092Q14906L19776j91367P0025K63067M5657
$$ -688829 344373 -529530 -1986468 -2102560 -1287654 -967878 -1159245 -1089220 -826153 -780496
9845g80496Q7142L64739J30685m42251m65069l1765k1055m28508m63169q4762
$$ -780496 -693354 -328615 -197930 -640181 -1105250 -1137015 -1158070 -1586578 -2049747 -2134509
9835b134509k0739m11465o30667l16506L13811R27807J185640P97068J6652m35981
$$ -2134509 -2155248 -2566713 -3197380 -3513886 -3200075 -2272268 -1086628 -289560 -272908 -708889
9825g08889l55557k89037m93085n02373p0364L66767M91126M60112K53682l20020
$$ -708889 -1064446 -1353483 -1846568 -2348941 -2419305 -2052538 -1561412 -1101300 -847618 -1167638
9815a167638q18050n14809K70321M32718j47409m18125L5180M10455K64221K22600
$$ -1167638 -1985688 -2500497 -2230176 -1797458 -1944867 -2362992 -2327812 -1917357 -1653136 -1430536
9805a430536N99082O46938j30244j002990j017071j97760O79345R10946L25592
$$ -1430536 -831454 -184516 -314760 -1317750 -2334821 -2532581 -1853236 -942290 -616698
9796f16698m93758n86354J78710P24388L38236j54054J42997N01035j60896j173540
$$ -616698 -1110456 -1696810 -1518100 -793712 -455476 -609530 -466533 34502 -126394 -1299934
9786a299934j085548q2677M59695L10713L05057M01032r8496p24948l79262N28353
$$ -1299934 -2385482 -2468159 -2008464 -1697751 -1392694 -991662 -1090158 -1815106 -2194368 -1666015
9776a666015N92823j07977j99186M64166O72991K22798J45028N11239K43169p05948
$$ -1666015 -1073192 -1181169 -1380355 -916189 -243198 -20400 124628 635867 879036 173088
9766A73088j129016p13381l45455j78016M78613J286888J144554L83929L67632
$$ 173088 -955928 -1669309 -2014764 -2192780 -1714167 -427279 717275 1101204 1468836
9757A468836Q17012J05066j548601j937567n10944N84010J9928p30302j23856
$$ 1468836 2285848 2390914 842313 -1095254 -1606198 -1022188 -1002260 -1732562 -1856418
9748a856418J035023J264221O06838q9666n20514n56396L916N86972K47932n95139
$$ -1856418 -821395 442826 1049664 959998 439484 -116912 -112996 473976 721908 126769
9738A26769n15484M53735O41659n03548j546367j510953j050525n76694M38492
$$ 126769 -388715 65020 706679 203131 -1343236 -2854189 -3904714 -4481408 -4042916
9729d042916J515276J034055q28271j512165J54053J956400J703248L58431j44140
$$ -4042916 -2527640 -1493585 -2321856 -3834021 -3679968 -1723568 -20320 338111 193971
9720A93971p6924o07680j081685k21464J124572J030929l35938r94608l39787
$$ 193971 117047 -490633 -1572318 -1793782 -669210 361719 25781 -968827 -1308614
9711a308614J63148l87577r71669m98582M71843P04383R7864l36288L1359O73707
$$ -1308614 -1145466 -1533043 -2504712 -3003294 -2531451 -1827068 -1729204 -2065492 -2034133 -1360426
9701a360426P42326K42122q8128L9110R8423j63100j32536M87632P56322j37590
$$ -1360426 -618100 -375978 -464106 -424996 -326573 -489673 -622209 -134577 621745 484155
9691D84155j255124j065998J83753Q45119M50324J95895O42940O93866m41739
$$ 484155 -770969 -1836967 -1653214 -808095 -357771 -161876 481064 1174930 733191
9682G33191j697619j562857j43728J107920J228642N91727J37095K34012M11166
$$ 733191 -964428 -2527285 -2671013 -1563093 -334451 257276 394371 628383 1039549
9673A039549J76436j58241m387L07448p5742p91253m18634J014859J468855R627
$$ 1039549 1215985 1057744 1053357 1360805 1285063 493810 75176 1090035 2558890 2568517
9663B568517j366499p80479M52541J17269j093047r42524K71900K92580r18893
$$ 2568517 1202018 421539 874080 991349 -101698 -1044222 -772322 -479742 -1398635
9654a398635j011324N30553J324992J12659j141703n02729J010912J312773K41346
$$ -1398635 -2409959 -1879406 -554414 -441755 -1583458 -2086187 -1075275 237498 478844
9645D78844q17497r81212l17632P52994J558753J440673N07118m69518r95713
$$ 478844 -338653 -1319865 -1637497 -884503 674250 2114923 2622041 2152523 1156810
9636A156810r98273l86817M77238M41504q95674j906443r07545J143451J867337
$$ 1156810 158537 -228280 248958 690462 -205212 -2111655 -3019200 -1875749 -8412
9627h412Q82797j40989m18149o28712q12138k52038N26161K21965o56272l03067
$$ -8412 874385 733396 315247 -313465 -1125603 -1377641 -851480 -629515 -1285787 -1588854
9617a588854J099112J391324J10087p57767l22374j23331r53117j246836L8480
$$ -1588854 -489742 901582 1011669 253902 -68472 -191803 -1144920 -2391756 -2353276
9608b353276J516846J742828J193541O37331j87653j056775p79748M70957P11499
$$ -2353276 -836430 906398 2099939 2737270 2549617 1492842 713094 1184051 1895550
9599A895550o35710j509240o58421K19723m25792j254581n28320Q34722J026470
$$ 1895550 1259840 -249400 -907821 -688098 -1113890 -2368471 -2896791 -2062069 -1035599
9590a035599L42512R0380R4927m04829p54606o9132P46781L69034n45521m45532
$$ -1035599 -693087 -602707 -507780 -912609 -1667215 -1736347 -989566 -620532 -1166053 -1611585
9580a611585M89637Q65736N03555L70009O10780N04922K3999k13422k66630o84683
$$ -1611585 -1121948 -256212 247343 617352 1228132 1733054 1757053 1543631 1277001 592318
9570E92318j214379j003654P437R13855R67928K19877o66240q02919J63607J348606
$$ 592318 -622061 -1625715 -1618278 -704423 263505 483382 -182858 -985777 -822170 526436
9560E26436J433838M11432m76841o82442q31792j007961l49263R76866J305427
$$ 526436 1960274 2371706 1894865 1212423 380631 -627330 -976593 273 1305700
9551A305700K3467j205902r96741k58086k21319j95488Q75244K032058J558900
$$ 1305700 1329167 123265 -873476 -1131562 -1352881 -1548369 -673125 1358933 2917833
9542B917833k38103j410899j047178k1536N64290M38966m1264k65866P9305L72325
$$ 2917833 2679730 1268831 221653 200117 764407 1203373 1162109 896243 975548 1347873
9532A347873k49330j263516j144219J67694Q48586L4245p74344k75638N77382
$$ 1347873 1098543 -164973 -1309192 -1141498 -292912 -258667 -1033011 -1308649 -731267
9523g31267N65933L76303R47971J342823L88813r33158r84960k30949k24407p77208
$$ -731267 -165334 210969 1158940 2501763 2890576 1957418 972458 741509 517102 -260106
9513b60106n33285K99675K59030o29294q04919P8621N71223m9603o25223j20155
$$ -260106 -793391 -493716 -234686 -863980 -1668899 -1590278 -1019055 -1068658 -1693881 -1814036
9503a814036P90041R26408K93702k23051j92922k2108k13603n92726m49337L77914
$$ -1814036 -1023995 -97587 196115 -26936 -219858 -241966 -455569 -1048295 -1497632 -1119718
9493a119718Q82145J05678j192257j270947O3215J092871P65868N1891L0139K93737
$$ -1119718 -237573 -131895 -1324152 -2595099 -2531884 -1439013 -673145 -621254 -591115 -297378
9483b97378K43770K96600N93095J96763r92813j269338J93484J400024M09136
$$ -297378 -53608 242992 836087 1032850 40037 -1229301 -1035817 364207 773343
9474G73343j384108j339798K74309J002577K72204k10728J65274J20613p06207
$$ 773343 -610765 -1950563 -1676254 -673677 -401473 -612201 -446927 -326314 -1032521
9465a032521r30915n6585N27110O6264k32734N10885J185675O03421n26748r33876
$$ -1032521 -1963436 -2020021 -1492911 -1426647 -1659381 -1148496 37179 640600 113852 -820024
9455h20024p82196q61585q34272O8289J213797J137016j21820p74363J85584J415188
$$ -820024 -1602220 -2463805 -3298077 -3229788 -2015991 -878975 -1000795 -1775158 -1589574 -174386
9445a74386J048061o31964j486045m11489J188572J336006J3807j133723j122119
$$ -174386 873675 241711 -1244334 -1655823 -467251 868755 882562 -251161 -1373280
9436a373280n05149m4197K90115O66312P51616K92099l15962n13654j90773M30329
$$ -1373280 -1878429 -1922626 -1632511 -966199 -214583 77516 -238446 -752100 -942873 -512544
9426e12544J028506J183662P08826L3363l17172m73414p33459o93903L7411O43269
$$ -512544 515962 1699624 2408450 2441813 2124641 1651227 917768 223865 261276 904545
9416I04545R6087q67887n76817P48902J073494j61569j061954m29411L58127r6931
$$ 904545 1000632 132745 -444072 304830 1378324 1216755 154801 -274610 83517 -13414
9406a3414q48405m75087M23405M80617m9174o2944K91953J30783l79541m40248
$$ -13414 -861819 -1336906 -913501 -432884 -482058 -545002 -253049 -122266 -501807 -942055
9396i42055j41132m7774K9760M36327O11400O8503l58063K51564J172107J086247
$$ -942055 -1083187 -1130961 -1101201 -664874 -53474 15029 -343034 -91470 1080637 2166884
9386B166884J87016l40566l21329m70007p75687o03789o2479J92372K01569M28541
$$ 2166884 2353900 2013334 1692005 1221998 446311 -157478 -219957 -27585 173984 602525
9376F02525O35547L34534q8487k3258P9098n21823j249693q91546L87327J174710
$$ 602525 1238072 1572606 1484119 1460861 1539959 1018136 -231557 -1123103 -735776 438934
9366D38934Q37015R6982l25045m28395l29403l2189J83020O755l18820l16024
$$ 438934 1275949 1372931 1047886 619491 290088 257899 440919 447674 128854 -187170
9356a87170N3218N22056Q81342Q13051Q7857o85842n23467K89923L35356o03071
$$ -187170 -133952 388104 1269446 2082497 2170354 1484512 961045 1250968 1586324 983253
9346I83253j008144k62421J77496m96602p21646O15033J771007R38347m69243
$$ 983253 -24891 -287312 -109816 -606418 -1328064 -713031 1057976 1996323 1527080
9337A527080j33166J142681Q98763o22338j002131P4849N16833l20120p97632
$$ 1527080 1393914 2536595 3435358 2813020 1810889 1885738 2402571 2082451 1284819
9328A284819k56401M2415k71852M7751J051311R60547o24373j581718o09148O91377
$$ 1284819 1028418 1070833 798981 846732 1898043 2858590 2234217 652499 43351 734728
9318G34728N07482m96551p45850k85092j47627m63680o09867l69614N3817M30105
$$ 734728 1242210 745659 -191 -285283 -432910 -896590 -1506457 -1876071 -1822254 -1392149
9308a392149L54189l91569j049262o06160N35358R93931O18396N62868R55798
$$ -1392149 -1037960 -1429529 -2478791 -3084951 -2549593 -1555662 -937266 -374398 581400
9299E81400N36520q11951j317591j13004J201078J051423J93923R1434N27557
$$ 581400 1117920 305969 -1011622 -1124626 76452 1127875 1321798 1413232 1940789
9290A940789M08798k71405q07209j136568j405658j064928J98167J362949J275421
$$ 1940789 2349587 2078182 1270973 134405 -1271253 -2336181 -2138014 -775065 500356
9281E00356L79686K252L74185N58419M7695o40699q72516o10627k37558r8136
$$ 500356 880042 882294 1256479 1814898 1862593 1221894 349378 -261249 -498807 -596943
9271e96943j21485J79215R48505J374023O31427o68723j109900n46440j46925
$$ -596943 -718428 -539213 409292 1783315 2414742 1746019 636119 89679 -57246
9262e7246k38769J06142Q54268M71999j296483k183638o56445J340563J100295
$$ -57246 -296015 -189873 664395 1136394 -160089 -2343727 -3000172 -1659609 -559314
9253e59314o97094j109859M77966J618325P35876o97796o83553N50327J386303
$$ -559314 -1256408 -2366267 -1888301 -269976 465900 -231896 -915449 -365122 1021181
9244A021181J101025K53204m05415n67624l91945l58959o94216q23239p4415J027218
$$ 1021181 2122206 2375410 1969995 1402371 1010426 651467 -42749 -865988 -940403 86815
9234H6815J133614m440j058062j054990o89405q99134j173089m83827P83256J269223
$$ 86815 1220429 1215989 157927 -897063 -1586468 -2485602 -3658691 -4142518 -3359262 -2090039
9224b090039P70399M74012R04964J042141R9149r70960p49761N40614J270439
$$ -2090039 -1319640 -845628 59336 1101477 1200626 229666 -520095 20519 1290958
9215A290958N13054r51888j730100j247842o0349P76436O30654o3534k47616L56978
$$ 1290958 1804012 852124 -877976 -2125818 -2186167 -1409731 -779077 -842611 -1090227 -733249
9205g33249P24660n766j085273j172298m08639j38343n89690l97052J061024K306221
$$ -733249 -8589 -14355 -1099628 -2271926 -2680565 -2818908 -3408598 -3805650 -2744626 -438405
9195d38405J732525j11922j349495j191688m23970O4422J30460n0913k86455k15769
$$ -438405 1294120 1182198 -167297 -1358985 -1782955 -1718533 -1588073 -1638986 -1925441 -2141210
9185b141210L79662J021100Q66548k22288j282469j111504M65661K167936K318656
$$ -2141210 -1761548 -740448 126100 -96188 -1378657 -2490161 -2024500 143436 2462092
9176B462092O70367j097638j282204k22142M43208K27220Q4638K87151j42970
$$ 2462092 3132459 2034821 752617 530475 973683 1200903 1285541 1572692 1429722
9167A429722j291980j538107o2606J439831J102329l62361r82013n46041l62327
$$ 1429722 137742 -1400365 -1462971 -23140 1079189 716828 -265185 -811226 -1173553
9158a173553o92555n11453L79011R28045O79390M01029N82269O95318L18528j69588
$$ -1173553 -1866108 -2377561 -1998550 -1070505 -391115 9914 592183 1287501 1606029 1436441
9148A436441l80232m40476m53109k67717K073l2353l90632o70246o15002k08355
$$ 1436441 1056209 615733 162624 -105093 -103020 -135373 -526005 -1196251 -1811253 -2019608
9138b019608N39362J280932J248042K80562n38795k33537N64363N58262k26977
$$ -2019608 -1480246 -199314 1048728 1329290 790495 556958 1121321 1679583 1452606
9129A452606o69661m15101j31190q7145J00928L36972O4204m91357m52778J69301
$$ 1452606 782945 367844 236654 149509 250437 587409 651613 160256 -292522 -123221
9119a23221M01622k872j54424L34774O39022K06408k45349N4144O79649P56171
$$ -123221 278401 275529 121105 455879 1094901 1301309 1055960 1110104 1789753 2545924
9109B545924K41854k61980m79994n94668o99128o23833k54904J67929J07291p02916
$$ 2545924 2787778 2525798 2045804 1451136 752008 128175 -126729 41200 148491 -554425
9099e54425j600423j389043J35495J544536J382741N2277p40506k07188P10873
$$ -554425 -2154848 -3543891 -3408396 -1863860 -481119 -428842 -1169348 -1376536 -665663
9090f65663P31740k72485j265840j155249L3978R95824O09959m11230l01352J102995
$$ -665663 66077 -206408 -1472248 -2627497 -2593519 -1597695 -987736 -1398966 -1700318 -597323
9080e97323J883036R21073l29911k19155M89660J37273r54109j205942n04639
$$ -597323 1285713 2206786 1876875 1657720 2147380 2284653 1330544 124602 -380037
9071c80037j9707Q7691N62448J080855O35604l27264m13165J73644r6498j191144
$$ -380037 -399744 -312053 250395 1331250 1966854 1639590 1226425 1400069 1303571 112427
9061A12427j321016j2294R81259N05659l97234n16791j46289J06293L71235N50228
$$ 112427 -1208589 -1220883 -239624 266035 -131199 -647990 -794279 -687986 -316751 233477
9051B33477K6916q32277o05218Q74609J816332J049173l09291p91520o16440o21741
$$ 233477 260393 -571884 -1177102 -302493 1513839 2563012 2253721 1462201 845761 224020
9041B24020o11683j15989L35946L3929o08094o62512k153P79757J168934R23173
$$ 224020 -387663 -503652 -167706 -133777 -741871 -1404383 -1406536 -626779 542155 1465328
9031A465328J42126n16775m49603m7767q9271l01091J41678P99257M02306p62323
$$ 1465328 1607454 1090679 641076 593309 504038 202947 344625 1143882 1546188 783865
9021G83865r05754L32788J065841Q9321j306099j476127o01602L39197J069048
$$ 783865 -121889 210899 1276740 1366061 59962 -1416165 -2017767 -1678570 -609522
9012f09522J370222O24483q01541j289344k72947P39110N54592O13L0637M784
$$ -609522 760700 1385183 583642 -705702 -978649 -239539 315053 315666 346303 351087
9002C51087o49854r21002j06725N06200k07214r96979k92445R84436R53179r0979
$$ 351087 -298767 -1219769 -1326494 -820294 -1027508 -2024487 -2316932 -1332496 -379317 -470296
8992d70296m53345K5626K03592K0391K56510N26128r0974q71673l15036J099450
$$ -470296 -923641 -898015 -694423 -674032 -417522 108606 17632 -854041 -1169077 -69627
8982f9627J423504L91275l42450j58552k14109r01789r93873j3704P23411L36887
$$ -69627 1353877 1745152 1402702 1244150 1030041 128252 -865621 -879325 -155914 180973
8972A80973k73205k67263k53276p19224p47107L23275J288832P05009p72271j205900
$$ 180973 -92232 -359495 -612771 -1331995 -2079102 -1755827 -466995 238014 -534257 -1740157
8962a740157q0627J182988J289007M91562j91232l25018k24994k08514j52314
$$ -1740157 -1820784 -637796 651211 1142773 951541 626523 401529 193015 40701
8953D0701J27944L08227j87038j182436j528653m81408J026367J320339J34827
$$ 40701 168645 476872 289834 -892602 -2421255 -2902663 -1876296 -555957 -421130
8944d21130j054719j018021k01452K56625J41034M8269J51212n476m96657o08304
$$ -421130 -1475849 -2493870 -2695322 -2438697 -2297663 -2249394 -2098182 -2103658 -2600315 -3208619
8934c208619J89288J323961J687713R68716o5744o16334o43022m24503N2155P32343
$$ -3208619 -3019331 -1695370 -7657 961059 895315 278981 -364041 -788544 -736389 -4046
8924d046J009546L82078o25689j015439p01303m82242o33239n26014J20111O31494
$$ -4046 1005500 1387578 761889 -253550 -954853 -1437095 -2070334 -2596348 -2476237 -1844743
8914a844743M89213J47352J75085L78269L81859L23241L12892j0431o23405o35712
$$ -1844743 -1355530 -1208178 -1033093 -654824 -272965 50276 363168 352737 -270668 -906380
8904i06380L43591J091643K95852j275536j592452k79197Q00190K63906q47916
$$ -906380 -562789 528854 824706 -450830 -2043282 -2322479 -1522289 -1258383 -2106299
8895b106299p13512O64307J638984J253935K09051n07574q19592r36513m96873
$$ -2106299 -2819811 -2155504 -516520 737415 946466 438892 -380700 -1317213 -1814086
8886a814086P09625J684943J109672o67970j693072q96798M80575O69206k80792
$$ -1814086 -1104461 580482 1690154 1022184 -670888 -1567686 -1087111 -417905 -698697
8877f98697q83352l53250O99139J378867J311918N35374m87758q73155k01280
$$ -698697 -1582049 -1935299 -1236160 142707 1454625 1989999 1502241 629086 427806
8868D27806O96298O14646m96745j582690j783958r84672M73740J760528J799225
$$ 427806 1124104 1738750 1242005 -340685 -2124643 -3109315 -2635575 -875047 924178
8859I24178N78555l92578r5857L42869m63735j524032q45853J077888J687169
$$ 924178 1502733 1110155 1014298 1357167 893432 -630600 -1476453 -398565 1288604
8850A288604K86347j009943p25360Q8079K25798J99275N67880N64501k29802p13649
$$ 1288604 1574951 565008 -160352 -72273 153525 352800 920680 1485181 1255379 541730
8840E41730j93833K16745m23582j116885o58981L26773O46987M87037N45334M85260
$$ 541730 347897 564642 141060 -975825 -1634806 -1308033 -661046 -174009 371325 856585
8830H56585j62953p21628n51228l79779q79649j095644k9261J286410J196195
$$ 856585 693632 -27996 -579224 -959003 -1838652 -2934296 -2963557 -1677147 -480952
8821d80952P9031l15613L94573R59357N87663k85976j008074j145779l82362Q06274
$$ -480952 -401921 -717534 -322961 636396 1224059 938083 -69991 -1215770 -1598132 -791858
8811g91858J053496m3136q60487n1074J095030N13739j212043j589957p8202J148617
$$ -791858 261638 218502 -641985 -693059 401971 915710 -296333 -1886290 -1964492 -815875
8801h15875N61331o96977q48302Q4892P94530N88983n4873l23060N6396N88011
$$ -815875 -254544 -951521 -1799823 -1714931 -920401 -331418 -386291 -709351 -652955 -64944
8791f4944O14938K07635J7897J04760k35417j032249j141797j4926J122261R63404
$$ -64944 549994 757629 775526 880286 644869 -387380 -1529177 -1544103 -421842 541562
8781E41562M0097k81300J38674M48892L38839L4134n23992j232225j288482l28339
$$ 541562 581659 300359 439033 887925 1226764 1260898 736906 -495319 -1783801 -2112140
8771b112140O96466R37837R19788J127643O75793r19692k005596r86542Q52209
$$ -2112140 -1415674 -477837 441951 1569594 2245387 1325695 -679901 -1666443 -814234
8762h14234J111543l96l09289N54122Q19042j12122p56604k82515K73639N0745
$$ -814234 297309 296913 -12376 541746 1360788 1248666 492062 209547 483186 533931
8752E33931m17234n19801l68169k560N80039O34080l74048j277513o71870N09666
$$ 533931 116697 -403104 -771273 -773833 -193794 440286 66238 -1211275 -1883145 -1373479
8742a373479K54769j000453q98879P65477J584845O30577j49527M30171Q54501
$$ -1373479 -1118710 -2119163 -3018042 -2252565 -667720 -37143 -186670 243501 1098002
8733A098002j4883q27240m42331j18981j010780j770234q26041Q42117J356409
$$ 1098002 1083119 255879 -186452 -305433 -1316213 -3086447 -3912488 -3070371 -1713962
8724a713962P83969L28402J47315j06671J8657O55853N99839o96402j556283n40456
$$ -1713962 -929993 -601591 -454276 -560947 -542290 113563 713402 17000 -1539283 -2079739
8714b079739R60022Q29475l97802p28857j43061j32125o02771q1733J304710J781022
$$ -2079739 -1119717 -290242 -688044 -1416901 -1559962 -1692087 -2294858 -2376591 -1071881 709141
8704G09141Q77473l6342k91478o14285j076253p43591K18696M27626j82472m4401
$$ 709141 1586614 1550272 1258794 644509 -431744 -1175335 -956639 -529013 -711485 -755886
8694g55886J094017J346563n7850j088176j09882J330041R79922n05165q14420
$$ -755886 338131 1684694 1626844 538668 428786 1758827 2738749 2233584 1419164
8685A419164K09502N37368o17786j686258j307671j00954O78674P77825O09465
$$ 1419164 1628666 2166034 1548248 -138010 -1445681 -1546635 -867961 -90136 519329
8676E19329M12505L40524M96074M36475m44440j620768j581018K9196J419114
$$ 519329 931834 1272358 1768432 2204907 1760467 139699 -1441319 -1412123 6991
8667F991Q66754p92011j206759K08057J452362P54430r75190j408182P1625J608156
$$ 6991 873745 81734 -1125025 -916968 535394 1289824 314634 -1093548 -1021923 586233
8657E86233J347466k48309j220335p52629K9546J3425k67903K19639J048164Q72631
$$ 586233 1933699 1685390 465055 -287574 -258028 -244603 -512506 -292867 755297 1627928
8647A627928k99829r38505l99962N1749n31127r86858J12491J848513J983954
$$ 1627928 1328099 389594 -10368 41381 -489746 -1476604 -1364113 484400 2468354
8638B468354K32934j264420r02345M46578R25426J2824j226111j492569m57090
$$ 2468354 2701288 1436868 534523 981101 1906527 1919351 693240 -799329 -1256419
8629a256419R20123J210509J34852r19243p03948R3101J3425p37663o89240K59724
$$ -1256419 -336296 874213 1009065 89822 -614126 -521025 -507600 -1245263 -1934503 -1674779
8619a674779O05753o7098k62984P60833J509259O83468o21882p10897R3164L29673
$$ -1674779 -1069026 -1136124 -1399108 -638275 870984 1554452 932570 221673 314837 644510
8609F44510j11466j52882M36893Q05932N01154j29817p26981j019467n87065L99040
$$ 644510 533044 380162 817055 1622987 2124141 1994324 1267343 247876 -339189 59851
8599E9851P69262r9168r33957k08433J333897J484374j78197j568397j045028
$$ 59851 829113 729945 -204012 -412445 921452 2405826 2227629 659232 -385796
8590c85796L89766O61176n81185j727228j413241j12301O85217M25358M1981M38721
$$ -385796 3970 665146 83961 -1643267 -3056508 -3168809 -2483592 -2058234 -2016253 -1577532
8580a577532J110112J000239K39895j23304N8655j10494p69457q94796j47203
$$ -1577532 -467420 532819 772714 649410 708065 597571 -171886 -1066682 -1213885
8571a213885M34681K56472J11950M59221L97407n20967j080434l80462M89325
$$ -1213885 -779204 -522732 -410782 48439 445846 -75121 -1155555 -1536017 -1046692
8562a046692K88030k95365q1716M57705L57832J49124O43962R49198m1147j221619
$$ -1046692 -758662 -1054027 -1135743 -678038 -320206 -171082 472880 1422078 1380931 159312
8552A59312q15502N04130O75847j90178j78647P72632O48215q88843j513067J9213
$$ 159312 -656190 -152060 523787 333609 154962 927594 1575809 686966 -826101 -806888
8542h06888J696280J217322p73578j893185j172739K87737J035288O91423M7113
$$ -806888 889392 2106714 1333136 -560049 -1732788 -1445051 -409763 281660 328773
8533C28773Q4372O35296L98003j046875k055850j072774Q21909J313208K57502
$$ 328773 413145 1048441 1446444 399569 -1656281 -2729055 -1907146 -593938 -336436
8524c36436m21356J9242L35537j12900l45405J06484K48021l77520p07734j26439
$$ -336436 -757792 -738550 -403013 -515913 -861318 -754834 -506813 -884333 -1592067 -1718506
8514a718506L70637O471l90828N1832P06358O14749N1813j89065j26425j93708
$$ -1718506 -1347869 -1341398 -1732226 -1680394 -974036 -359287 -307474 -496539 -622964 -816672
8504h16672k76629m6607L12335M07619K39726O0470K86J5042j28025o43833j100533
$$ -816672 -1093301 -1139908 -827573 -419954 -180228 -119758 -119472 -104430 -232455 -876288 -1976821
8493a976821n76627Q28240J485711L99732j033964r67219J17813N00728K30982
$$ -1976821 -2553448 -1725208 -239497 160235 -873729 -1840948 -1723135 -1222407 -991425
8484i91425O07543J240112N18034j049325j057271P11672J506445k9121j598776
$$ -991425 -383882 856230 1374264 324939 -732332 -20660 1485785 1456664 -142112
8475a42112r14535Q78666J311835J58820j011109j330602r26432O5150J206507
$$ -142112 -1056647 -177981 1133854 1292674 281565 -1049037 -1975469 -1910319 -703812
8466g03812J479409N99933k85981k06430L50756N55665M24443J08055o39945j445900
$$ -703812 775597 1375530 1089549 883119 1233875 1789540 2213983 2322038 1682093 236193
8456B36193j224594j6312O05823n0615n89150J19755J015472O82836l62549p60018
$$ 236193 -988401 -1004713 -398890 -449505 -1038655 -918900 96572 779408 416859 -343159
8446c43159m33575j26166R7693M22061L58997l10913n97881K84525J373236J197338
$$ -343159 -776734 -902900 -805207 -383146 -24149 -335062 -932943 -648418 724818 1922156
8436A922156q3434j024395q50066k6375O18428N21819l25360j120247r29126M792
$$ 1922156 1838722 814327 -35739 -62114 556314 1078133 752773 -367474 -1296600 -1291808
8426a291808N30254L70957L65280O84235M73857k30518j36127R26885J221957
$$ -1291808 -761554 -390597 -25317 658918 1132775 902257 766130 1693015 2914972
8417B914972j36102j521984j286148j51738L80521L54881M52828L36270l38770
$$ 2914972 2778870 1256886 -29262 -181000 199521 554402 1007230 1343500 1004730
8408A004730o67986m2621L97404l25330j006821j50203J346428J552250N62348
$$ 1004730 336744 294123 691527 366197 -640624 -790827 555601 2107851 2670199
8399B670199m6888o5674o27463j710787j901892p21224O32062J059480O80073
$$ 2670199 2623311 2557637 1930174 219387 -1682505 -2403729 -1771667 -712187 -32114
8390c2114O8801m26168n36095j95227J79725J75534p9991l02029m22203k09297
$$ -32114 36687 -389481 -925576 -1120803 -941078 -765544 -845535 -1147564 -1569767 -1779064
8380a779064O10537J427568J087120k72754j032513m37139L27209K28820n7499
$$ -1779064 -1168527 259041 1346161 1073407 40894 -396245 -69036 159784 102285
8371A02285K58901O01951L60955Q6555J14489k89225j139844j050865K05488O67770
$$ 102285 361186 963137 1324092 1410647 1525136 1235911 96067 -954798 -749310 -81540
8361h1540m86159j006488O82304K237018R21877j703691k141102m30292N18796
$$ -81540 -567699 -1574187 -891883 1345135 2267012 563321 -1577781 -2008073 -1489277
8352a489277J4660N263Q46557O86597o47487r07977N97879J584914M97280j150687
$$ -1489277 -1474617 -1469354 -622797 63800 -583687 -1491664 -893785 691129 1188409 37722
8342C7722j423412o21090O136K66688M92126M92244J13483k44055k95300j19137
$$ 37722 -1385690 -2006780 -2000644 -1733956 -1241830 -749586 -636103 -880158 -1175458 -1294595
8332a294595L82392J153998J296714J38063j239738j199745p2661L59590k40550
$$ -1294595 -912203 241795 1538509 1676572 436834 -762911 -835572 -475982 -716532
8323g16532m34338L45428R20694N10801j77223m56300n20335m11464K02596Q94730
$$ -716532 -1150870 -805442 115252 626053 448830 -7470 -527805 -939269 -736673 158057
8313A58057P55348K9676j74652J05602j70421q31484n46192O22928R80330Q5106
$$ 158057 913405 943081 768429 874031 703610 -127874 -674066 -51138 929192 1014298
8303A014298l88199M65138J204629M99419p61983j116212o62148k64763k5635
$$ 1014298 626099 1091237 2295866 2795285 2033302 917090 254942 -9821 -35456
8294c5456K05984L0714o04789q03342j04469N43290K36779m26104l94637J96173
$$ -35456 170528 201242 -403547 -1206889 -1311358 -768068 -531289 -957393 -1352030 -1155857
8284a155857N00585L87150L53848M65098K73589l62728r49913q27366J15999J053550
$$ -1155857 -655272 -268122 85726 550824 824413 461685 -488228 -1315594 -1199595 -146045
8274a46045Q65235l82434j141371l58701Q94746R25169q2967n69373j17049L06112
$$ -146045 719190 336756 -804615 -1163316 -268570 656599 573632 4259 -112790 193322
8264A93322L57787O21789R28320M20505n11931m66655M31910M16089q79752j510693
$$ 193322 551109 1172898 2101218 2521723 2009792 1543137 1975047 2391136 1511384 691
8254F91l49344J011948Q00315l69806r43439p98470n82068r5547R41099J608162
$$ 691 -348653 663295 1463610 1093804 150365 -648105 -1230173 -1325720 -384621 1223541
8244A223541R65410k87803q47325p67270r00050j042329k83828J097455J661623
$$ 1223541 2188951 1901148 1053823 286553 -613497 -1655826 -1939654 -842199 819424
8235H19424Q28131l51223p02591l17835r0040m27072q04503m72592N44565J310374
$$ 819424 1647555 1296332 593741 275906 185866 -241206 -1045709 -1518301 -973736 336638
8225C36638J024481K0318o87792o55983k40317K13973O38883Q01988M60502l7780
$$ 336638 1361119 1381437 693645 37662 -202655 11318 650201 1452189 1912691 1874911
8215A874911j29808M4215j9271j05322L16748P19835j5201j561980k101708q84469
$$ 1874911 1745103 1789318 1770047 1664725 1981473 2701308 2686107 1124127 -977581 -1862050
8205a862050N38655M73600o38980j067964j48323J130447J492304O85374l82123
$$ -1862050 -1323395 -849795 -1488775 -2556739 -2705062 -1574615 -82311 603063 220940
8196B20940n80978J44954N97400q0908j069458j029744j38145L45501K45414N83416
$$ 220940 -360038 -215084 382316 301408 -768050 -1797794 -1935939 -1590438 -1345024 -761608
8186g61608J490728J750205Q25043k91289q24574j235981j751262j443986J26168
$$ -761608 729120 2479325 3304368 3013079 2188505 952524 -798738 -2242724 -2116556
8177b116556J593223J319386n04948k215254k500585j232519P95256K300060K315059
$$ -2116556 -523333 796053 291105 -1924149 -4424734 -5657253 -4861997 -2561937 -246878
8168b46878J111804j39081p52892q75245n66473K82474J064685Q79589J02990
$$ -246878 864926 725845 -27047 -902292 -1468765 -1186291 -121606 757983 860973
8159H60973P4051Q47651Q93089l36999j256071n75062O62245P64042j39941p24943
$$ 860973 935024 1782675 2675764 2338765 1082694 507632 1169877 1933919 1793978 1069035
8149A069035o24411n03067n51968k52878N42720J266687J325402O14809m67271
$$ 1069035 444624 -58443 -610411 -863289 -320569 946118 2271520 2886329 2419058
8140B419058j218861j157007n11970J32203N55339P24308L18869o07653r54452
$$ 2419058 1200197 43190 -468780 -336577 218762 943070 1261939 654286 -300166
8131c00166P8926J313490R29590o90298j392775n61580J98051J9189N294P07523
$$ -300166 -221240 1092250 2021840 1331542 -61233 -622813 -424762 -405573 -400279 307244
8121C07244Q04115m10115j406291q64146J86531L53342K36143R11482J613780
$$ 307244 1111359 701244 -705047 -1569193 -1382662 -1029320 -793177 118305 1732085
8112A732085J013307l43085r06543n85432m43668o50280n41119j99534k85256
$$ 1732085 2745392 2402307 1495764 910332 466664 -183616 -724735 -924269 -1209525
8103a209525o28043m50486K69744Q42213R31475O26127l0063p02017o70107O3235
$$ -1209525 -1837568 -2288054 -2018310 -1176097 -244622 381505 351442 -350575 -1020682 -957447
8093i57447M44016M402k77761K44638N80996j05834p53135j01776J034644J056566
$$ -957447 -513431 -509029 -786790 -542152 38844 -66990 -820125 -921901 112743 1169309
8083A169309J49352l77501m58196q73867j165987k50919J173249J156201m31393
$$ 1169309 1318661 941160 482964 -390903 -1556890 -1807809 -634560 521641 90248
8074I0248j464190o31106Q75843J322268N59636m48821r77729p67736R6753R31409
$$ 90248 -1373942 -2005048 -1129205 193063 752699 303878 -673851 -1441587 -1344834 -413425
8064d13425Q22675k55228j235036j167449j88799Q57131J316202J124521O41338
$$ -413425 409250 154022 -1081014 -2248463 -2437262 -1580131 -263929 860592 1501930
8055A501930J88092k58861p16442p12594J37855J093667Q92852l12310q66195
$$ 1501930 1690022 1431161 714719 2125 139980 1233647 2126499 1814189 947994
8046I47994m5274P46142J47020j061539j270800m21211L12716M32635L54117L14910
$$ 947994 902720 1648862 1795882 734343 -536457 -957668 -644952 -212317 141800 456710
8036D56710K64611L55639N39585K71101m97119q31730k63987K58418p8356n40829
$$ 456710 721321 1076960 1616545 1887646 1390527 558797 294810 553228 474872 -65957
8026f5957k10805L74340L47054J51229M98064P57740R0255q01213p88053k36455
$$ -65957 -276762 97578 444632 595861 1093925 1851665 1941920 1140707 352654 116199
8016A16199p4087j0522M29411L13167j025804j900611m84947J802946K006176
$$ 116199 42112 31590 461001 774168 -251636 -2152247 -2637194 -834248 1171928
8007A171928J11356j176409p84260k38658l05813O8074J031382J176456L36689
$$ 1171928 1283284 106875 -677385 -916043 -1221856 -1153782 -122400 1054056 1390745
7998A390745R6305O98838L99374j108338j652674l20883P27641r3979j124941
$$ 1390745 1487050 2185888 2585262 1476924 -175750 -496633 231008 137029 -987912
7989i87912m94729O77543N06726l50844j79712O71386P21473J26526M6555K76698
$$ -987912 -1482641 -805098 -298372 -649216 -828928 -157542 563931 690457 737012 1013710
7979A013710j20540o74166l02297M58471K83138m71623l95444L32652K54064o58698
$$ 1013710 893170 219004 -83293 375178 658316 186693 -208751 123901 377965 -280733
7969b80733r49494l41969j17134n57757l45857Q39548J312676L4630j524394j457102
$$ -280733 -1230227 -1572196 -1689330 -2247087 -2592944 -1753396 -440720 -406090 -1930484 -3387586
7959c387586l165J187684J308549P14649j23600p70491n79327N22029J410157
$$ -3387586 -3390751 -2203067 -894518 -179869 -303469 -1073960 -1653287 -1131258 278899
7950B78899R75895l23501j036505o02163K08542N48288L15594k08127p17861q34494
$$ 278899 1254794 931293 -105212 -707375 -498833 49455 365049 156922 -560939 -1395433
7940a395433l87223K10630M53156M95553P18225P57931Q087r52728p55851N67874
$$ -1395433 -1782656 -1572026 -1118870 -623317 94908 852839 860926 -91802 -847653 -279779
7930b79779J205791J94773r16347l57716J010473R57323n77342j301420p1658
$$ -279779 926012 1120785 204438 -153278 857195 1814518 1237176 -64244 -135902
7921a35902J434874J301599l8849r18286q70167o19971m85927j91979J45436J20617
$$ -135902 1298972 2600571 2561722 1643436 773269 153298 -332629 -524608 -379172 -258555
7911b58555l2384K69592P77749N93134l18564q10904j94756O15160K94313r76878
$$ -258555 -290939 -21347 756402 1349536 1030972 220068 25312 640472 934785 -42093
7901d2093j606992o53669R08003J446793P69599J38476K40176K39367n57863j172697
$$ -42093 -1649085 -2302754 -1394751 52042 821641 960117 1200293 1439660 881797 -290900
7891b90900l48208J159757J319074k12127j509316j141922L3244N06533J42372
$$ -290900 -639108 520649 1839723 1627596 118280 -1023642 -990398 -483865 -341493
7882c41493l25582o12296o62468j39433Q01097J138004M54367j17895M25235J230594
$$ -341493 -667075 -1279371 -1941839 -2081272 -1280175 -142171 312196 194301 619536 1850130
7872A850130Q71954m03491j198787j149358r87571q17370n3689R50969R23154
$$ 1850130 2722084 2318593 1119806 -29552 -1017123 -1834493 -1888182 -937213 -14059
7863a4059l18024j279026p98176M48952J055489O58778p580k62718j06024L7614
$$ -14059 -332083 -1611109 -2409285 -1960333 -904844 -246066 -253646 -516364 -622388 -584774
7853e84774j48472n05051n26028J7821P26977J037973Q04301K12990m99599r68548
$$ -584774 -733246 -1238297 -1764325 -1746504 -1019527 18446 822747 1035737 536138 -432410
7843d32410q02899j42626L41808L30182J57163m6671o45086j418523j247657K36291
$$ -432410 -1235309 -1377935 -1036127 -705945 -548782 -595453 -1240539 -2659062 -3906719 -3670428
7833c670428J635752J542133N05443M486J72158J3955n96508p51210k01585K95228
$$ -3670428 -2034676 -492543 12900 17386 189544 203499 -393009 -1144219 -1345804 -1050576
7823a050576M19169O95781J195608J077491o4060j316386j482972m87899O22889
$$ -1050576 -631407 64374 1259982 2337473 2273413 957027 -525945 -1013844 -390955
7814c90955Q12548P1089n68364k04951O88339P65967k58689j077967o93744J61354
$$ -390955 421593 492682 -75682 -280633 407706 1173673 914984 -162983 -856727 -695373
7804f95373L40079L5060J24057N95431Q39660Q24273P66383K95277p99075j618332
$$ -695373 -355294 -320234 -196177 399254 1238914 2063187 2829570 3124847 2325772 707440
7794G07440j274586l82448j33541m79650n52737k24684J40602P30928J556240
$$ 707440 -567146 -949594 -1083135 -1562785 -2115522 -2340206 -2199604 -1468676 87564
7785H7564J534712R3155j171991n30241R10626O83913j037214j624952k10766
$$ 87564 1622276 1715431 543440 13199 923825 1607738 570524 -1054428 -1265194
7776a265194J059062N72404m85526m42526L86206P54317M42726L6384j29193j0373
$$ -1265194 -206132 366272 -119254 -561780 -175574 578743 1021469 1057853 928660 918287
7766I18287K52896J51838n26874r12460j70809Q49457O92679k79319m78370J32618
$$ 918287 1171183 1323021 796147 -116313 -287122 562335 1255014 975695 497325 629943
7756F29943J44901m68845k52390P37154O70259o44654j036414K49032J021518
$$ 629943 774844 305999 53609 790763 1461022 816368 -220046 28986 1050504
7747A050504k7325q71581L44382J928171J368736n85823j379968o93468k18008
$$ 1050504 1023179 151598 495980 2424151 3792887 3207064 1827096 1133628 915620
7738I15620m17853k82144K37452J10999o04349p02825L9928N77554M88410M21903
$$ 915620 497767 215623 453075 564074 -40275 -743100 -703172 -125618 362792 784695
7728G84695N33865J27145q28354j244787m81264O89193J146469P19607O4344k26815
$$ 784695 1318560 1445705 617351 -627436 -1108700 -419507 726962 1446569 1510913 1284098
7718A284098j15692J5401j16310k91151j15729K95229M48037K48634j1378l71294
$$ 1284098 1168406 1183807 1067497 776346 660617 955846 1403883 1652517 1641139 1269845
7708A269845r78445j213346l11888R96078R94317m28668j324227n42157O41040
$$ 1269845 291400 -921946 -1233834 -237756 756561 327893 -996334 -1538491 -897451
7699h97451P71793M00679O22790R69455M69379l73052m54683k1641L874j50051
$$ -897451 -125658 275021 897811 1867266 2336645 1963593 1508910 1487269 1491143 1341092
7689A341092K49350O23986j61467j573591j819415m67739R67309J178477M21581
$$ 1341092 1590442 2214428 2052961 479370 -1340045 -1807784 -840475 338002 759583
7680G59583l75916o20718r9699Q35692J114282Q3925j230802j180688J89975J128403
$$ 759583 383667 -237051 -336750 498942 1613224 1697149 466347 -714341 -524366 604037
7670F04037O51685k25760j95013N20856P66272J54080o27577r10188p80333o67099
$$ 604037 1255722 1029962 834949 1355805 2122077 2276157 1648580 738392 -41941 -709040
$$ [...]
##END NTUPLES=NMR SPECTRUM
##END=
