##TITLE=31Pdec_11P153_k5D2O
  aceton-d6
  24 sc
 27.9.2023
##JCAMPDX= 6.0         $$ Bruker NMR JCAMP-DX V2.0
##DATA TYPE= NMR SPECTRUM
##DATA CLASS= NTUPLES
##ORIGIN= UXNMR, Bruker Analytische Messtechnik GmbH
##OWNER= root
$$ XWIN-NMR		Version 3.5
$$ Wed Sep 27 16:41:11 2023 Russian Standard Time (UT+4h)  she@DPX200
##.OBSERVE FREQUENCY= 81.013821
##.OBSERVE NUCLEUS= ^31P
##.ACQUISITION MODE= SIMULTANEOUS
##.ACQUISITION SCHEME= undefined
##.AVERAGES= 24
##.DIGITISER RES= 16
##SPECTROMETER/DATA SYSTEM= spect
##.PULSE SEQUENCE= zgpg30
##.SOLVENT NAME= Acetone
##.SHIFT REFERENCE= (INTERNAL, Acetone, 0, 248.564)
##AUDIT TRAIL= $$ (NUMBER, WHEN, WHO, WHERE, WHAT)
$$ ##TITLE= Audit trail, XWIN-NMR		Version 3.5
$$ ##JCAMPDX= 5.01
$$ ##ORIGIN= Bruker BioSpin GmbH
$$ ##OWNER= she
$$ F:/spectra/data/she/nmr/P31/1/pdata/1/auditp.txt
$$ ##AUDIT TRAIL=  $$ (NUMBER, WHEN, WHO, WHERE, WHAT)
(   1,<2023-09-27 16:39:53.21 +0400>,<she>,<DPX200>,
      <created by zg, POWCHK disabled, PULCHK disabled
       configuration hash MD5:
       00 E9 B6 7A A2 85 ED C7 34 08 36 98 17 FE 4E 26
       data hash MD5: 32K
       2A 12 31 08 49 AD A9 46 40 61 39 36 08 6B CA 24>)
(   2,<2023-09-27 16:39:57.31 +0400>,<she>,<DPX200>,
      <Start of raw data processing
       efp BC_mod = 2 LB = 5 FT_mod = 6 PKNL = 1 PHC0 = -10633.54 PHC1 = 25.68629 SI = 64K 
       data hash MD5: 64K
       74 68 E0 8F E5 C9 B9 23 E3 A3 C9 46 15 FC FB BE>)
(   3,<2023-09-27 16:40:17.70 +0400>,<she>,<DPX200>,
      <pk PHC0 = -114.8917 PHC1 = 243.0001 
       data hash MD5: 64K
       D7 1B 54 7E 9D 0D 48 79 84 86 99 81 C4 66 8C EA>)
(   4,<2023-09-27 16:40:35.43 +0400>,<she>,<DPX200>,
      <pk PHC0 = 4.799993 PHC1 = 0 
       data hash MD5: 64K
       29 75 3D 0C F6 79 14 CA 59 BD B7 84 91 B6 97 82>)
$$ ##END=
$$ 
$$ hash MD5
$$ FA 42 29 40 5F 5D 81 6C B0 42 63 B6 D6 A8 BD 17
##$RELAX= 
##$RELAX= 
##$RELAX= 
##$RELAX= 
##$RELAX= 
##$RELAX= 
##$RELAX= 
##$RELAX= 
##$RELAX= 
$$ Bruker specific parameters
$$ --------------------------
##$DU= <F:/spectra>
##$EXPNO= 1
##$NAME= <P31>
##$PROCNO= 1
##$TYPE= <nmr>
##$USER= <she>
##$AMP= (0..31)
100 100 100 100 100 100 100 100 100 100 100 100 100 100 100 100 100 100 
100 100 100 100 100 100 100 100 100 100 100 100 100 100 
##$AQSEQ= 0
##$AQ_mod= 1
##$AUNM= <au_zg>
##$AUTOPOS= <>
##$BF1= 81.014009
##$BF2= 200.13
##$BF3= 200.13
##$BF4= 200.13
##$BF5= 200.13
##$BF6= 200.13
##$BF7= 200.13
##$BF8= 200.13
##$BYTORDA= 1
##$CFDGTYP= 0
##$CFRGTYP= 5
##$CHEMSTR= <none>
##$CNST= (0..31)
1 1 145 1 1 1 1 1 1 1 1 1 1 1 1 1 1 1 1 1 1 1 1 1 1 1 1 1 1 1 1 1 
##$CPDPRG= <waltz16>
##$CPDPRG1= <>
##$CPDPRG2= <waltz16>
##$CPDPRG3= <>
##$CPDPRG4= <mlev>
##$CPDPRG5= <mlev>
##$CPDPRG6= <mlev>
##$CPDPRG7= <mlev>
##$CPDPRG8= <mlev>
##$CPDPRGB= <>
##$CPDPRGT= <>
##$D= (0..31)
0 1 0 0 0 0 0 0 0 0 0 0.03 2e-05 3e-06 0 0 0 0 0 0 0 0 0 0 0 0 0 0 0 0 
0 0 
##$DATE= 1695818392
##$DBL= (0..7)
120 120 120 11 120 120 24 19 
##$DBP= (0..7)
150 150 150 150 150 150 150 150 
##$DBP07= 0
$$ [...]
##$SUBNAM2= <"">
##$SUBNAM3= <"">
##$SUBNAM4= <"">
##$SUBNAM5= <"">
##$SUBNAM6= <"">
##$SUBNAM7= <"">
##$SUBNAM8= <"">
##$SUBNAM9= <"">
##$SW= 501.771253377433
##$SWIBOX= (0..15)
0 1 3 0 0 0 0 0 0 0 0 0 0 0 0 0 
##$SW_h= 40650.406504065
##$TD= 32768
##$TD0= 1
##$TE= 0
##$TE2= 300
##$TE3= 300
##$TEG= 300
##$TL= (0..7)
0 120 53 12 22 120 120 120 
##$TP= (0..7)
150 150 150 150 150 150 150 150 
##$TP07= 0
##$TPNAME0= <>
##$TPNAME1= <>
##$TPNAME2= <>
##$TPNAME3= <>
##$TPNAME4= <>
##$TPNAME5= <>
##$TPNAME6= <>
##$TPNAME7= <>
##$TPOAL= (0..7)
0.5 0.5 0.5 0.5 0.5 0.5 0.5 0.5 
##$TPOFFS= (0..7)
0 0 0 0 0 0 0 0 
##$TUNHIN= 0
##$TUNHOUT= 0
##$TUNXOUT= 0
##$USERA1= <user>
##$USERA2= <user>
##$USERA3= <user>
##$USERA4= <user>
##$USERA5= <user>
##$V9= 5
##$VALIST= <valist>
##$VCLIST= <CCCCCCCCCCCCCCC>
##$VD= 0
##$VDLIST= <DDDDDDDDDDDDDDD>
##$VPLIST= <PPPPPPPPPPPPPPP>
##$VTLIST= <TTTTTTTTTTTTTTT>
##$WBST= 1024
##$WBSW= 4
##$XGAIN= (0..3)
0 0 0 0 
##$XL= 0
##$YL= 0
##$YMAX_a= 3634
##$YMIN_a= -3956
##$ZGOPTNS= <>
##$ZL1= 120
##$ZL2= 120
##$ZL3= 120
##$ZL4= 120
##$ABSF1= 0
##$ABSF2= 0
##$ABSG= 0
##$ABSL= 0
##$ALPHA= 0
##$AQORDER= 0
##$ASSFAC= 0
##$ASSFACI= 0
##$ASSFACX= 0
##$ASSWID= 0
##$AUNMP= <proc_1d>
##$AZFE= 0.1
##$AZFW= 0.5
##$BCFW= 0
##$BC_mod= 2
##$BYTORDP= 0
##$COROFFS= 0
##$CY= -3
##$DATMOD= 1
##$DC= 0
##$DFILT= <>
##$DTYPP= 0
##$F1P= 0
##$F2P= 0
##$FCOR= 1
##$FTSIZE= 65536
##$FT_mod= 6
##$GAMMA= 0
##$GB= 0
##$INTBC= 1
##$INTSCL= 6.047779e-11
##$ISEN= 30
##$LB= 5
##$LEV0= 0
##$LPBIN= 0
##$MAXI= 10000
##$MC2= 0
##$MEAN= 0
##$ME_mod= 0
##$MI= 50
##$NCOEF= 0
##$NC_proc= -9
##$NLEV= 6
##$NOISF1= 182.463
##$NOISF2= 159.3651
##$NSP= 0
##$NTH_PI= 0
##$NZP= 0
##$OFFSET= 248.5645
##$PC= 4
##$PHC0= -10743.63
##$PHC1= 268.6864
##$PH_mod= 1
##$PKNL= yes
##$PPARMOD= 0
##$PSCAL= 0
##$PSIGN= 0
##$REVERSE= no
##$SF= 81.0140089999694
##$SI= 65536
##$SIGF1= 159.3651
##$SIGF2= -187.1042
##$SINO= 113.3802
##$SIOLD= 16384
##$SREGLST= <1H.CDCl3>
##$SSB= 0
##$STSI= 65536
##$STSR= 0
##$SW_p= 40650.406504065
##$SYMM= 0
##$S_DEV= 0
##$TDeff= 32768
##$TDoff= 0
##$TI= <>
##$TILT= no
##$TM1= 0
##$TM2= 0
##$TOPLEV= 0
##$USERP1= <user>
##$USERP2= <user>
##$USERP3= <user>
##$USERP4= <user>
##$USERP5= <user>
##$WDW= 1
##$XDIM= 65536
##$YMAX_p= 312441127
##$YMIN_p= -90830630
$$ End of Bruker specific parameters
$$ ---------------------------------
##NTUPLES= NMR SPECTRUM
##VAR_NAME=  FREQUENCY,     SPECTRUM/REAL,   SPECTRUM/IMAG
##SYMBOL=    X,             R,               I
##VAR_TYPE=  INDEPENDENT,   DEPENDENT,       DEPENDENT
##VAR_FORM=  AFFN,          ASDF,            ASDF
##VAR_DIM=   65536,         65536,           65536
##UNITS=     HZ,            ARBITRARY UNITS, ARBITRARY UNITS
##FACTOR=    0.620285442955139, 1,           1
##FIRST=     20137.2065510682, 0,            0
##LAST=      -20513.1999529968, 0,           0
##MIN=       -20513.1999529968, -90830630,   0
##MAX=       20137.2065510682, 312441127,    0
$$ Real data points
##PAGE= N=1
##DATA TABLE= (X++(R..R)), XYDATA
$$ [...]
42275B676826p59516r78460j007469r05783p28398n56927m44522k94937N6835
$$ 2676826 1917310 938850 -68619 -974402 -1702800 -2259727 -2704249 -2999186 -2942351
42266b942351N80047R98986J086541Q82601N38021R1064m48784q98566r86570
$$ -2942351 -2362304 -1363318 -276777 605824 1143845 1234909 786125 -112441 -1099011
42257a099011o51444j29529K83309M80992N56532O43910P79444Q82323Q55842
$$ -1099011 -1750455 -1879984 -1596675 -1115683 -559151 84759 864203 1746526 2602368
42248B602368P04899N15796L14340L0401l37337o09592n97177l53406j48375j97483
$$ 2602368 3307267 3823063 4137403 4167804 3830467 3220875 2623698 2270292 2121917 1924434
42238A924434n03426r42928j373119j614944j466479q60990M746P76078J191967
$$ 1924434 1421008 478080 -895039 -2509983 -3976462 -4837452 -4832706 -4056628 -2864661
42229b864661J222596J003671P09314M94329M65444N99027O78698M17999k62994
$$ -2864661 -1642065 -638394 70920 565249 1030693 1629720 2308418 2726417 2463423
42220B463423j105175j720056j914044j748070j337989p44425o8667N16640R34550
$$ 2463423 1358248 -361808 -2275852 -4023922 -5361911 -6106336 -6175003 -5658363 -4723813
42211d723813J289689J673475J961158J917609J455783P00833j33236q27482j208033
$$ -4723813 -3434124 -1760649 200509 2118118 3573901 4274734 4141498 3314016 2105983
42202B105983j276794j260942j376175j545923j494243j103327n19655Q8910O77324
$$ 2105983 829189 -431753 -1807928 -3353851 -4848094 -5951421 -6471076 -6382166 -5704842
42193e704842J165778J345734J098548N99677J63887n5304j13920j04571o7711
$$ -5704842 -4539064 -3193330 -2094782 -1495105 -1331218 -1386522 -1500442 -1605013 -1672724
42184a672724m1804p4087j62048k53109l07669l15262k62611j40647K0594J62481
$$ -1672724 -1714528 -1788615 -1950663 -2203772 -2511441 -2826703 -3089314 -3229961 -3209367 -3046886
42174c046886K34298J98710M1800j73203k93454j84690J38078N12310P52617P65875
$$ -3046886 -2812588 -2613878 -2572078 -2745281 -3038735 -3223425 -3085347 -2573037 -1820420 -1054545
42164a054545N84651L26240R7831q4882k64541m25729m76297l81000k46614k09008
$$ -1054545 -469894 -143654 -45823 -130705 -395246 -820975 -1297272 -1678272 -1924886 -2133894
42154b133894k81746l79926m42395m44027l24158j4707M43960Q90755J172510
$$ -2133894 -2415640 -2795566 -3237961 -3681988 -4006146 -4020853 -3576893 -2686138 -1513628
42145a513628J251057J199826J148017J196526J297493J225453P81345O4469n50352
$$ -1513628 -262571 937255 2085272 3281798 4579291 5804744 6586089 6650558 6100206
42136F100206p67934o43860m51405l54146l02917k14179j22735j11457j58081
$$ 6100206 5332272 4688412 4237007 3882861 3579944 3365765 3243030 3131573 2973492
42127B973492j21421J21614N51323J005404J268610J165891O33530k23738j136503
$$ 2973492 2852071 2973685 3525008 4530412 5799022 6964913 7598443 7374705 6238202
42118F238202j798589k053604j954852j630354j131931m60996L02777R90292J468015
$$ 6238202 4439613 2386009 431157 -1199197 -2331128 -2792124 -2489347 -1499055 -31040
42109c1040J701369J681785J384599Q64217L26530M925m8040J851n2112k65370
$$ -31040 1670329 3352114 4736713 5600930 5927460 5932385 5884345 5886196 5834084 5568714
42099E568714n05398n62944l18048J39348N40031O37875M11108M1179l03196o03712
$$ 5568714 5063316 4500372 4182324 4321672 4861703 5499578 5910686 5951865 5648669 5044957
42089E044957q99470j136604j189389j009510o88804l74321j64034o8965j1859
$$ 5044957 4145487 3008883 1819494 809984 121180 -253141 -417175 -486140 -497999
42080d97999J40463M72163R10605J263458J386186J277338J006270O24063J91376
$$ -497999 -357536 114627 1025232 2288690 3674876 4952214 5958484 6582547 6773923
42071F773923j75425l71566m00695l48500k77130j90017o5815J35427M62096Q74191
$$ 6773923 6598498 6226932 5826237 5477737 5200607 5010590 4944775 5080202 5542298 6416489
42061F416489J168217J106868O61128N2788m74710q59721j164416j397833j482603
$$ 6416489 7584706 8691574 9352702 9405490 8930780 8071059 6906643 5508810 4026207
42052D026207j372572j127459q50515n83935k95529J6053K15004Q9433m19176
$$ 4026207 2653635 1526176 675661 91726 -203803 -187750 27254 116687 -302489
42043c02489j073152j500880j501880j134115n42925J53697P87592J123272J057990
$$ -302489 -1375641 -2876521 -4378401 -5512516 -6055441 -5901744 -5114152 -3990880 -2932890
42034b932890P67772N31743M43558L90005K69034J05565m2939j77601l19033m50478
$$ -2932890 -2165118 -1633375 -1189817 -799812 -530778 -425213 -468152 -645753 -964786 -1415264
42024a415264n32229n28845m13742j91851Q2784L56038O22842Q64105R57720P59516
$$ -1415264 -1947493 -2476338 -2890080 -3081931 -2999147 -2643109 -2020267 -1156162 -198442 561074
42014E61074L06131j48230l57386l00385j32426K5003J70723L15204L66136J83431
$$ 561074 867205 718975 361589 61204 -71222 -46219 124504 439708 805844 989275
42004I89275k43423p08359r36360q46896o35944n54662o33202o74802m97180j05886
$$ 989275 745852 37493 -898867 -1745763 -2381707 -2936369 -3569571 -4244373 -4741553 -4847439
41994d847439L64568P91191J109276J285300J297280J123444P42139J86808l93167
$$ -4847439 -4482871 -3691680 -2582404 -1297104 176 1123620 1865759 2052567 1659400
41985A659400p98497r49622r41274q93596q15124o76467n55219n88513p65991
$$ 1659400 860903 -88719 -1029993 -1923589 -2738713 -3415180 -3970399 -4558912 -5324903
41976e324903q56831o02893K4878P71946J284400J357302J053394O21171L00375
$$ -5324903 -6181734 -6784627 -6759749 -5987803 -4703403 -3346101 -2292707 -1671536 -1371161
41967a371161J85905K41071L85864N41386O28854N97460M70666L23439J94212
$$ -1371161 -1185256 -944185 -558321 -16935 611919 1209379 1680045 2003484 2197696
41958B197696N3147j23655k91106l88188m23798m49459m52163l43151q3906K24339
$$ 2197696 2250843 2127188 1836082 1447894 1024096 574637 122474 -220677 -304583 -80244
41948h0244M18669M14342K38193k6602k63161l26921j37834K09096N10235O71770
$$ -80244 338425 752767 990960 964358 701197 374276 236442 445538 955773 1627543
41938A627543P86070R33400R90142P48626K07784l64226o80458o73172m62978
$$ 1627543 2413613 3347013 4337155 5085781 5293565 4929339 4248881 3575709 3112731
41929C112731j81020J11284L82682O11533Q15088J025306J189587J143438P70377
$$ 3112731 2931711 3042995 3425677 4037210 4852298 5877604 7067191 8210629 8981006
41920H981006K11519j64338r5203K69826M79773K29137l52222q77573j102051
$$ 8981006 9192525 9028187 8932984 9202810 9682583 9911720 9559498 8681925 7579874
41911G579874j090042j048635j090932j162689j134165r41549o58415m24188k99496
$$ 7579874 6489832 5441197 4350265 3187576 2053411 1111862 453447 29259 -270237
41902b70237k33967j83837j69727j62722l1134K59934M73275L21521j27222m51788
$$ -270237 -504204 -688041 -857768 -1020490 -1051624 -791690 -318415 3106 -124116 -575904
41892e75904l48029O0235M59612P29250R31834J037559Q71629L59607l05627p94074
$$ -575904 -923933 -863698 -404086 325164 1256998 2294557 3166186 3525793 3220166 2426092
41882B426092q87807o03344j34056L08470O32134Q63491J024130J058700R04478
$$ 2426092 1538285 934941 800885 1109355 1741489 2604980 3629110 4687810 5592288
41873E592288N63119O2100n61832j150638j391927j073006l74132K36320M49406
$$ 5592288 6155407 6217507 5655675 4505037 3113110 2040104 1665972 1902292 2351698
41864B351698L66243K78852L24744M33732N17617N89515P09553Q88833J053427
$$ 2351698 2717941 2996793 3321537 3755269 4272886 4862401 5571954 6460787 7514214
41855G514214J074980Q61909M56938K1295l10312n35763p30285r41041j180576
$$ 7514214 8589194 9451103 9908041 9929336 9619024 9083261 8352976 7411935 6231359
41846F231359j458438j726513j821639j573821j001824l35579J77490M35485M57930
$$ 6231359 4772921 3046408 1224769 -349052 -1350876 -1686455 -1508965 -1073480 -615550
41837f15550L08553J05946K7528J89277N24281Q49361J053495J168832J264612
$$ -615550 -306997 -201051 -173523 15754 540035 1389396 2442891 3611723 4876335
41828D876335J337068J317135J132736P45075J72660m89084j095617j514559j646839
$$ 4876335 6213403 7530538 8663274 9408349 9581009 9091925 7996308 6481749 4834910
41819D834910j422590q59712j39996M62248P83076Q49757P34259M28471m7400
$$ 4834910 3412320 2552608 2412612 2874860 3657936 4507693 5241952 5670423 5623023
41810E623023n02668o95321n85831l48673j26573R3387L23282M40292L20918L2967
$$ 5623023 5120355 4425034 3839203 3490530 3363957 3457344 3780626 4220918 4541836 4574803
41800D574803k21216l25809l29847l34370m02944n80131q80838j202773j333012
$$ 4574803 4353587 4027778 3697931 3363561 2960617 2380486 1499648 296875 -1036137
41791a036137j148084q03483o34857q16623j151916j255114r35047l49762K04563
$$ -1036137 -2184221 -2987704 -3622561 -4439184 -5591100 -6846214 -7781261 -8131023 -7926460
41782g926460N64620P18215O60950L83320K497k25886j06755L24104Q54619J261887
$$ -7926460 -7361840 -6643625 -5982675 -5599355 -5596858 -5822744 -5929499 -5605395 -4750776 -3488889
41772c488889J402402J240691Q87303N65074M31526M21312L26111M2552l01351
$$ -3488889 -2086487 -845796 41507 606581 1038107 1459419 1785530 1828082 1526731
41763A526731m69272l31173L3400L96478N46262M44021K37897R4761K0415j11504
$$ 1526731 1057459 726286 759686 1156164 1702426 2146447 2384344 2479105 2499520 2388016
41753B388016l52677n69508n83093l78909j16694N8496J51331K38211L07075K41552
$$ 2388016 2035339 1465831 882738 503829 387135 445631 596962 835173 1142248 1383800
41743A383800l2427m35434p91760r56945q62044m91189J00656P55490J277712
$$ 1383800 1351373 915939 124179 -832766 -1694810 -2185999 -2085343 -1329853 -52141
41734e2141J555132J569105J302534P52622Q0083l83437m24458k21033j98675
$$ -52141 1502991 3072096 4374630 5127252 5207335 4823898 4399440 4178407 3979732
41725C979732n77203j134515j451677j332583r45171n99280m43515l73020j93294
$$ 3979732 3402529 2268014 816337 -516246 -1461417 -2060697 -2504212 -2877232 -3070526
41716c070526J53623N36541P94848R01609R27610Q80656O68167K49281k34175
$$ -3070526 -2916903 -2380362 -1585514 -683905 243705 1124361 1792528 2041809 1807634
41707A807634n38958n33696l11361r2414k4895p4328j03852n3514q957o8609j83764
$$ 1807634 1268676 734980 423619 331205 306310 231982 128130 74616 65659 -2950 -186714
41696a86714k09855j26589j17942l57966p53582r91162q61442m82605j66623j04264
$$ -186714 -396569 -523158 -641100 -999066 -1752648 -2743810 -3605252 -4087857 -4254480 -4358744
41686d358744k30135l70715m42962m76726n12465n61790o49422p92849r05685
$$ -4358744 -4588879 -4959594 -5402556 -5879282 -6391747 -6953537 -7602959 -8395808 -9301493
41677i301493q14309m60036l3499K09616K65982L92348P41001J103368J143477
$$ -9301493 -10115802 -10575838 -10609337 -10399721 -10133739 -9741391 -9000390 -7897022 -6753545
41668f753545Q35932N17503M78442O45084P53494P17215O63091O50742N62517
$$ -6753545 -5917613 -5400110 -4921668 -4276584 -3523090 -2805875 -2142784 -1492042 -929525
41659i29525L44580J93516L40462P07573R39856P94448L78961l0558k96444m70658
$$ -929525 -584945 -391429 -50967 656606 1596462 2390910 2769871 2739313 2442869 1972211
41649A972211o17038o86751n68285k06350L29547Q60539J186782J196191R11150
$$ 1972211 1355173 668422 100137 -106213 223334 1083873 2270655 3466846 4377996
41640D377996M53050j4187l35652m45459m30692m55568n73208o56817n64886l24243
$$ 4377996 4831046 4816859 4481207 4035748 3605056 3149488 2576280 1919463 1354577 1030334
41630A030334q0148R6186K56081M31398N39858M84554L05466J75569K31441M10793
$$ 1030334 950186 1046372 1302453 1733851 2273709 2758263 3063729 3239298 3470739 3881532
41620C881532M66834J75955m33324j056881j339077j134693n83039J3520L68011
$$ 3881532 4348366 4524321 4090997 3034116 1695039 560346 -22693 -9173 358838
41611C58838L50814M9944l10071n59563o93472p74590p89720o84644n09759m18264
$$ 358838 709652 759596 449525 -110038 -803510 -1578100 -2367820 -3052464 -3562223 -3980487
41601c980487m93567o55564p61225p18221m65131O2255Q41010J660421K201363
$$ -3980487 -4474054 -5129618 -5890843 -6609064 -7074195 -7011940 -6170930 -4510509 -2309146
41592b309146K255506J862975J257580P08211L85143L05588L65948M41416M80325
$$ -2309146 -53640 1809335 3066915 3775126 4160269 4465857 4831805 5273221 5753546
41583E753546N07625N42894N42558M47571K74494J17262M1567Q664o6860k06696
$$ 5753546 6261171 6804065 7346623 7794194 8068688 8185950 8227517 8236181 8169321 7962625
41573G962625l49868m18371l52410j08239K90302O82440Q41538O74112L04123
$$ 7962625 7612757 7194386 6841976 6733737 7024039 7706479 8548017 9222129 9526252
41564I526252p7445l92884o67291r07538j072597j137084j116937j039111r18976
$$ 9526252 9448807 9055923 8388632 7481094 6408497 5271413 4154476 3115365 2196389
41555B196389p40007m34092N5688O45492J110644J278564J160668Q41082L45934
$$ 2196389 1456382 1022290 1077978 1723470 2834114 4112678 5273346 6114428 6460362
41546F460362k63615p79062j011143j027195j036994j051617q50570l24780L25014
$$ 6460362 6196747 5417685 4406542 3379347 2342353 1290736 440166 115386 440400
41537D40400P96934R49377Q04693M66876J36380N3212K76246N90454P29260O17756
$$ 440400 1237334 2186711 2991404 3458280 3594660 3647872 3924118 4514572 5243832 5861588
41527E861588L39960j005k81172l48755j87916k2373j04285m38822q33235j144912
$$ 5861588 6201548 6200543 5919371 5570616 5382700 5360327 5256042 4817220 3983985 2839073
41517B839073j327916j297915r57208l79299J83381N12435N36707K44191l49574
$$ 2839073 1511157 213242 -743966 -1123265 -939884 -427449 109258 353449 3875
41508C875j081336j620252j678074j218062m51791K97739P40643P69830N44330
$$ 3875 -1077461 -2697713 -4375787 -5593849 -6045640 -5747901 -5007258 -4237428 -3693098
41499c693098L48676L10119L11269K11574O6936O8167L24792P63632J184676J375357
$$ -3693098 -3344422 -3034303 -2723034 -2511460 -2444524 -2376357 -2051565 -1287933 -103257 1272100
41489A272100J243513R01925N66183L13858O444m91216j086353j534160j676659
$$ 1272100 2515613 3417538 3983721 4297579 4304023 3812807 2726454 1192294 -484365
41480d84365j516114j118105n78826o9698K38488L53735M76331P75035J195875
$$ -484365 -2000479 -3118584 -3697410 -3767108 -3528620 -3174885 -2698554 -1923519 -727644
41471g27644J520603J560604J271579P51335J82075k70164n56598p25802p77863
$$ -727644 792959 2353563 3625142 4376477 4558552 4288388 3731790 3005988 2228125
41462B228125o02272j39499M31370P78204P27299M27486J64387O1636J9603q9713
$$ 2228125 1625853 1486354 1917724 2695928 3423227 3850713 4015100 4076736 4096339 4006626
41452D006626k57067l87830m48398m86763n15196m46289j97106J67265M51481
$$ 4006626 3749559 3361729 2913331 2426568 1911372 1465083 1267977 1435242 1886723
41443A886723N03578L34628N8133k28497m51650n05508l02946Q3644M15618N01466
$$ 1886723 2390301 2724929 2783062 2554565 2102915 1597407 1294461 1378105 1793723 2295189
41433B295189L95872L27502M37520O42764P56186O82442M71377K29495K9886j01549
$$ 2295189 2691061 3018563 3456083 4098847 4855033 5537475 6008852 6238347 6268233 6166684
41423F166684j53628j04434P1619L64914O91045R03672Q81006O27678K86691J7836
$$ 6166684 6013056 5908622 5980241 6345155 7036200 7939872 8820878 9448556 9735247 9753083
41413I753083j53746l38214n95859p88231p01534l35042K1625N9770k52283o86910
$$ 9753083 9599337 9261123 8665264 7877033 7175499 6840457 6862082 6921852 6669569 5982659
41403E982659r83970r71758n60700J94922J015972J541394J622636J381733R57643
$$ 5982659 4998689 4026931 3466231 3661153 4677125 6218519 7841155 9222888 10180531
41394A0180531L55542l65533r27383j055357q16976n65116n40656o65928p38323
$$ 10180531 10536073 10170540 9243157 8187800 7370824 6805708 6265052 5599124 4860801
41385D860801o84230n68786m67903m10961l89536l63537l03836k68321l75008
$$ 4860801 4176571 3607785 3139882 2728921 2339385 1975848 1672012 1403691 1028683
41376A028683o37149q66060q15381m30899P6882M13788M48179K99979K09538L08143
$$ 1028683 391534 -474526 -1289907 -1720806 -1643924 -1230136 -781957 -481978 -272440 35703
41366C5703N01246N79081M31931J33034j69190l74256m34367l21177o0789K30112
$$ 35703 536949 1116030 1547961 1680995 1511805 1137549 703182 382005 321216 551328
41356E51328M12235M31028L27980J73630L9108L053R9067K39536K65203J12749
$$ 551328 963563 1394591 1722571 1896201 1935309 1938362 2037429 2276965 2542168 2654917
41346B654917j14140k81581l89890n44784p86863j010908j062617q82826n57879
$$ 2654917 2540777 2259196 1869306 1324522 537659 -473249 -1535866 -2418692 -2976571
41337b976571k52538p3426M0359K58650O17546Q56162O23257r3616q41160j098571
$$ -2976571 -3229109 -3302535 -3262176 -3003526 -2385980 -1529818 -906561 -1000177 -1841337 -2939908
41327b939908p59381j50213L54733O22096P25444Q06963J008866J388195J803189
$$ -2939908 -3699289 -3849502 -3494769 -2872673 -2147229 -1340266 -331400 1056795 2859984
41318B859984J967613J704140J103528M00681k25690o89065r52538j057269j105909
$$ 2859984 4827597 6531737 7635265 8035946 7810256 7121191 6168653 5111384 4005475
41309D005475j094593q39415k33734M63342Q01417O51608L74785L80953O55646
$$ 4005475 2910882 2071467 1837733 2301075 3102492 3754100 4128885 4509838 5165484
41300E165484Q62973Q29336P34906Q05477R74714R65377O46983J93429j34804
$$ 5165484 6028457 6857793 7592699 8398176 9372890 10338267 10985250 11178679 11043875
41291A1043875k78830l88978n93879q54669j050690j117684j058472q94066o77591
$$ 11043875 10765045 10376067 9782188 8927519 7876829 6759145 5700673 4806607 4129016
41282D129016n09815m59008m80438m76138m18505l65995l88426n28943p80200
$$ 4129016 3619201 3160193 2679755 2203617 1785112 1419117 1030691 501748 -278452
41273b78452j006642r50948m66209K59518Q49379J126636J220335J262625J168228
$$ -278452 -1285094 -2236042 -2702251 -2442733 -1593354 -466718 753617 2016242 3184470
41264C184470Q22213L32800o6929k86100l89419m02233k74148l1452J91044L08506
$$ 3184470 4006683 4339483 4272554 3986454 3597035 3194802 2920654 2889202 3080246 3388752
41254C388752L63582M08971M12747L27878J74464P18j75531l41630m63537n27664
$$ 3388752 3752334 4161305 4574052 4901930 5076394 5077112 4901581 4559951 4096414 3568750
41244C568750n53544n19276l39281O202L59330N01699L98288K53034K82948M78697
$$ 3568750 3015206 2495930 2156649 2162851 2522181 3023880 3422168 3675202 3958150 4436847
41234D436847O32393N76404L35486L8063k51215n44702q11173r46112r05083p90415
$$ 4436847 5069240 5645644 5981130 6019193 5767978 5223276 4412103 3465991 2560908 1770493
41224A770493p24034o73192n01458j94919O1662Q3807r6759k68509k58759p1983
$$ 1770493 1046459 373267 -128191 -323110 -261448 -177641 -274400 -542909 -801668 -873651
41214h73651J62178L28341M13983M84218N68075N76987L82451j536l63077m70142
$$ -873651 -711473 -383132 30851 515069 1083144 1660131 2042582 2041046 1677969 1207827
41204A207827k79687O6231M05857O48994P37263O20141L01574j49069o46063j081834
$$ 1207827 928140 994371 1400228 2049222 2786485 3406626 3708200 3559131 2913068 1831234
41194A831234j270696j023672l79631K99040N85534L66880q4189l96583l91725
$$ 1831234 560538 -463134 -842765 -543725 41809 408689 324500 -72083 -463808
41185d63808j17275K69705N77962O32708L88763J1292k41429k64438j97418k34635
$$ -463808 -581083 -311378 266584 899292 1288055 1299347 1057918 793480 596062 361427
41175C61427l87140n01513m96681m77877n58443o49618n45954k07224J69537L97416
$$ 361427 -25713 -527226 -1023907 -1501784 -2060227 -2709845 -3255799 -3463023 -3293486 -2896070
41165b896070N01033N88675O34762N44550L92523M11017O86461J001120J067959
$$ -2896070 -2395037 -1806362 -1171600 -627050 -234527 176490 862951 1864071 2932030
41156B932030Q41421N09033K41685N7804r2231k12457k54941j71275M6824L46584
$$ 2932030 3773451 4282484 4524169 4581973 4489742 4277285 4022344 3851069 3897893 4244477
41146D244477O28763Q03112Q22478O57636K90591k16608o89407r67388j077048
$$ 4244477 4873240 5676352 6498830 7156466 7447057 7230449 6541042 5573654 4496606
41137D496606j211295j496477j808839j861624j482065p92927j08178L51247O05442
$$ 4496606 3285311 1788834 -20005 -1881629 -3363694 -4156621 -4264799 -3913552 -3308110
41128c308110P56167P52140M44513j19226o25419q23901q02821p90161p86076
$$ -3308110 -2551943 -1799803 -1355290 -1474516 -2099935 -2923836 -3726657 -4516818 -5302894
41119e302894n99943k12692J40323K98824L70534M81895N23314L18614o6246l72949
$$ -5302894 -5902837 -6115529 -5975206 -5676382 -5305848 -4823953 -4300639 -3982025 -4048271 -4421220
41109d421220m57056l73031j80802J43407N57862Q69581R01051O84783M30650
$$ -4421220 -4878276 -5251307 -5432109 -5288702 -4730840 -3861259 -2960208 -2275425 -1844775
41100a844775L38912M77451P81187J101796J269975J164264P57885J33869n15368
$$ -1844775 -1505863 -1028412 -247225 854571 2124546 3288810 4046695 4180564 3665196
41091C665196r37405r64503o63811l05162j27448j45404k09997k23683k33493
$$ 3665196 2727791 1763288 1099477 794315 666867 521463 311466 87783 -145710
41082a45710l06600l74033k54755J53982P29916J192374J332714J187007R83122
$$ -145710 -452310 -826343 -1081098 -927116 -197200 995174 2327888 3514895 4498017
41073D498017R25679J040597J207426J285917J175320P95724J10437p80122j609380
$$ 4498017 5423696 6464293 7671719 8957636 10132956 10928680 11039117 10258995 8649615
41064H649615k087206k104230j786119j352236r44404n79440k11734J84045N53825
$$ 8649615 6562409 4458179 2672060 1319824 375420 -204020 -415754 -231709 322116
41055C22116P59272O77134L60320P6859J11052M89205R23160J045438P06872P0959
$$ 322116 1081388 1758522 2118842 2195701 2306753 2795958 3719118 4764556 5471428 5542387
41045E542387n47066r34209j102348j172640j160293r40068m64158O3194L41176
$$ 5542387 4995321 4061112 2958764 1786124 625831 -314237 -778395 -715201 -374025
41036c74025K89527J04349o964k3261l544P4902K53119M47256N14715M50570L95499
$$ -374025 -84498 19851 12887 -10374 -13918 60984 314103 761359 1276074 1726644 2122143
41025B122143M28837M59499L74554K21518J64408K73138M10732L51600J1675m38010
$$ 2122143 2550980 3010479 3385033 3606551 3770959 4044097 4454829 4806429 4818104 4380094
41015D380094o99849o16478l13420o4348l0144j64897l61756o08762r42568j291741
$$ 4380094 3680245 3063767 2750347 2685999 2655855 2490958 2129202 1520440 577872 -713869
41005g13869j464289j332646r84202o33451m00714k30786k1847K42584N20654
$$ -713869 -2178158 -3510804 -4495006 -5128457 -5529171 -5759957 -5781804 -5539220 -5018566
40996e018566P92356J036511J176678J151232J027839R45137R18834P99966M69788
$$ -5018566 -4226210 -3189699 -2013021 -861789 166050 1111187 2030021 2829987 3299775
40987C299775n411m70862q58230j180154j399727j410682j162066p46948l44527
$$ 3299775 3294364 2823502 1965272 785118 -614609 -2025291 -3187357 -3934305 -4278832
40978d278832p7188R8755L66328Q56086J447547J822803J771643J387141Q99644
$$ -4278832 -4356020 -4257265 -3890937 -3034851 -1587304 235499 2007142 3394283 4293927
40969D293927L96218j80436p99756j260326j372902j134592o98004k55764J8188
$$ 4293927 4690145 4509709 3709953 2449627 1076725 -57867 -755871 -1011635 -993447
40960i93447J7951k16434n01211o45173n86029l97249k03291r5144p3848m6638
$$ -993447 -975496 -1191930 -1693141 -2338314 -2924343 -3321592 -3524883 -3620027 -3693875 -3740513
40950c740513Q8816L33396N73149O68470N37317K00125j80310l41045j28691L09804
$$ -3740513 -3651697 -3318301 -2745152 -2076682 -1539365 -1339240 -1519550 -1860595 -1989286 -1679482
40940a679482O55448P70250Q07713R23457J021515R15240O45582M76699N86553
$$ -1679482 -1024034 -253784 553929 1477386 2498901 3414141 4059723 4536422 5122975
40931E122975Q74247J070816R58367N09365p9945m96390n53238l42608p6722J83346
$$ 5122975 5997222 7068038 8026405 8535770 8455825 7959435 7406197 7063589 6986867 7170213
40921G170213N03131P90771P46656K22129n00949r57540r88260q42724q04144
$$ 7170213 7673344 8464115 9210771 9432900 8931951 7974411 6986151 6143427 5339283
40912E339283q50880p44070l58700J56488N28235O17052N21369M36617M13506
$$ 5339283 4488403 3744333 3385633 3542121 4070356 4687408 5208777 5645394 6058900
40903F058900K76404j83408r35552j670786k046261j946151j505667r40939l98843
$$ 6058900 6335304 6151896 5216344 3545558 1499297 -446854 -1952521 -2893460 -3292303
40894c292303O4533M28681O58573P02642N50822L04102J49152K12233M42142O76388
$$ -3292303 -3227770 -2799089 -2140516 -1437874 -887052 -582950 -433798 -221565 220577 896965
40884H96965Q09799Q41343P67764N39118J80479j29627k21535j55631j64138l47350
$$ 896965 1706764 2548107 3315871 3854989 4035468 3905841 3684306 3528675 3364537 3017187
40874C017187n33160m98727k43832M8553K62417M36393O19325P82117R27748J168472
$$ 3017187 2484027 1985300 1741468 1790021 2052438 2488831 3108156 3890273 4818021 5986493
40864E986493J569044J948713J964689J443549N89985j62461m98641m38828k70993
$$ 5986493 7555537 9504250 11468939 12912488 13502473 13340012 12841371 12402543 12131550
40855A2131550l01867o45787j199756j769410k181827k298178k017130j356745
$$ 12131550 11829683 11183896 9984140 8214730 6032903 3734725 1717595 360850
40847C60850n12435K47227P52670R60397Q59765M86094M2813j49817N2454M49879
$$ 360850 -151585 95642 848312 1808709 2668474 3154568 3197381 3047564 3100018 3549897
40837C549897P22747P56495O39734M23237N9635m19822q38088j041227j026409
$$ 3549897 4272644 5029139 5668873 6092110 6151745 5731923 4893835 3852608 2826199
40828B826199q62917n98815k96477m7328J20724K59363L65468L42063J72878J4018
$$ 2826199 1963282 1364467 1067990 1020662 1141386 1400749 1766217 2108280 2281158 2295176
40818B295176p934J4470p6307k48713l49754l53929l41797k69567l540L82469
$$ 2295176 2287242 2301712 2225405 1976692 1626938 1273009 931212 661645 658105 1040574
40808A040574N88285M70973K38607J15809O506k94856o78194p64126l71899K57732
$$ 1040574 1628859 2099832 2338439 2454248 2460754 2165898 1487704 723578 351679 609411
40798F09411P34261Q50498O17064J45668l94377q07831r80710r39382p65093m88051
$$ 609411 1343672 2194170 2811234 2956902 2562525 1754694 773984 -165398 -930491 -1418542
40788a418542q5079M69197J150492J803787K120990J850749J113013L87586P2703
$$ -1418542 -1503621 -1034424 116068 1919855 4040845 5891594 7004607 7392193 7464896
40779G464896J26047K37319K49563K48464L03666L32594K41972L1800k81540o76897
$$ 7464896 7590943 7828262 8077825 8326289 8629955 8962549 9204521 9236321 8954781 8277884
40769H277884r93660r57630m81928J54512N56229N76337L42244K1562k85160m82648
$$ 8277884 7284224 6326594 5844666 5999178 6555407 7131744 7473988 7495550 7210390 6727742
40759F727742m98602l84151k69736k02605j36650q9772j79619m52589p73878r42968
$$ 6727742 6229140 5844989 5575253 5372648 5235998 5146226 4966607 4514018 3740140 2797172
40749B797172q60327n66410k01106N6233J07414L9079K1639P3735K9410k14801
$$ 2797172 1936845 1370435 1169329 1225562 1332976 1372055 1393694 1467429 1496839 1282038
40739A282038n31512p08164o52170l69666J35896Q01201J411263J727633J704270
$$ 1282038 750526 42362 -609808 -979474 -843578 -42377 1368886 3096519 4800789
40730D800789J479353J182570Q53043N10048J74447j74166n37131p86633p45650
$$ 4800789 6280142 7462712 8315755 8825803 9000250 8826084 8288953 7502320 6756670
40721F756670m18691l6847J80893K29704K36131K58937K47603J49563k0112k12676
$$ 6756670 6337979 6301132 6482025 6711729 6947860 7206797 7454400 7603963 7583851 7371175
40711G371175m07082o24778q77343j087931j093727p79442k03296M53424J036113
$$ 7371175 6964093 6339315 5461972 4374041 3280314 2500872 2297576 2751000 3787113
40702C787113J444227J547852J233005N97289j9609l27355l70220m27769o64294
$$ 3787113 5231340 6779192 8012197 8609486 8589877 8262522 7892302 7464533 6800239
40693F800239r85616j232615j373210j430322j333676r96224n24187j94450j44260
$$ 6800239 5814623 4582008 3208798 1778476 444800 -551424 -1075611 -1270061 -1414321
40684a414321j89450p3135J68278K48735M0409k39353l19347j93492k3413J43628
$$ -1414321 -1603771 -1676906 -1508628 -1259893 -1219484 -1458837 -1778184 -1971676 -1995089 -1851461
40674a851461L72516O26174P70200Q02653Q78102J025186R99260N44922k70143
$$ -1851461 -1478945 -852771 -82571 720082 1598184 2623370 3622630 4167552 3897409
40665C897409j087241j581565j680450j502737j182669p80968l27607R6694L70709
$$ 3897409 2810168 1228603 -451847 -1954584 -3137253 -3918221 -4245828 -4149134 -3778425
40656c778425M54815M65049N57714P46526Q95193Q83221P11946M57177K01549
$$ -3778425 -3323610 -2858561 -2300847 -1554321 -659128 224093 936039 1393216 1594765
40647A594765J6531p5274j28110j77888j23662J77879O78608J124751J319060
$$ 1594765 1611296 1536022 1407912 1230024 1106362 1284241 1962849 3087600 4406660
40638D406660J276315J074025P05539J90553k95260n49036n40901l84309j86148
$$ 4406660 5682975 6757000 7462539 7653092 7357832 6808796 6267895 5883586 5697438
40629E697438l8576o3247k89185n19354m90460j89107J15138J74174o846k58609
$$ 5697438 5658862 5595615 5306430 4787076 4296616 4107509 4222647 4396821 4389975 4131366
40619D131366m55959n91835p26927r17465j143670j281711j196644q90831n23776
$$ 4131366 3675407 3083572 2356645 1439180 295510 -986201 -2182845 -3073676 -3597452
40610c597452k70080j86028k00270j70517N4066N40694J181723J725413J952214
$$ -3597452 -3867532 -4053560 -4253830 -4424347 -4370281 -3829587 -2647864 -922451 1029763
40601A029763J834944J517693J138130O79531J8701q56934j700666k141088j997206
$$ 1029763 2864707 4382400 5520530 6200061 6218762 5361828 3661162 1520074 -477132
40592d77132j424579p37118j45828L03289O31526Q66925J044718J179446J235690
$$ -477132 -1901711 -2638829 -2784657 -2481368 -1849842 -982917 61801 1241247 2476937
40583B476937J165234R48079N75442O6906m38494o98019n78311k01015K11247
$$ 2476937 3642171 4590250 5165692 5232598 4794104 4096085 3517774 3316759 3528006
40574C528006N51656P74086P39444L52826j65832m11563k85450j44395l18743
$$ 3528006 4079662 4853748 5593192 5946018 5780186 5368623 5083173 4938778 4620035
40565D620035o48264o91312l03427J98108M31482L31920J01962o2322r8575k6790
$$ 4620035 3971771 3280459 2977032 3175140 3606622 3938542 4040504 3978182 3879607 3852817
40555C852817R5458J65036P6402j75542m71611o85325p90016p98224o33124j68536
$$ 3852817 3948275 4113311 4189713 4014171 3542560 2857235 2067219 1268995 635871 467335
40545D67335N72578J349881J896586K117995K058630J777489J363644R93868Q13804
$$ 467335 1039913 2389794 4286380 6404375 8463005 10240494 11604138 12598006 13411810
40536A3411810P64174O49119L84882P2902j75124l64068n46491p36883r17063
$$ 13411810 14175984 14825103 15209985 15282887 15107763 14743695 14197204 13460321 12543258
40527A2543258j019579q92312m21224K51367P54029Q21693N36336J90469M789
$$ 12543258 11523679 10631367 10210143 10461510 11215539 12037232 12573568 12764037 12768826
40518A2768826K2773J58271K57149K08577Q4721Q2324K46014L63378K50696L3423
$$ 12768826 12791599 12949870 13207019 13415596 13500317 13582641 13828655 14192033 14442729 14476152
40508A4476152j8462J31243K43031J17454k01643n37621p43738p28714m61374
$$ 14476152 14457690 14588933 14831964 14949418 14747775 14210154 13466416 12737702 12276328
40499A2276328k5874L97367O54490O88019N00771J42019k54521n10343n24513
$$ 12276328 12250454 12647821 13302311 13990330 14491101 14633120 14378599 13868256 13343743
40490A3343743l10511Q0850N72226R63982R56333L96901n10173j329082j748159
$$ 13343743 13033232 13114082 13686308 14650290 15606623 16003524 15493351 14164269 12416110
40481A2416110j785613j660159j519760j327024r71214m22700K46576R28708J474954
$$ 12416110 10630497 8970338 7450578 6123554 5152340 4729640 4976216 5904924 7379878
40472G379878J645052J208869K07488r45537j743247j980526j827088j556375
$$ 7379878 9024930 10233799 10441287 9495750 7752503 5771977 3944889 2388514
40464B388514j306336j087533q79939o48685l44697K8139L71816N64347N53101
$$ 2388514 1082178 -5355 -885294 -1533979 -1878676 -1850537 -1478721 -914374 -361273
40455c61273L68464R9040j13267j13167J54846N68162R00202R96041Q94762Q06948
$$ -361273 7191 106231 -7036 -120203 34643 602805 1503007 2499048 3393810 4200758
40445D200758R56346J371973J798331J865261J418111O82809P5220j42559k291
$$ 4200758 5157104 6529077 8327408 10192669 11610780 12293589 12368809 12226250 12223959
40436A2223959L12520O47068Q89336Q99626N53039j03144p93368j196965j208359
$$ 12223959 12536479 13183547 14072883 14972509 15525548 15422404 14629036 13432071 12223712
40427A2223712r83264p25189m82191j83872J85691N36362P82330R24401R93675
$$ 12223712 11240448 10515259 10033068 9849196 10034887 10571249 11353579 12277980 13271655
40418A3271655R63021P61653L79203n8485l38837l32357j35427N599l5271j12110
$$ 13271655 14234676 14996329 15375532 15317047 14978210 14645853 14510426 14516025 14480754 14368644
40408A4368644q40K86982M84437L63924m1844n14493q30259q46881n64356j98156
$$ 14368644 14367804 14654786 15139223 15503147 15461303 14946810 14116551 13269670 12705314 12507158
40398A2507158p5809l14300o42110o60278k54659L49153Q86071J247913J386172
$$ 12507158 12431349 12117049 11474939 10814661 10560002 10909155 11795226 13043139 14429311
40389A4429311J219336P59191K28055q8269q8136J25395M34910P99330J131334
$$ 14429311 15648647 16407838 16635893 16547624 16459488 16584883 17019793 17819123 18950457
40380A8950457J207911Q32015Q4890o75538j123053j234866j220750j240770j283720
$$ 18950457 20158368 20990383 21075273 20399735 19276682 18041816 16821066 15580296 14296576
40371A4296576j295599j283620j229878j019697n80606m3986L47206M68184L47253
$$ 14296576 13000977 11717357 10487479 9467782 8887176 8843190 9190396 9658580 10005833
40362A0005833J5612n07281j049226j285925j035127m66349R0719M81306P61279
$$ 10005833 10021445 9514164 8464938 7179013 6143886 5677537 5768256 6249562 7010841
40353G010841R66267J011768Q48000N83604L76053K54289J13052j35641m41392
$$ 7010841 7977108 8988876 9836876 10420480 10796533 11050822 11163874 11028233 10586841
40344A0586841o36036n60407j89509L41813Q27410J107843J134647R83007Q25160
$$ 10586841 9950805 9390398 9200889 9542702 10370112 11477955 12612602 13595609 14420769
40335A4420769Q19952R46028R68480O57123M7843n72042r30641r46106o48472
$$ 14420769 15240721 16186749 17155229 17812352 17860195 17288153 16357512 15411406 14762934
40326A4762934p1765O85306J383147J768248J786084J583241J285875Q62691K60483
$$ 14762934 14691169 15376475 16759622 18527870 20313954 21897195 23183070 24045761 24306244
40317B4306244l84768p74292p22054l64350m6851j1530k37957n78405r46189j297801
$$ 24306244 23921476 23147184 22425130 22060780 22013929 22002399 21764442 21186037 20239848 18942047
40307A8942047j505776j398020r58169l92887N3668K96137L85875L70108K51599
$$ 18942047 17436271 16038251 15080082 14687195 14740863 15037000 15422875 15792983 16044582
40298A6044582O2569q7927o1395K02996N94815Q67169Q53188O62640N59030O02625
$$ 16044582 16107151 16019224 15957829 16160825 16755640 17622809 18475997 19138637 19697667 20300292
40288B0300292N48610J99656k63481m66368k92504K1334K15982K57528K43637
$$ 20300292 20848902 21048558 20785077 20318709 20026205 20047539 20263521 20521049 20764686
40279B0764686K52843L63558O68433J146727J602142J824374J762767J488986
$$ 20764686 21017529 21381087 22049520 23196247 24798389 26622763 28385530 29874516
40271B9874516J081105O35769L13767K41593L79564N76246P42703Q97827J056832
$$ 29874516 30955621 31591390 31905157 32146750 32526314 33102560 33845263 34743090 35799922
40262C5799922J161822J139144R69020O82733L25901p0419m98283r24934j208303
$$ 35799922 36961744 38100888 39069908 39752641 40078542 40008123 39509840 38584906 37376603
40253C7376603j122232n65908K49933R17929J188311J181988J232925J549772
$$ 37376603 36254371 35688463 35938396 36856325 38044636 39226624 40459549 42009321
40245D2009321K045637K457494K588075K433895K110385J689575J146352M72750
$$ 42009321 44054958 46512452 49100527 51534422 53644807 55334382 56480734 56953484
40237E6953484j98775o51521p90494p69008q73949j260844j791677k140704k079862
$$ 56953484 56754709 56103188 55312694 54543686 53669737 52408893 50617216 48476512 46396650
40228D6396650j674491j208050r35264r16984j047495j169938j161856r81628
$$ 46396650 44722159 43514109 42578845 41661861 40614366 39444428 38282572 37300944
40220C7300944o78488l37740j1813K58307L75450K43360o7958l05077k50791J00546
$$ 37300944 36622456 36284716 36272903 36531210 36906660 37150020 37082062 36776985 36526194 36626740
40210C6626740O37914J293855J982457K451362K383723J689092N88039o06924
$$ 36626740 37264654 38558509 40540966 42992328 45376051 47065143 47653182 47046258
40202D7046258j677393k449155k730471k448642j796307j112705o00231k17690
$$ 47046258 45368865 42919710 40189239 37740597 35944290 34831585 34231354 34013664
40194C4013664J49368M89202O77932O56175N22945M16463L30263J20797k68123
$$ 34013664 34163032 34652234 35330166 35986341 36509286 36925749 37256012 37376809 37108686
40185C7108686o45339p13226l67530J87790O13768O84313M04435j5491k85687
$$ 37108686 36463347 35750121 35382591 35570381 36184149 36868462 37272897 37257406 36971719
40176C6971719k27174J02766M97967Q25201J119134J466428J874232K272195K561505
$$ 36971719 36744545 36847311 37345278 38170479 39289613 40756041 42630273 44902468 47463973
40167D7463973K620714K341594J728678R25427J00272o48967j253761j627346
$$ 47463973 50084687 52426281 54154959 55080386 55180658 54531691 53277930 51650584
40159E1650584j737910j675287j561950j427831j236816r93618p46069n13663
$$ 51650584 49912674 48237387 46675437 45247606 44010790 43017172 42271103 41757440
40151D1757440k90851r0451R3023L21993O19989Q71136R31453Q18094O48798L94769
$$ 41757440 41466589 41376138 41469161 41791154 42411143 43282279 44213732 45031826 45680624 46075393
40141D6075393j27777r42265j732457k102039j936279j412689p51475j02706L75106
$$ 46075393 45947616 45005351 43272894 41170855 39234576 37821887 37070412 36967706 37342812
40132C7342812N21346L33978L4095j02601M2566L98294Q25463J224229J531586
$$ 37342812 37864158 38198136 38232231 38129630 38172196 38570490 39395953 40620182 42151768
40123D2151768J657682J484466R87335L51448j25128k99686k85345k15461o65
$$ 42151768 43809450 45293916 46281251 46632699 46507571 46207885 45922540 45707079 45706414
40114D5706414N36416J322253J998077K258343K096596J691285J209457P99776
$$ 45706414 46242830 47565083 49563160 51821503 53918099 55609384 56818841 57618617
40106E7618617O09668O38522O51016M03749n6907m49485o03120o36461p86713
$$ 57618617 58228285 58866807 59517823 59921572 59864665 59415180 58812060 58175599 57388886
40097E7388886j153863j612749j882686j687486r67148J8377Q60435J305612J358918
$$ 57388886 56235023 54622274 52739588 51052102 50084954 50103331 50963766 52269378 53628296
40088E3628296J140083P62868L42849m2643m59438j035757j693168k101294k032564
$$ 53628296 54768379 55531247 55874096 55831453 55372015 54336258 52643090 50541796 48509232
40079D8509232j652293j294370j022916o10611O0452P80688J264933J464205J507653
$$ 48509232 46856939 45562569 44539653 43929042 43989494 44770182 46035115 47499320 49006973
40070D9006973J436273J154856O46214J01085k42115l47599m13498o57165j102343
$$ 49006973 50443246 51598102 52244316 52345401 52103286 51755687 51342189 50685024 49582681
40061D9582681j563748j783022j578731r69425k45716J38462r8817p85016j415419
$$ 49582681 48018933 46235911 44657180 43687755 43442039 43580501 43481684 42696668 41281249
40052D1281249j587323j261642o29063J18655Q18668J298389J467279J400890
$$ 41281249 39693926 38432284 37803221 37921876 38740544 40038933 41506212 42907102
40044D2907102J234381J030013Q32041P41794P76717P21977L18329l98357j104481
$$ 42907102 44141483 45171496 46003537 46745331 47522048 48244025 48562354 48163997 47059516
40035D7059516j543191j717255j726859j614893j443287j339430j336162j281859
$$ 47059516 45516325 43799070 42072211 40457318 39014031 37674601 36338439 35056580
40027C5056580j035152o70078l80487k46947j96985j36999k6126J34675L00169
$$ 35056580 34021428 33351350 32970863 32723916 32526931 32389932 32363806 32498481 32798650
40018C2798650M08065M78442O27701R05369J185481J318696J326661J323936J300526
$$ 32798650 33206715 33685157 34312858 35218227 36403708 37722404 39049065 40373001 41673527
40009D1673527J132828Q00883M49263K11014R8625J03093K75872O44620J129926
$$ 41673527 42806355 43607238 44056501 44267515 44366140 44469233 44745105 45389725 46519651
40000D6519651J596497J911352J922601J507295P44399m0238n28223o89871p29653
$$ 46519651 48116148 50027500 51950101 53457396 54201795 54161557 53633334 52943463 52213810
39991E2213810p93958q49915q38469p97405p70025p06433n63764m44578n11364
$$ 52213810 51419852 50569937 49731468 48934063 48164038 47457605 46893841 46449263 45937899
39982D5937899p63595j005946j075696j023256j011984j099691j197766j219905
$$ 45937899 45174304 44168358 43092662 42069406 41057422 39957731 38759965 37540060
39974C7540060j185176j159694j160870j148262j059389q17229l50832L13491
$$ 37540060 36354884 35195190 34034320 32886058 31826669 31009440 30658608 30972099
39966C0972099R72400J326213J213283P81793L95376L34477N88823R45625J241881
$$ 30972099 31944499 33270712 34483995 35265788 35661164 35995641 36584464 37530089 38771970
39957C8771970J477517J699837J867246J874472J663789J267875P83383L38498
$$ 38771970 40249487 41949324 43816570 45691042 47354831 48622706 49406089 49744587
39949D9744587K6282j95439m89694r48251j448112j772967j828555j640350j199281
$$ 49744587 49770869 49575430 49085736 48137485 46689373 44916406 43087851 41447501 40248220
39940D0248220m79477L78163J071063J409704J488556J518168J578522J600968
$$ 40248220 39768743 40146906 41217969 42627673 44116229 45634397 47212919 48813887
39932D8813887J498155J228700Q07665L36121l8182k62804m34210o61327r51011
$$ 48813887 50312042 51540742 52348407 52684528 52646346 52383542 51949332 51288005 50336994
39923E0336994j279122j656920k013456k112147j758452j082139m78397k38392
$$ 50336994 49057872 47400952 45387496 43275349 41516897 40434758 39956361 39717969
39915C9717969l09760m26548m15417l72981n70961j153242j907817k422312k510475
$$ 39717969 39408209 38981661 38566244 38193263 37622302 36469060 34561243 32138931 29628456
39906B9628456k366590k216769j981012j465200p66780k32885m0286n6899j28358
$$ 29628456 27261866 25045097 23064085 21598885 20832105 20599220 20558934 20502035 20373677
39897B0373677k44384l48493k38815J67491O21561P63764M83977l7859n48944
$$ 20373677 20129293 19780800 19541985 19709476 20331037 21094801 21578778 21540919 20991975
39888B0991975q69752r23518p63403n31747l00908j0416L58717O36760O18204
$$ 20991975 20122223 19198705 18435302 17903555 17602647 17592231 17950948 18587708 19205912
39879A9205912L08553j06962n07302r20055j365432j733252j855292j649847j186601
$$ 19205912 19514465 19407503 18900201 17980146 16614714 14881462 13026170 11376323 10189722
39870A0189722o43826j88219J33336L61069M84348M31493K46901J59877L50121
$$ 10189722 9545896 9357677 9491013 9852082 10336430 10767923 11014824 11174701 11524822
39861A1524822P04897R32642Q76471O00996K28378j46372l90450l65297q5964
$$ 11524822 12229719 13162361 14038832 14639828 14868206 14721834 14331384 13966087 13880123
39852A3880123K60966M98682N68685M59094J73723j75300l90942m14225m32471
$$ 13880123 14141089 14639771 15208456 15667550 15841273 15665973 15275031 14860806 14428335
39843A4428335o61209j073708j423722j476358j145851m86697L32810J080227
$$ 14428335 13767126 12693418 11269696 9793338 8647487 8160790 8493600 9573827
39835I573827J593270J872813J981216J872095J408621N64175m50064j274345
$$ 9573827 11167097 13039910 15021126 16893221 18301842 18866017 18415953 17141608
39827A7141608j615257j438155j020010p70583q99193j243436j473780j434495
$$ 17141608 15526351 14088196 13068186 12297603 11398410 10154974 8681194 7246699
39819G246699j205756q81531m46911Q2032N33421O98515N18505Q4044m90053j102491
$$ 7246699 6040943 5159412 4712501 4794533 5327954 6026469 6544974 6629018 6138965 5036474
39809E036474j612052j842799j674523j120532l42891L98759Q84150J084039J144159
$$ 5036474 3424422 1581623 -92900 -1213432 -1556323 -1157564 -273414 810625 1954784
39800A954784J181747J167108J071501J032317J215390J538533J697998J510803
$$ 1954784 3136531 4303639 5375140 6407457 7622847 9161380 10859378 12370181
39792A2370181J106030P31489M93695L53262K52890J44208k3613k26066l30866
$$ 12370181 13476211 14207700 14701395 15054657 15307547 15451755 15428142 15202076 14871210
39783A4871210k47247n7840R8785K20091L92825O04471P56390Q54475J018541
$$ 14871210 14623963 14566123 14664908 14884999 15277824 15882295 16638685 17493160 18511701
39774A8511701J257214J375035J181970P05165J40077l12514n12235m12749j45378
$$ 18511701 19768915 21143950 22325920 23031085 23171162 22858648 22346413 21933664 21788286
39765B1788286J1622j19739m16872n86000m67535j48116J78345L60859L36702
$$ 21788286 21799908 21680169 21263297 20677297 20209762 20061646 20239991 20600850 20937552
39756B0937552J50330n3834j46813j52437k12782m12600p03102r91719j206488
$$ 20937552 21087882 21034048 20887235 20734798 20522016 20109416 19406314 18414595 17208107
39747A7208107j247767r96066m62156J35462N52485P67015R58719J236891J482536
$$ 17208107 15960340 14964274 14502118 14637580 15190065 15957080 16915799 18152690 19635226
39738A9635226J505832J285840R71227O80748M14908J89802J47133M26179R57258
$$ 19635226 21141058 22426898 23398125 24078873 24493781 24683583 24830716 25256895 26214153
39729B6214153J476001J746104J703253J405175R66691N82063M78531P24023J123518
$$ 26214153 27690154 29436258 31139511 32544686 33511377 34093440 34571971 35295994 36419512
39720C6419512J400238J455917J383533J279044J163223J075086J093418J195732
$$ 36419512 37819750 39275667 40659200 41938244 43101467 44176553 45269971 46465703
39712D6465703J189007Q85056L39745j34958k16557J58136P33668J133191J151788
$$ 46465703 47654710 48539766 48879511 48744553 48527996 48686132 49419800 50552991 51704779
39703E1704779R00879O88165P59030J117648J525256J650953J313927O66191R3983
$$ 51704779 52605658 53293823 54052853 55170501 56695757 58346710 59660637 60326828 60420811
39694F0420811j50364j92767l42426p15553j176782j593448j946357k177838k166293
$$ 60420811 60270447 60077680 59735254 59019701 57842919 56249471 54303114 52125276 49958983
39685D9958983j965695j872472k074710k369007k422677k215207j982920j769924
$$ 49958983 47993288 46120816 44046106 41677099 39254422 37039215 35056295 33286371
39677C3286371j309466m25885O58614J542370K024817K147588J987311J586872
$$ 33286371 31976905 31551020 32209634 33752004 35776821 37924409 39911720 41498592
39669D1498592J059685O11846M20491N36797Q85126J287317J511246J399300R99262
$$ 41498592 42558277 43170123 43590614 44127411 45012537 46299854 47811100 49210400 50209662
39660E0209662N43104K78554L16279N92430R18281J078993R55914N93815J53044
$$ 50209662 50752766 51031320 51347599 51940029 52858310 53937303 54893217 55487032 55640076
39651E5640076j83120k48422P8046P79108J639316K371055K839709L125444L370940
$$ 55640076 55456956 55208534 55286580 56065688 57705004 60076059 62915768 66041212 69412152
39642F9412152L643052L943904M249797M497743M639759M776338N119339N703688
$$ 69412152 73055204 76999108 81248905 85746648 90386407 95162745 100282084 105985772
39634A05985772O231776O378754O222294O187814O545995P141307P683555Q134041
$$ 105985772 112217548 118596302 124818596 131006410 137552405 144693712 152377267 160511308
39626A60511308Q668919R381744J0191664J0992894J1730894J2327677J2664644
$$ 160511308 169180227 178561971 188753635 199746529 211477423 223805100 236469744
39619B36469744J2676856J2385398J1816746J0949377R735762Q113647O021333
$$ 236469744 249146600 261531998 273348744 284298121 294033883 302147530 308168863
39612C08168863L499527P72737j874802m315203o574041q618283j0287083j1472545
$$ 308168863 311668390 312441127 310566325 306251122 299677081 291058798 280771715 269299170
39604B69299170j2230679j2646556j2733468j2576170j2436605j2527287j2710973
$$ 269299170 257068491 244421935 231688467 219112297 206675692 194148405 181437432
39597A81437432j2580116j1856584j0638381r283679q148106p392804o904540
$$ 181437432 168857316 157000732 146362351 137078672 128930566 121537762 114633222
39590A14633222o383340n620769m726594m004740l603611l389166l171658k928041
$$ 114633222 108249882 102629113 97902519 93897779 90294168 86905002 83733344 80805303
39582H0805303k739247k612562k462677k227335j937259j692984j594339j640944
$$ 80805303 78066056 75453494 72990817 70763482 68826223 67133239 65538900 63897956
39574F3897956j672573j468321r52207k64470L84441Q55066J042461Q14932J28131
$$ 63897956 62225383 60757062 59804855 59540385 59924826 60779892 61822353 62637285 62765416
39565F2765416p95444j488015j501288p05494N89033J779018K337727K168236
$$ 62765416 61969972 60481957 58980669 58275175 58864208 60643226 62980953 65149189
39557F5149189J625864J175291J036215J141468J323539J449740J437615J260944
$$ 65149189 66775053 67950344 68986559 70128027 71451566 72901306 74338921 75599865
39549G5599865R60515O05052K61662M2830J15785N60533J231750J851212K241679
$$ 75599865 76560380 77165432 77427094 77469924 77585709 78146242 79377992 81229204 83470883
39540H3470883K408656K422057K325059K174106K071347K103973K281857K532486
$$ 83470883 85879539 88301596 90626655 92800761 94872108 96976081 99257938 101790424
39532A01790424K711205K650511K308537J893335J750526K074390K760408L536273
$$ 101790424 104501629 107152140 109460677 111354012 113104538 115178928 117939336 121475609
39524A21475609M173116M582751M816714N001461N184722N211938M844127M038960
$$ 121475609 125648725 130231476 135048190 140049651 145234373 150446311 155290438 159329398
39516A59329398L031618K103978J369650Q11777L76641p9258q10615j990319l529690
$$ 159329398 162361016 164464994 165834644 166646421 167023062 166943804 166133189 164142870 160613180
39507A60613180n183547o755557q076592q874745q888469q156621p074403o122294
$$ 160613180 155429633 148674076 140597484 131722739 122834270 114677649 107603246 101480952
39499A01480952n595980n538583n766307n944325n807714n388736m927993m526597
$$ 101480952 95884972 90346389 84580082 78635757 72828043 67439307 62511314 57984717
39491E7984717m019728l256349k361508j611115j150895r51360r39529j026889
$$ 57984717 53964989 50708640 48347132 46736017 45585122 44633762 43694233 42667344
39483D2667344j067632r54807p64311o88991q22836j095460j394560j637227j732078
$$ 42667344 41599712 40644905 39880594 39191603 38368767 37273307 35878747 34241520 32509442
39474C2509442j611703j334937j036333p36989l38139J31108M08066K87545n5152
$$ 32509442 30897739 29562802 28526469 27789480 27451341 27582449 27990515 28278060 28222908
39465B8222908j99189N5269M72784O59028M59414N3516k57111k92284q2143J99466
$$ 28222908 28023719 28078988 28551772 29210800 29670214 29723730 29466619 29174335 29092192 29291658
39455B9291658L73987L67465K24143N5159o792J47741N26154R96006J391477J668806
$$ 29291658 29665645 30033110 30257253 30312412 30305620 30453361 30979515 31975521 33366998 35035804
39445C5035804J888490K033126J949957J549990R88866N44917L47724L22098L77867
$$ 35035804 36924294 38957420 40907377 42457367 43446233 43991150 44338874 44660972 45038839
39436D5038839N35744Q34951J209695J519198J664445J648303J553294J464751
$$ 45038839 45574583 46409534 47619229 49138427 50802872 52451175 54004469 55469220
39428E5469220J369047J139234P05945K45034O4958K30673M02020J67351n03936
$$ 55469220 56838267 57977501 58683446 58928480 58993438 59224111 59626131 59793482 59289546
39419E9289546j239575j652760j644304j358157r95807p17508o02707o16683o62083
$$ 59289546 58049971 56397211 54752907 53394750 52398943 51681435 51078728 50462045 49799962
39410D9799962p09507q24601j024755j177454j122793q75948o40337o13232q12340
$$ 49799962 49090455 48265854 47241099 46063645 44940852 44064904 43424567 42811335 41998995
39401D1998995j092009j301109j418140j534172j693619j768460j548662r83516
$$ 41998995 40906986 39605877 38187737 36653565 34959946 33191486 31642824 30659308
39393C0659308k80738K81287N96376P24205O86092L88188k03518q88021j324482
$$ 30659308 30378570 30659857 31256233 31980438 32666530 33054718 32851200 31963179 30638697
39384C0638697j320832r96730o53604n10661n77324p38599q96015j004482j025449
$$ 30638697 29317865 28321135 27667531 27156870 26579546 25840947 24944932 23940450 22915001
39375B2915001r08656o23758j82946L47491Q15114J000309P83105L36293O2169
$$ 22915001 22006345 21382587 21199641 21547132 22362246 23362555 24145660 24481953 24544122
39366B4544122K39524P40885J136063J044132L70227o87228j729881k317321k232430
$$ 24544122 24783646 25524531 26660594 27704726 28074953 27387725 25657844 23340523 21108093
39357B1108093j677165j108429q00782o29868l36644Q8127L92365L92861J95918
$$ 21108093 19430928 18322499 17521717 16891849 16555205 16643332 17035697 17428558 17624476
39348A7624476O5764J45797L41784M41463L26889Q9341n7413J1256K14027L63757
$$ 17624476 17690240 17836037 18177821 18619284 18946173 19035514 18978101 18989357 19203384 19567141
39338A9567141L46685J76821o7289k85894l79236l31608k74432l59161n36606
$$ 19567141 19913826 20090647 20023358 19737464 19358228 19026620 18752188 18393027 17856421
39329A7856421n61502k79590J52862L93892K24227k80008p97077r53101n96618
$$ 17856421 17294919 17015329 17168191 17562083 17786310 17506302 16709225 15756124 15159506
39320A5159506R626L56573J79677k60682m97146l90298k05791k21003m58803q09189
$$ 15159506 15169132 15525705 15705382 15444700 14947554 14557256 14351465 14130462 13671659 12862470
39310A2862470j174777j399402j265765p54956k00558P830j48822l21867k05106
$$ 12862470 11687693 10288291 9022526 8267570 8067012 8074842 7926020 7604153 7399047
39301G399047J74477N60224P36791O77822N19702M30838M62157N10443M54520
$$ 7399047 7573524 8133748 8870539 9548361 10068063 10498901 10961058 11471501 11926021
39292A1926021L06267J80732J40963J32784O3380j05723l34475n38023o70237
$$ 11926021 12232288 12413020 12553983 12686767 12750147 12644424 12309949 11771926 11101689
39283A1101689p98219j029932j318652j429282j198606p53230l40897j1938L62738
$$ 11101689 10303470 9273538 7954886 6525604 5326998 4573768 4232871 4220933 4583671
39274D583671P92623J098062J179777J162957J175311J134983Q88932M64246N4810
$$ 4583671 5376294 6474356 7654133 8817090 9992401 11127384 12016316 12480562 12535372
39265A2535372j89658k68686k78095l34751m97306o67880o13243j86890M66707
$$ 12535372 12345714 12077028 11798933 11464182 10966876 10298996 9685753 9498863 9965570
39256I965570R91328J111813Q37097M15276J22315N2654P3330J670j76265l28017
$$ 9965570 10956898 12068711 12905808 13321084 13443399 13496053 13569383 13571053 13394788 13066771
39246A3066771m07769n40721q14927j107441j225697j145524r99210q82736p80200
$$ 13066771 12659002 12118281 11303354 10195913 8970216 7824692 6825482 5942746 5162546
39237E162546o33788l86577r68M54040P66610P48821M33097K3708l03128m51889
$$ 5162546 4528758 4142181 4141213 4595253 5361863 6110684 6543781 6567489 6264361 5812472
39227E812472l36117O0290N40261P85731O63954L34197M509k97106o38311r80943
$$ 5812472 5476355 5536645 6076906 6862637 7526591 7860788 7865297 7568191 6929880 5948937
39217E948937j179737j144692r23502o33684l57129r1655K08046N21636P15600
$$ 5948937 4769200 3624508 2701006 2067322 1710193 1618538 1826584 2348220 3063820
39208C063820O81047N27384N33606Q36855J237155J396395J196026Q14985M71700
$$ 3063820 3744867 4272251 4805857 5642712 6879867 8276262 9472288 10287273 10758973
39199A0758973J89357j43467n50064q90294j013356r21073p38217n67757m50043
$$ 10758973 10948330 10804863 10254799 9364505 8351149 7430076 6691859 6124102 5674059
39190E674059m43803o33588j006026j396457j620765j604873j347702q64499k63576
$$ 5674059 5230256 4596668 3590642 2194185 573420 -1031453 -2379155 -3243654 -3507230
39181c507230K23009M41502N06226O39548Q51905R41545Q01580N46882L09987
$$ -3507230 -3284221 -2842719 -2336493 -1696945 -845040 96505 898085 1444967 1754954
39172A754954R7814p6969r4689J19802M54171P21356Q30261P72371N51905K28459
$$ 1754954 1852768 1775799 1681110 1800912 2255083 2976439 3806700 4579071 5130976 5359435
39162E359435p0775k85851m80136o65012o85467m22380j6920K65855L29330K45330
$$ 5359435 5288660 5002809 4522673 3857661 3172194 2749814 2732894 2998749 3328079 3573409
39152C573409M9069k39901m18111j84432M83768J231166J708165J892740J908604
$$ 3573409 3622478 3382577 2964466 2780034 3263802 4494968 6203133 8095873 10004477
39143A0004477J696992J098442K08034n79847r37430q67851n50311q2790M82847
$$ 10004477 11701469 12799911 13007945 12428098 11490668 10622817 10072506 9989716 10472563
39134A0472563R59135J103372R25672P43962Q04259R41412P72964K01933m32848
$$ 10472563 11431698 12535070 13460742 14204704 15008963 15950375 16723339 16925272 16492424
39125A6492424p42503o90831n36479m70415m16539j62842L79581J036916J461876
$$ 16492424 15749921 15059090 14522611 14052196 13635657 13472815 13852396 14889312 16351188
39116A6351188J398923Q92085J96361n09911j224542j905622k308258k185151
$$ 16351188 17750111 18642196 18838557 18328646 17104104 15198482 12890224 10705073
39108A0705073j596426q86151l62727j00564k7211p0589j86203l27783m37205
$$ 10705073 9108647 8222496 7859769 7759205 7731994 7661405 7475202 7147419 6710214
39099F710214m34629k33556J76467O74363J094944J361821J488195J490891J384379
$$ 6710214 6275585 6042029 6218496 6892859 7987803 9349624 10837819 12328710 13713089
39090A3713089J221895J040971P89167M11720L028k44544k56307j45829p1729
$$ 13713089 14934984 15975955 16765122 17176842 17179870 16935326 16679019 16533190 16461461
39081A6461461j25506l46554p05320j045708j180802j091594r12887o98141l63015
$$ 16461461 16335955 15989401 15284081 14238373 13057571 11965977 11053090 10354949 9991934
39072I991934O9670L51572K82657j4738k45910k79923j87832k8303K17556N19014
$$ 9991934 10061604 10413176 10695833 10681095 10435185 10155262 9967430 9939127 10156683 10675697
39062A0675697P79081R70859J153863J315880J312150J018077M75667j36622o10214
$$ 10675697 11454778 12425637 13579500 14895380 16207530 17225607 17701274 17564652 16954438
39053A6954438p73462n58275p2091M38067P45843P69110N55796K20171q1877j86116
$$ 16954438 16180976 15622701 15550610 15988677 16734520 17503630 18059426 18279597 18197720 18011604
39043A8011604j0307L64825P08353P51592L56837l47557j012543j336075j322358
$$ 18011604 18001297 18366122 19074475 19826067 20182904 19835347 18822804 17486729 16164371
39034A6164371j231712j257830j307449j125156n90406J39376P46213R89140Q62663
$$ 16164371 14932659 13674829 12367380 11242224 10651818 10791194 11537407 12526547 13389210
39025A3389210N54289K43934l8887l33889n83731o63753n85986n42022o68130
$$ 13389210 13943499 14187433 14148546 13814657 13230926 12567173 11981187 11439165 10771035
39016A0771035q67427r64234r51827r53131r84223r22397p25411n23065m11558
$$ 10771035 9903608 8939374 7987547 7034416 6050193 5127796 4402385 3879320 3467762
39007C467762k77260M9567N14990Q34285P71600L56614j72881n66050o87132n47770
$$ 3467762 3190502 3240069 3755059 4589344 5360944 5717558 5544677 4978627 4291495 3743725
38997C743725k94677j35935j93525l88989m99315l62900m4202K14441K25149N3705
$$ 3743725 3449048 3313113 3119588 2730599 2231284 1868384 1824182 2038623 2263772 2317477
38987B317477k4419K04525O58930J024489J058333P95666M38049J04821k18040
$$ 2317477 2293058 2497583 3156513 4181002 5239335 6035001 6473050 6577871 6359831
38978F359831n15262o75523o60339o29438p52448r22805q17801l02562L36842
$$ 6359831 5844569 5169046 4508707 3879269 3126821 2204016 1386215 1083653 1420495
38969A420495O59001N12433J37959j19156r4464J68709N33756Q48613R91014R25813
$$ 1420495 2079496 2591929 2729888 2610732 2516268 2684977 3218733 4067346 5058360 5984173
38959E984173P12558M21862N9061m00023r08061j307539j406305j116226n52475
$$ 5984173 6696731 7118593 7177654 6777631 5869570 4562031 3155726 2039500 1487025
38950A487025J3154L53572M66955N27528O50056P49649O50038K77207k75493q08101
$$ 1487025 1500179 1853751 2320706 2848234 3498290 4247939 4897977 5175184 4899691 4091590
38940D091590j102786j036592o97514l52678k16381k58567k94662k23872r9436
$$ 4091590 2988804 1952212 1254698 902020 685639 427072 132410 -91462 -190898
38931a90898q95N2954O6532N1579P0573J96918L86990M67553L04312n5699m27677
$$ -190898 -191793 -138839 -72307 -20728 49845 246763 633753 1101306 1405618 1349919 922242
38920I22242o23704n44958k33031J27161L28834L25033K50996K44507L04512L48146
$$ 922242 298538 -246420 -479451 -352290 -23456 301577 552573 797080 1101592 1449738
38910A449738L24603K26213O0786j30991k87523l94761m78881n10383m21224k62366
$$ 1449738 1774341 2000554 2061340 1930349 1642826 1248065 769184 258801 -162423 -424789
38900d24789k11090l25797m15573k85257j2045J72966J99985J84628J86194J31102
$$ -424789 -635879 -961676 -1377249 -1662506 -1674551 -1501585 -1301600 -1116972 -930778 -799676
38890g99676k0679j97799l28321l93166l58041j89274M6748K29685L33235L84975
$$ -799676 -820355 -1018154 -1346475 -1739641 -2097682 -2286956 -2240208 -2010523 -1677288 -1292313
38880a292313K97256m9510n12225p10327m79411j16899q939j52478k38389j15346
$$ -1292313 -995057 -1044567 -1556792 -2267119 -2746530 -2863429 -2872368 -3024846 -3263235 -3378581
38870c378581M2320J4646j95783m17441n19228n10321m68639l91865j40374L98510
$$ -3378581 -3336261 -3321615 -3517398 -3934839 -4454067 -4964388 -5433027 -5824892 -5965266 -5566756
38860e566756J069934J487531J393323R02673L20986j68604n23104o79594n84968
$$ -5566756 -4496822 -3009291 -1615968 -713295 -392309 -560913 -1084017 -1763611 -2348579
38851b348579l46931j62110q2487n025J10719J91125K40888L97640P04649R73443
$$ -2348579 -2695510 -2857620 -2940107 -2945132 -2834413 -2643288 -2402400 -2004760 -1300111 -326668
38841c26668R87301P50033M35294J67380m5360k12793l01590k60936n7130K87931
$$ -326668 660633 1410666 1845960 2013340 1967980 1755187 1453597 1192661 1135531 1423462
38831A423462O51183Q52072Q05648O01659L82511J87095k0110k08825k69542j49777
$$ 1423462 2074645 2926717 3732365 4334024 4716535 4903630 4883520 4674695 4405153 4255376
38821D255376O1089K02312J62810o0332l64188n81549n75446l46643m0377J89707
$$ 4255376 4316465 4518777 4681587 4621255 4257067 3675518 3100072 2753429 2713052 2902759
38811B902759L29526M88925P27876R37683R44039P15041M02423J63882J7831q6909
$$ 2902759 3232285 3721210 4449086 5386769 6330808 7045849 7448272 7612154 7629985 7543076
38801G543076j43882j24610q3663r8833j09633N8527M67559R53722J279395J315455
$$ 7543076 7399194 7274584 7190921 7092088 6982455 7040982 7508541 8462263 9741658 11057113
38791A1057113J043956M99354j94397p97430j080302r81131o00223q6839M06209
$$ 11057113 12101069 12600423 12406026 11608596 10528294 9547163 8946940 8860101 9266310
38782I266310P10077O94366L62265j43395o23533q97608q59096n40860j16516
$$ 9266310 9976387 10670753 11033018 10889623 10266090 9368482 8509386 7968526 7852010
38773G852010K24629M06994M53928L98325K74236J50173P3306n869j63196l62123
$$ 7852010 8076639 8483633 8937561 9335886 9610122 9760295 9833601 9827732 9664536 9302413
38763I302413m78221m62434l76378k47943p598L71137P52732R33575Q09801M17188
$$ 9302413 8824192 8361758 7985380 7737437 7729839 8100976 8853708 9787283 10597084 11014272
38753A1014272j21081o30364r45281j022374r55809q22137n69923j45465L35327
$$ 11014272 10893191 10262827 9317546 8295172 7339363 6517226 5947303 5801838 6137165
38744F137165O64382P69438P40979O35854M06472Q7305q6059J11474N95254R99703
$$ 6137165 6801547 7570985 8311964 8947818 9354290 9441595 9355536 9467010 10062264 11061967
38734A1061967J030512P26746L52892Q4005j55019n46681j118478j656180j885462
$$ 11061967 12092479 12819225 13172117 13256122 13101103 12554422 11435944 9779764 7894302
38725G894302j716817j291584q21566m48396k51861k83380m95542o77828n78899
$$ 7894302 6177485 4885901 4064335 3615939 3364078 3080698 2585156 1907328 1328429
38716A328429j44367M05321P68413Q21646O84214N59381N41109N61895M98956
$$ 1328429 1184062 1589383 2357796 3179442 3863656 4423037 4964146 5526041 6024997
38707F024997L15076R1357o9542j41147j51122r6412M9501K32850K99870J50828
$$ 6024997 6340073 6431430 6361888 6220741 6069619 5973207 6022708 6255558 6555428 6706256
38697F706256j10914k55234j63094O0256K26530K70740K76472L22287L57206K45365
$$ 6706256 6595342 6340108 6177014 6237270 6463800 6734540 7011012 7333299 7690505 7935870
38687G935870q3350n35860r04683j023505q90450o34198l56810m8302L02087N50395
$$ 7935870 7852520 7316660 6411977 5388472 4498022 3863824 3507014 3458712 3760799 4311194
38677D311194M62896j1424n98086r04572p61111l25999R0905K36066O184n11129
$$ 4311194 4774090 4762666 4164580 3260008 2498897 2172898 2263803 2499869 2506053 1994924
38667A994924j046850j308688j206437q74979m50811P9695P45927J399692J768426
$$ 1994924 948074 -360614 -1567051 -2442030 -2892841 -2813146 -2067219 -667527 1100899
38658A100899J677867J167940M54679j51731l99571l25632k82071n54726r62495
$$ 1100899 2778766 3946706 4401385 4249654 3850083 3524451 3242380 2687654 1725159
38649A725159j028731n91897n1668R7337j71832m44387l34508J98648Q96230J390810
$$ 1725159 696428 104531 52863 150200 -21632 -466019 -800527 -601879 294351 1685161
38639A685161J401973R13305J86375m72004r32439j180646j146791p74900k32568
$$ 1685161 3087134 4000439 4186814 3714810 2782371 1601725 454934 -319966 -552534
38630e52534J43230J69567k6645k02911k26380p4470K31600N86023P88623P01276
$$ -552534 -409304 -239737 -266382 -469293 -695673 -770143 -538543 47480 836103 1537379
38620A537379L92071N9981j48083j97478j09260O1118K04375K04630M3736j61721
$$ 1537379 1929450 1989431 1841348 1643870 1534610 1595728 1800103 2004733 2048469 1886748
38610A886748k48580j53486N681J8080j91166m21698l59586R6749P24743J194630
$$ 1886748 1638168 1484682 1490363 1508443 1317277 895579 535993 632742 1357485 2552115
38600B552115J316514J067568N22594j30365n96352o53732l44815Q7609M43555
$$ 2552115 3868629 4936197 5458791 5328426 4732074 4078342 3733527 3821136 4264691
38591D264691O75120P79502O99175L82733j00038n52563p79632p49295o38165
$$ 4264691 4939811 5719313 6418488 6801221 6701183 6148620 5368988 4619693 3981528
38582C981528o66467q50891r75153q59912n95074m11300l77469l61545k76199
$$ 3981528 3315061 2464170 1489017 629105 34031 -377269 -754738 -1116283 -1392482
38573a392482k01734k14452k37769j73363q9317j43785l45541n03986m35669j46331
$$ -1392482 -1594216 -1808668 -2046437 -2219800 -2309117 -2452902 -2798443 -3302429 -3738098 -3884429
38563c884429K14156N15242P22247Q45428Q68855P48941M72147J00419k47257
$$ -3884429 -3670273 -3155031 -2432784 -1587356 -718501 30440 502587 603006 355749
38554C55749m60312m90039l55313j12406J78770M60830O48546O12989K60184l24745
$$ 355749 -104563 -594602 -949915 -1062321 -883551 -422721 225825 838814 1098998 774253
38544G74253q49766j019875p99431m33020j93335j53088k15703k92057l69411
$$ 774253 -75513 -1095388 -1894819 -2327839 -2521174 -2674262 -2889965 -3182022 -3551433
38535c551433m29322l83887j39143K94070P75409J122512J222213J071795P47597
$$ -3551433 -3980755 -4364642 -4503785 -4209715 -3434306 -2311794 -1089581 -17786 729811
38526G29811L68750P6626l2409k1078j16408m99235j068545j491883j523794j212531
$$ 729811 1098561 1175187 1142778 1121700 1005292 506057 -562488 -2054371 -3578165 -4790696
38516d790696p66655l12873J33315N31068P80219Q33995P62174O79925O58809
$$ -4790696 -5557351 -5870224 -5736909 -5205841 -4425622 -3591627 -2829453 -2149528 -1490719
38507a490719O97747P17868N96781K96081k9892j45349q51J83557J64266n2527
$$ -1490719 -792972 -75104 521677 817758 787866 642517 641666 825223 989489 936962
38497I36962k47828k48103o1078K13119M90494O91262P10352M87905J07031k27736
$$ 936962 689134 441031 379953 593072 1083566 1774828 2485180 2973085 3080116 2852380
38487B852380l39306k11927K0937K16841L40653M33585M96261M63598L14238J43027
$$ 2852380 2513074 2301147 2322084 2538925 2879578 3313163 3809424 4273022 4587260 4730287
38477D730287O3284O4125L2009q7318k10564k22362j20279k8491p9398k87782
$$ 4730287 4793571 4857696 4889705 4802387 4591823 4369461 4249182 4220691 4141293 3853511
38467C853511n33948o78267o94475o59310o10660m98880l30394k53309l64871
$$ 3853511 3319563 2641296 1946821 1287511 676851 177971 -152423 -405732 -770603
38458g70603n00935m08620j26553K4827r6254k20839m9992L14655N39065N34632
$$ -770603 -1271538 -1680158 -1806711 -1781884 -1878138 -2098977 -2148969 -1834314 -1295249 -760617
38448g60617N08200N77562O10022M90060L09647J87030Q0611q6187k49297k89097
$$ -760617 -252417 325145 935167 1425227 1734874 1921904 2002515 1916328 1667031 1377934
38438A377934k05208r7156m2761p9932k17206l61715l25985k4880M03187P78333
$$ 1377934 1172726 1075570 1032809 952877 735671 373956 47971 23091 426278 1204611
38428A204611J094429J414954J639743J568966J184197O90777K66718p6185l66784
$$ 1204611 2299040 3713994 5353737 6922703 8106900 8797677 9064395 8988210 8621426
38419H621426n80494p18803q20342q17267n39080J6451N30838O27766K37540l95907
$$ 8621426 8040932 7322129 6501787 5684520 5145440 5161891 5692729 6320495 6558035 6162128
38409F162128r90050j377407j460005j208449p46925l08277l9774P8252J02639
$$ 6162128 5172078 3794671 2334666 1126217 379292 71015 31241 109493 212132
38400B12132K5606j33246k31549j24817J34490L21395K87899J21715K4224Q6116
$$ 212132 237738 104492 -127057 -251874 -117384 204011 491910 613625 637849 723965
38390G23965K33183L50493L81393L06585J12756j61974l92582m44918k97534n8138
$$ 723965 957148 1307641 1689034 1995619 2108375 1946401 1553819 1108901 811367 753229
38380G53229J40542K43067K84814L32547M02997M19013K71601l5439l30156m28512
$$ 753229 893771 1136838 1421652 1754199 2157196 2576209 2847810 2812371 2482215 2053703
38370B053703l46477k90796m21794o88612r31689j086988j227272j428401j652369
$$ 2053703 1707226 1416430 994636 306024 -625665 -1712653 -2939925 -4368326 -6020695
38361f020695j759281j595217j072835k18318Q19363J807558K513829K796587
$$ -6020695 -7779976 -9375193 -10448028 -10666346 -9846983 -8039425 -5525596 -2729009
38353b729009K639689K101489J251943K11345p55277j307051j311240j015394
$$ -2729009 -89320 2012169 3264112 3475457 2720180 1413129 101889 -913505
38345i13505q04822p90861p67777n76263l22018j53546j5035K03820M09139M38148
$$ -913505 -1718327 -2509188 -3276965 -3853228 -4175246 -4328792 -4343827 -4140007 -3730868 -3292720
38335c292720M05383O35053J168064J564477J364006O13923k27145q15039j146824
$$ -3292720 -2887337 -2252284 -1084220 480257 1844263 2458186 2231041 1416002 269178
38326B69178j297994j189162p48963j69853J91783J83655J5462P631K42136N04519
$$ 269178 -1028816 -2217978 -2966941 -3136794 -2945011 -2761356 -2745894 -2738263 -2496127 -1991608
38316a991608N35926K95550k0545j85508j48173l7252K1305M9049J45840L17037
$$ -1991608 -1455682 -1160132 -1180677 -1366185 -1514358 -1551610 -1530305 -1481256 -1335416 -1018379
38306a018379M55770N05245N38132O14054O41811M79808J22332l13963p36227
$$ -1018379 -562609 -57364 480768 1094822 1736633 2216441 2338773 2024810 1288583
38297A288583j071308j151482q07964j50699M13301N81686M91469N25696Q39907
$$ 1288583 217275 -934207 -1742171 -1892870 -1479569 -897883 -406414 119282 959189
38288I59189J200788J266789R19676L29418k08178m85377n08089m32165l57347
$$ 959189 2159977 3426766 4346442 4675860 4467682 3982305 3474216 3042051 2684704
38279B684704k22684N6038M14803O87756P67114O26531K59125k66628p34464r37403
$$ 2684704 2462020 2518058 2932861 3620617 4387731 5014262 5273387 5006759 4272295 3334892
38269C334892r14242q68633q36670o26063j57865L23091N26283M74805M21804
$$ 3334892 2420650 1552017 715347 89284 -68581 254510 780793 1255598 1677402
38260A677402M92284N88634O21658O49970P42611Q32043P81151N35505J56990
$$ 1677402 2169686 2758320 3379978 4029948 4772559 5604602 6385753 6921258 7078248
38251G078248k50450o01348q40646r44613r26503q32350p12303n73826l64654
$$ 7078248 6827798 6226450 5385804 4441191 3514688 2682338 1970035 1396209 1031555
38242A031555l2844L84634P60769R76553R92272Q27581N38494K37463M8801l5748
$$ 1031555 998711 1383345 2144114 3120667 4112939 4940520 5479014 5716477 5765278 5729530
38232E729530k04419o25892j203066j601789j538518r99284k06353N33799R46466
$$ 5729530 5525111 4899219 3696153 2094364 555846 -443438 -649791 -115992 830474
38223H30474Q94166M88816O6384o3996J10187L26265L57261K51729K21646L41177
$$ 830474 1724640 2213456 2279840 2215844 2326031 2652296 3009557 3261286 3482932 3824109
38213C824109M50992L69732J01805k21501n18244p63071q65633o86884k09711
$$ 3824109 4275101 4644833 4746638 4525137 4006893 3243822 2378189 1691305 1481594
38204A481594L99331R22423J197798J099231N75866j85467p58432p93427l19364
$$ 1481594 1880925 2803348 4001146 5100377 5676243 5490776 4732344 3938917 3619553
38195C619553L37644Q61204J075330Q87383L27328l35854p16512o69772m41865
$$ 3619553 3957197 4818401 5893731 6781114 7108442 6772588 6056076 5386304 4944439
38186D944439l81766n66906p83925q11099o14674k87125R1981M72323P59315Q10488
$$ 4944439 4562673 3995767 3211842 2400743 1786069 1498944 1590925 2063248 2822563 3633051
38176C633051N44693L0784n65649j101990j478737j577562j304942p53614k20013
$$ 3633051 4177744 4208528 3642879 2540889 1062152 -515410 -1820352 -2573966 -2793979
38167b793979M6678P2953N7606R6486J28210J25988J97518M48049Q29816J165173
$$ -2793979 -2747301 -2674348 -2616742 -2520256 -2392046 -2266058 -2068540 -1620491 -790675 374498
38157C74498J261696J003797M29170k37903o96501p76216n37036j82900Q2576
$$ 374498 1636194 2639991 3069161 2831258 2134757 1358541 821505 638605 721181
38148G21181J54605Q1910L2798J27089K92304L55071K61229J16500L6073Q1910
$$ 721181 875786 957696 990494 1117583 1409887 1764958 2026187 2142687 2178760 2260670
38138B260670L27556P93531J264072J358432R14640J86413m46479q42054j059019
$$ 2260670 2588226 3381757 4645829 6004261 6918901 7105314 6658835 5816781 4757762
38129D757762j108567r47454o56598m24469l38327l28007l22274l33414l64297
$$ 4757762 3649195 2701741 2045143 1620674 1282347 954340 632066 298652 -65645
38120f5645l36639j51707K20834O93385J042381J006481N36690n9195l48368j80325
$$ -65645 -402284 -553991 -333157 360228 1402609 2409090 2945780 2886585 2538217 2357892
38110B357892K08718M80654M81627K64654j9421k02748j92454o3607n44r7171
$$ 2357892 2566610 3047264 3528891 3793545 3774124 3571376 3378922 3315315 3314771 3217600
38100C217600k65306l59138l15397j45214J19999M12104O16066O40258M78773
$$ 3217600 2952294 2593156 2277759 2132545 2252544 2664648 3280714 3920972 4399745
38091D399745J95393j03729k82477k49868o0112J35058K68424M14779O33190Q52223
$$ 4399745 4595138 4491409 4208932 3959064 3898952 4034010 4302434 4717213 5350403 6202626
38081F202626R81757J048727J124647J183169J137231R75874P49847M39189m1106
$$ 6202626 7184383 8233110 9357757 10540926 11678157 12654031 13403878 13843067 13801961
38072A3801961o72773j265302j612870j676479j571950j416967j243288j051183
$$ 13801961 13129188 11863886 10251016 8574537 7002587 5585620 4342332 3291149
38064C291149q90467q31329q47690p86027n20578j38413J03093M0143k24829m49672
$$ 3291149 2400682 1569353 721663 -64364 -584942 -723355 -620262 -580119 -804948 -1254620
38054a254620m96963l98463k30047j2297K75386O60168J157957J715587K159508
$$ -1254620 -1751583 -2150046 -2380093 -2392390 -2117004 -1456836 -298879 1416708 3576216
38045C576216K285710K044244J571053R90154K60848o81004j672915k359471k525232
$$ 3576216 5861926 7906170 9477223 10467377 10728225 10047221 8374306 6014835 3489603
38036C489603k299629j963490j635942j257045q15963m30839j74966L7741L23496
$$ 3489603 1189974 -773516 -2409458 -3666503 -4482466 -4913305 -5088271 -5050530 -4727034
38027d727034O87612J082092J485855J810017J827858J383056O48828J7175k85964
$$ -4727034 -4039422 -2957330 -1471475 338542 2166400 3549456 4198284 4215459 3929495
38018C929495l41899k98798j73738L7268K19691K45649J30802k4953j84381l58608
$$ 3929495 3587596 3288798 3115060 3152328 3372019 3617668 3748470 3723517 3539136 3180528
38008C180528n09234n74663n54447m71313k90665J6342L56328N71465O17786O00955
$$ 3180528 2671294 2096631 1542184 1070871 780206 796548 1152876 1724341 2342127 2943082
37998B943082O28425O90875O83139M83715M3021n24119r57758j065592r15056
$$ 2943082 3571507 4262382 4945521 5429236 5472257 4948138 3990380 2924788 2009732
37989B009732p22240n65814l41551j7498K27339K21344N0066m9049j502K8389
$$ 2009732 1287492 721678 380127 362629 589968 811312 861378 812329 810827 839216
37979H39216j02864k83903k45590J32663O64358J015092J001220P19216M03811
$$ 839216 736352 452449 206859 339522 1003880 2018972 3020192 3739408 4143219
37970D143219K10769J55689J94053K64284K56443M9237l47769p36671q95375p98399
$$ 4143219 4353988 4509677 4703730 4968014 5224457 5273694 4925925 4189254 3293879 2495480
37960B495480o24080n43073n52555n35898m33697l07096k49213k79883l30160
$$ 2495480 1871400 1328327 775772 239874 -193823 -500919 -750132 -1030015 -1360175
37951a360175k98667j30783J03176K00751j5375m59655p57588n66743O9770P67111
$$ -1360175 -1658842 -1789625 -1686449 -1485698 -1501073 -1960728 -2718316 -3285059 -3215289 -2448178
37941b448178J189076J298674J228103J066107Q74122P88214R32230J240363J485518
$$ -2448178 -1259102 39572 1267675 2333782 3207904 3996118 4928348 6168711 7654229
37932G654229J498619J284392R28065M80811l6115n74832j038211j299220j273912
$$ 7654229 9152848 10437240 11365305 11846116 11810001 11235169 10196958 8897738 7623826
37923G623826j027618p78151p19180q47903j020104j135362j180768j131039r39705
$$ 7623826 6596208 5818057 5098877 4250974 3230870 2095508 914740 -216299 -1156004
37914a156004o46156l75062j93190o5080J7984j9461j98347l82032l97069k02888
$$ -1156004 -1802160 -2177222 -2370412 -2435492 -2417508 -2436969 -2635316 -3017348 -3414417 -3617305
37904c617305J16911M63793P49935Q75767P85466N48181L38233L38724O58529
$$ -3617305 -3500394 -3036601 -2286666 -1410899 -625433 -77252 260981 599705 1258234
37895A258234J257424J892873K217910K041894J492478Q68851L64630j6553l36835
$$ 1258234 2515658 4408531 6626441 8668335 10160813 11029664 11394294 11377741 11040906
37886A1040906o25298q90673j131558j307206j351433j223506r11815m25992J34038
$$ 11040906 10415608 9524935 8393377 7086171 5734738 4511232 3599417 3173425 3307463
37877C307463N31488N44490K07037j93126m11195m70056n42157o96774q59757
$$ 3307463 3838951 4383441 4590478 4397352 3986157 3516101 2973944 2277170 1417413
37868A417413r66270j026065j033080r21649o56434k88877J21297N63113R81632
$$ 1417413 451143 -574922 -1608002 -2529651 -3186085 -3474962 -3353665 -2790552 -1808920
37859a808920J201660J071728O78718K96998Q4984o4043l05878n80440o74508
$$ -1808920 -607260 464468 1143186 1440184 1525168 1461125 1155247 574807 -99701
37850i9701m95901j63025J60905L96166M93520L83714N7310l73102p54606r93477
$$ -99701 -595602 -758627 -597722 -201556 291964 675678 732988 359886 -394720 -1388197
37840a388197j037256q36110m08973Q6143M36162N38117M42491K50173K2785k05195
$$ -1388197 -2425453 -3261563 -3670536 -3584393 -3148231 -2610114 -2167623 -1917450 -1894665 -2099860
37830b099860l81141m34969l26011r8644J05459J30784n0114k87792l89960l08440
$$ -2099860 -2481001 -2915970 -3241981 -3340625 -3235166 -3104382 -3154496 -3442288 -3832248 -4140688
37820d140688j68064j15955j75897k53846k48651j33390N0349K42099L97833M99251
$$ -4140688 -4308752 -4424707 -4600604 -4854450 -5103101 -5236491 -5186142 -4944043 -4546210 -4046959
37810d046959N52879N78174N76977N14720L55723J18051j39994l89079o26161
$$ -4046959 -3494080 -2915906 -2338929 -1824209 -1468486 -1350435 -1490429 -1879508 -2505669
37801b505669p79573o97894l15315K11761O16677P51098O38286L56363o632l00602
$$ -2505669 -3285242 -3983136 -4298451 -4086690 -3470013 -2718915 -2080629 -1724266 -1730898 -2031500
37791b031500l68295k02036N3001K84403N01515P15253Q57677Q80617Q15046O59110
$$ -2031500 -2399795 -2601831 -2548830 -2264427 -1762912 -1047659 -189982 690635 1505681 2164791
37781B164791L30683j60654n93297p12884m81718o6260L39735N74023M89575O0073
$$ 2164791 2495474 2334820 1741523 1028639 546921 480661 820396 1394419 1883994 1944067
37771A944067n04958q85798r19946o87399l74775j45437q6085j41922j12083J65352
$$ 1944067 1439109 553311 -366635 -1054034 -1428809 -1574246 -1660331 -1802253 -1914336 -1748984
37761a748984O03287R20440R00387N30535n4586o30731r12936p09275j21716M95795
$$ -1748984 -1145697 -225257 675130 1205665 1151079 520348 -392588 -1101863 -1223579 -727784
37751g27784Q36928Q67916P76243P75237R34696J098015R73239M12536l98775
$$ -727784 109144 977060 1753303 2528540 3463236 4561251 5534490 5947026 5548251
37742E548251j122315j598201j870013j936625j700188j197112o65388k76810
$$ 5548251 4425936 2827735 957722 -978903 -2679091 -3876203 -4541591 -4818401
37734d818401L3207L54535N75850N28351K63389K8343p040J00773J67823O6564
$$ -4818401 -4785194 -4430659 -3854809 -3326458 -3063069 -3034726 -3041766 -2940993 -2773170 -2706606
37724b706606j43147k21143M0193N56430R94555J138784J104597J103232J121111
$$ -2706606 -2849753 -3070896 -3030703 -2474273 -1479718 -340934 763663 1866895 2988006
37715B988006R79121O24555K01179j30437l01304l06691k31559k87975o51820
$$ 2988006 3967127 4591682 4792861 4662424 4361120 4054429 3822870 3534895 2883075
37706B883075j213605j614867j590103j198635p03632l24101j37169j07627j23322
$$ 2883075 1669470 54603 -1535500 -2734135 -3437767 -3761868 -3899037 -4006664 -4129986
37697d129986n5942J30799L41788M56722M57066M14590L76833L20321K38220K32377
$$ -4129986 -4185928 -4055129 -3713341 -3256619 -2799553 -2384963 -2008130 -1687809 -1449589 -1217212
37687a217212M43547Q54217J213413J236911Q75414L17578k45062p33996j061528
$$ -1217212 -773665 80552 1293965 2530876 3406290 3723868 3478806 2744810 1683282
37678A683282j073912p35246k53064J20045L39980M99602N88712N09773L06248
$$ 1683282 609370 -125876 -378940 -258895 81085 580687 1169399 1679172 1985420
37669A985420J72889J81018J40447j77895p60348j347016j652766j572053j240276
$$ 1985420 2158309 2339327 2479774 2301879 1541531 194515 -1458251 -3030304 -4270580
37660d270580r17618p40994n74578j85212M22408R47614J107960R18647O15927
$$ -4270580 -5188198 -5929192 -6503770 -6688982 -6266574 -5318960 -4211000 -3292353 -2676426
37651b676426M02143L33400L64556L98614L35100J68722L7246J08236M09382P92478
$$ -2676426 -2274283 -1940883 -1576327 -1177713 -842613 -673891 -636645 -528409 -119027 673451
37641F73451J050361J060122Q55511N90786M05181L03210J95301M3683j09544
$$ 673451 1723812 2783934 3639445 4230231 4635412 4938622 5133923 5177606 5068062
37632E068062k70001n36758r50880j379311j637078j669227j527632j229348p58834
$$ 5068062 4798061 4261303 3310423 1931112 294034 -1375193 -2902825 -4132173 -4891007
37623d891007j89904L17261O63239Q67784R67951R48875Q06992N97197L66408
$$ -4891007 -5080911 -4763650 -4100411 -3232627 -2264676 -1315801 -508809 88388 454796
37614D54796J07116j64574l41814l16833j18246J04682K25589K15779R4937j06125
$$ 454796 561912 397338 55524 -261309 -379555 -274873 -49284 166495 261432 155307
37604A55307l03747l54733j64123K10971O05805Q82712R84485Q82092N50864K7398
$$ 155307 -148440 -503173 -667296 -456325 149480 1032192 2016677 2898769 3449633 3477031
37594C477031n64328j085275j448083j584006j400912q58017q5394O34865J043323
$$ 3477031 2912703 1827428 379345 -1204661 -2605573 -3463590 -3548984 -2914119 -1870796
37585a870796J059281P91927M45979K04622J28105J19907J9184k35410n33153
$$ -1870796 -811515 -19588 426391 631013 759118 879025 898209 662799 129646
37576A29646o86942n91515k98762K1668J83284R0173k05101n43719p76264q44817
$$ 129646 -557296 -1148811 -1447573 -1425905 -1242621 -1152448 -1357549 -1901268 -2677532 -3522349
37566c522349p66706n70443k65203J43076O23818J104529J473494J613547J460272
$$ -3522349 -4289055 -4859498 -5124701 -4981625 -4357807 -3253278 -1779784 -166237 1294035
37557A294035J052032N36804J13654q1342o7108J6581N7052O6121J14842K14716
$$ 1294035 2346067 2882871 2996525 2915183 2848075 2864656 2921708 2987829 3102671 3317387
37547C317387L12560L65109L40501J65642k12443o66919q91592o75722j74981
$$ 3317387 3629947 3995056 4335557 4501199 4288756 3621837 2730245 2054523 1879542
37538A879542J73566N1323m41175q95162r85619p33166l98296j83037q5995o297
$$ 1879542 2053108 2104431 1663256 768094 -217525 -950691 -1348987 -1532024 -1618019 -1624316
37528a624316J13687K67764M06181M21830K14151j45792m05585m08669l00765
$$ -1624316 -1510629 -1242865 -836684 -414854 -200703 -346495 -752080 -1160749 -1461514
37519a461514l01394l41866j63672K20780M37183K33205j75218m19713m59553
$$ -1461514 -1762908 -2104774 -2268446 -2047666 -1610483 -1377278 -1552496 -1972209 -2431762
37510b431762n13767o34415o29903m03301j07984J05135K92974N58225Q22485
$$ -2431762 -2945529 -3579944 -4209847 -4613148 -4721132 -4615997 -4323023 -3764798 -2942313
37501b942313Q96180P09965L77556P1643q6890o2426P6966J72324P1867k47750
$$ -2942313 -2046133 -1336168 -958612 -886969 -973859 -1036285 -959319 -786995 -715128 -962878
37491i62878o54739r46883r71877p11433k80704J68251N57522Q90175J160428
$$ -962878 -1617617 -2564500 -3536377 -4247810 -4528514 -4360263 -3802741 -2912566 -1752138
37482a752138J305923J266887J052285P19597L19198j12242n24256q42232r67241
$$ -1752138 -446215 820672 1872957 2592554 2911752 2799510 2275254 1433022 465781
37473D65781p81931k19132O06967J359353J664558J408732Q37764L26571M8236
$$ 465781 -316150 -535282 71685 1431038 3095596 4504328 5342092 5668663 5716899
37464E716899j11192l37124o56323r44842j088382j046275p89438l06527K74350
$$ 5716899 5605707 5268583 4612260 3667418 2579036 1532761 743323 436796 711146
37455G11146O72058O75827L66819M0339q5147k0092J06214J97316K00891P1422
$$ 711146 1383204 2059031 2425850 2466189 2381042 2360950 2467164 2664480 2865371 2936793
37445B936793j81031m27501m87204k87993O2984L77352N32614N13265L41502K7313
$$ 2936793 2755762 2328261 1841057 1553064 1616048 1993400 2526014 3039279 3380781 3408094
37435C408094l82649p43547q71460o97354l40181r253J48639J06715p9840l20136
$$ 3408094 3025445 2281898 1410438 713084 372903 363650 512289 619004 539164 219028
37425B19028n15013n86401m97749k52029J08864N00420Q22267R98191R74144P17376
$$ 219028 -295985 -882386 -1380135 -1632164 -1523300 -1022880 -200613 797578 1771722 2489098
37415B489098L00333l8944o4050J86521M33413N37495O75573R82921J189616Q90095
$$ 2489098 2789431 2750487 2686437 2872958 3306371 3843866 4519439 5502360 6691976 7582071
37405G582071J32450n43496p11645m73869j94245n1716L293M4104J18447K86063
$$ 7582071 7714521 7171025 6459380 5985511 5791266 5739550 5742843 5786947 5905394 6191457
37395F191457N11623N87146L38560j23231n05750o57342o44782n52715l93533
$$ 6191457 6703080 7290226 7628786 7505555 6999805 6342463 5697681 5144966 4751433
37386D751433k34205k28660m33648o99793q23771p33827m71112q1323L77359P64395
$$ 4751433 4517228 4288568 3854920 3155127 2331356 1597529 1126417 1045094 1422453 2186848
37376B186848Q98385O91350K12345l72985q91346j197912j179187p84925j01558
$$ 2186848 3085233 3776583 3988928 3615943 2724597 1526685 347498 -437427 -538985
37367e38985O14298J046760J039323P09338L09530k2990l48357p63908j209458
$$ -538985 75313 1122073 2161396 2870734 3180264 3157274 2808917 2045009 835551
37358H35551j452747j263872o26702J88031P76990Q90374O01505K06268k0299
$$ 835551 -617196 -1881068 -2507770 -2319739 -1542749 -652375 -50870 155398 135099
37349A35099K6369K83120N81307P40722P08821O27391O89424R10793J108651J124672
$$ 135099 161468 444588 1025895 1766617 2475438 3102829 3792253 4703046 5811697 6936369
37339F936369R96653Q68206P90518O79902M55532J71072q628K9750K01945K76774
$$ 6936369 7933022 8801228 9591746 10271648 10727180 10898252 10889624 10919374 11121319 11398093
37329A1398093J17885j54675l16449l35134m19045p55349j294151j818838k126445
$$ 11398093 11515978 11361303 11044854 10709720 10290675 9535326 8241175 6422337 4295892
37320D295892k091502j676077r93723l01130J88265M63366O22661O83344N88001
$$ 4295892 2204390 528313 -465410 -766540 -578275 -114909 507752 1191096 1779097
37311A779097L59198J19443m2356j19361j10106j9015N1277m9427l06072m86026
$$ 1779097 2138295 2257738 2215382 2096021 1985915 1966900 2018177 1968750 1662678 1176652
37301A176652l91544r0971J89224L36837M13599M85547N17118M46435K75699N9893
$$ 1176652 785108 694137 883361 1220198 1633797 2119344 2636462 3082897 3358596 3418489
37291C418489j30654k15178j34167Q2418L14927M59492N19093N72915O74360P93192
$$ 3418489 3287835 3072657 2938490 3020908 3335835 3795327 4314420 4887335 5561695 6354887
37281F354887Q43707P66661O03149M80022M81779N34379M69197K24170p2488k57952
$$ 6354887 7198594 7965255 8568404 9048426 9530205 10064584 10533781 10757951 10685463 10427511
37271A0427511l21204l68265m36245m38160l17243j85325k46085n88458j083728
$$ 10427511 10106307 9738042 9301797 8863637 8546394 8361069 8114984 7526526 6442798
37262F442798j487089j633295j541660j344499j132186q97866o37124m38270l95455
$$ 6442798 4955709 3322414 1780754 436255 -695931 -1593797 -2230921 -2669191 -3064646
37253c064646m40406l49385L0210N96709J077926J275242J197234R90006P99482
$$ -3064646 -3505052 -3854437 -3824227 -3227518 -2149592 -874350 322884 1312890 2112372
37244B112372P06224P33703Q56661R84915R80948P64518M26864J82302J44078
$$ 2112372 2818596 3552299 4408960 5393875 6374823 7139341 7566205 7748507 7892585
37235G892585J93217J60788J04191K54518O58907J030885J057140P39122L12988
$$ 7892585 8085802 8246590 8350781 8605299 9264206 10295091 11352231 12091353 12404341
37226A2404341n9817l56390n25036m76627k67293j08583j28213k43015l07014
$$ 12404341 12344524 11988134 11463098 10986471 10719178 10610595 10482382 10239367 9932353
37217I932353k46321o710M47080R60033J173268Q68553K62802j91530k52895j0790
$$ 9932353 9686032 9679322 10126402 11086435 12259703 13128256 13391058 13199528 12946633 12935843
37207A2935843L55149P27530R72345R39876O53194L56176K46989K30232L2675
$$ 12935843 13290992 14018522 14990867 15930743 16583937 16940113 17187102 17417334 17450009
37198A7450009m71056j118220j607564j727254j472892j024978o22122m08122
$$ 17450009 16978953 15860733 14253169 12525915 11053023 10028045 9405923 8997801
37190H997801l73482m31270n15753n92670o18605n42421l46726p1725J89630L21297
$$ 8997801 8624319 8193049 7677296 7084626 6466021 5923600 5576874 5505149 5694779 6016076
37180F016076K60758Q2759l4909J5886J57446K35329K16615J95958K00139R4799
$$ 6016076 6276834 6359593 6324684 6340570 6498016 6733345 6949960 7145918 7346057 7440856
37170G440856k29756o29364p75564m89366N4654N03405O69583O53444O49802P11525
$$ 7440856 7211100 6581736 5806172 5316806 5371460 5874865 6544448 7197892 7847694 8559219
37160H559219P26588N69863K27680j99333n64436p53245p43589o02617m00647
$$ 8559219 9285807 9855670 10083350 9884017 9319581 8566336 7822747 7220130 6819483
37151F819483j24428K96446Q66866J452484J845491J901560J618729J106916M99196
$$ 6819483 6695055 6991501 7858367 9310851 11156342 13057902 14676631 15783547 16282743
37142A6282743j06101o28030r62004j011612p93413m80357k86132k86921l63709
$$ 16282743 16176642 15548612 14586608 13574996 12781583 12301226 12015094 11728173 11364464
37133A1364464l11503m357M97629R50635J061597P02791L2455o17390r87209j029945
$$ 11364464 11052961 11048604 11546233 12496868 13558465 14261256 14293711 13676321 12689112 11659167
37123A1659167q53339n80846k56176J68755P41119J349849J691038J492327P95113
$$ 11659167 10805828 10224982 9968806 10137561 10878680 12228529 13919567 15411894 16207007
37114A6207007n9988p43080j153634j336236j321483j126287q00967l70633J90610
$$ 16207007 16147019 15403939 14250305 12914069 11592586 10466299 9665332 9294699 9485309
37105I485309Q17375J260816J287128R46538N12326J62185j37819m21964n70578
$$ 9485309 10302684 11563500 12850628 13797166 14309492 14471677 14333858 13911894 13341316
37096A3341316m62997j71562J15493L01796L96611L59345P7814m46355r82895
$$ 13341316 12878319 12706757 12822250 13124046 13520657 13880002 13957816 13511461 12528566
37087A2528566j235745j112769p86334m95295l39516k72691k19348j32075K6364
$$ 12528566 11292821 10180052 9393718 8898423 8558907 8286216 8066868 7934793 7961157
37078G961157K61168M92242O02559N74595N15080N10536N33611N43960N91383
$$ 7961157 8222325 8714567 9317126 9891721 10406801 10917337 11450948 11994908 12586291
37069A2586291P16823Q12601P13945M23054J29366l699K4015J29602K51343L41261
$$ 12586291 13303114 14115715 14829660 15252714 15382080 15378381 15402396 15531998 15783341 16124602
37059A6124602L61758L47990L91144M99557N47697M29244K09809P1734J45611
$$ 16124602 16486360 16834350 17225494 17725051 18272748 18701992 18911801 18983535 19129146
37050A9129146M18207P24860P87064L71508m57698j279432j623030j355954p34482
$$ 19129146 19547353 20272213 21059277 21430785 20973087 19693655 18070625 16714671 15980189
37041A5980189j26885K32497K79925P7006k22169m51804n47208n54313n28094
$$ 15980189 15853304 16085801 16365726 16442732 16220563 15768759 15221551 14667238 14139144
37032A4139144m79812m29881m35424n23061o39036p00840o68502n48963l75045
$$ 14139144 13659332 13229451 12794027 12270966 11631930 10931090 10262588 9713625 9338580
37023I338580k09689j33330j87495l41878n28511o83027p47738o87100n39096
$$ 9338580 9128891 8995561 8808066 8466188 7937677 7254650 6506912 5819812 5280716
37014E280716m14310l88758m04811l20675o0587L14712O82514R57513J100179
$$ 5280716 4866406 4477648 4072837 3752162 3691575 4006287 4688801 5646314 6746493
37005F746493J076803Q78163N85492L61483L24533M37015N48066N44270M36710
$$ 6746493 7823296 8701459 9286951 9648434 9972967 10409982 10958048 11502318 11939028
36996A1939028L18063K80701L71846N63655P36059P36306N01128J06692l11268
$$ 11939028 12257091 12537792 12909638 13473293 14209352 14945658 15446786 15553478 15242210
36987A5242210o47009q27226q03528o04932l50708j45449P569J38438K11030J71258
$$ 15242210 14595201 13767975 12964447 12359515 12008807 11863358 11870927 12009365 12220395 12391653
36977A2391653M8908r1056k72937n69144r30940j173702j160116r08787n06593
$$ 12391653 12440561 12349505 12076568 11507424 10576484 9402782 8242666 7333879 6827286
36968F827286k6968M22571O88571O92749M95132J71332k97015r29182j603491
$$ 6827286 6800318 7222889 7911460 8604209 9099341 9270673 8973658 8044476 6440985
36959F440985k094156k218038j902465j194669k99834M65236Q98720J083369J218096
$$ 6440985 4346829 2128791 226326 -968343 -1268177 -802941 95779 1179148 2397244
36950B397244J297194J098513N24260j80053o40365p22218n99178m85558l83696
$$ 2397244 3694438 4792951 5317211 5137158 4496793 3774575 3175397 2689839 2306143
36941B306143j14885M34803J121873J601462J589268J089175L78431k18195n43970
$$ 2306143 2191258 2626061 3747934 5349396 6938664 8027839 8406270 8188075 7644105
36932G644105o44081o39105n87048m62788k52297k3664J38193K42713L60298M70358
$$ 7644105 7000024 6360919 5773871 5311083 5058786 5035122 5173315 5416028 5776326 6246684
36922F246684M47417K60796R5533J69766M86182Q71357J210910J506352J716363
$$ 6246684 6694101 6954897 7050430 7220196 7706378 8577735 9788645 11294997 13011360
36913A3011360J706999J414966R44976M44155k9605m63382q10564j026988j107099
$$ 13011360 14718359 16133325 17078301 17522456 17492851 17029469 16218905 15191917 14084818
36904A4084818j016617o72038p8127N74995J050424J269016J303791J223663J046678
$$ 14084818 13068201 12396163 12318036 12893031 13943455 15212471 16516262 17739925 18786603
$$ [...]
##END NTUPLES=NMR SPECTRUM
##END=
