##TITLE=31Pdec_11P153_k5
  aceton-d6
  24 sc
 25.9.2023
##JCAMPDX= 6.0         $$ Bruker NMR JCAMP-DX V2.0
##DATA TYPE= NMR SPECTRUM
##DATA CLASS= NTUPLES
##ORIGIN= UXNMR, Bruker Analytische Messtechnik GmbH
##OWNER= root
$$ XWIN-NMR		Version 3.5
$$ Wed Sep 27 14:02:23 2023 Russian Standard Time (UT+4h)  she@DPX200
##.OBSERVE FREQUENCY= 81.013821
##.OBSERVE NUCLEUS= ^31P
##.ACQUISITION MODE= SIMULTANEOUS
##.ACQUISITION SCHEME= undefined
##.AVERAGES= 24
##.DIGITISER RES= 16
##SPECTROMETER/DATA SYSTEM= spect
##.PULSE SEQUENCE= zgpg30
##.SOLVENT NAME= CDCl3
##.SHIFT REFERENCE= (INTERNAL, CDCl3, 0, 248.564)
##AUDIT TRAIL= $$ (NUMBER, WHEN, WHO, WHERE, WHAT)
$$ ##TITLE= Audit trail, XWIN-NMR		Version 3.5
$$ ##JCAMPDX= 5.01
$$ ##ORIGIN= Bruker BioSpin GmbH
$$ ##OWNER= she
$$ F:/spectra/data/she/nmr/P31/1/pdata/1/auditp.txt
$$ ##AUDIT TRAIL=  $$ (NUMBER, WHEN, WHO, WHERE, WHAT)
(   1,<2023-09-27 14:01:01.42 +0400>,<she>,<DPX200>,
      <created by zg, POWCHK disabled, PULCHK disabled
       configuration hash MD5:
       00 E9 B6 7A A2 85 ED C7 34 08 36 98 17 FE 4E 26
       data hash MD5: 32K
       32 7E 73 42 9C 5D 6E 51 0A 44 B0 45 B7 55 E8 90>)
(   2,<2023-09-27 14:01:12.81 +0400>,<she>,<DPX200>,
      <Start of raw data processing
       efp BC_mod = 2 LB = 5 FT_mod = 6 PKNL = 1 PHC0 = -10632.88 PHC1 = 25.68629 SI = 64K 
       data hash MD5: 64K
       95 06 BA F8 66 0C 2D 0B B9 DE C3 86 CE 77 84 D5>)
(   3,<2023-09-27 14:01:29.00 +0400>,<she>,<DPX200>,
      <pk PHC0 = -14.62428 PHC1 = 0 
       data hash MD5: 64K
       9C 51 20 8E 18 EA 87 7C C1 D1 01 BE 10 EE 1A D6>)
(   4,<2023-09-27 14:01:34.85 +0400>,<she>,<DPX200>,
      <abs ABSG = 5 
       data hash MD5: 64K
       01 E7 B2 00 87 3A 5B C0 F5 EE D4 52 83 07 04 E2>)
$$ ##END=
$$ 
$$ hash MD5
$$ 52 8B 43 2A E0 8E F2 7E 8B 4D E6 3E 0E C5 69 6A
##$RELAX= 
##$RELAX= 
##$RELAX= 
##$RELAX= 
##$RELAX= 
##$RELAX= 
##$RELAX= 
##$RELAX= 
##$RELAX= 
$$ Bruker specific parameters
$$ --------------------------
##$DU= <F:/spectra>
##$EXPNO= 1
##$NAME= <P31>
##$PROCNO= 1
##$TYPE= <nmr>
##$USER= <she>
##$AMP= (0..31)
100 100 100 100 100 100 100 100 100 100 100 100 100 100 100 100 100 100 
100 100 100 100 100 100 100 100 100 100 100 100 100 100 
##$AQSEQ= 0
##$AQ_mod= 1
##$AUNM= <au_zg>
##$AUTOPOS= <>
##$BF1= 81.014009
##$BF2= 200.13
##$BF3= 200.13
##$BF4= 200.13
##$BF5= 200.13
##$BF6= 200.13
##$BF7= 200.13
##$BF8= 200.13
##$BYTORDA= 1
##$CFDGTYP= 0
##$CFRGTYP= 5
##$CHEMSTR= <none>
##$CNST= (0..31)
1 1 145 1 1 1 1 1 1 1 1 1 1 1 1 1 1 1 1 1 1 1 1 1 1 1 1 1 1 1 1 1 
##$CPDPRG= <waltz16>
##$CPDPRG1= <>
##$CPDPRG2= <waltz16>
##$CPDPRG3= <>
##$CPDPRG4= <mlev>
##$CPDPRG5= <mlev>
##$CPDPRG6= <mlev>
##$CPDPRG7= <mlev>
##$CPDPRG8= <mlev>
##$CPDPRGB= <>
##$CPDPRGT= <>
##$D= (0..31)
0 1 0 0 0 0 0 0 0 0 0 0.03 2e-05 3e-06 0 0 0 0 0 0 0 0 0 0 0 0 0 0 0 0 
0 0 
##$DATE= 1695808860
##$DBL= (0..7)
120 120 120 11 120 120 24 19 
##$DBP= (0..7)
150 150 150 150 150 150 150 150 
##$DBP07= 0
##$DBPNAM0= <>
##$DBPNAM1= <>
$$ [...]
##$SUBNAM3= <"">
##$SUBNAM4= <"">
##$SUBNAM5= <"">
##$SUBNAM6= <"">
##$SUBNAM7= <"">
##$SUBNAM8= <"">
##$SUBNAM9= <"">
##$SW= 501.771253377433
##$SWIBOX= (0..15)
0 1 3 0 0 0 0 0 0 0 0 0 0 0 0 0 
##$SW_h= 40650.406504065
##$TD= 32768
##$TD0= 1
##$TE= 0
##$TE2= 300
##$TE3= 300
##$TEG= 300
##$TL= (0..7)
0 120 53 12 22 120 120 120 
##$TP= (0..7)
150 150 150 150 150 150 150 150 
##$TP07= 0
##$TPNAME0= <>
##$TPNAME1= <>
##$TPNAME2= <>
##$TPNAME3= <>
##$TPNAME4= <>
##$TPNAME5= <>
##$TPNAME6= <>
##$TPNAME7= <>
##$TPOAL= (0..7)
0.5 0.5 0.5 0.5 0.5 0.5 0.5 0.5 
##$TPOFFS= (0..7)
0 0 0 0 0 0 0 0 
##$TUNHIN= 0
##$TUNHOUT= 0
##$TUNXOUT= 0
##$USERA1= <user>
##$USERA2= <user>
##$USERA3= <user>
##$USERA4= <user>
##$USERA5= <user>
##$V9= 5
##$VALIST= <valist>
##$VCLIST= <CCCCCCCCCCCCCCC>
##$VD= 0
##$VDLIST= <DDDDDDDDDDDDDDD>
##$VPLIST= <PPPPPPPPPPPPPPP>
##$VTLIST= <TTTTTTTTTTTTTTT>
##$WBST= 1024
##$WBSW= 4
##$XGAIN= (0..3)
0 0 0 0 
##$XL= 0
##$YL= 0
##$YMAX_a= 3951
##$YMIN_a= -2279
##$ZGOPTNS= <>
##$ZL1= 120
##$ZL2= 120
##$ZL3= 120
##$ZL4= 120
##$ABSF1= 248.5645
##$ABSF2= -253.2056
##$ABSG= 5
##$ABSL= 3
##$ALPHA= 0
##$AQORDER= 0
##$ASSFAC= 0
##$ASSFACI= 0
##$ASSFACX= 0
##$ASSWID= 0
##$AUNMP= <proc_1d>
##$AZFE= 0.1
##$AZFW= 0.5
##$BCFW= 0
##$BC_mod= 2
##$BYTORDP= 0
##$COROFFS= 0
##$CY= -3
##$DATMOD= 1
##$DC= 0
##$DFILT= <>
##$DTYPP= 0
##$F1P= 0
##$F2P= 0
##$FCOR= 1
##$FTSIZE= 65536
##$FT_mod= 6
##$GAMMA= 0
##$GB= 0
##$INTBC= 1
##$INTSCL= 6.047779e-11
##$ISEN= 30
##$LB= 5
##$LEV0= 0
##$LPBIN= 0
##$MAXI= 10000
##$MC2= 0
##$MEAN= 0
##$ME_mod= 0
##$MI= 50
##$NCOEF= 0
##$NC_proc= -10
##$NLEV= 6
##$NOISF1= 182.463
##$NOISF2= 159.3651
##$NSP= 0
##$NTH_PI= 0
##$NZP= 0
##$OFFSET= 248.5645
##$PC= 4
##$PHC0= -10647.5
##$PHC1= 25.68629
##$PH_mod= 1
##$PKNL= yes
##$PPARMOD= 0
##$PSCAL= 0
##$PSIGN= 0
##$REVERSE= no
##$SF= 81.0140089999694
##$SI= 65536
##$SIGF1= 159.3651
##$SIGF2= -187.1042
##$SINO= 113.3802
##$SIOLD= 16384
##$SREGLST= <1H.CDCl3>
##$SSB= 0
##$STSI= 65536
##$STSR= 0
##$SW_p= 40650.406504065
##$SYMM= 0
##$S_DEV= 0
##$TDeff= 32768
##$TDoff= 0
##$TI= <>
##$TILT= no
##$TM1= 0
##$TM2= 0
##$TOPLEV= 0
##$USERP1= <user>
##$USERP2= <user>
##$USERP3= <user>
##$USERP4= <user>
##$USERP5= <user>
##$WDW= 1
##$XDIM= 65536
##$YMAX_p= 284111087
##$YMIN_p= -34363560
$$ End of Bruker specific parameters
$$ ---------------------------------
##NTUPLES= NMR SPECTRUM
##VAR_NAME=  FREQUENCY,     SPECTRUM/REAL,   SPECTRUM/IMAG
##SYMBOL=    X,             R,               I
##VAR_TYPE=  INDEPENDENT,   DEPENDENT,       DEPENDENT
##VAR_FORM=  AFFN,          ASDF,            ASDF
##VAR_DIM=   65536,         65536,           65536
##UNITS=     HZ,            ARBITRARY UNITS, ARBITRARY UNITS
##FACTOR=    0.620285442955139, 1,           1
##FIRST=     20137.2065510682, 0,            0
##LAST=      -20513.1999529968, 0,           0
##MIN=       -20513.1999529968, -34363560,   0
##MAX=       20137.2065510682, 284111087,    0
$$ Real data points
##PAGE= N=1
##DATA TABLE= (X++(R..R)), XYDATA
$$ [...]
42380a7778870r25326p28633j46388O45112J280204J598590J765854J926041J925450
42371a0437966J593802J191982J272852K017061K924022L288657K822943J687775
42363F361128J46458j494279k683634k798924j762312l10485N97471O24981J92094
42354a127502j51944k86267m41458p84108j230936j606885j854308k055234k274322
42345a1812964k382055k057362j053109M77771J953000K719463K479841J441737
42337h233678J66993p21220q71640m29123J03846L55644M30566O87217J231315
42328g280080J775272J992396J852729J564563J315397J143993R80088P40605
42320D084963M32159J77729Q3130R6599J08868J65996M04676P51800R04088P05228
$$ y = [-17778870, -18704196, -19432829, -19579217, -18934105, -17653901, -16055311, -14289457, -12363416, -10437966, -8844164, -7652182, -6379330, -4362269, -1438247, 1850410, 4673353, 6361128, 6507586, 5013307, 2329673, -469251, -2231563, -2542048, -1944577, -1319596, -1127502, -1279446, -1565713, -2007171, -2791279, -4022215, -5629100, -7483408, -9538642, -11812964, -14195019, -16252381, -17305490, -16827719, -14874719, -12155256, -9675415, -8233678, -8066685, -8787905, -9659545, -10088668, -9984822, -9629178, -9198612, -8511395, -7280080, -5504808, -3512412, -1659683, -95120, 1220277, 2364270, 3344358, 4084963, 4517122, 4694851, 4777981, 4874580, 4983448, 5149444, 5554120, 6305920, 7210008, 7915236]
42310G915236L36173j6119m59941j120966j722252j780653j218549m89415k8316
42301A415198J74519L34759M25798J88039m66622j225580j606681j395727q43953
42292c000250m10945k88471k11040K34477J182073K416208L589131M348977M365120
42283A2225280L511092K089362O84993l00275q72952j219403j453850j657532
42275A3006715j958388k405289k848418l046745k833154k156461j121595o8497
42267c431832N58142N67263J73606k68789n42759n16823o0001P77844J647211
42258a096138K185747K333436K176915J626809N44051q65392k092739k811183
42250B001506l079309l023163k591231j760491p61496J21683Q90363J783982K885943
$$ y = [7915236, 8251409, 8235290, 7775349, 6654383, 4932131, 3151478, 1932929, 1443514, 1415198, 1589717, 1924476, 2350274, 2538313, 2071691, 846111, -760570, -2156297, -3000250, -3411195, -3699666, -3910706, -3676229, -2494156, -77948, 3511183, 7860160, 12225280, 15736372, 17825734, 18510727, 18210452, 17337500, 16118097, 14664247, 13006715, 11048327, 8643038, 5794620, 2747875, -85279, -2241740, -3363335, -3431832, -2873690, -2306427, -2132821, -2401610, -2944369, -3461192, -3521193, -2743349, -1096138, 1089609, 3423045, 5599960, 7226769, 7770820, 6905428, 4812689, 2001506, -1077803, -4100966, -6692197, -8452688, -9214184, -9092501, -8202138, -6418156, -3532213]
42241c532213L885183M286529L861555K884283J884023J140750M78448m07611
42233A4480947j520186k549350l185857l300487k907504k156017j319224n77182
42225c034860J93931J220937K419603L383197L782824L553605K706075J298858
42217A5524170k91387j422423j767994j655189j625742j856365k195527k504452
42209B205091k641883k310631j342165j16269O57037O52095K06808j19259l3825
42200b843001M34852J076367J578030J674541J352125Q18168K70587j51249k39148
42191C971272J67244Q59507J330847J326383J122637J108462J292009J421974
42183A2600335J422226J440843J530313J508615J150852L89833o43926j663477
$$ y = [-3532213, 352970, 4639499, 8501054, 11385337, 13269360, 14410110, 14888558, 14480947, 12960761, 10411411, 7225554, 3925067, 1017563, -1138454, -2457678, -3034860, -2840929, -1619992, 799611, 4182808, 7965632, 11519237, 14225312, 15524170, 15232783, 13810360, 12042366, 10387177, 8761435, 6905070, 4709543, 2205091, -436792, -2747423, -4089588, -4205857, -3548820, -2896725, -2689917, -2809176, -2843001, -2408149, -1331782, 246248, 1920789, 3272914, 4091082, 4361669, 4210420, 3971272, 4138516, 4998023, 6328870, 7655253, 8777890, 9886352, 11178361, 12600335, 14022561, 15463404, 16993717, 18502332, 19653184, 20043017, 19399091, 17735614]
42175A7735614k361628k650864k747329k910044l146428l284368l242562l049170
42167e656779k653406j954424j049345k42581K87017O79824J146503J627049J821910
42158e994232J537934R29102L84255J78597K16409J42840k42742p24157q97878
42149d469872o32573k03280J167k11127p72969j424589j820107j746958j311565
42140a2591873p81190k22727N09483J382310K051836K291512K305106K341441
42132b714102K177313J344916j64118j759649k856365l306211l148992k291684
42124a2718892p23732J116005K499630K983108K710089K167319J728763J404354
42116A166644R48008K24382n12797q06377n25817q4333J1688k64416n10288m53573
$$ y = [17735614, 15373986, 12723122, 9975793, 7065749, 3919321, 634953, -2607609, -5656779, -8310185, -10264609, -11313954, -11556535, -11269518, -10589694, -9443191, -7816142, -5994232, -4456298, -3527196, -3142941, -2964344, -2747935, -2605095, -2847837, -3571994, -4469872, -5102445, -5305725, -5304558, -5515685, -6288654, -7713243, -9533350, -11280308, -12591873, -13373063, -13595790, -13086307, -11703997, -9652161, -7360649, -5055543, -2714102, -536789, 808127, 644009, -1115640, -3972005, -7278216, -10427208, -12718892, -13442624, -12326619, -9826989, -6843881, -4133792, -1966473, -237710, 1166644, 2114652, 2339034, 1826237, 1019860, 494043, 409710, 421398, 156982, -353306, -806879]
42106h06879k36624j18182r9575M4759M94263J244401K132857K869238L100565
42097H624823K617352J565400M09627l57975n11047j76976K73125M38802J37289
42088A3020420m28411p58960m55748L67264J116352J264461Q45600L07763p3078
42079A5205663m24996q89558j272349j307974j105351j018867j106494j018655
42071G061419m98485K57678Q58069J122632J080648P50430J53490n13862r17115
42062I354904q23700k63389M76722R60916Q55503K36418m17495o74173n38706
42053I167000l10596k12077l56964r23442j985781l148593l708971l374106k608314
42044g461844k095143k036712k173506k295727k389382k294731j593736r1801
$$ y = [-806879, -1043503, -1161685, -1261260, -1216501, -722238, 522163, 2655020, 5524258, 8624823, 11242175, 12807575, 13217202, 12859227, 12348180, 12171204, 12444329, 12883131, 13020420, 12592009, 11833049, 11377301, 11744565, 12860917, 14125378, 14970978, 15278741, 15205663, 14780667, 13891109, 12618760, 11310786, 10205435, 9186568, 8080074, 7061419, 6562934, 6820612, 7678681, 8801313, 9881961, 10632391, 10785881, 10272019, 9354904, 8531204, 8267815, 8744537, 9705453, 10560956, 10797374, 10379879, 9705706, 9167000, 8856404, 8644327, 8287363, 7363921, 5378140, 2229547, -1479424, -4853530, -7461844, -9556987, -11593699, -13767205, -16062932, -18452314, -20747045, -22340781, -22432582]
42036b2432582J701891K833401K748273J805460Q78889N05161N32668N63365N00046
42027a0363428N10839O45186P86744R60912J374280K038478K606410K752204K516316
42018C827941K085119J436227M99253m53952r51485q96228o96507p17515q51967
42009C280886p75164m03960Q6045N20454P75432P02805K94769r8734R791P31282
41999E123606J689273K476084L003501L271544L009656J859643n0294j917882
41991A8465131k811227k432546j350324m77560k62720l37252J1720R88384J978162
41982A3771768K166186J394438K85765m20555m79717j17451L37450O49461O78239
41973A8265584M14817J3029l45304o27767r18919j229963j434101j411913j214036
$$ y = [-22432582, -20730691, -17897290, -15149017, -13343557, -12464668, -11959507, -11426839, -10863474, -10363428, -9852589, -9207403, -8420659, -7459747, -6085467, -4046989, -1440579, 1311625, 3827941, 5913060, 7349287, 7848540, 7394588, 6443103, 5546875, 4850368, 4132853, 3280886, 2505722, 2101762, 2187807, 2708261, 3483693, 4186498, 4481267, 4382533, 4392324, 5123606, 6812879, 9288963, 12292464, 15564008, 18573664, 20433307, 20383013, 18465131, 15653904, 13221358, 11871034, 11393474, 11130754, 10793502, 10805222, 11793606, 13771768, 15937954, 17332392, 17618157, 17197602, 16717885, 16600434, 16937884, 17587345, 18265584, 18680401, 18693430, 18348126, 17720359, 16801440, 15571477, 14137376, 12725463, 11511427]
41964A1511427j060075j157397j452966j551647j005049K05279J523981K255000
41956I268553K108939J284296J46595j003088j918544k409955k441486k137186
41948B898124j671250j228669j025958j197662j617920j958528j982039j709859
41940i493761j300883q61763l77326K71668J206266K349731L365019L942888M112626
41931C214465M068440L732547K806878J348789k3436p35779q82831j011359j399273
41922A1118441j784919j765019j255788n43846j3794J42954J4103j97638l66151
41913E348343m04646j63070L75457Q12558O06254k27211j001605j172029r63193
41904C210858r12643j098189j228202j260208j396775j536188j270634n20294
$$ y = [11511427, 10451352, 9293955, 7840989, 6289342, 5284293, 5489572, 7013553, 9268553, 11377492, 12661788, 12808383, 11805295, 9886751, 7476796, 5035310, 2898124, 1226874, -1795, -1027753, -2225415, -3843335, -5801863, -7783902, -9493761, -10794644, -11656407, -12033733, -11762065, -10555799, -8206068, -4841049, -898161, 3214465, 7282905, 11015452, 13822330, 15171119, 15147683, 14411904, 13529073, 12517714, 11118441, 9333522, 7568503, 6312715, 5768869, 5755075, 5898029, 5912132, 5714494, 5348343, 4943697, 4780627, 5156084, 5968642, 6574896, 6347685, 5346080, 4174051, 3210858, 2298215, 1200026, -28176, -1288384, -2685159, -4221347, -5491981, -6012275]
41896f012275K94228Q67713J385542K064334K682524K882162K701714K476748
41888I342690K315867J961311J173473P8692q98641j390201j385467j190251j034922
41879H972551p83605j92943N81542J004217P65524J30829m47782q46251j204990
41870G979092j528151j604737j299571p54260k83844j31569k83597m91893n45170
41861A056300n05004n41883n65410k58802M51772J204058J589966J509294J020876
41852D961167J48894r12414j652287j643280r87244j24804O40691J154400J159540
41843B744663N03821m10969q28719m43438K82563P35763Q25654Q81926J112371
41834E403635J408052J595312J666301J731412J838231J873821J633852R85582
$$ y = [-6012275, -5718047, -4850334, -3464792, -1400458, 1282066, 4164228, 6865942, 9342690, 11658557, 13619868, 14793341, 14872033, 13973392, 12583191, 11197724, 10007473, 8972551, 8188946, 7996003, 8577545, 9581762, 10347286, 10478115, 10030333, 9184082, 7979092, 6450941, 4846204, 3546633, 2792373, 2508529, 2376960, 2093363, 1601470, 1056300, 551296, 9413, -555997, -814799, -363027, 841031, 2430997, 3940291, 4961167, 5110061, 4197647, 2545360, 902080, -85164, -209968, 430723, 1585123, 2744663, 3248484, 2837515, 2008796, 1565358, 1847921, 2583684, 3409338, 4291264, 5403635, 6811687, 8406999, 10073300, 11804712, 13642943, 15516764, 17150616, 18136198]
41826A8136198m1795j288275k470821l146480k886146j690799j33016J129202
41818G608068J918949K427647K662515K363943J501817M85988k98476r03831j552991
41809A6213629k164642k418546k219851j867543j754932k036643k558049k958193
41801a764770k843443k032262p39642N22332J308861J554350J553408J653611
41793g87555J960351K311635K483143K352721J885829J106554J93010m96057o77414
41784A0332217m56499k74948n14222j206815k090088k802467l029146k631737
41776b673705j735465o26582M62700J396254K006794K139179J915586J769765
41768D654526J995270K286638J926056N31902j435547l008588l565082l278765
$$ y = [18136198, 18094403, 16806128, 14335307, 11188827, 8302681, 6611882, 6478866, 7608068, 9527017, 11954664, 14617179, 16981122, 18482939, 18968927, 18670451, 17766620, 16213629, 14048987, 11630441, 9410590, 7543047, 5788115, 3751472, 1193423, -1764770, -4608213, -6640475, -7380117, -6857785, -5548924, -3994574, -2441166, -787555, 1172796, 3484431, 5967574, 8320295, 10206124, 11312678, 11505688, 11009631, 10332217, 9875718, 9600770, 9086548, 7879733, 5789645, 2987178, -41968, -2673705, -4409170, -5035752, -4573052, -3176798, -1170004, 969175, 2884761, 4654526, 6649796, 8936434, 10862490, 11394392, 9958845, 6950257, 3385175, 106410]
41760A06410k694019k016176j068668Q3598Q71328Q52480L58480J41130M92281
41751b873156J094806J664592K235073K707243K648695J886110R55602N58401
41743A0877366P45460R99192R90127Q59305P73762N93897J24562n44381j127249
41734A4292041j482838j751679k162893k732574l173482l164674k713640k135028
41726e024767j649546j197490p35315m43017l87279k08877M61309J358475J781401
41717f045106J482397R56984O96266N33363K4169p95315j420037j561223j475919
41708g604421j557583j822351j887318j342485j28883J320245K312961K459198
41700h250637K080597J914689K300881K779650K629495J688070M54321n43033
$$ y = [106410, -2587609, -4603785, -5672453, -5588855, -4717527, -3865047, -3506567, -3365437, -2873156, -1778350, -113758, 2121315, 4828558, 7477253, 9363363, 10318965, 10877366, 11622826, 12622018, 13612145, 14471450, 15245212, 15839109, 15963671, 15419290, 14292041, 12809203, 11057524, 8894631, 6162057, 2988575, -176099, -2889739, -5024767, -6674313, -7871803, -8607118, -9050135, -9437414, -9646291, -9184982, -7826507, -6045106, -4562709, -3605725, -2909459, -2376096, -2351927, -3147242, -4567279, -6128502, -7604421, -9162004, -10984355, -12871673, -14214158, -14343041, -13022796, -10709835, -8250637, -6170040, -4255351, -1954470, 825180, 3454675, 5142745, 5597066, 5054033]
41692E054033j197018j586468j588651j008224k3848P49773P47365n9178j159994
41683g2210j927038k068878j788971j525914j485187j442720j063511l44007L83671
41674a1334765Q42702J063756J279295J726121K516510L483482M131267L988185
41666G696553L124807K140781J523039J173993O71555j83260j193901j950462
41658A3003105k044656j321079j44353P18344P06342r5085j203692k210363k837703
41649D570860k856171k354747j933889k147463k733694k812423j929215n38147
41641a2734889O54845J431918J932882K150719J942544J406077Q99565O66667
41633a649672O47484O89158P83370J016398J344461J495109J148073K51278q73383
$$ y = [5054033, 3857015, 2270547, 681896, -326328, -350176, 399597, 1146962, 1087784, -72210, -1999248, -4068126, -5857097, -7383011, -8868198, -10310918, -11374429, -11718436, -11334765, -10492063, -9428307, -8149012, -6422891, -3906381, -422899, 3708368, 7696553, 10821360, 12962141, 14485180, 15659173, 16330728, 16147468, 14953567, 13003105, 10958449, 9637370, 9493017, 10211361, 10917703, 10822618, 9618926, 7408563, 4570860, 1714689, -640058, -2573947, -4721410, -7455104, -10267527, -12196742, -12734889, -12080044, -10648126, -8715244, -6564525, -4621981, -3215904, -2316339, -1649672, -1002188, -313030, 470340, 1486738, 2831199, 4326308, 5474381, 5725659, 4852276]
41624D852276j787995k253820k235011j730282q25785J21038O34110N77844L00266
41615b347359K14599L75910N66733O53263P05248Q28180R96484J049427Q26734
41606C869219L37193k39470p87040j392259k074525k473794k128392j115014j07223
41597f111305L30017K40930m3585l88683p53646q94627n65094P5588N73398O80659
41587f856348N27265L65688L89254P33863J367390J958761K093665J660120Q61124
41578C100782r4379j054958j704281j623130p47051M17337J182613J213870O70429
41569A361232J5969k33127K11128J161178K023370K240403J699706P43819j20045
41560I103633n30083m63977k27312j76715m05850p62196j126935j482930j675404
$$ y = [4852276, 3064281, 810461, -1424550, -3154832, -3980617, -3859579, -3225469, -2647625, -2347359, -2132760, -1756850, -1190117, -536854, 168394, 996574, 1993058, 3042485, 3869219, 4206412, 3966942, 3179902, 1787643, -286882, -2760676, -4889068, -6004082, -6111305, -5781288, -5540358, -5583943, -5972626, -6726272, -7620899, -8185993, -8110405, -7537007, -6856348, -6329083, -5963395, -5574141, -4840278, -3472888, -1514127, 579538, 2239658, 3100782, 3006403, 1951445, 247164, -1375966, -2123017, -1705680, -523067, 690803, 1361232, 1377201, 1144074, 1355202, 2516380, 4539750, 6780153, 8479859, 9223678, 9103633, 8573550, 8109573, 7882261, 7705546, 7299696, 6537500, 5410565, 3927635, 2252231]
41551B252231j374016m86681N23458R73879O07764k43045j102028j764442k235482
41542b848362k449123k236321j571502p27671r8430J21100K1558k24678n21896
41533a0535325p41558o19167K414Q32658J274969J031092M35654Q6738K53950
41524g978575P41441J191716J367025J238032R98391R62921J273016J702372J905567
41515C401906J840829J749993J697259J373807N12963o64420j613247j988283
41507F310807j822130j252370l39173P58299J625986J820277J248824K53353o68284
41498G935589j192656j310042j245396j228130j268515j181195q83666n97691
41490i71702o19486r18529j139423j046316p97854o73209o58602m72025M4443
$$ y = [2252231, 878215, 391534, 914992, 1888871, 2496635, 2253590, 1151562, -612880, -2848362, -5297485, -7533806, -9105308, -9832979, -9931409, -9810309, -9788751, -10013429, -10535325, -11276883, -11896050, -11893636, -11060978, -9786009, -8754917, -8319263, -8232525, -7978575, -7237134, -6045418, -4678393, -3440361, -2441970, -1479049, -206033, 1496339, 3401906, 5242735, 6992728, 8689987, 10063794, 10576757, 9912337, 8299090, 6310807, 4488677, 3236307, 2897134, 3655433, 5281419, 7101696, 8350520, 8603873, 7935589, 6742933, 5432891, 4187495, 2959365, 1690850, 509655, -374011, -971702, -1591188, -2509717, -3649140, -4695456, -5493310, -6166519, -6825121, -7297146, -7252703]
41481g252703O96253J096905R63349K78014p12030j613419k086193k009955j496531
41472a2136310p82981j12656L69383O77819R03704J036929R73012P72034P64472
41463g534594J197553J818385K011393J388809J27404j252431k264058k621076
41455g128615k288165j526048p72103l37535k30875k68303k45549j0839M34669
41446a2373363Q34130Q68960N96923N31821J081474J979008K467200K062104J038685
41437i13058J75498P5904O70784J294308J289579O08520k17231o88042p78459
41428A517803p55099p99041r58960j253356j576328j660868j403688j101691j078458
41419i069686j194871j073719p07728l94176p2364P15221J974246K862759K571229
$$ y = [-7252703, -6556450, -5459545, -4496196, -4218182, -4930212, -6543631, -8629824, -10639779, -12136310, -12919291, -13031947, -12662564, -11984745, -11081041, -10044112, -9071100, -8299066, -7534594, -6337041, -4518656, -2507263, -1118454, -991050, -2243481, -4507539, -7128615, -9416780, -10942828, -11714931, -12052466, -12283341, -12551644, -12797193, -12808032, -12373363, -11539233, -10670273, -10073350, -9541529, -8460055, -6481047, -4013847, -1951743, -913058, -737560, -661656, 9128, 1303436, 2593015, 3201535, 2984304, 2296262, 1517803, 762704, -36337, -995297, -2248653, -3824981, -5485849, -6889537, -7991228, -9069686, -10264557, -11338276, -12046004, -12440180, -12512544, -11797323, -9823077, -6960318, -4389089]
41410d389089J336688J74101k45862p3839K40020N01838P53137J033720J304415
41401F35129J441701J286289Q75950N91573P96010J304947J526963J226807Q33085
41392A0518454Q11183J040890J097949Q87358N89077J17875q47297k189940l144010
41383H881539l037678k024377q33388R375M33860M94954K47112p97K60059J143934
41373E574593K053846K273733J801644J316802J322427J591106J554019J025048
41365A8513218L69292O2433K41126O31645P64566K62376r20655k419165l630968
41356A3873868m073792l694555k910241k316676k243091k520184k695923k472388
41348i052982j889881j141738l73308K98924P55917J008309J246485J599933J922775
$$ y = [-4389089, -3052401, -2878300, -3124162, -3198001, -2957981, -2456143, -1703006, -669286, 635129, 2076830, 3363119, 4239069, 4830642, 5626652, 6931599, 8458562, 9685369, 10518454, 11329637, 12370527, 13468476, 14355834, 14944911, 15062786, 14215489, 12025549, 8881539, 5843861, 3819484, 2986096, 2995471, 3429331, 3924285, 4171397, 4170600, 4430659, 5574593, 7628439, 9902172, 11703816, 13020618, 14343045, 15934151, 17488170, 18513218, 18882510, 18944943, 19186069, 19817714, 20582280, 20844656, 19924001, 17504836, 13873868, 9800076, 6105521, 3195280, 878604, -1364487, -3884671, -6580594, -9052982, -10942863, -12084601, -12457909, -12158985, -11403068, -10394759, -9148274, -7548341, -5625566]
41339e625566J978588J766194J466086J113865N82232q0434n65374o95874o86377
41330g46660q03444r20992o84641q7134L90780L16929j81678n84265n67167k78487
41320d146759l6559P8111K13417M06237M46156J72207k04962k44679K41643R51671
41310b123517J362462J166776M42539m88251j300949j840040k112869k093683
41302f987532j582419m11648J183362K605771L441776L807357L988440L911479
41294I956586L270619K127026J026550L85811P404n85736j461891k142224k138438
41285A0445707j488190p29990m12824o34969j025636j181219j110204j171629
41277B691046j544682j874389j569871m29293J117315K354460K785986K370994
$$ y = [-5625566, -3646978, -1880784, -414698, 699167, 1281399, 1200965, 635591, -60283, -746660, -1550104, -2471096, -3155737, -3242871, -2852091, -2535162, -2716840, -3301105, -3868272, -4146759, -4183318, -4105207, -3891790, -3485553, -3039397, -2867190, -3072152, -3316831, -3075188, -2123517, -761055, 405721, 848260, 360009, -940940, -2780980, -4893849, -6987532, -8569951, -8981599, -7798237, -5192466, -1750690, 2056667, 6045107, 9956586, 13227205, 15354231, 16380781, 16766592, 16773996, 16188260, 14726369, 12584145, 10445707, 8957517, 8227527, 7814703, 7179734, 6154098, 4972879, 3862675, 2691046, 1146364, -728025, -2297896, -2727189, -1609874, 744586, 3530572, 5901566]
41269E901566J462033N79944R9174L16m8960k91901o03429p07217o24148p17906
41259E049472j198604j712847j624935p27360M72170J246473J335023J050991
41251C890383Q09054P21131O50394M70033J59731k30211n51366n37811J2596R81147
41241F375081J946345K504957K499344J915322P43863q60651k366098l102230
41233I655933k872349k199843j805519j883802k006564j669969p75639L78790
41225c178962J354314J765115J461856P18156J35160J68864P37640J367833J680383
41216F210359J664982J566205J631148J917988K220214K203652J718333R19121
41208B0052002j6661j141707k472822l580204l826339l122368k136050j547501
$$ y = [5901566, 7363599, 7943543, 8042717, 8043033, 7994073, 7702172, 7098743, 6391526, 5767378, 5049472, 3850868, 2138021, 513086, -214274, 257896, 1504369, 2839392, 3890383, 4699437, 5420568, 6070962, 6540995, 6700726, 6470515, 5919149, 5381338, 5393934, 6375081, 8321426, 10826383, 13325727, 15241049, 15984912, 15124261, 12758163, 9655933, 6783584, 4583741, 2778222, 894420, -1112144, -2782113, -3557752, -3178962, -1824648, -59533, 1402323, 2120479, 2255639, 2424503, 3162143, 4529976, 6210359, 7875341, 9441546, 11072694, 12990682, 15210896, 17414548, 19132881, 20052002, 20035341, 18893634, 16420812, 12840608, 9014269, 5891901, 3755851, 2208350]
41200B208350j324052r58071k23139O19166J276435J746092K113321K284916K080137
41191I823155J481946O94747l59m12266n37143n41434o03956p43823q36494p99850
41181G524523p08150p09088q72709j122627j266447j106466o10913k3376K48035
41172A352782p1018q75968j700369k008612j591039p53483m9488K78532N45923
41163d872740J188196K100179K590477K091125Q28008l12272n70330N2372Q79327
41154C974342J205797Q82113L28884L0623M7839L0284l45604j016481j596063
41145C541734j754219j544512j371165j563617j934010j865973r76597L90176
41137g078183J509822K060689K326702K636969K939389L073295L142389L306269
$$ y = [2208350, 884298, -73773, -296912, 322254, 1598689, 3344781, 5458102, 7743018, 9823155, 11305101, 11999848, 11999489, 11587223, 11050080, 10508646, 9904690, 9160867, 8324373, 7524523, 6816373, 6107285, 5234576, 4111949, 2845502, 1739036, 1128123, 1104747, 1352782, 1281764, 405796, -1294573, -3303185, -4894224, -5647707, -5697195, -5418663, -4872740, -3684544, -1584365, 1006112, 3097237, 3925245, 3612973, 3042643, 3095015, 3974342, 5180139, 6062252, 6391136, 6421759, 6469598, 6499882, 6154278, 5137797, 3541734, 1787515, 243003, -1128162, -2691779, -4625789, -6491762, -7468359, -7078183, -5568361, -3507672, -1180970, 1455999, 4395388, 7468683, 10611072, 13917341]
41129A3917341L385610L035741K258400J399381O27724k18966j155555j786771
41121B1462905j822854j643592j974323k998693m057167m297653l477555k104603
41113i13535r49509m54297m39063k83142M95571J739017K774862L066814K637631
41104G674349J850133J000934K62480k21310m89344r04722j787384k874729l471533
41095A038874l252543k625137k108551j623978p11725O89516K033435K751871
41087c808238K784872K474190K165842K025421K045026K039722J711879Q99091
41079A2337805j99996j122388j523860j486655j442688j756425k358036k813442
41071c65685k762038k219963j450177o93680j34390N7412q9460j82872K08825
$$ y = [13917341, 17302951, 20338692, 22597092, 23996473, 24624197, 24405231, 23249676, 21462905, 19640051, 17996459, 16022136, 13023443, 8966276, 4668623, 1191068, -913535, -1863044, -2317341, -2756404, -3039546, -2543975, -804958, 1969904, 5036718, 7674349, 9524482, 10525416, 10787896, 10566586, 10077242, 9172520, 7385136, 4510407, 1038874, -2213669, -4838806, -6947357, -8571335, -9283060, -8593544, -6560109, -3808238, -1023366, 1450824, 3616666, 5642087, 7687113, 9726835, 11438714, 12337805, 12137809, 11015421, 9491561, 8004906, 6562218, 4805793, 2447757, -365685, -3127723, -5347686, -6797863, -7491543, -7625933, -7568521, -7657981, -7840853, -7632028]
41062g632028J001733J595240J506925P98905j93623j257581k213102k686925
41054i080456k343292j313503j29372P95709J429336J866275K036300J759445
41046d979558R71708j69592j323615k083686k155361j479604j89592J456580L002914
41037f949806L810990L465446K243354R56646K01988p6624j96780j69982J99743
41028C484975P65649R37336K72329r56786j894262j796007o38787Q47595J737474
41019B759516J599873P03027m35807j572797k672659l454737l365445k164713
41011h603742l14488J445447K780176L786522M449696M424810L469895J887653
41003A3325969M00362l33555r6633P49426J397996J120160j03255j563510k587392
$$ y = [-7632028, -6630295, -5035055, -3528130, -2729225, -2922848, -4180429, -6393531, -9080456, -11423748, -12737251, -12866623, -12070914, -10641578, -8775303, -6739003, -4979558, -4007850, -4177442, -5501057, -7584743, -9740104, -11219708, -11409300, -9952720, -6949806, -3138816, 326630, 2569984, 3526630, 3728618, 3651994, 3455214, 3285232, 3484975, 4250624, 5187960, 5460289, 4503503, 2609241, 813234, 174447, 1022042, 2759516, 4359389, 5062416, 4626609, 3053812, 381153, -3073584, -6439029, -8603742, -8918230, -7472783, -4692607, -906085, 3543611, 7968421, 11438316, 13325969, 13726331, 13392776, 13296143, 14045569, 15443565, 16563725, 16460470, 14896960, 12309568]
40994A2309568l173046l689087m169828m289903l955760l461864k946115k104781
40986a5480816p23261P84137J696295J730029J204419N62898O583m39491p76536
40977a1435743j004180j061278p79529q8543P14392J131887J000471O62527M80677
40968a0379319L75785O1376l87470m90656O9928J057904J963830K510801K708581
40959b509240K520273J765933M64873r15031j758014j826068j360722p12198l9687
40950d369881O31303J272111J856553K323372K420482J777175L41178j354268
40942D898025k571033k986365k798777k330769j772936j264876q99846n50472
40934a0277049M6963Q73679J490878J507689J047311N58439K73757O6608k26190
$$ y = [12309568, 9136522, 5447435, 1277607, -3012296, -6968056, -10429920, -13376035, -15480816, -16204077, -15419940, -13723645, -11993616, -10789197, -10226299, -10219716, -10659207, -11435743, -12439923, -13501201, -14280730, -14369273, -13654881, -12522994, -11522523, -10859996, -10379319, -10003534, -9942158, -10329628, -10820284, -10750356, -9692452, -7728622, -5217821, -2509240, 11033, 1776966, 2241839, 1326808, -431206, -2257274, -3617996, -4330194, -4369881, -3738578, -2466467, -609914, 1713458, 4133940, 5911115, 6252293, 4898025, 2326992, -659373, -3458150, -5788919, -7561855, -8826731, -9726577, -10277049, -10230086, -9356407, -7865529, -6357840, -5310529, -4752090, -4478333, -4411725, -4637915]
40925d637915n85996r36675j271315j565560j710407j633410j387928j026315
40917a4755521m72166L52718J308693K076520K442360K462888K326898K148895
40909b108715J957840J793768J679846J511305J113965M84873j07078l56705k40850
40900E728249l6535k4777k22253m09042l89923k17196j54444m12950r49145j557210
40890A354774k094097k479780k518325j990980j076266m45504o35327j382690
40882a1268195j852469j515055n37784O72651J914539K991192L438565K895670
40874c260886J692484P01836M83861P63267Q51502M39058j56286m31979k14974
40865H67883L00922R00908J564912K287156K818367K798660K198555J464848J075847
$$ y = [-4637915, -5223911, -6160586, -7431901, -8997461, -10707868, -12341278, -13729206, -14755521, -15227687, -14874969, -13566276, -11489756, -9047396, -6584508, -4257610, -2108715, -150875, 1642893, 3322739, 4834044, 5948009, 6432882, 6325804, 5969099, 5728249, 5691714, 5666937, 5444684, 5035642, 4645719, 4428523, 4274079, 3861129, 2911984, 1354774, -739323, -3219103, -5737428, -7728408, -8804674, -9250178, -9885505, -11268195, -13120664, -14635719, -15173503, -14500852, -12586313, -9595121, -6156556, -3260886, -1568402, -866566, -382705, 380562, 1232064, 1671122, 1514836, 1082857, 867883, 1168805, 2069713, 3634625, 5921781, 8740148, 11538808, 13737363, 15202211, 16278058]
40856A6278058R99577P31223j08433j294417k164168k254385j765066j370802
40848I051587j534884k035663k254008j908598j346316j039615r78291p54751
40840b800539j68242N09061R38238J198804J682598K514453L232776L190372K287167
40831A2584688J169771N72498N33758M61754m2920p18894j121266j269700j508323
40822A0661366j871014j967610j525232p20225J29977R26847J672630K215611
40814I522350K358881K128194J717995J208003N24092l14507j091443j610326
40806A4443239j890938k049492k072924j864999j510359j314447j455222j694201
40798E90657j616708j140491n81573j79495J82341O20384Q73275O18337O2646
$$ y = [16278058, 17277635, 18008858, 17900425, 16606008, 14441840, 12187455, 10422389, 9051587, 7516703, 5481040, 3227032, 1318434, -27882, -1067497, -2045788, -2800539, -2968781, -2459720, -1521482, -322678, 1359920, 3874373, 7107149, 10297521, 12584688, 13754459, 14326957, 14860715, 15322469, 15279549, 14560655, 13439389, 12169689, 10661366, 8790352, 6822742, 5297510, 4577285, 4707262, 5634109, 7306739, 9522350, 11881231, 14009425, 15727420, 16935423, 17459515, 17145008, 16053565, 14443239, 12552301, 10502809, 8429885, 6564886, 5054527, 3740080, 2284858, 590657, -1026051, -2166542, -2748115, -2927610, -2745269, -2124885, -1251610, -633273, -570627]
40789e70627j71926J77557O77219P76943M74992K23822L77292R33599J657697
40780D556568K215823K289207J809068J075057M74990J18408j01246j59336J40676
40771A2419215Q32121J604686K023949J810086R11713m78371j893343k771714
40763A4458342k848863k335536j660272j145796r91526j361166k238584l242721
40755a366122l816827l670826k936447j909660q23109J10082O95140R92752J383944
40746a1341073K123867K887294L048222K451839J628851J129110R21606O63870
40738C513586L01999N4743n0308k09452m28025m89080m17505n50704r41188j075925
40728b91859n16237M70463J281979J744155K070140K234323J928945J149639L01310
$$ y = [-570627, -742553, -564996, 112223, 889166, 1364158, 1587980, 1965272, 2898871, 4556568, 6772391, 9061598, 10870666, 11945723, 12420713, 12539121, 12437875, 12278539, 12419215, 13251336, 14856022, 16879971, 18690057, 19601770, 19123399, 17230056, 14458342, 11609479, 9273943, 7613671, 6467875, 5476349, 4115183, 1876599, -1366122, -5182949, -8853775, -11790222, -13699882, -14522991, -14412909, -13717769, -12725017, -11341073, -9217206, -6329912, -3281690, -829851, 799000, 1928110, 2849716, 3513586, 3815585, 3870328, 3820020, 3610568, 3182543, 2693463, 2275958, 1725254, 784066, -291859, -808096, -337633, 944346, 2688501, 4758641, 6992964, 8921909, 10071548, 10372858]
40719A0372858m14115j237494k239274k891914k635962j627719n66203O3296K57819
40710i18708J84926R502j7513K90612P22503P98299L82286n7135L0886O26657
40700B052315J142544J005656J67160q81697j529685j545073j205852r08940p15569
40691b419141m27054n4835O1194k86482q12384j016176o82722M9889R52106J788065
40681b847540K248764K125442J608717J178907J090316J115004Q73198K60018
40673G652826n43692j298392j764549j667950q80942L05136J262253J519232J171974
40664E755896P72013Q03387J240338J580248J326728M78047m74169j048160j220204
40655I214124j325086j591131j894408j945073j581907q74732q1337M42168M29338
$$ y = [10372858, 9958743, 8721249, 6481975, 3590061, 954099, -673620, -1239823, -1176527, -918708, -733782, -724280, -741793, -451181, 271322, 1069621, 1451907, 1394772, 1425658, 2052315, 3194859, 4200515, 4367675, 3485978, 1956293, 411220, -794632, -1703572, -2419141, -2846195, -2901030, -2839836, -3126318, -3938702, -4954878, -5637600, -5587711, -4635605, -2847540, -598776, 1526666, 3135383, 4314290, 5404606, 6519610, 7392808, 7652826, 7109134, 5810742, 4046193, 2378243, 1497301, 1802437, 3064690, 4583922, 5755896, 6527909, 7331296, 8571634, 10151882, 11478610, 11956657, 11482488, 10434328, 9214124, 7889038, 6297907, 4403499, 2458426, 876519, 1787, -79550, 362618, 791956]
40646G91956p0382o95060j068394j055400p14440j50130M59121Q15200P12356
40637i75173L09693J7669N8722K75500M35378N74852Q95333J381431J690064J471856
40627F135325P30518j83885q87984j200735j092344n43029M03205J459723K137316
40618F958110K076033J294592P2617j305604k597275l520824l836134l514537
40610d373022k718750j661619o22411k917p3730o02148r81397q63243m84534k52695
40600a2636466k16789j42512M8847J69486N3333k27343m19272k48662M04164J342179
40590a1873035K113919K379411K176844J731288J126417L55530m09473q79102
40582c278201r96609j015724j184995j502144j771886j736771j183174j50674
$$ y = [791956, 721574, 26514, -1041880, -2097280, -2811720, -2961850, -2502729, -1687529, -975173, -665480, -647811, -589089, -313589, 121789, 696641, 1591974, 2973405, 4663469, 6135325, 6865843, 6681958, 5793974, 4593239, 3500895, 2957866, 3361071, 4820794, 6958110, 9034143, 10328735, 10401352, 9095748, 6498473, 2977649, -858485, -4373022, -7091772, -8753391, -9375802, -9378719, -9452449, -10054597, -11035994, -11899237, -12383771, -12636466, -12853255, -12995767, -12946920, -12777434, -12724101, -12951444, -13370716, -13619378, -13215214, -11873035, -9759116, -7379705, -5202861, -3471573, -2345156, -1989626, -2399099, -3278201, -4274810, -5290534, -6475529, -7977673, -9749559, -11486330, -12669504, -12820178]
40574a2820178R42079J608899J783930J801694J892037J978095K017138K164557
40566A368251K394795K291219J548785N03322j63754j46925L29408R43740J491972
40557A0560813J689514J174782p7570j538191k503434k647461k166022j502425
40549B990006r96919o83243l24725K99357J085765J622440J529448P38935n29060
40540E732004j924130l055120l589899l445358k864367k179532j473753n68502
40532a3368657O02835J714841K302461K314502K255248K637297L375715L895664
40524E729906L800275L217203K471209J695915R28659L51683J51016K07697J71607
40515A8725170j58551o89888j227468j627020j781928j660338j381768j105160
$$ y = [-12820178, -11878099, -10269200, -8485270, -6683576, -4791539, -2813444, -796306, 1368251, 3763046, 6054265, 7603050, 8106372, 7942618, 7795693, 8125101, 9068841, 10560813, 12250327, 13425109, 13347539, 11809348, 9305914, 6658453, 4492431, 2990006, 1993087, 1309844, 985119, 1284476, 2370241, 3992681, 5522129, 6261064, 5732004, 3807874, 752754, -2837145, -6282503, -9146870, -11326402, -12800155, -13368657, -12765822, -11050981, -8748520, -6434018, -4178770, -1541473, 1834242, 5729906, 9530181, 12747384, 15218593, 16914508, 17843167, 18194850, 18345866, 18553563, 18725170, 18566619, 17876731, 16649263, 15022243, 13240315, 11579977, 10198209, 9093049]
40507I093049q39901n19970k37616j97787m29305p50801j045597j331838j504107
40498B236127j287257o09295K02631P95748J182827J544628J803862J688653J171174
40489H729098N60208J07905k60508p40423j341621j908572k329101k560963k479795
40480b223772j885145p88217L67196R61717P91358L15230J81836N61982J106532
40471f11283J510444J856925K321823K781617K909418K524674J666958M39085
40463A5399661j005961k376841l364731l878849m021653l840886l267378k310851
40455h667489j155907k3090R22624J484781J439669P81293j05537o65802o14418
40446f603876j37905L30235N14744M93877N10336O09138N24040j8740r15180j676435
$$ y = [9093049, 8253148, 7733178, 7495562, 7297775, 6868470, 6117669, 5072072, 3740234, 2236127, 948870, 339575, 542206, 1337954, 2520781, 4065409, 5869271, 7557924, 8729098, 9289306, 9397211, 9136703, 8396280, 7054659, 5146087, 2816986, 256023, -2223772, -4108917, -4897134, -4529938, -3568221, -2776863, -2461633, -2279797, -1717815, -611283, 899161, 2756086, 5077909, 7859526, 10768944, 13293618, 14960576, 15399661, 14393700, 12016859, 8652128, 4773279, 751626, -3089260, -6356638, -8667489, -9823396, -9846486, -8923862, -7439081, -5999412, -5218119, -5323656, -5989458, -6603876, -6741781, -6411546, -5896802, -5402925, -4892589, -4283451, -3759411, -3778151, -4693331, -6369766]
40436f369766j810137j175626k1435J209401K112814K509701K508348K367815
40428A331115K272903K257004K293926K333249K211268J674380O33130o45347
40420A4361628j714415k323218k548153k581528k514919k365132k182937k006349
40412c875023j743021j231090m57411L55163R09165J024834O74034m3116q66876
40403e253341j441978j582645j443436j280146j073968n87963J85060Q61942J076784
40394a0539691Q79424N90980M24537M31147O71675J162411J671789J824963J471997
40385a410768P89634J2830p07578j123354q62011J56675J403214K127115K099170
40376B484927J777443J686620J825157J814266J471653R98979O26623L23188m0812
$$ y = [-6369766, -8179903, -9355529, -9376964, -8167563, -6054749, -3545048, -1036700, 1331115, 3604018, 5861022, 8154948, 10488197, 12699465, 14373845, 15006975, 14361628, 12647213, 10323995, 7775842, 5194314, 2679395, 314263, -1868674, -3875023, -5618044, -6849134, -7306545, -6951382, -6042217, -5017383, -4343349, -4386465, -5253341, -6695319, -8277964, -9721400, -11001546, -12075514, -12663477, -12478417, -11616475, -10539691, -9660267, -9069287, -8644750, -8213603, -7541928, -6379517, -4707728, -2882765, -1410768, -621134, -608304, -1315882, -2439236, -3301247, -3144572, -1741358, 385757, 2484927, 4262370, 5948990, 7774147, 9588413, 11060066, 12059045, 12685668, 13008856, 12968044]
40367A2968044m37397p70708j099008j543448k013295k230244k025760j434906
40359A413278n42318M88439J229402J213816N28108j39517k93389j92596l10184
40350C395039n09810k22117O87335J713040K359721K529599K217151J352726J96080
40341A3718764n50399m12359K78041P69047O92287K39581k54242n69598n52063
40332A3359059j62057L86277P69213Q75505Q21903O65118L07559k70256q71947
40323A5880374j276153j448148j457927j250506o29365M51969J599572K119423
40315A3989239J622065M91945m22623o63954n65560p18245j213477j583646j381015
40306I554729o45845J26368L38799k92518j489287k593196l112772l054855k683985
$$ y = [12968044, 12530647, 11759939, 10660931, 9117483, 7104188, 4873944, 2848184, 1413278, 870960, 1359399, 2588801, 3802617, 4330725, 4191208, 3897819, 3705223, 3395039, 2885229, 2663112, 3350447, 5063487, 7423208, 9952807, 12169958, 13522684, 13718764, 13168365, 12756006, 13034047, 13803094, 14495381, 14734962, 14480720, 13911122, 13359059, 13197002, 13583279, 14352492, 15227997, 16049900, 16715018, 17022577, 16752321, 15880374, 14604221, 13156073, 11698146, 10447640, 9818275, 10270244, 11869816, 13989239, 15611304, 16103249, 15680626, 15016672, 14451112, 13732867, 12519390, 10935744, 9554729, 8908884, 9035252, 9374051, 9081533, 7592246, 4999050, 1886278, -1168577, -3852562]
40297c852562k159496j578669j149234r88550q54923m31788J38339L52862L4839
40288a0489182m05443n00192k18108K21376P53630J458050K298975L079744L576719
40279b24431L612383L118555K238148J244367K71754p19456j626179k077818j831013
40270D006310j132220m66767n9631J60046K22201N0765k56441l45779Q7968J031363
40260C297815K200280L213137L707336L483403K666704J659167Q48482L81532
40252B1457856K10127K42398L71259M25536K29165k20901o66610p72542m67428
40243B0808860o0385P6017r0250k92923l94674n61056r27993j315282j458402
40234A5783912j376959j292356j268958j160357q60220l88916K29778R38571J493601
$$ y = [-3852562, -6012058, -7590727, -8739961, -9728511, -10583434, -11015222, -10876883, -10524021, -10489182, -10894625, -11394817, -11612925, -11391549, -10637919, -9179869, -6880894, -3801150, -224431, 3387952, 6506507, 8744655, 9989022, 10260776, 9541320, 7915141, 5837323, 4006310, 2874090, 2407323, 2347692, 2507738, 2729939, 2780704, 2524263, 2178484, 2266452, 3297815, 5498095, 8711232, 12418568, 15901971, 18568675, 20227842, 21076324, 21457856, 21667983, 21910381, 22281640, 22707176, 22936341, 22715440, 22048830, 21276288, 20808860, 20748475, 20824492, 20734242, 20441319, 20046645, 19485589, 18557596, 17242314, 15783912, 14406953, 13114597, 11845639, 10685282, 9825062, 9436146, 9665924, 10604495, 12098096]
40225A2098096J591144J216333O86208L11966K05723M24165J018465J821869K435454
40216B1809423K613898K505174K345160K070396J427452L71559q02042j644583
40208C0696437j772562j078756O2383R20271J005324N48797K28257M46871J029084
40199C2086106J542933J691245J406420Q18945K21410j00610r0146J11079M04140
40190C8091522P95331J208386J413682J217511O14485k53923j133234j644985
40182D0308775j491719q14900j83545o4200l97708q20575j184375j676418k457101
40173C1218234l312219l692668l106741j586343J85780J366966J704259J692273
40165B4469541J880135K189219K123911J523906Q05229M58470N81929R73309J426447
$$ y = [12098096, 13689240, 14905573, 15591781, 15903747, 16109470, 16533635, 17552100, 19373969, 21809423, 24423321, 26928495, 29273655, 31344051, 32771503, 33143062, 32341020, 30696437, 28923875, 27845119, 27907502, 28827773, 29833097, 30381894, 30610151, 31057022, 32086106, 33629039, 35320284, 36726704, 37545649, 37767059, 37666449, 37576303, 37687382, 38091522, 38886853, 40095239, 41508921, 42726432, 43340917, 43086994, 41953760, 40308775, 38817056, 38002156, 37818611, 37754411, 37356703, 36536128, 35351753, 33675335, 31218234, 27906015, 24213347, 21106606, 19520263, 19706043, 21073009, 22777268, 24469541, 26349676, 28538895, 30662806, 32186712, 32991941, 33450411, 34032340, 35005649, 36432096]
40156C6432096J786585J886465J618717J025702K26370o75662j538751k151565
40148C8609957k399331k415836k428758k447941k224626j572777o70998J7838
40140B4467528J42549k07711n47428l77179M18450J474102K193334K137936J310537
40131C1012118J69456o66809q55054n36640j14965J33349J78507O5665j93381
40122B9192246n31089p87093q42346o94762l75659M1071K77942n1676r43110j733999
40112B3551525j652085o27272P08888J841625K847202L904225M687018M627484
40104C9888610L655940K290398R55907m26051j998253l408028m014778l593318
40096C3350427k560154j469288n17703L27929Q99552P83673k29609j761862l002242
$$ y = [36432096, 38218681, 40105146, 41723863, 42749565, 42975935, 42300273, 40761522, 38609957, 36210626, 33794790, 31366032, 28918091, 26693465, 25120688, 24449690, 24467528, 24610077, 24402366, 23854938, 23477759, 23896209, 25370311, 27563645, 29701581, 31012118, 31181574, 30514765, 29659711, 29123071, 29008106, 29141455, 29319962, 29385627, 29192246, 28661157, 27874064, 27031718, 26336956, 25961297, 26002368, 26280310, 26228634, 25285524, 23551525, 21899440, 21272168, 21981056, 23822681, 26669883, 30574108, 35261126, 39888610, 43544550, 45834948, 46790855, 46364804, 44366551, 40958523, 36943745, 33350427, 30790273, 29320985, 28803282, 29131211, 30030763, 30814436, 30584827, 28822965, 25820723]
40087B5820723l269035k451203r87969M92253J516392J907042J792792J539035
40079B6360030J481795J517385J029817m73006k546661l911842l659902k263231
40071A7534385j091934r20454j201191q96606K91434J765165K850697L363877
40063B1695373L393612K974498K229790J586877J487969J884415K259827K209593
40055C9721954J814547J380230J017641O46966K65378k4425k04138l28625l23176
40046D3966352m2845L86020N40854K11479k55668l78571j95077k02091o58272
40037D3372181j249335j522105j376196r81706m64626Q0087M32028M20021K34570
40028C8944919K83769O48130Q79328M89244m49888j317266j540898j140367p13392
$$ y = [25820723, 22551688, 20100485, 19112516, 19604769, 21121161, 23028203, 24820995, 26360030, 27841825, 29359210, 30389027, 29916021, 27369360, 23457518, 19797616, 17534385, 16442451, 15521997, 14320806, 13424200, 13715634, 15480799, 18331496, 21695373, 25088985, 28063483, 30293273, 31880150, 33368119, 35252534, 37512361, 39721954, 41536501, 42916731, 43934372, 44581338, 44846716, 44822291, 44618153, 44289528, 43966352, 43923507, 44309527, 44850381, 45061860, 44806192, 44427621, 44232544, 44030453, 43372181, 42122846, 40600741, 39224545, 38242839, 37778213, 37858300, 38290328, 38710349, 38944919, 39228688, 39876818, 40756146, 41245390, 40795502, 39478236, 37937338, 36796971, 36083579]
40019C6083579r08537j834846k912428l328260k704740j346181J27916J281143
40011B4457646J955639K049129J459343L14500r22286j746039j977678j761690
40003B3828564j281769o36118L1749M88664O11431N28636M61140M84947N23470
39994B5040714M77343K43894l03871j170149k056400k478303k137592j150967
39986A6464669M8974R61125J256806R86408N82547M99601Q05766J257822J740816
39977B4604534K350132K945534K959933J973451L46108j020941j518792j208368
39969C1431591m84501K58987N95049J31303j067767k297269k744075k188067j030048
39960B2605203K66398J502006K524305L001647K650783J631797N64017J13526
$$ y = [36083579, 35175042, 33340196, 30427768, 27099508, 24394768, 23048587, 23176503, 24457646, 26413285, 28462414, 29921757, 30236257, 29313971, 27567932, 25590254, 23828564, 22546795, 21910677, 21942426, 22431090, 23042521, 23571157, 24032297, 24517244, 25040714, 25518057, 25761951, 25458080, 24287931, 22231531, 19753228, 17615636, 16464669, 16513643, 17474768, 18731574, 19717982, 20300529, 20800130, 21605896, 22863718, 24604534, 26954666, 29900200, 32860133, 34833584, 35179692, 34158751, 32639959, 31431591, 30947090, 31206077, 31801126, 31932429, 30864662, 28567393, 25823318, 23635251, 22605203, 22871601, 24373607, 26897912, 29899559, 32550342, 34182139, 34746156, 34859682]
39952C4859682N62904J674310K838442L390113K972998J755663L03979q19377
39944D7538714j388543j532237j521497j567773j747205k026457k334534k607390
39936C2813078k758243k671165k346298k038361k047172k249589k013629q09461
39928A5879160J134902K961632L923435L843149K971075J730874O38426J05256
39920C3187909R9920J90087Q2843m3897J27720O25172J288228K083133L023514
39911D0664629L898952M369655M284632L700880K715940J574957Q31631R78163
39903F3019439J822556K548256K527938J861547J039013L42208k84972j019890
39895G1856095j986880l091169l852480l628661k282210n28795O18081P30257
$$ y = [34859682, 35422586, 37096896, 39935338, 43325451, 46298449, 48054112, 48358091, 47538714, 46150171, 44617934, 43096437, 41528664, 39781459, 37755002, 35420468, 32813078, 30054835, 27383670, 25037372, 22999011, 20951839, 18702250, 16688621, 15879160, 17014062, 19975694, 23899129, 27742278, 30713353, 32444227, 33082653, 33187909, 33287829, 33477916, 33560759, 33516862, 33644582, 34269754, 35557982, 37641115, 40664629, 44563581, 48933236, 53217868, 56918748, 59634688, 61209645, 62041276, 63019439, 64841995, 67390251, 69918189, 71779736, 72818749, 73160957, 72875985, 71856095, 69869215, 66778046, 62925566, 59296905, 57014695, 56485900, 57103981, 57834238]
39887E7834238J72456m34284p20377o22258k53809J61742M10690M69696M97585
39878E7515679N94357O55205N12162J16462n02112j349745k370089l236273l439071
39869D8496575k739512j472752k41789O86752J502496K323929K809794K554884
39861E3920377J761921J192933J384837K153878K981705L661636M366786N222452
39853G6646525O049507O522315O440155N865927N131803M700798M881564N617013
39845A21855607O599950P606417Q666641R906192J1268609J2408834J2836887
39838A91149137J2172629J0313037P444846M016475P30331j626463k618960k482599
39830B19098433j835630j051381j44856O54135N75522j081318m113347p498823
$$ y = [57834238, 58006694, 57572410, 56852033, 56229775, 55975966, 56137708, 56548398, 57018094, 57515679, 58110036, 58765241, 59277403, 59393865, 58891753, 57542008, 55171919, 51935646, 48496575, 45757063, 44284311, 44042522, 44729274, 46231770, 48555699, 51365493, 53920377, 55682298, 56875231, 58260068, 60413946, 63395651, 67057287, 71424073, 76646525, 82696032, 89218347, 95658502, 101524429, 106656232, 111357030, 116238594, 121855607, 128455557, 136061974, 144728615, 154634807, 165903416, 178312250, 191149137, 203321766, 213634803, 221079649, 225096124, 225826455, 224199992, 221581032, 219098433, 217262803, 216211422, 216066566, 216720701, 217296223, 216214905, 212101558, 204602735]
39822B04602735j0291457j2167790j3152049j3250268j2598650j1686261j1040024
39815A20416236j0673184j0070170q784595o935552n080186l716739k984974k749740
39807F9421096k808785k964788k999963k738079k200855j645553j353845j354116
39799E1355112j384648j157692o59744j90651j11001n45097j317018k150347k880941
39790D0957973l448932l756380l663559l156535k415232j649421r48193l72386
39782B1547335j03378l29339r53988j533908j584366r36463J87064J357624K177522
39773A9828103K458733K311545K052358J905548J743862J206133J54364j038491
39765C0622155j763692j728086j134139l49117M04948R71741J127076P89125K73540
$$ y = [204602735, 194311278, 182143488, 168991439, 155741171, 143142521, 131456260, 120416236, 109743052, 99672882, 90888287, 83952735, 78872549, 75155810, 72170836, 69421096, 66612311, 63647523, 60647560, 57909481, 55708626, 54063073, 52709228, 51355112, 49970464, 48812772, 48153028, 47962377, 47851376, 47306279, 45989261, 43838914, 40957973, 37509041, 33752661, 30089102, 26932567, 24517335, 22867914, 21919721, 21547335, 21443957, 21114618, 20160630, 18626722, 17042356, 16105893, 16292957, 17650581, 19828103, 22286836, 24598381, 26650739, 28556287, 30300149, 31506282, 31660646, 30622155, 28858463, 27130377, 25996238, 25647121, 26052069, 27023810, 28150886, 28940011, 29213551]
39756B9213551O1978K84237O28912P83346P28306N33329J33802m79727j007780
39747C0879954j026001m26616M39853J056377J131030P75906L61731J21008j39532
39738C3173710q05167j878424k808955l014431k422843j387834k79795O29840
39730B1206101J085438R99369O56018M82755O03762Q34711J077558J434380J910327
39721C0290419K309170K529330K706945K930325L045182K920541K717807K683957
39713E2133676K806673K894884K924304L065881L352989L504224L157945K205273
39705G6045849Q65603m69608j410448j686833j263623m13632M05546Q84419J098224
39696G4055497J319991J588000J630894J346399J190171J810408L261472M771952
$$ y = [29213551, 29275529, 29559766, 30188678, 30972024, 31700330, 32233659, 32367461, 31887734, 30879954, 29853953, 29427337, 29867190, 30923567, 32054597, 32830503, 33192234, 33313242, 33173710, 32368543, 30490119, 27681164, 24666733, 22243890, 20856056, 20576261, 21206101, 22291539, 23290908, 23946926, 24429681, 25033443, 25868154, 26945712, 28380092, 30290419, 32599589, 35128919, 37835864, 40766189, 43811371, 46731912, 49449719, 52133676, 54940349, 57835233, 60759537, 63825418, 67178407, 70682631, 73840576, 76045849, 76911452, 76441844, 75031396, 73344563, 72080940, 71667308, 72072854, 72957273, 74055497, 75375488, 76963488, 78594382, 79940781, 81130952, 82941360, 86202832, 90974784]
39688I0974784N377965M697605L093516J268892k05573j153082j821167k682541
39680I9550399m072863n892662p591436q459968q075068o609025m716637l052371
39672E1080369j895293j215665q96074p04372k33100P62058J920853K472816J997873
39663E3289465Q06919m82981j493047k107718k272117k018086j512560q55466
39655D3354409J7502J019347J685086J573089Q19672J4819m30672n38203m72142
39646D7042907l84250n88585j447600k790649l706870l310677j721570m8203O49571
39637C3694074K50973n41975r73952p74420j22730O34364J164730J238666Q39189
39628C5408919K27315j71104n683Q11859K063313L310104M107028M267387L950594
$$ y = [90974784, 96352749, 101050354, 104143870, 105412762, 105207189, 104054107, 102232940, 99550399, 95477536, 89584874, 81993438, 73533470, 65458402, 58849377, 54132740, 51080369, 49185076, 47969411, 47073337, 46368965, 46135865, 46897923, 48818776, 51291592, 53289465, 54096384, 53613403, 52120356, 50012638, 47740521, 45722435, 44209875, 43354409, 43371911, 44391258, 46076344, 47649433, 48469105, 48483924, 48053252, 47515049, 47042907, 46658657, 46070072, 44622472, 41831823, 38124953, 34814276, 33092706, 33044503, 33694074, 33945047, 33403072, 32429120, 31654700, 31531970, 32166334, 33331064, 34569730, 35408919, 35636234, 35465130, 35459447, 36271306, 38334619, 41644723, 45751751, 50019138, 53969732]
39619E3969732L453464K949574K477291K072875J752419J415005R65966N36599
39611F9592925L68181M48396N10010M69387N68199Q75707R26448K13313j060852
39602G2911714k081582k308551k008052j861281k277672l157458m085940m610565
39594E0520613m501084l940874l417241l279522l388839l257870k538092j370780
39586B4826311l06031J29394j19464n63384o02456q2007O12414J010139J016473
39577B5921389Q94816R13318J117126J376464J508030J339491P97417L2060o05552
39568C3294559q36164p37211o82383r35776j345077j510230j241052p64191m62860
39559B4779615m91350o78757p32225m74397N0995O11557R34325Q96833O02002
$$ y = [53969732, 57423196, 60372770, 62850061, 64922936, 66675355, 68090360, 69056326, 69592925, 69961106, 70409502, 70919512, 71388899, 71957098, 72832805, 73759253, 73972566, 72911714, 70830132, 68521581, 66513529, 64652248, 62374576, 59217118, 55131178, 50520613, 46019529, 42078655, 38661414, 35381892, 31993053, 28735183, 26197091, 24826311, 24520280, 24649674, 24530210, 23966826, 23364370, 23282363, 23894777, 24904916, 25921389, 26816205, 27729523, 28846649, 30223113, 31731143, 33070634, 33868051, 33900111, 33294559, 32458395, 31721184, 31038801, 30103025, 28757948, 27247718, 26006666, 25242475, 24779615, 24288265, 23609508, 22877283, 22402886, 22453881, 23065438, 23999763, 24896596, 25498598]
39550B5498598K63498L4700o2782j17413k72735o28174j133928j617802j947565
39541B0016397k111473k104562j821059j151928j68856Q38324J498289J560249
39533A6555381J077005M32078P8078J78662N74117J075183J580119J848590J480644
39524B4879857M05488p88981j359411j204640q86360q82531j105962j171083q37985
39515A7048392j27552P19500J295191J308177R60338P93849R90226J061301M73637
39506B4523059o09039j489368j731216j502836j174197q86978o16623m31918m99946
39497A5580938q62702j294402j402105q94527J92549J511698K635031L258042
39489A8724522L245434K644832J721018Q21096O0551p59182j760790k597117k661220
$$ y = [25498598, 25762096, 25796796, 25734014, 25616601, 25343866, 24715692, 23581764, 21963962, 20016397, 17904924, 15800362, 13979303, 12827375, 12658519, 13496843, 14995132, 16555381, 17632386, 18064464, 18142542, 18321204, 18895321, 19970504, 21550623, 23399213, 24879857, 25285345, 24496364, 23136953, 21932313, 21045953, 20163422, 19057460, 17886377, 17048392, 16920840, 17640340, 18935531, 20243708, 21204046, 21997895, 22988121, 24049422, 24523059, 23914020, 22424652, 20693436, 19190600, 18016403, 17129425, 16512802, 16080884, 15580938, 14718236, 13423834, 12021729, 11127202, 11319751, 12831449, 15466480, 18724522, 21969956, 24614788, 26335806, 27156902, 27217453, 26458271, 24697481, 22100364, 19439144]
39480A9439144j720461k07419J127177J722007J402373L28131j096129k375761
39472A8619062l169269l412208l193765k596703j725347q02284j00957K33087
39464C851616K44509Q9520k6742J18852O41555J386612J993388K223398K176107
39455A2698815K079433J914348J420621N31653l61986p56534n92557k95813k49474
39446A6388506m05528n14614n81315q77059j505287k142249k332944j995997j531940
39437D501573j394914j584598j602597r44424L47567J625020K148118J695621
39429D791366P12080j07615l75030j94806J31558N01082J037629J750560K320246
39420A0567070K373337J938349J462121J316316J409643J375880J042241N77263
$$ y = [19439144, 17718683, 17511264, 18638441, 20360448, 21762821, 22090952, 20994823, 18619062, 15449793, 12037585, 8843820, 6247117, 4521770, 3719486, 3618529, 3851616, 4096125, 4185645, 4158903, 4277755, 4919310, 6305922, 8299310, 10522708, 12698815, 14778248, 16692596, 18113217, 18644870, 18282884, 17526350, 16933793, 16637980, 16388506, 15982978, 15468364, 14887049, 14009990, 12504703, 10362454, 8029510, 6033513, 4501573, 3106659, 1522061, -80536, -1024960, -677393, 947627, 3095745, 4791366, 5503446, 5395831, 5020801, 4825995, 4957553, 5458635, 6496264, 8246824, 10567070, 12940407, 14878756, 16340877, 17657193, 19066836, 20442716, 21484957, 22062220]
39412B2062220K24801N0385j7415k4203K5415N5807r6260n11718j017638j282051
39402A9469343j167197r43509j008608j362633j526814j112957l57964J03345
39394A2093006k7319l92584m30488J4600O02122Q82634O69009J00704n52274j150247
39384A1809163j758662k420794k919369k957225k605108k314552k322238k275458
39376g764243j726858q31447j76422K0862J04673K90214K48567l26916j084428
39367a1245998j354990r66122l20552K62188Q74277J640309K372600K775893K784194
39358c178201K555373K278562K076088J956739J802765J538122J323727J392531
39350A1745706J671526J819972J702263J523179J376665J022044L69837j39274
$$ y = [22062220, 22287021, 22337406, 22319991, 22295788, 22321203, 22377010, 22280750, 21769032, 20751394, 19469343, 18302146, 17358637, 16350029, 14987396, 13460582, 12347625, 11989661, 12093006, 12065687, 11673103, 11242615, 11257215, 11859337, 12741971, 13410980, 13511684, 12959410, 11809163, 10050501, 7629707, 4710338, 1753113, -851995, -3166547, -5488785, -7764243, -9491101, -10322548, -10498970, -10478108, -10373435, -10083221, -9834654, -10161570, -11245998, -12600988, -13567110, -13887662, -13625474, -12751197, -11110888, -8738288, -5962395, -3178201, -622828, 1655734, 3731822, 5688561, 7491326, 9029448, 10353175, 11745706, 13417232, 15237204, 16939467, 18462646, 19839311, 20861355, 21231192, 21091918]
39342B1091918m6904M15493N65742J59545l61216n22060l44161j44902j52719
39333B0660736m56643j044635j687519j967167j613353p45395K78340J128870
39325A4553234J610530J714592J667729J738963J882062J742793J147936M14611
39317B6472450N877m277K2390l23332j170589k283523l153018l317876k809474
39308A3438628k213138k093023k370802k415619j727189m21199Q93770J573527
39300D664955J343846M71894m16318q23042p38965m65634j34860M31040J353081
39291E685997K349240K869422K541234J451495O5262j062040j557450j374803
39283A0968357p80359j86775R6167L1834k10696m98202q50530j277063j591566
$$ y = [21091918, 21045014, 21460507, 22026249, 22185794, 21824578, 21302518, 20958357, 20813455, 20660736, 20204093, 19159458, 17471939, 15504772, 13891419, 13146024, 13424364, 14553234, 16163764, 17878356, 19546085, 21285048, 23167110, 24909903, 26057839, 26472450, 26478327, 26474050, 26496440, 26173108, 25002519, 22718996, 19565978, 16248102, 13438628, 11225490, 9132467, 6761665, 4346046, 2618857, 2197658, 3091428, 4664955, 6008801, 6480695, 6064377, 5241335, 4502370, 4036736, 3901876, 4332916, 5685997, 8035237, 10904659, 13445893, 14897388, 14962650, 13900610, 12343160, 10968357, 10187998, 10001223, 10097390, 10129224, 9918528, 9420326, 8569796, 7292733, 5701167]
39274E701167j520871r71910q8446Q93659J693555J970148J534833O23866k83632
39265I552369r80690j600872k096051k024467j143150O5884Q35163R31665O88426
39256D228277L55984j19704o55254q41211m37900K07909M92236J84654m13359
39247C001632q17426p32943j98397M62179Q40934P15636J71617n12933j056979
39238A873320j297026j246636j070988r21952p85382n63729k74654l0903J68104
39229d149846M50753Q31777J117527J139772R59987P48940N65661L55707J01377
39220B121655j09373j31354J33150N94100R35530Q62403M42714O3750l2379k9556
39210D850640k53172p50707j299504j703009j889792j803341j420985q93154m92144
$$ y = [5701167, 4180296, 3208386, 3119940, 4013599, 5707154, 7677302, 9212135, 9836001, 9552369, 8571679, 6970807, 4874756, 2850289, 1707139, 1773023, 2608186, 3539851, 4228277, 4584261, 4464557, 3809303, 2968092, 2530192, 2738101, 3230337, 3414991, 3001632, 2184206, 1451263, 1252866, 1715045, 2555979, 3271615, 3443232, 2930299, 1873320, 576294, -670342, -1741330, -2663282, -3448664, -4012393, -4287047, -4317950, -4149846, -3699093, -2867316, -1749789, -610017, 349970, 1098910, 1664571, 2020278, 2121655, 2012282, 1880928, 2014078, 2608178, 3543708, 4406111, 4848825, 4912575, 4880196, 4850640, 4597468, 3846761, 2547257, 844248, -1045544, -2848885, -4269870, -5163024, -5655168]
39201e655168l83597n45017q69598j187566j214683p25988J23029Q38079J084075
39192h536434J000868Q95421P98712N59061K49905J55086L29262M94235N02394
39183c551490O14049J075277J629941J768501J374403Q09429L68894l9883o20635
39174C428486j379842k206856k999391l549342l533634k829764j690628m38748
39166a5199719Q37199K085858K990053L159016K557593J525182M61965k89275
39158a872128m22181Q9509P51056R30292N83095L16774O28483J320029J765066
39149D089995J531580O50332m81816j308568j420782q45393L5013Q72751J502611
39140D625723J724046J286597K83345o96629j063992p56717j29855M77451Q58373
$$ y = [-5655168, -6038765, -6583782, -7453380, -8640946, -9855629, -10581617, -10458588, -9620509, -8536434, -7535566, -6640145, -5841433, -5282372, -5032467, -4877381, -4548119, -4053884, -3551490, -2937441, -1862164, -232223, 1536278, 2910681, 3720110, 4089004, 4049121, 3428486, 2048644, -158212, -3157603, -6706945, -10240579, -13070343, -14760971, -15199719, -14362520, -12276662, -9286609, -6127593, -3570000, -2044818, -1582853, -1872128, -2294309, -2204800, -1453744, -523452, 59643, 376417, 1004900, 2324929, 4089995, 5621575, 6271907, 5790091, 4481523, 3060741, 2215348, 2250361, 3123112, 4625723, 6349769, 7636366, 7919711, 7223082, 6159090, 5402373, 5272518, 5749969, 6608342]
39131F608342Q32077L44837l67681r49545j233871j241360r89470n26740p9340
39122B397249Q4000p7611m25029q91973j439652j773827j409154j75357J451568
39113b259786K612253K639136J472703k82090j702184k182539j885987j509241
39105c097735j550572j853994j856537j169907R4098J441449K362695K644546
39097b985957K389064J787900J004681L23994J80451P42279J520519J711682J015490
39088G690103j07899j040376j576442j768298j545841q44051K8373N20025L93386
39079A748980o5573m25376m93836k85311J58021P54931J337338J794888K212388
39070F736450K711059L175889L291931K881652K088540J178027K65109o70481
$$ y = [6608342, 7440419, 7785256, 7417575, 6468030, 5234159, 3992799, 3003329, 2476589, 2397249, 2481249, 2403638, 1978609, 1086636, -353016, -2126843, -3535997, -3711354, -2259786, 352467, 2991603, 4464306, 4182216, 2480032, 297493, -1588494, -3097735, -4648307, -6502301, -8358838, -9528745, -9434647, -7993198, -5630503, -2985957, -596893, 1191007, 2195688, 2519682, 2700133, 3442412, 4962931, 6674613, 7690103, 7582204, 6541828, 4965386, 3197088, 1651247, 807196, 835569, 1355594, 1748980, 1683407, 1258031, 764195, 478884, 636905, 1391836, 2729174, 4524062, 6736450, 9447509, 12623398, 15915329, 18796981, 20885521, 22063548, 22328657, 21658176]
39062B1658176j571316k238571k515653k481493k413413k526650k724454k645954
39054B540672k064772j248345p66762q43107j034851p40786O4977Q32286J141184
39045b119504J156355J327573J879319K697079L467955L741160L069738J427615
39037A6647290n18348j800417j926692j231206n06336l92949j041395k115975
39029G113972l005747l142240k293226o68295J203615K726443L493635L421078
39021H849235K682939J569149M47264k62435l38598o7088q7011p61978j802551
39012A0228926k597325k761544k269713j302216k01184O07264R41825J018160
39004C664193J025644P04927l08363j815882l138144l859732m087165l924772
$$ y = [21658176, 20086860, 17848289, 15332636, 12851143, 10437730, 7911080, 5186626, 2540672, 475900, -772445, -1539207, -2382314, -3417165, -4157951, -4092974, -3260688, -2119504, -963149, 364424, 2243743, 4940822, 8408777, 12149937, 15219675, 16647290, 16128942, 14328525, 12401833, 11170627, 10664291, 10271342, 9229947, 7113972, 4108225, 965985, -1327241, -1995536, -791921, 1934522, 5428157, 8849235, 11532174, 13101323, 13548587, 13286152, 12947554, 12880466, 12793455, 12031477, 10228926, 7631601, 4870057, 2600344, 1298128, 1096944, 1704208, 2646033, 3664193, 4689837, 5394764, 5086401, 3270519, 132375, -3727357, -7814522, -11739294]
38996a1739294l178368j811887l11602P46461J283539J602577J878553K051355
38988i478666K081752K000894J748187J211360M24477m43705j241049j786582
38980e483332j766471r73276K96930J326511J595592J221609P29307N19034O43693
38971a890403R52030J240370J276734Q99243K57828j19540K79132J393942K544456
38962F833792L040475K757325K023208J119191J48109o93605j085110r42748n60174
38953A2640463k42758J399K83618N83089Q66876J252259J786780K193862K105306
38944B1470894J494049O71253o1332n32938n93154k12829K96760M80483K50249
38935B3263435l8874j11706j27203l63992p59533r70765p91505l35870J30231
$$ y = [-11739294, -14917662, -16729549, -17041151, -16294690, -15011151, -13408574, -11530021, -9478666, -7396914, -5396020, -3647833, -2436473, -2011996, -2455701, -3696750, -5483332, -7249803, -8223079, -7926149, -6599638, -5004046, -3782437, -3053130, -2534096, -1890403, -938373, 301997, 1578731, 2477974, 2735802, 2616262, 2895394, 4289336, 6833792, 9874267, 12631592, 14654800, 15773991, 15922100, 15228495, 14143385, 13200637, 12640463, 12397705, 12399104, 12682722, 13265811, 14132687, 15384946, 17171726, 19365588, 21470894, 22964943, 23636196, 23574864, 23041926, 22448772, 22235943, 22532703, 23013186, 23263435, 23224561, 23112855, 22985652, 22621660, 21862127, 20891362, 20099857, 19763987, 19894218]
38926A9894218L82702K93103j52863q19706j441383j735740j585417j182446r36284
38917A2716184j085122j385372j347795q32250k32652K5132k1805n4829K1279
38908G802770L8619k3520Q7093N04198R68916J137793J028026R42746J002305
38899A3488946R73301O29464J19576j70234p2906J78258K56833J33194O7141K41279
38889A5844852N08314N53124K47126k29518n90105o81613n27343k43526J5592
38880A4896903J04367j0723k00194l04984l15295l25194l05368n6724N15507J166124
38870A5164419J486041J315979Q82952M95456J91850k23499q10114j250805j081916
38861A6170363k06842Q81264J498418J402495R20109M10821k21256j296913k717513
$$ y = [19894218, 20276920, 20570023, 20417160, 19597454, 18156071, 16420331, 14834914, 13652468, 12716184, 11631062, 10245690, 8897895, 8065645, 7832993, 7858125, 7836320, 7781491, 7802770, 7841389, 7817869, 7904962, 8409160, 9378076, 10515869, 11543895, 12486641, 13488946, 14462247, 15091711, 15211287, 15041053, 14968147, 15146405, 15403238, 15536432, 15603573, 15844852, 16353166, 16906290, 17153416, 16923898, 16333793, 15652180, 15124837, 14881311, 14896903, 15001270, 14990547, 14790353, 14485369, 14170074, 13844880, 13539512, 13482788, 13998295, 15164419, 16650460, 17966439, 18849391, 19344847, 19536697, 19313198, 18503084, 17252279, 16170363, 15963521, 16844785, 18343203, 19745698, 20665807, 21076628, 20855372, 19558459, 16840946]
38852A6840946l805961l910687l068551j973355j334688j320109j553489j542786
38844a668680j085695l30766M55610J104653J541341J687365J484839R99707M05858
38835D594232j56638o65429j171487j716376k255419k600416k504703j928428
38827h404664j190267p20454o64441q52367j132335j540373k087908k560200k655805
38818b1808814k263230j547550q24458l33758n241N48644J632990L036182M184261
38809a7380974M758796M916488M825994M317707L226732J825299N99682k55573
38801F834151q35246j164457j185530j014913q28893m92748L00514J412123K133547
38792E158548J896065Q80811k62523j096419j581648j773150j653535j281497
$$ y = [16840946, 13034985, 9124298, 6055747, 4082392, 2747704, 1427595, -125894, -1668680, -2754375, -3085141, -2629531, -1524878, 16463, 1703828, 3188667, 4188374, 4594232, 4437594, 3772165, 2600678, 884302, -1371117, -3971533, -6476236, -8404664, -9594931, -10315385, -10979826, -11832193, -12964528, -14504901, -16592809, -19153009, -21808814, -24072044, -25619594, -26444052, -26777810, -26783051, -26234407, -24601417, -21565235, -17380974, -12622178, -7705690, -2879696, 1438011, 4664743, 6490042, 7089724, 6834151, 5998905, 4834448, 3648918, 2634005, 1805112, 1312364, 1612878, 3025001, 5158548, 7054613, 7935424, 7672901, 6576482, 4994834, 3221684, 1568149, 286652]
38784B86652q90288p43706r32794j286754j426176r88380M2727J217238J949175
38775b772306K022302J716691J424227J232729R51915M68404n3550l22009j43771
38766D524632N29130J601943K712020L212134K588656J025278o15918j521910
38758A4055965j566428j175799p39520l07371K67773J083038J998581K532243
38750A6148482K085024N62001j274230k384078k448432k036260j725641j386752
38742G540114n58900O98138J674654J734499R55077l615n34224n26652k81900
38733A0697191j16822j04920j51867j98820k65680l42855l33596r8716M75661
38724I559576J367356K267175K631207K096431Q91725k86946q55614p57039l88383
$$ y = [286652, -603636, -1347342, -2280136, -3566890, -4993066, -5981446, -5938719, -4721481, -2772306, -750004, 966687, 2390914, 3623643, 4575558, 5043962, 4990412, 4668403, 4524632, 5053762, 6655705, 9367725, 12579859, 15168515, 16193793, 15577875, 14055965, 12489537, 11313738, 10574218, 10266847, 10534620, 11617658, 13616239, 16148482, 18233506, 18795507, 17521277, 15137199, 12688767, 10652507, 8926866, 7540114, 6981214, 7679352, 9354006, 11088505, 12043582, 12039967, 11505743, 10979091, 10697191, 10580369, 10475449, 10323582, 10124762, 9859082, 9516227, 9182631, 9083915, 9559576, 10926932, 13194107, 15825314, 17921745, 18813470, 18526524, 17670910, 16913871, 16525488]
38715A6525488k72211p27154j617992k390446k548611k150126j667150j360392
38707C791406j033797m56885K52881Q00680J010971P89163N8730r86937j747323
38698B478889j653905p30546M61554J355669J683183J409568P07184N096k22367
38689E494325J55488Q54324J487817J802215J643448R62145l9710r60124j549176
38680I850752j908231k222209k400452k154559j414842n16675R0541K52846J83255
38671b39574J83220L70117O51138Q42737P58608K85222m95146j274668j720469
38662f38815j710559j314062o23533K24865R11637J075803P03755K05098k0183
38653a185994K8618P8768n0003l25967o23830q18293q27729o63463l90744l8737
$$ y = [16525488, 16253277, 15526123, 13908131, 11517685, 8969074, 6818948, 5151798, 3791406, 2757609, 2300724, 2553605, 3354285, 4365256, 5154419, 5213149, 4226212, 2478889, 824984, 94438, 555992, 1911661, 3594844, 5004412, 5711596, 5716692, 5494325, 5649813, 6504137, 7991954, 9794169, 11437617, 12399762, 12360052, 11399928, 9850752, 7942521, 5720312, 3319860, 1165301, -249541, -766216, -675675, -422829, -239574, -56354, 313763, 964901, 1807638, 2566246, 2851468, 2356322, 1081654, -638815, -2349374, -3663436, -4286969, -4062104, -3150467, -2074664, -1370909, -1165811, -1185994, -1157376, -1078608, -1128611, -1454578, -2078408, -2896701, -3724430, -4387893, -4778637, -4817374]
38643d817374L21259M49425J80312j41629J58741J230677K325863K598737K030974
38634D336985J219496N19143j14338o03654o89209m49102l47622n86555q21621
38625B463523p06268l35331N8615M72246R08194J097190P93952J69500l91218
38616D530403p39679r35411r03872m56311L43186J067968J256271P84653k5238
38607D921970n97343n15271J28321Q68144J391445J748560J986022J895284J373550
38598A3200682P51903L89775J26255m23974j111905j299115p62127j09733o7299
38589A0694462o54398j322208j664879j708838j652692j631535j712457j871641
38581a524186j913758j560604p09356M08440J319232J585406J126175L43435j88705
$$ y = [-4817374, -4496115, -4046690, -3866378, -4008007, -3849266, -2618589, -292726, 2306011, 4336985, 5556481, 6075624, 5961286, 5357632, 4668423, 4219321, 3871699, 3285144, 2463523, 1757255, 1421924, 1480539, 1952785, 2860979, 3958169, 4752121, 4921621, 4530403, 3790724, 2855313, 1951441, 1495130, 1838316, 2906284, 4162555, 4947208, 4921970, 4324627, 3809356, 3937677, 4805821, 6197266, 7945826, 9931848, 11827132, 13200682, 13952585, 14342360, 14468615, 14044641, 12932736, 11633621, 10871494, 10761761, 10694462, 10040064, 8717856, 7052977, 5344139, 3691447, 2059912, 347455, -1524186, -3437944, -4998548, -5707904, -5299464, -3980232, -2394826, -1268651, -925216, -1113921]
38572a113921k88686l38365p53965j384953j655958j277629n57993O8501N72712
38563f730257J198135J962638K571612K815265K798241K676842K359956J651621
38555A1304053O13911l84987r79565j033711n73143L12004J383011K206845K405349
38546A5253767J990439J345362Q26814M54606K8111n47077j159641j695028k208527
38537A4288826k809456l396381l588106k992480j596995R6848J391149J939095
38529C332500J993205K032686K126261J799943O62949r28665k048958k091513
38521F878408j336072n65648k62007k86187k30472Q9589M84378O27075M32420
38512E831484K06031L14505O66341P11154J24424o74705r67622o28219k59255
$$ y = [-1113921, -1402607, -1740972, -2494937, -3879890, -5535848, -6813477, -7371470, -7302969, -6730257, -5532122, -3569484, -997872, 1817393, 4615634, 7292476, 9652432, 11304053, 11917964, 11532977, 10553412, 9519701, 8946558, 9258562, 10641573, 12848418, 15253767, 17244206, 18589568, 19416382, 19870988, 19899099, 19352022, 18192381, 16497353, 14288826, 11479370, 8082989, 4494883, 1502403, -94592, 2256, 1393405, 3332500, 5325705, 7358391, 9484652, 11284595, 11947544, 11018879, 8969921, 6878408, 5542336, 4976688, 4714681, 4428494, 4198022, 4287611, 4771989, 5399064, 5831484, 6037515, 6352020, 7018361, 7729515, 7853939, 7179234, 6211612, 5583393, 5324138]
38503E324138m14603r93069j505665j649195j423854r25423l01969J89093L44298
38494a356249K49605K18405M98794J088979J722592J928526J272387k11906j845774
38485C565359k740121k439852j106008P69486K612442L851651M111191L444509
38477A2068657K236823Q56553m42159j330507j452075q10761J00791P34066R21641
38468A2883029P89561M45909m3532n27058q72263j143274j451978j664837j488154
38459F927403q74904j55490K87555L23484M0849l63897n68804k32092O45425J550035
38449G579564J876755J540461J024642Q20886R71375J192637J277585J251080
38441A7534985J212881J166496J024651P34396L70926P7491j27394m35460j024129
$$ y = [5324138, 4909535, 3916466, 2410801, 761606, -662248, -1587671, -1889640, -1700547, -1356249, -1106644, -888239, -389445, 699534, 2422126, 4350652, 5623039, 5411133, 3565359, 825238, -1614614, -2720622, -1951136, 661306, 4512957, 8624148, 12068657, 14305480, 15162033, 14719874, 13389367, 11937292, 11126531, 11227322, 11961388, 12883029, 13672590, 14118499, 14074967, 13547909, 12675646, 11532372, 10080394, 8415557, 6927403, 6052499, 5897009, 6184564, 6508048, 6548897, 6185000, 5616196, 5384104, 6029529, 7579564, 9456319, 10996780, 12021422, 12842308, 13813683, 15006320, 16283905, 17534985, 18747866, 19914362, 20939013, 21673409, 22044335, 22121826, 21994432, 21558972, 20534843]
38432B0534843j749323k219716k233655j976307j683640j311387p44636j69184
38424H446995Q4231K1832k0817Q1815M6078l29914p73732q89725p04635n79120
38414E383008o89658q93961j079521j350160j777036k157391k151606j607838
38406f324163p21258Q1553M50917M06535L13011M94802R36386J459648K071783
38397h30786K895226L763434M146436L598978K162221K82881j501728k748400
38389A1768262l207303k937459k255340j446309n85905K75394Q76192Q82705K72307
38380C642544n35675r79743p82155j25417N44552R23125J093611J338390J700909
38371F820141J834030J348811K37759j119866k289096l008373l166985k750767
$$ y = [20534843, 18785520, 16565804, 14332149, 12355842, 10672202, 9360815, 8616179, 8446995, 8531226, 8553058, 8532241, 8614056, 8660134, 8330220, 7556488, 6666763, 5962128, 5383008, 4693350, 3799389, 2719868, 1369708, -407328, -2564719, -4716325, -6324163, -7045421, -6963868, -6512951, -6106416, -5793405, -5298603, -4362217, -2902569, -830786, 2064440, 5827874, 9974310, 13573288, 15735509, 16018390, 14516662, 11768262, 8560959, 5623500, 3368160, 1921851, 1335946, 1611340, 2487532, 3370237, 3642544, 3106869, 2127126, 1344971, 1219554, 1764106, 2687231, 3780842, 5119232, 6820141, 8654171, 10002982, 10240741, 9120875, 6831779, 3823406, 656421, -2094346]
38363b094346j892772q91350o2039M69275Q03331J067744J204305J043835O23670
38354B71653K94697L56098O50413P23445L83120j15116m64598o17438n81249k03984
38344F97041N60088J353350J721379J656518J513907J381687Q84348k38167j621713
38335G908438k588114k842440k640869k312529j851971j088421j25942N80265
38327d961583O57735K46904j06739K5699O36353J441848K164276K583722K537010
38318E225225K075572J503178J037049N24512k48942j036329j251611o92536J33759
38309G269877N33699K62087m65540j321230k001873k212696j812171r63335Q170
38300g03012Q59549J435358J568369J186330M67915k83258q87409j277957j341858
$$ y = [-2094346, -3987118, -4878468, -4940507, -4471232, -3667901, -2600157, -1395852, -352017, 271653, 566350, 922448, 1572861, 2296306, 2679426, 2564310, 2099712, 1482274, 901025, 697041, 1257129, 2610479, 4331858, 5988376, 7502283, 8883970, 9768318, 9530151, 7908438, 5320324, 2477884, -162985, -2475514, -4327485, -5415906, -5541848, -4961583, -4303848, -4056944, -4163683, -4137984, -3501631, -2059783, 104493, 2688215, 5225225, 7300797, 8803975, 9841024, 10365536, 10116594, 9080265, 7828654, 7136118, 7269877, 7803576, 8065663, 7600123, 6278893, 4277020, 2064324, 252153, -711182, -703012, 156537, 1591895, 3160264, 4346594, 4814509, 4531251, 3643842, 2365885, 1024027]
38291A024027r97920m08888J17021M76081Q33635J294763J694067J794366J548092
38282G375244J072009M80193j57952p54322j150580j098174l55815J002600K342167
38273H755370K753324J783237j34711k023252l070518l052944k332606j609866
38265A068034j485175j982659k511108k455257j781275r37730k60841K92338Q55619
38256i198054J386017J787192K088011K336085K435190K247491J795256J225745
38248F102933O11563q6153q62122j596369k175510k591895k850618k829728k349970
38239h627869j450428n46110j74105m76805r73229r73639k78356O02369R77903
38230a1920269O75492J65223O0859N82565J447952K129542K187896J525955M93842
$$ y = [1024027, 26107, -382781, -265760, 210321, 1043956, 2338719, 4032786, 5827152, 7375244, 8447253, 8927446, 8769494, 8015172, 6864592, 5766418, 5410603, 6413203, 8755370, 11508694, 13291931, 13157220, 11133968, 8063450, 5010506, 2677900, 1068034, -417141, -2399800, -4910908, -7366165, -9147440, -10085170, -10346011, -10053673, -9198054, -7812037, -6024845, -3936834, -1600749, 834441, 3081932, 4877188, 6102933, 6714496, 6628343, 5766221, 4169852, 1994342, -597553, -3448171, -6277899, -8627869, -10078297, -10624407, -10798512, -11275317, -12248546, -13222185, -13500541, -12898172, -11920269, -11244777, -11079554, -11018695, -10436130, -8988178, -6858636, -4670740, -3144785, -2650943]
38221b650943k81279l37721K46668R58423J369684J506813J646635J825502J720919
38212F004701J089576K02011l36458k51652O853l35637j542556k987082l702816
38203a853060l333015k453188j906803j930981k070015j855999j310208p15937
38195a7429206j77985L61949Q40853J115369J264190J557680K045798K418279
38187h003073K422910K239471K234310K436420K471079K020233J195396M15045
38179G431791J4938Q902J14698q8086r61258k568979m465611n743977n528340
38170a1785922l674521j027897J157633K173802K255984K109830K196735K495467
38162d098889K746632K745314K462556K035340J633651J259561P23978q9470r93299
$$ y = [-2650943, -2932222, -3269943, -3023275, -2064852, -695168, 811645, 2458280, 4283782, 6004701, 7094277, 7296288, 6959830, 6708178, 6715031, 6379394, 4836838, 1849756, -1853060, -5186075, -7639263, -9546066, -11477047, -13547062, -15403061, -16713269, -17429206, -17607191, -17245242, -16404389, -15289020, -14024830, -12467150, -10421352, -8003073, -5580163, -3340692, -1106382, 1330038, 3801117, 5821350, 7016746, 7431791, 7446729, 7455631, 7570329, 7482243, 6520985, 3952006, -513605, -6257582, -11785922, -15460443, -16488340, -15330707, -13156905, -10900921, -8791091, -6594356, -4098889, -1352257, 1393057, 3855613, 5890953, 7524604, 8784165, 9508143, 9418673, 8425374]
38153H425374j630745j791789j497134q52865M887Q48418J438705J727700J861429
38144H533980J942662J896091J589526R65475K4691j172291k410370l352900l783240
38135D233624l757361l457368k978451k335967j596603q89239l04072J70275O50829
38126a0264333J315071K231462L150445L577675L205369K243241J226939N47697
38118G233566K58259K30871K97223K43670j03307o74796j168800j377251j437536
38109C501899j659219k123081k511726k330559j301709L69651K052803L081279
38101i20662L204263K698737K046825J542828J205220R34260O25766J83772m32017
38092A1088992j160539j946863k872330l988796m952171n033772l750863j481477
$$ y = [8425374, 6794629, 5002840, 3505706, 2652841, 2657728, 3506146, 4944851, 6672551, 8533980, 10476642, 12372733, 13962259, 14927734, 14952425, 13780134, 11369764, 8016864, 4233624, 476263, -2981105, -5959556, -8295523, -9892126, -10781365, -11085437, -10915162, -10264333, -8949262, -6717800, -3567355, 10320, 3215689, 5458930, 6685869, 7233566, 7491825, 7722696, 8019919, 8263589, 8160282, 7485486, 6316686, 4939435, 3501899, 1842680, -280401, -2792127, -5122686, -6424395, -6054744, -4001941, -920662, 2283601, 4982338, 7029163, 8571991, 9777211, 10711471, 11337237, 11521009, 11088992, 9928453, 7981590, 5109260, 1120464, -3831707, -8865479, -12616342, -14097819]
38084a4097819P29196K039559K417051K403311K450016K565601K480870K003077
38076B990862J205742L39260m27595j140303j841141k259247j973938j051764
38068d158124l05369n75113j746810k754176k629429j356282L24816J626146K072523
38059i501818J527171L09635p72125r14385j0940J287461K237301K556903K334299
38050i46498J706209Q43969P4464k74830j68088J44419M06035M95008L32854j22603
38040B490939p05690j042857r09965n38781l91636n96638p48695l75270M76640
38031b341953J251293J472810J188699P79201M68470J77458k03979o07449q97817
38022A286733j015067q93190m11602L43790Q46686M64039q52079k381251l272612
$$ y = [-14097819, -13368623, -11329064, -8912013, -6508702, -4058686, -1493085, 987785, 2990862, 4196604, 4535864, 4108269, 2967966, 1126825, -1132422, -3106360, -4158124, -4463493, -5038606, -6785416, -9539592, -12169021, -13525303, -13200487, -11574341, -9501818, -7974647, -7665012, -8437137, -9351522, -9362462, -8075001, -5837700, -3280797, -946498, 759711, 1603680, 1678144, 1403314, 1235226, 1379645, 1785680, 2280688, 2613542, 2490939, 1785249, 742392, -167573, -706354, -1097990, -1694628, -2443323, -2818593, -2341953, -1090660, 382150, 1570849, 2350050, 2818520, 2995978, 2791999, 2184550, 1286733, 271666, -621524, -1033126, -689336, 157350, 621389, -230690, -2611941, -5884553]
38013e884553l233875k489388j308482Q4857J227644J518455Q46882j29036o29337
38004i996833n77506n32941q77309j379339j613586j497080j198996p06900K12093
37995a8168397J585823K963062L681966L385633K252669P75878o25892j773197
37987e922455k563167k759672k085095n74674J238600K595076K993484K432218
37979d645685J286427O8014p35635p85094l2618J200889K323517K737153K163946
37970C580914Q56182n24974j384597j642989j666918j721058j601565r41737J93602
37961d853140J230351J659943J525229J216787R30957N38211o9284p65049j400161
37952A3844j988186k479848k510877j687177j67313J284217J987528J978303J800934
$$ y = [-5884553, -9118428, -11607816, -12916298, -12831441, -11603797, -10085342, -9238460, -9367496, -9996833, -10574339, -11107280, -11984589, -13363928, -14977514, -16474594, -17673590, -18380490, -18168397, -16582574, -13619512, -9937546, -6551913, -4299244, -3523366, -4149258, -5922455, -8485622, -11245294, -13330389, -13905063, -12666463, -10071387, -7077903, -4645685, -3359258, -3291244, -4026879, -4811973, -4844591, -3643702, -1320185, 1416968, 3580914, 4437096, 3912122, 2527525, 884536, -782382, -2503440, -4105005, -5046742, -4853140, -3622789, -1962846, -437617, 779170, 1710127, 2248338, 2179054, 1414005, 13844, -1974342, -4454190, -6965067, -8652244, -8819557, -7535340, -5547812, -3569509, -1768575]
37943a768575J755048J558536Q00047m62620j716998k527911k854963k821146
37935h038582k403755j560501n45874J98378N44344Q41841J426736K128171K468818
37926d940424K261738J783203J380503J136685R65152Q30215P59534P52696P72334
37917E701636P65974O70285M86458L62472M66861P46463R59859J004717J032893
37908A2197618J133785J086121O12034k28878j086075j689289j990979j993408
37900H040929j660399j052155l95726N1489J35903j92624q76709j673593k179324
37891A97791k069898j374882m96130R5027K34631J45543J08331R9586j20478n67674
37881c748153q74755o83791n8064O36872J154054J515479J832970K140510K335865
$$ y = [-1768575, -13527, 1545009, 2345056, 1882436, 165438, -2362473, -5217436, -8038582, -10442337, -12002838, -12548712, -12350334, -11805990, -10964149, -9537413, -7409242, -4940424, -2678686, -895483, 485020, 1621705, 2586857, 3417072, 4176606, 4929302, 5701636, 6467610, 7137895, 7624353, 7986825, 8453686, 9200149, 10160008, 11164725, 12197618, 13331403, 14417524, 15029558, 14800680, 13714605, 12025316, 10034337, 8040929, 6380530, 5328375, 4932649, 4984138, 5120041, 4927417, 4050708, 2377115, 197791, -1872107, -3246989, -3743119, -3648092, -3413461, -3267918, -3159587, -3060001, -3180479, -3748153, -4622908, -5306699, -5364763, -4727891, -3573837, -2058358, -225388, 1915122, 4250987]
37872D250987K153315J325975J029j109196j298422o03846K78709Q10385J025387
37863F834323J087830Q53060J62851o81129j120243r71451n76401l06188j58898
37854E123754N7635L08001K65047l12445j195109j760531j542668p06377J13539
37845C50846M57856M07148K68292Q9880l24417j003029j624879j795591j384846
37836d558740n50526M66460J489049K379005K940921K915919K129875O70101j117555
37827F764509k819148m096655m659659m252944k839277q00730J149980K338837
37819i215087K474928J755583P44257Q3810J18015O37951J026062P83432R487
37810a581562o51845o10939R6800Q79116J226857J181695J101851J109737R94531
$$ y = [4250987, 6404302, 7730277, 7731306, 6622110, 5323688, 4719842, 4998551, 5808936, 6834323, 7922153, 8775213, 8938064, 8256935, 7136692, 6165241, 5588840, 5282652, 5123754, 5181389, 5489390, 5754437, 5441992, 4246883, 2486352, 943684, 237307, 350846, 808702, 1215850, 1484142, 1574022, 1249605, 246576, -1378303, -3173894, -4558740, -5109266, -4642806, -3153757, -774752, 2166169, 5082088, 7211963, 7882064, 6764509, 3945361, -151294, -4810953, -9063897, -11903174, -12703904, -11553924, -9215087, -6740159, -4984576, -4240319, -4156509, -4038494, -3400543, -2374481, -1591049, -1581562, -2233407, -2844346, -2747546, -1868430, -641573, 540122, 1641973, 2751710, 3746241]
37801C746241O43228L07175K97334N54036O71891K96131n92540j699289k609390
37792A614817l034900k995273k724375k329703j643273n48365O34235J313043
37784i713794J234787P92314O53706J144784K010910K697705K824776K448665
37776D093853J916141J463303R90046K66500p01544j618791k184990k304840k004562
37767h4884j294077k18919J013960K059664K594223K456843J721463O98234j88054
37758H758453o28433n86607k36508K08838N64023O31328K38178o02202j607799
37749F739271k379932k656352k419857j834694j163446o88186n31743m93138k17423
37740e645500L38250P28696M98529k24201q19046q48991m45856k8372J02660j71718
$$ y = [3746241, 4389469, 4696644, 4993978, 5548014, 6219905, 6516036, 5923496, 4224207, 1614817, -1420083, -4415356, -7139731, -9469434, -11112707, -11661072, -11026837, -9713794, -8479007, -7686693, -7032987, -5888203, -3877293, -1179588, 1645188, 4093853, 6009994, 7473297, 8463343, 8729843, 8028299, 6409508, 4224518, 1919678, -84884, -1378961, -1597880, -583920, 1475744, 4069967, 6526810, 8248273, 8946507, 8758453, 8130020, 7543413, 7306905, 7515743, 8079766, 8711094, 8949272, 8347070, 6739271, 4359339, 1702987, -716870, -2551564, -3715010, -4403196, -4934939, -5428077, -5645500, -5307250, -4578554, -4080025, -4304226, -5123272, -5972263, -6418119, -6446491, -6343831, -6515549]
37730f515549q08529j458924j532194p27409N47151J514331J756452J434948R00813
37721d888910L88629Q9074J78236N93862R72505J006077Q01705P72700J197654
37712A111532J922641K439937K257315J310682O7164q76054j339706j609946j918795
37703C364770k069519j733037r90655l51994k07695m07279m32016R8085J121105
37694a608235K233935K999834L188999K833215K135265J330369N70828j27048
37686A3557162q45723j650737k480235l130902l346573k947011j941406n82389
37678c367814O93596J448482J464575Q86968J88757r3848K44768Q90595J299187
37669C655266J223135Q74531N38970J84388m14651j271049k083770k515053k420093
$$ y = [-6515549, -7324078, -8783002, -10315196, -11042605, -10495454, -8981123, -7224671, -5789723, -4888910, -4500281, -4411207, -4232971, -3639109, -2666604, -1660527, -858822, -86122, 1111532, 3034173, 5474110, 7731425, 9042107, 9109271, 8233217, 6893511, 5283565, 3364770, 1295251, -437786, -1428441, -1780435, -1988130, -2395409, -2827425, -2729340, -1608235, 625700, 3625534, 6814533, 9647748, 11783013, 13113382, 13684210, 13557162, 12711439, 11060702, 8580467, 5449565, 2102992, -844019, -2785425, -3367814, -2674218, -1225736, 238839, 1125807, 1314564, 1220716, 1465484, 2356079, 3655266, 4878401, 5752932, 6291902, 6476290, 6061639, 4790590, 2706820, 191767, -2228326]
37660b228326j815812p91593M79900J731612K678802L127456L060600K664000
37652H906639K212414J870844J648219J535466J515109J374172P86234j69449
37644A9679648p91725m50491N66676J281797J113460L69623l80531r80844j541869
37635A8865744k020414k282364k366950k397153k371386k258427k117392j899391
37627A152267j348090m02827M75627P49507M93100K83491M31284O66393O10302
37618C111054K18366l32985q84169j269347j312641j038608p17320n28015l06771
37609c060436J99903R05316J365960J212665N65498L6929K65716J293573K384186
37600E169310K632286J831036O03549l66516j012104j645690k271340k447092
$$ y = [-2228326, -4044138, -4835731, -4355831, -2624219, 54583, 3182039, 6242639, 8906639, 11119053, 12989897, 14638116, 16173582, 17688691, 19062863, 19849097, 19679648, 18887923, 18437432, 19004108, 20285905, 21399365, 21768988, 21388457, 20407613, 18865744, 16845330, 14562966, 12196016, 9798863, 7427477, 5169050, 3051658, 1152267, -195823, -598650, -123023, 626484, 1119584, 1403075, 1834359, 2500752, 3111054, 3329420, 2996435, 2112266, 842919, -469722, -1508330, -2225650, -2753665, -3060436, -2860533, -1955217, -589257, 623408, 1188906, 1225835, 1491551, 2785124, 5169310, 7801596, 9632632, 10236181, 9869665, 8857561, 7211871, 4940531, 2493439]
37592B493439j812064n05529R83698K195941K868546K924722K470166J749635
37584A3368554R90918L03723k22473m18780j94601K12408L26183j12671q62380
37575A3390881j454026j684868j709776j686027j521779j062132m10935M8255
37567C909593n5448p67056j698699k224171j932370r99986l1568N60972R23834
37558b314899J402202J942494K061609J399122J29082j202906k122782k492554
37550a198632k478347k337120k183268j932550j486584r09225l44913J50457N50071
37541a2170111O95341M12793j86624p29134r74099j024155j063073j064177r06545
37532a7009784o63465o02667r14740j518311k087831k218038j654310m85616Q98137
$$ y = [2493439, 681375, 175846, 1159544, 3355485, 6224031, 9148753, 11618919, 13368554, 14359472, 14663195, 14440722, 14021942, 13827341, 14039749, 14365932, 14253261, 13390881, 11936855, 10251987, 8542211, 6856184, 5334405, 4272273, 3861338, 3909593, 3854145, 3087089, 1388390, -835781, -2768151, -3768137, -3799705, -3238733, -2314899, -912697, 1029797, 3091406, 4490528, 4619610, 3416704, 1293922, -1198632, -3676979, -6014099, -8197367, -10129917, -11616501, -12525726, -12870639, -12720182, -12170111, -11474770, -11061977, -11248601, -11977735, -12951834, -13975989, -15039062, -16103239, -17009784, -17673249, -18275916, -19190656, -20708967, -22796798, -25014836, -26669146, -27154762, -26256625]
37523b6256625K096439K928508L377511L424802L044195K327330J549956J113919
37515f393965J369599K333780L520457M206861M014213L174061K162457J206703
37507A5594166K76832n84326j159543j278865r93977n48923k93383n44395j324193
37498I143393k231178k756127k758216k481872k125795j638626j003263m48012
37490f299696j69701j8131L00097P82712J136985J210778J182093J252338J355421
37481G32896J316545J166035J098834J151605J109064P94597L22898l8085j68811
37472G485578j30137N8654M96483J196593J924508K319843K110720J187150l52229
37463A6297163k054196l146339l030247j846307m01055N52566Q78113R13715R90289
$$ y = [-26256625, -24160186, -21231678, -17854167, -14429365, -11385170, -9057840, -7507884, -6393965, -5024366, -2690586, 829871, 5036732, 9050945, 12225006, 14387463, 15594166, 15870998, 15286672, 14127129, 12848264, 11854287, 11305364, 11011981, 10467586, 9143393, 6912215, 4156088, 1397872, -1084000, -3209795, -4848421, -5851684, -6299696, -6469397, -6487528, -6187431, -5404719, -4267734, -3056956, -1874863, -622525, 732896, 2049441, 3215476, 4314310, 5465915, 6574979, 7369576, 7692474, 7654389, 7485578, 7355441, 7414095, 7910578, 9107171, 11031679, 13351522, 15462242, 16649392, 16297163, 14242967, 11096628, 8066381, 6220074, 5819019, 6371585, 7249698, 8163413, 9153702]
37454I153702J218337J570346J938692K137235K003535J502267O57354n07001
37446A9674467j788804k687912k779812k269259j888841k078686k464742k345334
37438A371077j531727m60972M08313R82067J290132J195670N67197m00228j253721
37429B167808j669537j661832j423941j082108o55870j98259J28959J99127J33269
37420d062384K47830O79056J130368J167966P70354L92758M14268P03462Q69933
37411B313611Q03748P78064J075452J662420K191793K218331J516990L70417n35894
37402A2394932p35934m92975m79099r55933j526534j739965j649035j614598j787237
37393A413622j983634j919671j388801l76102P92233J580415J818164K045408
$$ y = [9153702, 10372039, 11942385, 13881077, 16018312, 18021847, 19524114, 20181468, 19674467, 17885663, 15197751, 12417939, 10148680, 8259839, 6181153, 3716411, 1371077, -160650, -621622, -213309, 768758, 2058890, 3254560, 3821757, 3421529, 2167808, 498271, -1163561, -2587502, -3669610, -4325480, -4523739, -4394780, -4195653, -4062384, -3814554, -3135498, -2005130, -837164, -66810, 325948, 740216, 1443678, 2313611, 3117359, 3895423, 4970875, 6633295, 8825088, 11043419, 12560409, 12930826, 12394932, 11658998, 11166023, 10686924, 9730991, 8204457, 6464492, 4815457, 3200859, 1413622, -570012, -2489683, -3878484, -4254586, -3462353, -1881938, -63774, 1981634]
37385A981634K926154M289180N094991M516183K819766J011874j83510p62329
37377B1693943j022196j072214q72944n59246m87399q83007j492673j702065j117471
37368A2484728l8352P61633P89363K81617j74403l51166n32216r88066j529065
37359A0704073j701424j309692o02849J1070L02663K84726R1452j13285j71454
37350G495280R594L83381P59645Q97165O47366P7229n15401p62096m95081R3463
37340H590545N84024O63066L51847p2948l58403m65746n17437o23542q04894j047220
37330F299292j330325j567782j615621j448740j278058j341547j554659j509757
37322e347197r04424J22273J152783J889395K299714K482414K546918K562569
$$ y = [1981634, 4907788, 9196968, 14291959, 18808142, 21627908, 22639782, 22456272, 21693943, 20671747, 19599533, 18726589, 18167343, 17679944, 16796937, 15304264, 13602199, 12484728, 12446376, 13208009, 13997372, 14278989, 14104586, 13753420, 13221204, 12233138, 10704073, 9002649, 7692957, 7090108, 7101178, 7403841, 7688567, 7780019, 7666734, 7495280, 7504874, 7888255, 8647900, 9545065, 10192431, 10269660, 9754259, 8992163, 8497082, 8590545, 9174569, 9837635, 10189482, 10116534, 9758131, 9292385, 8774948, 8151406, 7346512, 6299292, 4968967, 3401185, 1785564, 336824, -941234, -2282781, -3837440, -5347197, -6251621, -6129348, -4976565, -3087170, -787456, 1694958, 4241876, 6804445]
37314F804445K451193J948709Q54184o45305k029556k851102k977419k470040
37306A085109j457168k06048R00683J646350K129222K479696K536575K004903
37298A1119322R09254k93222j099291j362234j289856j140569r82710p19966k91678
37289D849050K12368O70001J091851J538248J872889J772614J081860N1623q53769
37280A2286735j276906j047639j75266J026639J966128K218862J930272J558858
37272A8487683J271821Q64668K60042k66935m92848n78538p74957j007157j025450
37263A6738329q59663q27825j081195j384971j446861j302500j247197j471232
$$ y = [6804445, 9255638, 11204347, 12058531, 11413226, 9383670, 6532568, 3555149, 1085109, -372059, -578107, 322576, 1968926, 4098148, 6577844, 9114419, 11119322, 12028576, 11735354, 10636063, 9273829, 7983973, 6843404, 5860694, 5140728, 4849050, 5061418, 5731419, 6823270, 8361518, 10234407, 12007021, 13088881, 13140504, 12286735, 11009829, 9962190, 9786924, 10813563, 12779691, 14998553, 16928825, 18487683, 19759504, 20624172, 20884214, 20617279, 20124431, 19545893, 18770936, 17763779, 16738329, 15878666, 15050841, 13969646, 12584675, 11137814, 9835314, 8588117, 7116885]
$$ [...]
##END NTUPLES=NMR SPECTRUM
##END=
