##TITLE=31Pdec_11P153_k4TFA
  24 sc
 25.9.2023
##JCAMPDX= 6.0         $$ Bruker NMR JCAMP-DX V2.0
##DATA TYPE= NMR SPECTRUM
##DATA CLASS= NTUPLES
##ORIGIN= UXNMR, Bruker Analytische Messtechnik GmbH
##OWNER= root
$$ XWIN-NMR		Version 3.5
$$ Mon Sep 25 16:24:27 2023 Russian Standard Time (UT+4h)  she@DPX200
##.OBSERVE FREQUENCY= 81.013821
##.OBSERVE NUCLEUS= ^31P
##.ACQUISITION MODE= SIMULTANEOUS
##.ACQUISITION SCHEME= undefined
##.AVERAGES= 24
##.DIGITISER RES= 16
##SPECTROMETER/DATA SYSTEM= spect
##.PULSE SEQUENCE= zgpg30
##.SOLVENT NAME= CDCl3
##.SHIFT REFERENCE= (INTERNAL, CDCl3, 0, 248.564)
##AUDIT TRAIL= $$ (NUMBER, WHEN, WHO, WHERE, WHAT)
$$ ##TITLE= Audit trail, XWIN-NMR		Version 3.5
$$ ##JCAMPDX= 5.01
$$ ##ORIGIN= Bruker BioSpin GmbH
$$ ##OWNER= she
$$ F:/spectra/data/she/nmr/P31/1/pdata/1/auditp.txt
$$ ##AUDIT TRAIL=  $$ (NUMBER, WHEN, WHO, WHERE, WHAT)
(   1,<2023-09-25 16:22:17.18 +0400>,<she>,<DPX200>,
      <created by zg, POWCHK disabled, PULCHK disabled
       configuration hash MD5:
       00 E9 B6 7A A2 85 ED C7 34 08 36 98 17 FE 4E 26
       data hash MD5: 32K
       62 F4 52 8C 85 D8 79 F0 FE 39 A8 97 AE FC 27 2F>)
(   2,<2023-09-25 16:22:19.48 +0400>,<she>,<DPX200>,
      <Start of raw data processing
       efp BC_mod = 2 LB = 5 FT_mod = 6 PKNL = 1 PHC0 = -10655.6 PHC1 = 25.68629 SI = 64K 
       data hash MD5: 64K
       6A 7F 04 46 78 AB CD 21 D4 31 B1 5F DE CA FA AC>)
(   3,<2023-09-25 16:22:38.23 +0400>,<she>,<DPX200>,
      <pk PHC0 = 17.11936 PHC1 = 0 
       data hash MD5: 64K
       D0 37 3B 12 E1 06 12 F9 4A 6E C9 D1 78 13 49 66>)
(   4,<2023-09-25 16:22:58.67 +0400>,<she>,<DPX200>,
      <pk PHC0 = 1.799968 PHC1 = 0 
       data hash MD5: 64K
       A0 B4 6E D2 B7 D1 D7 A9 5E 3C A0 65 33 1F 96 21>)
(   5,<2023-09-25 16:23:10.84 +0400>,<she>,<DPX200>,
      <pk PHC0 = -6.531739 PHC1 = 0 
       data hash MD5: 64K
       31 2C F8 D6 9F 9F 54 95 7A 75 FA BD 01 AD C8 32>)
(   6,<2023-09-25 16:23:39.37 +0400>,<she>,<DPX200>,
      <pk PHC0 = 10.33175 PHC1 = 0 
       data hash MD5: 64K
       FD C8 2D 4D 73 11 5C 73 81 17 02 4A 49 E6 B4 6A>)
$$ ##END=
$$ 
$$ hash MD5
$$ CA AB DC EC C1 BA E0 79 06 94 1A 46 21 70 F4 4E
##$RELAX= 
##$RELAX= 
##$RELAX= 
##$RELAX= 
##$RELAX= 
##$RELAX= 
##$RELAX= 
##$RELAX= 
##$RELAX= 
$$ Bruker specific parameters
$$ --------------------------
##$DU= <F:/spectra>
##$EXPNO= 1
##$NAME= <P31>
##$PROCNO= 1
##$TYPE= <nmr>
##$USER= <she>
##$AMP= (0..31)
100 100 100 100 100 100 100 100 100 100 100 100 100 100 100 100 100 100 
100 100 100 100 100 100 100 100 100 100 100 100 100 100 
##$AQSEQ= 0
##$AQ_mod= 1
##$AUNM= <au_zg>
##$AUTOPOS= <>
##$BF1= 81.014009
##$BF2= 200.13
##$BF3= 200.13
##$BF4= 200.13
##$BF5= 200.13
##$BF6= 200.13
##$BF7= 200.13
##$BF8= 200.13
##$BYTORDA= 1
##$CFDGTYP= 0
##$CFRGTYP= 5
##$CHEMSTR= <none>
##$CNST= (0..31)
1 1 145 1 1 1 1 1 1 1 1 1 1 1 1 1 1 1 1 1 1 1 1 1 1 1 1 1 1 1 1 1 
##$CPDPRG= <waltz16>
##$CPDPRG1= <>
##$CPDPRG2= <waltz16>
##$CPDPRG3= <>
##$CPDPRG4= <mlev>
$$ [...]
##$SUBNAM2= <"">
##$SUBNAM3= <"">
##$SUBNAM4= <"">
##$SUBNAM5= <"">
##$SUBNAM6= <"">
##$SUBNAM7= <"">
##$SUBNAM8= <"">
##$SUBNAM9= <"">
##$SW= 501.771253377433
##$SWIBOX= (0..15)
0 1 3 0 0 0 0 0 0 0 0 0 0 0 0 0 
##$SW_h= 40650.406504065
##$TD= 32768
##$TD0= 1
##$TE= 0
##$TE2= 300
##$TE3= 300
##$TEG= 300
##$TL= (0..7)
0 120 53 12 22 120 120 120 
##$TP= (0..7)
150 150 150 150 150 150 150 150 
##$TP07= 0
##$TPNAME0= <>
##$TPNAME1= <>
##$TPNAME2= <>
##$TPNAME3= <>
##$TPNAME4= <>
##$TPNAME5= <>
##$TPNAME6= <>
##$TPNAME7= <>
##$TPOAL= (0..7)
0.5 0.5 0.5 0.5 0.5 0.5 0.5 0.5 
##$TPOFFS= (0..7)
0 0 0 0 0 0 0 0 
##$TUNHIN= 0
##$TUNHOUT= 0
##$TUNXOUT= 0
##$USERA1= <user>
##$USERA2= <user>
##$USERA3= <user>
##$USERA4= <user>
##$USERA5= <user>
##$V9= 5
##$VALIST= <valist>
##$VCLIST= <CCCCCCCCCCCCCCC>
##$VD= 0
##$VDLIST= <DDDDDDDDDDDDDDD>
##$VPLIST= <PPPPPPPPPPPPPPP>
##$VTLIST= <TTTTTTTTTTTTTTT>
##$WBST= 1024
##$WBSW= 4
##$XGAIN= (0..3)
0 0 0 0 
##$XL= 0
##$YL= 0
##$YMAX_a= 3997
##$YMIN_a= -3562
##$ZGOPTNS= <>
##$ZL1= 120
##$ZL2= 120
##$ZL3= 120
##$ZL4= 120
##$ABSF1= 0
##$ABSF2= 0
##$ABSG= 0
##$ABSL= 0
##$ALPHA= 0
##$AQORDER= 0
##$ASSFAC= 0
##$ASSFACI= 0
##$ASSFACX= 0
##$ASSWID= 0
##$AUNMP= <proc_1d>
##$AZFE= 0.1
##$AZFW= 0.5
##$BCFW= 0
##$BC_mod= 2
##$BYTORDP= 0
##$COROFFS= 0
##$CY= -3
##$DATMOD= 1
##$DC= 0
##$DFILT= <>
##$DTYPP= 0
##$F1P= 0
##$F2P= 0
##$FCOR= 1
##$FTSIZE= 65536
##$FT_mod= 6
##$GAMMA= 0
##$GB= 0
##$INTBC= 1
##$INTSCL= 6.047779e-11
##$ISEN= 30
##$LB= 5
##$LEV0= 0
##$LPBIN= 0
##$MAXI= 10000
##$MC2= 0
##$MEAN= 0
##$ME_mod= 0
##$MI= 50
##$NCOEF= 0
##$NC_proc= -10
##$NLEV= 6
##$NOISF1= 182.463
##$NOISF2= 159.3651
##$NSP= 0
##$NTH_PI= 0
##$NZP= 0
##$OFFSET= 248.5645
##$PC= 4
##$PHC0= -10632.88
##$PHC1= 25.68629
##$PH_mod= 1
##$PKNL= yes
##$PPARMOD= 0
##$PSCAL= 0
##$PSIGN= 0
##$REVERSE= no
##$SF= 81.0140089999694
##$SI= 65536
##$SIGF1= 159.3651
##$SIGF2= -187.1042
##$SINO= 113.3802
##$SIOLD= 16384
##$SREGLST= <1H.CDCl3>
##$SSB= 0
##$STSI= 65536
##$STSR= 0
##$SW_p= 40650.406504065
##$SYMM= 0
##$S_DEV= 0
##$TDeff= 32768
##$TDoff= 0
##$TI= <>
##$TILT= no
##$TM1= 0
##$TM2= 0
##$TOPLEV= 0
##$USERP1= <user>
##$USERP2= <user>
##$USERP3= <user>
##$USERP4= <user>
##$USERP5= <user>
##$WDW= 1
##$XDIM= 65536
##$YMAX_p= 265332206
##$YMIN_p= -223214040
$$ End of Bruker specific parameters
$$ ---------------------------------
##NTUPLES= NMR SPECTRUM
##VAR_NAME=  FREQUENCY,     SPECTRUM/REAL,   SPECTRUM/IMAG
##SYMBOL=    X,             R,               I
##VAR_TYPE=  INDEPENDENT,   DEPENDENT,       DEPENDENT
##VAR_FORM=  AFFN,          ASDF,            ASDF
##VAR_DIM=   65536,         65536,           65536
##UNITS=     HZ,            ARBITRARY UNITS, ARBITRARY UNITS
##FACTOR=    0.620285442955139, 1,           1
##FIRST=     20137.2065510682, 0,            0
##LAST=      -20513.1999529968, 0,           0
##MIN=       -20513.1999529968, -223214040,  0
##MAX=       20137.2065510682, 265332206,    0
$$ Real data points
##PAGE= N=1
##DATA TABLE= (X++(R..R)), XYDATA
$$ [...]
$$ plain form
43048 -7448056 -8080734 -7334633 -5136297 -1811388 2101795 5981164 9123531 10857189
43040 10857189 10843371 9261694 6623851 3425915 28943 -3217979 -5935608 -7879961
43032 -7879961 -9076834 -9733949 -10064673 -10218727 -10286601 -10271465 -10091006 -9702233 -9238977 -8987130
43022 -8987130 -9232978 -10142390 -11684317 -13540765 -15123016 -15845959 -15474663 -14158730 -12146898
43013 -12146898 -9618260 -6851069 -4379335 -2780592 -2315805 -2861707 -4099600 -5586724
43005 -5586724 -6709856 -6906314 -6147538 -5066939 -4374041 -4140688 -3822412 -2992240 -1879876
42996 -1879876 -1102527 -993469 -1326577 -1624809 -1565366 -1067105 -160735 1061250 2376295
42987 2376295 3438312 3953364 3888855 3520987 3261825 3381047 3821253 4248583 4302283 3843159
$$ packed form
43048g448056o32678P46101K198336L324909L913183L879369L142367J733658
43040A0857189j3818j581677k637843l197936l396972l246922k717629j944353
43032g879961j196873o57115l30724j54054o7874J5136J80459L88773M63256K51847
43022h987130k45848r09412j541927j856448j582251p22943L71296J315933K011832
43013a2146898K528638K767191K471734J598743M64787n45902j237893j487124
43005e586724j123132j96458P58776J080599O92898K33353L18276Q30172J112364
42996a879876P77349J09058l33108k98232N9443M98261R06370J221985J315045
42987B376295J062017N15052o4509l67868k59162J19222M40206M27330N3700m59124
$$ plain form
42977 3843159 3016570 2126262 1455227 1144197 1157552 1357186 1686287 2326581 3597479
42968 3597479 5581098 7850302 9706097 10783308 11363937 11990884 12794613 13301107 12905252
42959 12905252 11442854 9308821 7159929 5547685 4662545 4256076 3855916 3185300 2354719
42950 2354719 1586255 883650 146979 -509417 -853915 -963672 -1248870 -1935338 -2791187
42941 -2791187 -3557167 -4424688 -5826357 -7885618 -10336678 -12901889 -15458317 -17837366
42933 -17837366 -19749564 -21034223 -21857049 -22600004 -23622372 -25066841 -26723027 -28099321
42925 -28099321 -28831304 -29057802 -29242688 -29629850 -30053204 -30255560 -30136267 -29665934 -28879905
42916 -28879905 -28087596 -27784852 -28122385 -28644843 -28745090 -28194298 -27064596 -25413063 -23354163
$$ packed form
42977C843159q26589q90308o71035l11030J3355J99634L29101O40294J270898
42968C597479J983619K269204J855795J077211N80629O26947Q03729N06494l95855
42959A2905252j462398k134033k148892j612244q85140m06469m00160o70616q30581
42950B354719p68464p02605p36671o56396l44498j09757k85198o86468q55849
42941b791187p65980q67521j401669k059261k451060k565211k556428k379049
42933a7837366j912198j284659q22826p42955j022368j444469j656186j376294
42925b8099321p31983k26498j84886l87162m23354k02356J19293M70333P86029
42916b8879905P92309L02744l37533n22458j00247N50792J129702J651533K058900
$$ plain form
42907 -23354163 -21220429 -19234276 -17119510 -14489899 -11663642 -9666869 -9239338 -10099552
42899 -10099552 -11329867 -12204528 -12439448 -11912060 -10532090 -8406803 -5910991 -3518295
42891 -3518295 -1614378 -408453 122937 235411 282350 537056 1114695 1957866 2803823
42882 2803823 3240960 2977286 2137340 1238212 800658 968916 1502992 2086008 2572643
42873 2572643 2954787 3211618 3311044 3318458 3362254 3478323 3648841 4063224 5150896 7150041
42863 7150041 9694486 11980791 13315463 13407437 12270565 10101424 7245285 4053195
42855 4053195 734464 -2487768 -5137921 -6727860 -7323068 -7575495 -8020615 -8564641 -8829195
42846 -8829195 -8733013 -8437503 -7883781 -6735554 -4784718 -2197345 599192 3043328 4515628
$$ packed form
42907b3354163K133734J986153K114766K629611K826257J996773M27531q60214
42899a0099552j230315q74661k34920N27388J379970K125287K495812K392696
42891c518295J903917J205925N31390J12474M6939K54706N77639Q43171Q45957
42882B803823M37137k63674q39946q99128m37554J68258N34076N83016M86635
42873B572643L82144K56831R9426P414M3796J16069J70518M14383J087672J999145
42863G150041K544445K286305J334672R1974j136872k169141k856139l192090
42855D053195l318731l222232k650153j589939n95208k52427m45120n44026k64554
42846h829195R6182K95510N53722J148227J950836K587373K796537K444136J472300
$$ plain form
42837 4515628 4646141 3722331 2634988 2257528 2867749 4108814 5327588 5915725 5551857
42828 5551857 4345105 2767212 1367142 501162 260499 530308 1068014 1602305 1936533
42819 1936533 1971198 1650702 941967 -127066 -1434070 -2757278 -3822067 -4484853 -4972650
42810 -4972650 -5823641 -7393871 -9425003 -11227957 -12256709 -12368538 -11635234 -10200340 -8342550
42801 -8342550 -6361953 -4277488 -1921491 479105 2094583 2182469 869392 -1002062
42793 -1002062 -2670417 -3812703 -4265134 -3878433 -2788281 -1477425 -329276 697067
42785 697067 1776592 2795880 3444947 3613618 3478471 3270266 3164770 3333012 3815187
42776 3815187 4288026 4200885 3295203 1867524 416956 -820055 -1827481 -2442426 -2327345
$$ packed form
42837D515628J30513r23810j087343l77460O10221J241065J218774N88137l63868
42828E551857j206752j577893j400070q65980k40663K69809N37706N34291L34228
42819A936533L4665l20496p08735j069033j307004j323208j064789o62786m87797
42810d972650q50991j570230k031132j802954j028752j11829P33304J434894J857790
42801h342550J980597K084465K355997K400596J615478Q7886j313077j871454
42793a002062j668355j142286m52431L86701J090152J310856J148149J026343
42785F97067J079525J019288O49067J68671j35147k08205j05496J68242M82175
42776C815187M72839q7141r05682j427679j450568j237011j007426o14945J15081
$$ plain form
42767 -2327345 -1405256 -172556 553328 196083 -1229300 -3150355 -4713541 -5191683 -4411499
42758 -4411499 -2892894 -1442204 -468943 300576 1404813 2997424 4669171 5855906
42750 5855906 6314734 6202427 5821771 5408401 5144723 5252798 5942207 7214350 8765678
42741 8765678 10175142 11210853 11872047 12075561 11414765 9423326 6123355 2175727 -1598541
42732 -1598541 -4742103 -7116179 -8496817 -8521434 -7143760 -4959791 -2883476 -1510140
42724 -1510140 -895199 -887572 -1446709 -2495849 -3584947 -3939303 -2966580 -690263 2330166
42715 2330166 5412060 8020777 9787986 10557922 10548668 10301124 10233293 10217203 9713366 8332321
42705 8332321 6160298 3560752 869072 -1599881 -3413909 -4154472 -3756361 -2625513
$$ packed form
42767b327345R22089J232700P25884l57245j425383j921055j563186m78142P80184
42758d411499J518605J450690R73261P69519J104237J592611J671747J186735
42750E855906M58828j12307l80656m13370k63678J08075O89409J272143J551328
42741H765678J409464J035711O61194K03514o60796j991439l299971l947628l774268
42732a598541l143562k374076j380638k4617J377674K183969K076315J373336
42724a510140O14941P627n59137j049140j089098l54356R72723K276317L020429
42715B330166L081894K608717J767209P69936r254k47544o7831j6090n03837j381045
42705H332321k172023k599546k691680k468953j814028p40563L98111J130848
$$ plain form
42697 -2625513 -1357467 -328684 495922 1443059 2828690 4707729 6871248 9040575
42689 9040575 10976177 12383675 12888516 12306247 10912576 9258528 7676461 6122661
42681 6122661 4562508 3315942 2820945 3088906 3547464 3474480 2570479 1167591 -22027
42672 -22027 -385877 207790 1381921 2584737 3492194 4142433 4765632 5557010 6592398
42663 6592398 7848626 9200012 10378375 11002013 10742328 9551185 7777798 6066223
42655 6066223 5077460 5171573 6187832 7459457 8149194 7764683 6465279 4889339 3694664
42646 3694664 3252379 3657762 4853646 6679056 8866890 11039483 12706792 13373162 12836372
42637 12836372 11420878 9752132 8197904 6628769 4792573 2776243 960927 -363118
$$ packed form
42697b625513J268046J028783Q24606R47137J385631J879039K163519K169327
42689I040575J935602J407498N04841n82269j393671j654048j582067j553800
42681F122661j560153j246566m94997K67961M58558p2984r04001j402888j189618
42672b2027l63850N93667J174131J202816R07457O50239O23199P91378J035388
42663F592398J256228J351386J178363O23638k59685j191143j773387j711575
42655F066223r88763R4113J016259J271625O89737l84511j299404j575940j194675
42646C694664m42285M05383J195884J825410K187834K172593J667309O66370n36790
42637A2836372j415494j668746j554228j569135j836196k016330j815316j324045
$$ plain form
42629 -363118 -1155274 -1466749 -1351029 -995001 -801453 -1221232 -2466156 -4336025 -6298239
42620 -6298239 -7832526 -8810847 -9503314 -10142921 -10597208 -10625377 -10356854 -10260892 -10645487 -11453819
42610 -11453819 -12625202 -14353869 -16741128 -19336306 -21291520 -21979142 -21325814 -19619865
42602 -19619865 -17241018 -14640152 -12358685 -10829286 -10112114 -9889825 -9756040 -9521065 -9274434
42593 -9274434 -9200556 -9371295 -9733418 -10253309 -10947801 -11666883 -11913005 -11099007 -9142462
42584 -9142462 -6729166 -4796862 -3703583 -3023774 -2218779 -1351396 -975878 -1420443 -2420270
42575 -2420270 -3476118 -4323443 -4918065 -5185510 -5065183 -4758009 -4669588 -5002321 -5508176
42566 -5508176 -5719936 -5398811 -4763910 -4339897 -4549599 -5352824 -6252897 -6684471 -6378412
$$ packed form
42629c63118p92156l11475J15720L56028J93548m19779j244924j869869j962214
42620f298239j534287r78321o92467o39607m54287k8169K68523R5962l84595q08332
42610a1453819j171383j728667k387259k595178j955214o87622O53328J705949
42602a9619865K378847K600866K281467J529399P17172K22289J33785K34975K46631
42593i274434P3878j70739l62123n19891o94492p19082k46122Q13998J956545
42584i142462K413296J932304J093279O79809Q04995Q67383L75518m44565r99827
42575b420270j055848q47325n94622k67445J20327L07174Q8421l32733n05855
42566e508176k11760L21125O34901M24013k09702q03225r00073m31574L06059
$$ plain form
42557 -6378412 -5386287 -3975689 -2688891 -2303854 -3315478 -5341230 -7301544 -8346050
42549 -8346050 -8473912 -8231574 -8098686 -8313375 -8952225 -9791464 -10205363 -9592270 -7984716
42540 -7984716 -6034096 -4361880 -3106147 -2100874 -1240898 -539913 13872 509169 1066306
42531 1066306 1797891 2749804 3848450 4986606 6178861 7509511 8867434 9857562 10095349
42522 10095349 9542324 8476393 7197951 5867602 4582200 3447806 2486366 1505306
42514 1505306 143092 -1878660 -4495682 -7284703 -9712369 -11362879 -11898934 -10946650
42506 -10946650 -8301436 -4386217 -346490 2569619 3846432 3952891 3866432 4423096 5976012
42497 5976012 8355334 10964885 13010212 13845542 13242781 11403864 8770594 5794360
$$ packed form
42557f378412R92125J410598J286798L85037j011624k025752j960314j044506
42549h346050j27862K42338J32888k14689o38850q39239m13899O13093J607554
42540g984716J950620J672216J255733J005273Q59976P00985N53785M95297N57137
42531A066306P31585R51913J098646J138156J192255J330650J357923R90128K37787
42522A0095349n53025j065931j278442j330349j285402j134394r61440r81060
42514A505306j362214k021752k617022k789021k427666j650510n36055R52284
42506a0946650K645214L915219M039727K916109J276813J06459q6459N56664J552916
42497E976012K379322K609551K045327Q35330o02761j838917k633270k976234
$$ plain form
42489 5794360 2758866 -263718 -3237779 -5897550 -7750687 -8487894 -8374326 -8093332 -8137670
42480 -8137670 -8402263 -8372942 -7622057 -6110256 -4144787 -2139737 -331879 1377929 3259662
42471 3259662 5343115 7220067 8365979 8649261 8450567 8322803 8625259 9412870 10483754
42462 10483754 11495908 12206040 12703158 13331259 14307559 15459020 16346710 16562534 15904592
42453 15904592 14432989 12468758 10434211 8554962 6734130 4765121 2595898 336938
42445 336938 -1868500 -3872077 -5517534 -6742685 -7628068 -8270305 -8754857 -9403837 -10839418
42436 -10839418 -13415420 -16547425 -18928981 -19586297 -18586081 -16690753 -14628400 -12873117
42428 -12873117 -11788046 -11492158 -11575944 -11351868 -10605447 -9916655 -10035960 -11026450 -12193840
$$ packed form
42489E794360l035494l022584k974061k659771j853137p37207J13568K80994m4338
42480h137670k64593K9321P50885J511801J965469K005050J807858J709808J881733
42471C259662K083453J876952J145912K83282j98694j27764L02456P87611J070884
42462A0483754J012154P10132M97118O28101R76300J151461Q87690K15824o57942
42453A5904592j471603j964231k034547j879249j820832j969009k169223k258960
42445C36938k205438k003577j645457j225151q85383o42237m84552o48980j435581
42436a0839418k576002l132005k381556o57316J000216J895328K062353J755283
42428a2873117J085071K95888q3786K24076P46421O88792j19305r90490j167390
$$ plain form
42419 -12193840 -12808850 -12692094 -12061333 -11049026 -9602052 -7798180 -6013584 -4661480
42411 -4661480 -3866167 -3470870 -3252070 -3004888 -2520914 -1688442 -627790 442774 1537321
42402 1537321 2963798 4955540 7308409 9460872 10901788 11489889 11479376 11296501 11180741
42393 11180741 10915783 9950309 7888432 4855982 1347014 -2190227 -5483321 -8236198
42385 -8236198 -10048707 -10656913 -10169338 -8996082 -7609413 -6398483 -5600849 -5193203 -4866469
42376 -4866469 -4283729 -3471871 -2915025 -3172464 -4365275 -6031185 -7474032 -8273911 -8529159
42367 -8529159 -8684890 -9141407 -9949030 -10768221 -11079263 -10503749 -9052983 -7129755 -5243598
42358 -5243598 -3649757 -2250324 -864014 437073 1302839 1377756 511506 -1265387 -3773435
$$ packed form
42419a2193840o15010J16756O30761J012307J446974J803872J784596J352104
42411d661480P95313L95297K18800K47182M83974Q32472J060652J070564J094547
42402A537321J426477J991742K352869K152463J440916N88101j0513j82875j15760
42393A1180741k64958r65474k061877l032450l508968l537241l293094k752877
42385h236198j812509o08206M87575J173256J386669J210930P97634M07646L26734
42376d866469N82740Q11858N56846k57439j192811j665910j442847p99879k55248
42367h529159j55731m56517q07623q19191l11042N75514J450766J923228J886157
42358e243598J593841J399433J386310J301087Q65766P4917q66250j776893k508048
$$ plain form
42349 -3773435 -6548754 -8808826 -9845981 -9606876 -8820553 -8474204 -9153607 -10806191 -12914918
42340 -12914918 -14763307 -15688974 -15370626 -13997652 -12118115 -10297374 -8926712 -8242575
42332 -8242575 -8327845 -9034871 -10031300 -11013489 -11836784 -12422370 -12628672 -12260270 -11122930
42323 -11122930 -9048418 -6028114 -2459753 863758 3262159 4729493 5862796 7184044
42315 7184044 8646516 9859408 10642675 11201258 11822372 12588743 13407198 14141738 14619411
42306 14619411 14636878 14122039 13237391 12160821 10785705 8858498 6509364 4443021 3363653
42297 3363653 3246023 3370926 3091342 2382532 1611567 1011737 557642 183609 -150893
42288 -150893 -592816 -1341269 -2376473 -3409490 -4194375 -4737418 -5075271 -5017954 -4365814
$$ packed form
42349c773435k775319k260072j037155K39105P86323L46349o79403j652584k108727
42340a2914918j848389r25667L18348J372974J879537J820741J370662O84137
42332h242575q5270p07026r96429r82189q23295n85586k06302L68402J137340
42323a1122930K074512L020304L568361L323511K398401J467334J133303J321248
42315G184044J462472J212892P83267N58583O21114P66371Q18455P34540M77673
42306A4619411J7467n14839q84648j076570j375116j927207k349134k066343j079368
42297C363653j17630J24903k79584p08810p70965n99830m54095l74033l34502
42288a50893m41923p48453j035204j033017p84885n43043l37853N7317O52140
$$ plain form
42279 -4365814 -3339925 -2517945 -2236565 -2244870 -2084305 -1654501 -1218907 -969302 -837566 -713739
42269 -713739 -574158 -306383 348265 1485909 2807084 3874124 4503878 4714768 4381523
42260 4381523 3243777 1336055 -812781 -2564183 -3658867 -4239749 -4527653 -4627711 -4562537
42251 -4562537 -4279867 -3599759 -2338104 -614584 1022838 1904204 1713228 664021 -731785
42242 -731785 -1987422 -2759519 -2833928 -2203700 -1207277 -446549 -392633 -1007464 -1786468 -2220462
42232 -2220462 -2256615 -2350436 -3071766 -4598899 -6535910 -8229540 -9303435 -9907172 -10486893
42223 -10486893 -11379395 -12606626 -13907333 -14851414 -15012898 -14212400 -12648413 -10749201 -8906488
42214 -8906488 -7373556 -6314463 -5813406 -5870044 -6497560 -7747278 -9441259 -10917198 -11323954
$$ packed form
42279d365814J025889Q21980K81380q305J60565M29804M35594K49605J31736J23827
42269g13739J39581K67775O54648J137644J321175J067040O29754K10890l33245
42260D381523j137746j907722k148836j751402j094684n80882k87904j00058O5174
42251d562537K82670O80108J261655J723520J637422Q81366j90976j049207j395806
42242g31785j255637p72097p4409O30228R96423P60728N3916o14831p79004m33994
42232b220462l6153r3821p21330j527133j937011j693630j073895o03737n79721
42223a0486893q92502j227231j300707r44081j61484Q00498J563987J899212J842713
42214h906488J532932J059093N01057n6638o27516j249718j693981j475939m06756
$$ plain form
42205 -11323954 -10325183 -8394474 -6336306 -4640764 -3353823 -2352496 -1539747 -872954
42197 -872954 -405892 -291340 -629812 -1369498 -2470029 -4080381 -6369544 -9178213 -11971296
42188 -11971296 -14153930 -15382901 -15681789 -15452174 -15337525 -15808416 -16743534 -17543627 -17765758
42179 -17765758 -17555240 -17369055 -17392039 -17391812 -17127724 -16740194 -16644745 -17078779 -17802783 -18229093
42169 -18229093 -17804246 -16308387 -13945666 -11311230 -9242168 -8443158 -9009578 -10304932
42161 -10304932 -11446052 -11972962 -12021904 -11903327 -11653514 -11033403 -9847846 -8182231 -6380404
42152 -6380404 -4849765 -3837641 -3322136 -3118804 -3111523 -3350474 -3910732 -4720795 -5602427
42143 -5602427 -6461459 -7368044 -8425377 -9596373 -10691803 -11524167 -12055204 -12380079 -12554216
$$ packed form
42205a1323954R98771J930709K058168J695542J286941J001327Q12749O66793
42197h72954M67062J14552l38472p39686j100531j610352k289163k808669k793083
42188a1971296k182634j228971k98888K29615J14649m70891r35118q00093k22131
42179a7765758K10518J86185k2984K27K64088L87530R5449m34034p24004m26310
42169a8229093M24847J495859K362721K634436K069062P99010n66420j295354
42161a0304932j141120n26910m8942J18577K49813O20111J185557J665615J801827
42152f380404J530639J012124N15505K03332P281k38951n60258q10063q81632
42143e602427q59032r06585j057333j170996j095430q32364n31037l24875j74137
$$ plain form
42134 -12554216 -12425964 -11662756 -10016297 -7639771 -5134524 -3175493 -2000851 -1292434
42126 -1292434 -604316 146893 686883 786259 497362 25677 -425037 -642646 -479513 -84535
42116 -84535 116551 -117286 -483280 -411659 362769 1647055 3080223 4335157 5102237
42107 5102237 5180540 4651761 3736958 2422285 482254 -1984567 -4261285 -5481810 -5333284
42098 -5333284 -4182398 -2637122 -1170368 -93362 374254 167015 -514977 -1212918 -1379925
42089 -1379925 -639731 1029397 3319541 5760260 7853765 9181860 9596313 9350242 8884178
42080 8884178 8397719 7728995 6679041 5284730 3704761 2046465 457230 -808253
42072 -808253 -1652663 -2360276 -3308424 -4499720 -5607555 -6453506 -7182147 -7930037 -8575782
$$ packed form
42134a2554216J28252P63208J646459K376526K505247J959031J174642P08417
42126a292434O88118P51209N39990R9376k88897m71685m50714k17609J63133L94978
42116h4535K01086k33837l65994P1621P74428J284286J433168J254934P67080
42107E102237P8303n28779r14803j314673j940031k466821k276718j220525J48526
42098e333284J150886J545276J466754J077006M67616k07239o81992o97941j67007
42089a379925P40194J669128K290144K440719K093505J328095M14453k46071m66064
42080H884178m86459o68724j049954j394311j579969j658296j589235j265483
42072h08253q44410p07613r48148j191296j107835q45951p28641p47890o45745
$$ plain form
42063 -8575782 -8935963 -9032665 -9040670 -9092600 -9246341 -9542425 -9983954 -10527988 -11166583 -11917456
42053 -11917456 -12645719 -13017109 -12806612 -12235265 -11842775 -11959934 -12366007 -12510934 -12055545
42044 -12055545 -11172351 -10313442 -9686627 -8996118 -7756662 -5851685 -3696680 -1844073 -551835
42035 -551835 198706 427821 112030 -624860 -1495950 -2290631 -2960376 -3377304 -3208403 -2270162
42025 -2270162 -939033 78510 479490 657045 1097382 1641324 1589501 500795 -1350839
42016 -1350839 -3328572 -4973942 -6082748 -6516705 -6242838 -5483533 -4545552 -3464644 -2034080
42007 -2034080 -247935 1482506 2666528 3132075 2958501 2173998 756355 -1097143 -2938625
41998 -2938625 -4421100 -5593666 -6782880 -8246862 -9979997 -11737078 -13111572 -13630974
$$ packed form
42063h575782l60181r6702q005n1930j53741k96084m41529n44034o38595p50873
42053a1917456p28263l71390K10497N71347L92490j17159m06073j44927M55389
42044a2055545Q83194Q58909O26815O90509J239456J904977K155005J852607J292238
42035e51835P50541K29115l15791p36890q71090p94681o69745m16928J68901R38241
42025b270162J331129J017543M00980J77555M40337N43942n1823j088706j851634
42016a350839j977733j645370j108806m33957K73867P59305R37981J080908J430564
42007b034080J786145J730441J184022M65547j73574p84503j417643j853498j841482
41998b938625j482475j172566j189214j463982j733135j757081j374494n19402
$$ plain form
41990 -13630974 -12963183 -11164331 -8713363 -6241705 -4206846 -2794154 -2013642 -1762994
41982 -1762994 -1811265 -1855426 -1657022 -1063354 103761 2005570 4487666 6937253 8690787
41973 8690787 9656187 10369562 11304194 12183213 12085638 10241665 6717120 2418781 -1440873
41964 -1440873 -3917503 -4631589 -3813531 -2224528 -940210 -923029 -2536278 -5389551 -8697424
41955 -8697424 -11803154 -14367845 -16209535 -17211749 -17478078 -17412774 -17467440 -17814079 -18360189
41946 -18360189 -19069965 -20151979 -21841258 -23982765 -25869291 -26590289 -25674870 -23463962
41938 -23463962 -20841998 -18610224 -17144248 -16546457 -16862883 -17992833 -19517993 -20840631
41930 -20840631 -21530017 -21464950 -20687659 -19255398 -17249726 -14826435 -12217328 -9719134 -7636031
$$ packed form
41990a3630974O67791J798852K450968K471658K034859J412692P80512K50648
41982a762994m8271m4161J98404N93668J167115J901809K482096K449587J753534
41973H690787R65400P13375R34632Q79019r7575j843973l524545m298339l859654
41964a440873k476630p14086Q18058J589003J284318J7181j613249k853273l307873
41955h697424l105730k564691j841690j002214k66329O5304n4666l46639n46110
41946a8360189p09776j082014j689279k141507j886526p20998R15419K210908
41938b3463962K621964K231774J465976N97791l16426j129950j525160j322638
41930b0840631o89386O5067P77291J432261K005672K423291K609107K498194K083103
$$ plain form
41921 -7636031 -6123070 -5089137 -4358562 -3923672 -3903966 -4230221 -4534453 -4473849 -4077014
41912 -4077014 -3649755 -3391040 -3225070 -2985362 -2616256 -2146976 -1592994 -1009562 -614685
41903 -614685 -733437 -1559842 -3028045 -4971539 -7344243 -10162959 -13228994 -16056012 -18195222
41894 -18195222 -19593674 -20537840 -21250513 -21610389 -21271486 -20022150 -18040777 -15808315 -13696398
41885 -13696398 -11606082 -9143642 -6277737 -3691722 -2238837 -2045511 -2358827 -2295284 -1513031
41876 -1513031 -124194 1683447 3642649 5228136 5875785 5444213 4253942 2630636
41868 2630636 591135 -1965975 -4943227 -8045495 -10995559 -13608157 -15671349 -16883103
41860 -16883103 -17004663 -16111475 -14671532 -13309669 -12443100 -12146321 -12333355 -12938820 -13839769
$$ packed form
41921g636031J512961J033933P30575M34890J9706l26255l04232O0604L96835
41912d077014M27259K58715J65970K39708L69106M69280N53982N83432L94877
41903f14685j18752q26405j468203j943494k372704k818716l066035k827018k139210
41894a8195222j398452r44166p12673l59876L38903J249336J981373K232462K111917
41885a3696398K090316K462440K865905K586015J452885J93326l13316O3543P82253
41876a513031J388837J807641J959202J585487O47649m31572j190271j623306
41868B630636k039501k557110k977252l102268k950064k612598k063192j211754
41860a6883103j21560Q93188J439943J361863Q66569K96779j87034o05465r00949
$$ plain form
41851 -13839769 -14710973 -15112077 -14698558 -13265126 -10704620 -7169939 -3283731 79509
41843 79509 2381279 3678492 4229748 4055546 3101131 1692661 492777 -97220 -300557
41834 -300557 -604113 -1143569 -1568613 -1451173 -711633 301995 1008615 903384 -72191
41825 -72191 -1295408 -1721490 -628507 1802700 4686539 7141147 8669821 8961430 7725649
41816 7725649 4999327 1444994 -1981460 -4712445 -6773849 -8331261 -9222367 -9003101
41808 -9003101 -7371853 -4580157 -1573822 328510 226180 -1643486 -4022476 -5611086
41800 -5611086 -5978255 -5570790 -5004666 -4453447 -3627867 -2217449 -362577 1253481 1824332
41791 1824332 1010879 -845133 -3020007 -4837801 -5915956 -6272864 -6312534 -6523970 -7047315
$$ packed form
41851a3839769q71204m01104M13519J433432K560506L534681L886208L363240
41843G9509K301770J297213N51256j74202r54415j408470j199884n89997k03337
41834c00557l03556n39456m25044J17440P39540J013628P06620j05231r75575
41825g2191j223217m26082J092983K431207K883839K454608J528674K91609j235781
41816G725649k726322l554333l426454k730985k061404j557412q91106K19266
41808i003101J631248K791696L006335J902332j02330j869666k378990j588610
41800e611086l67169M07465N66124N51219Q25580J410418J854872J616058N70851
41791A824332q13453j856012k174874j817794j078155l56908l9670k11436n23345
$$ plain form
41782 -7047315 -7632730 -8072089 -8431622 -8686135 -8390267 -7100595 -5090943 -3311741 -2540327
41773 -2540327 -2755691 -3374797 -3868875 -4063978 -4078633 -4182286 -4643620 -5562546 -6833088
41764 -6833088 -8282468 -9771513 -11138473 -12178717 -12791565 -13081511 -13201672 -13111667 -12579744
41755 -12579744 -11457702 -9938233 -8534179 -7778308 -7863838 -8492512 -9041183 -8922127 -7912312
41746 -7912312 -6289458 -4688002 -3701835 -3507201 -3871866 -4523036 -5389242 -6446678 -7521671
41737 -7521671 -8408297 -9044652 -9383181 -9226203 -8467337 -7433844 -6684401 -6445206 -6504816
41728 -6504816 -6657313 -6894255 -7054001 -6646766 -5290802 -3127949 -620328 1855419 4026606
41719 4026606 5615649 6556391 7185789 7881598 8542760 8697188 8090468 6908941 5460901
$$ packed form
41782g047315n85415m39359l59533k54513K95868J289672K009652J779202P71414
41773b540327k15364o19106m94078j95103j4655j03653m61334r18926j270542
41764f833088j449380j489045j366960j040244o12848k89946j20161R0005N31923
41755a2579744J122042J519469J404054P55871q5530o28674n48671J19056J009815
41746g912312J622854J601456R86167J94634l64665o51170q66206j057436j074993
41737g521671q86626o36355l38529J56978P58866J033493P49443K39195n9610
41728f504816j52497k36942j59746M07235J355964K162853K507621K475747K171187
41719D026606J589043R40742O29398O95809O61162J54428o06720j181527j448040
$$ plain form
41710 5460901 3953711 2634788 1840959 1732371 2141899 2824436 3744045 5011969 6619308
41701 6619308 8288965 9521166 9799038 8930708 7287416 5595461 4400779 3790682 3626845
41692 3626845 3844014 4371733 4893794 4915465 4134135 2700447 1143849 99893 36462
41683 36462 1056823 2820613 4623629 5617257 5096066 2776214 -1024640 -5401064 -9116228
41674 -9116228 -11070222 -10824316 -8851380 -6207440 -3785480 -1824796 -145729 1258073
41666 1258073 2030251 1829402 720604 -858032 -2400291 -3577156 -4335205 -4862967 -5398098
41657 -5398098 -5990136 -6454638 -6518870 -5923054 -4449443 -2087000 742640 3282655 4875132
41648 4875132 5223449 4270742 2143859 -590799 -2907841 -3975714 -3849962 -3294290 -2951187
$$ packed form
41710E460901j507190j318923p93829j08588M09528O82537R19609J267924J607339
41701F619308J669657J232201K77872q68330j643292j691955j194682o10097j63837
41692C626845K17169N27719N22061K1671p81330j433688j556598j043956o3431
41683C6462J020361J763790J803016R93628n21191k319852l800854m376424l715164
41674i116228j953994K45906J972936K643940K421960J960684J679067J403802
41666A258073P72178k00849j108798j578636j542259j176865p58049n27762n35131
41657e398098n92038m64502o4232N95816J473611K362443K829640K540015J592477
41648D875132L48317r52707k126883k734658k317042j067873J25752N55672L43103
$$ plain form
41639 -2951187 -2935401 -3189982 -3838138 -4970259 -6306913 -7328990 -7698849 -7434622 -6743440
41630 -6743440 -5791007 -4560593 -2838945 -434923 2444073 5075486 6610660 6591829 5077056
41621 5077056 2432660 -786372 -3834791 -5982792 -6915191 -6880941 -6417531 -6001130 -5916862
41612 -5916862 -6239109 -6822900 -7463786 -8187633 -9249062 -10707402 -12139432 -12952282 -12876052
41603 -12876052 -11959827 -10239007 -7782795 -5119780 -3264831 -3082343 -4715749 -7684703
41595 -7684703 -11289374 -14757520 -17276131 -18284951 -17798493 -16271532 -14150963 -11679713
41587 -11679713 -9038429 -6415939 -3895739 -1473722 721311 2355019 3127790 3036553
41579 3036553 2381815 1575906 899752 297192 -612424 -2165560 -4203213 -6033089 -6869386
$$ packed form
41639b951187J5786k54581o48156j132121j336654j022077l69859K64227O91182
41630f743440R52433J230414J721648K404022K878996K631413J535174j8831j514773
41621E077056k644396l219032l048419k148001r32399L4250M63410M16401Q4268
41612e916862l22247n83791o40886p23847j061429j458340j432030q12850P6230
41603a2876052R16225J720820K456212K663015J854949J82488j633406k968954
41595g684703l604671l468146k518611j008820M86458J526961K120569K471250
41587a1679713K641284K622490K520200K422017K195033J633708P72771r1237
41579C036553o54738q05909o76154o02560r09616j553136k037653j829876q36297
$$ plain form
41570 -6869386 -6302136 -4453778 -1867521 779322 3089512 5186032 7421073 9794168
41562 9794168 11783973 12774028 12470410 10888899 8228944 4954052 1798082 -558316
41554 -558316 -1781745 -1806438 -709086 1101858 2770165 3444698 2901822 1554048 -74015
41545 -74015 -1622048 -2724090 -2966612 -2213720 -811874 633582 1554593 1490704 176994
41536 176994 -2179276 -4812383 -6823637 -7755521 -7727324 -7106901 -6172168 -5050293 -3844595
41527 -3844595 -2749913 -2041293 -1936371 -2469860 -3532503 -5004890 -6769568 -8602423 -10176604
41518 -10176604 -11217330 -11556392 -11021838 -9464496 -7042496 -4358888 -2097929 -494656
41510 -494656 723682 1869078 2891422 3477511 3421290 2778161 1688538 185042 -1732552
$$ packed form
41570f869386N67250J848358K586257K646843K310190K096520K235041K373095
41562I794168J989805R90055l03618j581511k659955l274892l155970k356398
41554e58316j223429k4693J097352J810944J668307O74533n42876j347774j628063
41545g4015j548033j102042k42522P52892J401846J445456R21011o3889j313710
41536A76994k356270k633107k011254r31884K8197O20423R34733J121875J205698
41527c844595J094682P08620J04922n33489j062643j472387j764678j832855j574181
41518a0176604j040726l39062N34554J557342K422000K683608K260959J603273
41510d94656J218338J145396J022344N86089n6221o43129j089623j503496j917594
$$ plain form
41501 -1732552 -3859373 -5734476 -6911109 -7267565 -7016668 -6454862 -5768568 -5020712 -4167947
41492 -4167947 -3066745 -1623444 -44313 1162019 1558766 1130746 189776 -1014971 -2500203
41483 -2500203 -4399264 -6705761 -9151862 -11267878 -12602809 -13018659 -12817249 -12510018 -12394104
41474 -12394104 -12318855 -11818050 -10453498 -8128653 -5201805 -2306074 28478 1620260
41466 1620260 2519440 2745328 2267920 1219206 -57904 -1272692 -2438414 -3807609 -5593409
41457 -5593409 -7741403 -9854220 -11305005 -11605472 -10854674 -9780292 -9146360 -9055916 -8927333
41448 -8927333 -8189785 -6908767 -5685058 -5045749 -5031165 -5297631 -5447756 -5200516 -4361766
41439 -4361766 -2814025 -649294 1689188 3497089 4188945 3696595 2493864 1170818
$$ packed form
41501a732552k126821j875103j176633l56456K50897N61806O86294P47856Q52765
41492d167947J101202J443301J579131J206332L96747m28020r40970j204747j485232
41483b500203j899061k306497k446101k116016j334931m15850K01410L07231J15914
41474a2394104P5249N00805J364552K324845K926848K895731K334552J591782
41466A620260Q99180K25888m77408j048714j277110j214788j165722j369195j785800
41457e593409k147994k112817j450785l00467P50798J074382O33932R0444J28583
41448h927333P37548J281018J223709O39309J4584k66466j50125K47240Q38750
41439d361766J547741K164731K338482J807901O91856m92350j202731j323046
$$ plain form
41431 1170818 -34594 -1265131 -2648238 -3987171 -4921654 -5348780 -5588407 -6102957 -7087804
41422 -7087804 -8340745 -9470360 -10156629 -10188114 -9321845 -7278091 -4038966 -158294 3400048
41413 3400048 5904469 7350526 8266208 9087165 9839045 10384323 10755875 11104421 11400500
41404 11400500 11336444 10562554 9013695 7056009 5348606 4473573 4564207 5240039 5912176
41395 5912176 6146017 5760246 4715800 3050311 902143 -1521826 -4032668 -6442892
41387 -6442892 -8459860 -9710010 -9964592 -9336623 -8234855 -7153356 -6503437 -6537112 -7283414
41378 -7283414 -8506167 -9792727 -10784732 -11370592 -11641490 -11640425 -11180392 -9972533 -7969455
41369 -7969455 -5550633 -3308818 -1619976 -409616 682722 1923468 3232323 4255450
$$ packed form
41431A170818j205412j230537j383107j338933r34483m27126k39627n14550r84847
41422g087804j252941j129615o86269l1485Q66269K043754L239125L880672L558342
41413C400048K504421J446057R15682Q20957P51880N45278L71552L48546K96079
41404A1400500o4056p73890j548859j957686j707403q75033R0634O75832O72137
41395E912176K33841l85771j044446j665489k148168k423969k510842k410224
41387f442892k016968j250150k54582O27969J101768J081499O49919l3675p46302
41378g283414j222753j286560r92005n85860k70898J065M60033J207859K003078
41369g969455K418822K241815J688842J210360J092338J240746J308855J023127
$$ plain form
41361 4255450 4703066 4693511 4810058 5755166 7809084 10518058 12907925 14083448 13715280
41352 13715280 12034216 9478204 6470820 3507740 1201099 -15671 -216235 161885
41344 161885 816886 1794200 3182220 4799586 6303427 7469863 8254528 8727640 9103767
41335 9103767 9672094 10435932 10878689 10351628 8721609 6441339 4003530 1612048 -547595
41326 -547595 -2060235 -2576587 -2197406 -1311435 -141221 1301749 2853451 4083933 4667841
41317 4667841 4703257 4519852 4249795 3735792 2883382 2012151 1763733 2609535 4434732
41308 4434732 6616017 8511674 9889488 10968592 12192258 13988714 16566159 19711855
41300 19711855 22757123 24881817 25576695 24854002 23083334 20746179 18371827 16547065
$$ packed form
41361D255450M47616r555J16547R45108K053918K708974K389867J175523l68168
41352A3715280j681064k556012l007384k963080k306641j216770k00564L78120
41344A61885O55001R77314J388020J617366J503841J166436P84665M73112L76127
41335I103767N68327P63838M42757n27061j630019k280270k437809k391482k159643
41326e47595j512640n16352L79181Q85971J170214J442970J551702J230482N83908
41317D667841L5416j83405k70057n14003q52410q71231k48418Q45802J825197
41308D434732K181285J895657J377814J079104J223666J796456K577445L145696
41300A9711855L045268K124694O94878p22693j770668k337155k374352j824762
$$ plain form
41292 16547065 15766242 16178391 17534364 19438927 21609404 23813920 25619590 26410861
41284 26410861 25797863 23933248 21304034 18284343 15065773 11973834 9557249 8205027
41276 8205027 7832519 8111434 8897755 10241786 12034047 13864507 15307349 16255482 16944846
41267 16944846 17707670 18676989 19619831 20029710 19466490 17876996 15617717 13228351 11213036
41258 11213036 9929242 9527180 9949646 11000156 12349404 13468208 13771190 13063931 11782187
41249 11782187 10553480 9520617 8292079 6525187 4281440 1776414 -878964 -3501725
41241 -3501725 -5677749 -7080460 -7855430 -8472289 -9257179 -10218477 -11190274 -11891427 -11903441
41232 -11903441 -10881266 -8884410 -6389395 -3976807 -2098988 -1023398 -706557 -683394
$$ packed form
41292A6547065p80823M12149J355973J904563K170477K204516J805670P91271
41284B6410861o12998j864615k629214l019691l218570l091939k416585j352222
41276H205027l72508K78915P86321J344031J792261J830460J442842R48133O89364
41267A6944846P62824R69319R42842M09879n63220j589494k259279k389366k015315
41258A1213036j283794m02062M22466J050510J349248J118804L02982p07259j281744
41249A1782187j228707j032863j228538j766892k243747k505026k655378k622761
41241c501725k176024j402711p74970o16859p84890r61298r71797p01153j2014
41232a1903441J022175J996856K495015K412588J877819J075590L16841K3163
$$ plain form
41224 -683394 -354080 448492 1270514 1462789 663635 -1137008 -3729745 -6684853 -9392798
41215 -9392798 -11372778 -12554055 -13142569 -13265161 -12871217 -11926699 -10551478 -8977032 -7482039
41206 -7482039 -6321384 -5547010 -4880964 -3916804 -2509358 -886796 621364 1839227 2718839
41197 2718839 3251522 3533054 3805413 4283844 4985556 5850191 6986036 8623138 10744121
41188 10744121 12834509 14093967 13962228 12536244 10566710 9010032 8414960 8606177
41180 8606177 8950559 8970798 8723278 8627187 9017221 9893382 11004214 12051288 12834293
41171 12834293 13340463 13773132 14420359 15389969 16480209 17389893 18047851 18609244 19055440
41162 19055440 18925821 17661929 15276289 12542082 10412592 9327157 9172814 9777965
$$ packed form
41224f83394L29314Q02572Q22022J92275p99154j800643k592737k955108k707945
41215i392798j979980j181277n88514j22592L93944R44518J375221J574446J494993
41206g482039J160655P74374O66046R64160J407446J622562J508160J217863Q79612
41197B718839N32683K81532K72359M78431P01712Q64635J135845J637102K120983
41188A0744121K090388J259458j31739j425984j969534j556678n95072J91217
41180H606177L44382K0239k47520r6091L90034Q76161J110832J047074P83005
41171A2834293N06170M32669O47227R69610J090240R09684O57958N61393M46196
41162A9055440j29619j263892k385640k734207k129490j085435j54343O05151
$$ plain form
41154 9777965 11152369 13160822 15203114 16490622 16670585 16058750 15230583 14464676 13606198
41145 13606198 12388230 10823173 9312728 8423167 8529800 9600063 11239802 12907430
41137 12907430 14121681 14584851 14233017 13218848 11835108 10422067 9262579 8417937
41129 8417937 7585164 6219421 3974930 1075702 -1811029 -4068011 -5440143 -5936582
41121 -5936582 -5642866 -4734894 -3542667 -2424967 -1565192 -943949 -480520 -149140 -6862
41112 -6862 -178328 -759507 -1623236 -2313747 -2228440 -981414 1353294 4263422 7024285
41103 7024285 9043114 10184355 10804738 11375863 12034037 12542612 12658648 12413920 12023069
41094 12023069 11655103 11372236 11192511 11105231 11066090 11061129 11158951 11450519 11964636 12668237
$$ packed form
41154I777965J374404K008453K042292J287508J79963o11835q28167p65907q58478
41145A3606198j217968j565057j510445q89561J06633J070263J639739J667628
41137A2907430J214251M63170l51834j014169j383740j413041j159488q44642
41129H417937q32773j365743k244491k899228k886731k256982j372132m96439
41121e936582K93716R07972J192227J117700Q59775O21243M63429L31380J42278
41112f862j71466n81179q63729o90511Q5307J247026K334708K910128K760863
41103G024285K018829J141241O20383N71125O58174N08575J16036k44728l90851
41094A2023069l67966k82867j79725q7280l9141m961R7822K91568N14117P03601
$$ plain form
41084 12668237 13465127 14100240 14127552 13136444 11081117 8335344 5389077 2525941 -198322
41075 -198322 -2734914 -4859035 -6184598 -6330953 -5127112 -2767738 140711 2702348
41067 2702348 4052461 3788678 2248137 346444 -990617 -1365227 -982230 -303009 299137
41058 299137 612755 510498 -70179 -1077986 -2325012 -3516338 -4342170 -4667361 -4714236
41049 -4714236 -4979024 -5827972 -7153540 -8494868 -9481440 -10053832 -10237094 -9854505 -8628378
41040 -8628378 -6567452 -4145601 -2025783 -616926 88026 310828 267008 226573 692515
41031 692515 2278128 5246649 9219378 13433885 17233885 20216017 22045782 22451785
41023 22451785 21515396 19774262 17891253 16312277 15286144 14960934 15205555 15459528 15062361
$$ packed form
41084A2668237P96890O35113K7312r91108k055327k745773k946267k863136k724263
41075a98322k536592k124121j325563j46355J203841K359374K908449K561637
41067B702348J350113k63783j540541j901693j337061l74610L82997O79221O02146
41058B99137L13618j02257n80677j007807j247026j191326q25832l25191m6875
41049d714236k64788q48948j325568j341328r86572n72392j83262L82589J226127
41040h628378K060926K421851K119818J408857P04952K22802m3820m0435M65942
41031F92515J585613K968521L972729M214507L800000K982132J829765M06003
41023B2451785r36389j741134j883009j578976j026133l25210K44621K53973l97167
$$ plain form
41014 15062361 13779566 11862401 9655798 7391900 5365280 4010877 3651824 4313301
41006 4313301 5851874 8061099 10514467 12498071 13334733 12764994 10962818 8343621
40998 8343621 5506277 3194393 2025565 2202196 3556491 5774098 8430044 10965841
40990 10965841 12966665 14521280 16076302 17832510 19437327 20346353 20330803 19531683 18176677
40981 18176677 16439427 14556852 12933694 12032005 12109570 13024559 14312202 15524769 16521299
40972 16521299 17406970 18255946 19019291 19696568 20439041 21392654 22494140 23446573 23822416
40963 23822416 23204694 21406045 18683193 15680604 13067029 11217463 10199028 9889144
40955 9889144 10004298 10153029 10056855 9719389 9265615 8629118 7531496 5829134 3822288
$$ packed form
41014A5062361j282795j917165k206603k263898k026620j354403l59053O61477
41006D313301J538573K209225K453368J983604Q36662n69739j802176k619197
40998H343621k837344k311884j168828J76631J354295K217607K655946K535797
40990A0965841K000824J554615J555022J756208J604817R09026j5550p99120j355006
40981A8176677j737250j882575j623158r01689P7565R14989J287643J212567R96530
40972A6521299Q85671Q48976P63345O77277P42473R53613J101486R52433L75843
40963B3822416o17722j798649k722852l002589k613575j849566j018435l09884
40955I889144J15154J48731r6174l37466m53774o36497j097622j702362k006846
$$ plain form
40946 3822288 2162481 1422415 1687745 2492617 3164165 3324442 3140529 3108171 3567831
40937 3567831 4382255 5041825 5084145 4443027 3417029 2345853 1395086 642255 179090
40928 179090 -50821 -413242 -1309157 -2667849 -3892976 -4407151 -4130977 -3382291 -2487045
40919 -2487045 -1590472 -646727 622630 2659579 5713256 9492145 13245670 16191845
40911 16191845 17877146 18306393 17922317 17417340 17387267 18100738 19582361 21765107 24427974
40902 24427974 27107483 29283840 30660407 31178177 30874698 29918220 28711943 27748010 27345592
40893 27345592 27634817 28668079 30313113 32138715 33749230 35275421 37248297 39909873
40885 39909873 42898877 45685859 48040504 49961396 51451463 52581431 53555696 54473524
$$ packed form
40946C822288j659807p40066K65330Q04872O71548J60277j83913l2358M59660
40937C567831Q14424O59570M2320o41118j025998j071176r50767p52831m63165
40928A79090k29911l62421q95915j358692j225127n14175K76174P48686Q95246
40919b487045Q96573R43745J269357K036949L053677L778889L753525K946175
40911A6191845J685301M29247l84076n04977l0073P13471J481623K182746K662867
40902B4427974K679509K176357J376567N17770l03479r56478j206277r63933m02418
40893B7345592K89225J033262J645034J825602J610515J526191J972876K661576
40885C9909873K989004K786982K354645J920892J490067J129968R74265R17828
$$ plain form
40877 54473524 55147344 55317335 54894984 53863585 52183526 50041159 47963422 46313750
40869 46313750 44749663 42525364 39347127 35665044 32131059 29074248 26561948 24654855
40861 24654855 23401301 22730087 22488542 22496003 22515525 22338834 21995471 21733616 21685764 21684841
40851 21684841 21532641 21323889 21335607 21654399 22070287 22329345 22373769 22345930 22500312 23180781
40841 23180781 24794773 27659561 31762392 36635894 41520723 45749930 49048899 51514601
40833 51514601 53390173 54914780 56282737 57535385 58417287 58470886 57416061 55459954
40825 55459954 53230125 51420516 50411309 50024543 49568220 48302079 46088341 43617494
40817 43617494 41912699 41584564 42522372 44126150 45682024 46623320 46703042 46042795 44954847
$$ packed form
40877E4473524O73820J69991m22351j031399j680059k142367k077737j649672
40869D6313750j564087k224299l178237l682083l533985l056811k512300j907093
40861B4654855j253554o71214k41545P461J9522j76691l43363k61855m7852r23
40851B1684841j52200k08752J1718L18792M15888K59058M4424k7839J54382O80469
40841B3180781J613992K864788M102831M873502M884829M229207L298969K465702
40833E1514601J875572J524607J367957J252648Q81902N3599j054825j956107
40825E5459954k229829j809609j009207l86766m56323j266141k213738k470847
40817D3617494j704795l28135R37808J603778J555874R41296P9722o60247j087948
$$ plain form
40808 44954847 43688998 42410148 41380912 40987948 41498436 42897632 45067554 48023605
40800 48023605 51782985 55966874 59695971 62049736 62667244 61866909 60218725 58111928
40792 58111928 55758839 53444326 51552919 50327082 49746443 49707369 50207375 51275677 52831152
40783 52831152 54728455 56876386 59167090 61271506 62563850 62253351 59654845 54591270
40775 54591270 47770041 40666274 34734882 30633607 28296750 27628444 28744425 31429304
40767 31429304 34735679 37486900 39115595 39822260 40044865 40038478 39893457 39609940 39030808
40758 39030808 37921665 36279479 34458028 32871014 31635503 30584811 29557564 28573079
40750 28573079 27743872 27086900 26441463 25592115 24519901 23517128 22971952 23036747 23602938
$$ packed form
40808D4954847j265849j278850j029236l92964N10488J399196K169922K956051
40800D8023605L759380M183889L729097K353765O17508q00335j648184k106797
40792E8111928k353089k314513j891407j225837n80639l9074N00006J068302J555475
40783E2831152J897303K147931K290704K104416J292344l10499k598506n063575
40775E4591270o821229p103767n931392m101275k336857o68306J115981K684879
40767C1429304L306375K751221J628695P06665K22605o387j45021k83517n79132
40758C9030808j109143j642186j821451j587014j235511j050692j027247r84485
40750B8573079q29207o56972o45437q49348j072214j002773n45176O4795N66191
$$ plain form
40741 23602938 24594221 26108667 28174181 30515194 32745065 34739209 36652529 38581905
40733 38581905 40384283 41874269 43047494 43991768 44646459 44762119 44098458 42624336 40578176
40724 40578176 38426832 36738799 35925362 35937854 36194820 35919375 34694631 32790523 30988639
40715 30988639 30064186 30329959 31515649 32973345 34042199 34383270 34108480 33606670 33169897
40706 33169897 32711690 31837869 30259622 28222993 26529379 26011378 26865838 28490102 30002156
40697 30002156 30882038 31089694 30733566 29885433 28752280 27792285 27469984 27927083 28940468
40688 28940468 30105475 31013993 31439484 31552691 31901468 32991788 34863293 37169899 39645832
40679 39645832 42374898 45625818 49532392 53879476 58045549 61210041 62869401 63245000
$$ packed form
40741B3602938R91283J514446K065514K341013K229871J994144J913320J929376
40733C8581905J802378J489986J173225R44274O54691J15660o63661j474122k046160
40724D0578176k151344j688033q13437J2492K56966k75445j224744j904108j801884
40715C0988639r24453K65773J185690J457696J068854L41071k74790n01810m36773
40706C3169897m58207q73821j578247k036629j693614n18001Q54460J624264J512054
40697C0002156Q79882K07656l56128q48133j133153r59995l22301M57099J013385
40688B8940468J165007R08518M25491J13207L48777J090320J871505K306606K475933
40679C9645832K729066L250920L906574M347084M166073L164492J659360L75599
$$ plain form
40671 63245000 63056879 62884678 62942190 63487683 65099651 68251202 72750087 77895459 83196734
40662 83196734 88760977 94996998 102133304 110031554 118262499 126289785 133759049 140762929
40654 140762929 147781257 155287525 163428397 172044857 180825380 189328911 196985685 203257944
40646 203257944 207790250 210287758 210300538 207370116 201559918 193782574 185441856 177663613
40638 177663613 170847138 164867677 159540384 154794926 150503068 146334909 141881711 136892645
40630 136892645 131403672 125765544 120633479 116793957 114729466 114206788 114366232 114348183
40622 114348183 113879692 113266177 112900059 112871643 113007834 113109947 113044288 112685746 111935272
40613 111935272 110842152 109645188 108675737 108288555 108877998 110778807 113979231 117996686
$$ packed form
40671F3245000j88121j72201N7512N45493J611968L151551M498885N145372N301275
40662H3196734N564243O236021P136306P898250Q230945Q027286P469264P003880
40654A40762929P018328P506268Q140872Q616460Q780523Q503531P656774O272259
40646B03257944M532306K497508J2780k930422n810198p777344q340718p778243
40638A77663613o816475n979461n327293m745458m291858m168159m453198m989066
40630A36892645n488973n638128n132065l839522k064491n22678J59444j8049
40622A14348183m68491o13515l66118k8416J36191J02113o5659l58542p50474
40613A11935272j093120j196964r69451l87182N89443J900809L200424M017455
$$ plain form
40605 117996686 122244942 126595254 131486973 137492085 144923729 153863877 164254679 175684747
40597 175684747 187223002 197813350 206922959 214621007 220984223 225657893 228143817 228363343
40589 228363343 226765838 223963658 220394200 216238206 211452548 205857365 199339112 192033466
40581 192033466 184252743 176241408 168099513 159956738 152110448 144930718 138683860 133482006
40573 133482006 129341719 126234503 124091501 122754656 121874631 120883302 119214296 116667728
40565 116667728 113527680 110251603 107080257 104032684 101250290 99204270 98468406 99296938
40557 99296938 101440540 104315742 107290653 109874938 111847253 113388158 115066091 117486221
40549 117486221 120791705 124529663 128081459 131200234 134094251 137108496 140499541 144476973
$$ packed form
40605A17996686M248256M350312M891719O005112P431644Q940148J0390802J1430068
40597A75684747J1538255J0590348R109609P698048O363216M673670K485924K19526
40589B28363343j597505k802180l569458m155994m785658n595183o518253p305646
40581A92033466p780723q011335q141895q142775p846290p179730o246858n201854
40573A33482006m140287l107216k143002j336845q80025r91329j669006k546568
40565A16667728l140048l276077l171346l047573k782394k046020p35864Q28532
40557I9296938K143602K875202K974911K584285J972315J540905J677933K420130
40549A17486221L305484L737958L551796L118775K894017L014245L391045L977432
$$ plain form
40541 144476973 149211484 154655279 160456266 166186047 171654925 176990404 182476968 188321863
40533 188321863 194427039 200303914 205359822 209447446 213099492 217105446 221885762 227339897
40525 227339897 233161352 239084772 244859667 250216853 254951805 258939753 262048296 264149142
40517 264149142 265224130 265332206 264476743 262690402 260307917 257954899 256089290 254599103
40509 254599103 252939641 250622559 247531032 243849433 239761737 235150260 229524277 222324851
40501 222324851 213413706 203294864 192891892 183167801 174862860 168310179 163305991 159221980
40493 159221980 155358860 151190097 146332482 140546349 133950990 127119248 120769860 115364967
40485 115364967 111011224 107548225 104576027 101581680 98305061 94929798 91729320 88631404
$$ packed form
40541A44476973M734511N443795N800987N729781N468878N335479N486564N844895
40533A88321863O105176N876875N055908M087624L652046M005954M780316N454135
40525B27339897N821455N923420N774895N357186M734952L987948L108543K100846
40517B64149142J074988J08076q55463j786341k382485k353018j865609j490187
40509B54599103j659462k317082l091527l681599m087696m611477n625983p199426
40501B22324851q911145j0118842j0402972r724091q304941o552681n004188m084011
40493A59221980l863120m168763m857615n786133o595359o831742o349388n404893
40485A15364967m353743l462999k972198k994347l276619l375263l200478l097916
$$ plain form
40477 88631404 85399069 82199144 79675718 78339393 78039722 78112060 77939120 77370435 76749289
40468 76749289 76573110 77029653 77872857 78830230 80004635 81662043 83736475 85891616 88091232
40459 88091232 90737105 94077931 97760819 101159376 103901356 105831018 106644218 105886089
40451 105886089 103322628 99183311 94114187 89017661 84772098 81797033 79827386 78274750
40443 78274750 76879629 75933866 75843705 76557068 77487930 78032932 78174495 78517359 79644440
40434 79644440 81494345 83532642 85494828 87696770 90543599 94026358 97913705 102224946
40426 102224946 107225780 113027163 119383948 125786194 131532783 135843215 138266986 139125246
40418 139125246 139426488 140283087 142399281 145907158 150384855 155021965 159040504 162106273
$$ packed form
40477H8631404l232335l199925k523426j336325k99671P2338j72940n68685o21146
40468G6749289j76179M56543Q43204R57373J174405J657408K074432K155141K199616
40459H8091232K645873L340826L682888L398557K741980J929662Q13200p58129
40451A05886089k563461m139317n069124n096526m245563k975065j969647j552636
40443G8274750j395121r45763r0161P13363R30862N45002J41563L42864J127081
40434G9644440J849905K038297J962186K201942K846829L482759L887347M311241
40426A02224946N000834N801383O356785O402246N746589M310432K423771Q58260
40418A39125246L01242Q56599K116194L507877M477697M637110M018539L065769
$$ plain form
40410 162106273 164279483 165622194 166061157 165664508 164837123 164102737 163752168 163733268 163799400
40401 163799400 163760443 163690594 163882461 164477652 165160420 165368935 164816161 163651240 162108280
40392 162108280 160190949 157758099 154741551 151195853 147288054 143339288 139756973 136830373
40384 136830373 134660302 133270572 132561349 132041810 130845180 128307908 124570562 120507920
40376 120507920 117083501 114802492 113623557 113148783 112854323 112329380 111500998 110701737 110453977
40367 110453977 111039241 112174033 113175039 113592418 113686851 114160185 115416544 117234364 119164073
40358 119164073 121028396 122937236 125018874 127311706 129775308 132208049 134257774 135758816
40350 135758816 137060758 138828569 141464121 144845604 148660803 152858641 157694910 163415361
$$ packed form
40410A62106273K173210J342711M38963l96649q27385p34386l50569j8900O6132
40401A63799400l8957o9849J91867N95191O82768K08515n52774j164921j542960
40392A62108280j917331k432850l016548l545698l907799l948766l582315k926600
40384A36830373k170071j389730p09223n19539j196630k537272l737346m062642
40376A20507920l424419k281009j178935m74774k94460n24943q28382p99261k47760
40367A10453977N85264J134792J001006M17379R4433M73334J256359J817820J929709
40358A19164073J864323J908840K081638K292832K463602K432741K049725J501042
40350A35758816J301942J767811K635552L381483L815199M197838M836269N720451
$$ plain form
40342 163415361 169978229 177063389 184292396 191419731 198319233 204811079 210540133 215026519
40334 215026519 217806362 218570279 217326335 214548860 211100773 207831325 205125103 202799707
40326 202799707 200420616 197720830 194767460 191776907 188813404 185746794 182561423 179598097
40318 179598097 177271057 175474182 173418773 170196596 165501026 159846478 154277317 149911108
40310 149911108 147460784 146847614 147257119 147754603 147885747 147629097 146922497 145523635 143382230
40301 143382230 140935102 138902145 137844270 137906371 138819958 140065951 141152694 141872154
40293 141872154 142303069 142586037 142796055 143056734 143628344 144733789 146318738 148087037 149795527
40284 149795527 151466511 153302809 155450078 157894892 160579641 163516915 166678604 169783196
$$ packed form
40342A63415361O562868P085160P229007P127335O899502O491846N729054M486386
40334B15026519K779843P63917j243944k777475l448087l269448k706222k325396
40326B02799707k379091k699786k953370k990553k963503l066610l185371k963326
40318A79598097k327040j796875k055409l222177m695570n654548n569161m366209
40310A49911108k450324o13170M09505M97484J31144k56650p06600j398862k141405
40301A43382230k447128k032957j057875O2101R13587J245993J086743P19460
40293A41872154M30915K82968K10018K60679N71610J105445J584949J768299J708490
40284A49795527J670984J836298K147269K444814K684749K937274L161689L104592
$$ plain form
40276 169783196 172353312 174122225 175349539 176625035 178345490 180411708 182352689 183618889
40268 183618889 183809194 182834777 180992782 178814897 176744559 174931028 173287384 171658083
40260 171658083 169936395 168145494 166475124 165173946 164351033 163918397 163728488 163679541 163673583
40251 163673583 163614805 163552095 163726320 164340154 165312691 166366294 167311592 168090053 168502098
40242 168502098 168044394 166168163 162718202 158072966 152852380 147524321 142289253 137255742
40234 137255742 132593618 128450291 124801222 121547850 118831977 117152260 117029024 118524869
40226 118524869 121139083 124142435 126911900 128945608 129768139 129071404 126973666 123951873
40218 123951873 120397816 116344090 111747021 106912790 102397993 98503637 95169051 92497881
$$ packed form
40276A69783196K570116J768913J227314J275496J720455K066218J940981J266200
40268A83618889J90305r74417j841995k177885k070338j813531j643644j629301
40260A71658083j721688j790901j670370j301178q22913m32636j89909m8947n958
40251A63673583n8778o2710J74225O13834R72537J053603R45298P78461M12045
40242A68502098m57704j876231l449961m645236n220586n328059n235068n033511
40234A37255742m662124m143327l649069l253372k715873j679717j23236J495845
40226A18524869K614214L003352K769465K033708Q22531o96735k097738l021793
40218A23951873l554057m053726m597069m834231m514797l894356l334586k671170
$$ plain form
40210 92497881 91068615 91333060 92780078 94126802 94535127 94405375 94752857 95960259 97402700
40201 97402700 98232355 98238596 97864655 97620406 97664430 97835902 97849403 97401208 96235885 94265014
40191 94265014 91666849 88854247 86319952 84462658 83485864 83404326 84120229 85467061 87164479
40182 87164479 88793658 89962229 90600978 91073549 91908813 93402399 95497326 98003590
40174 98003590 100841408 104065947 107727358 111699427 115552662 118618614 120375239 120902104
40166 120902104 120864158 120917990 121179299 121354559 121269689 121047460 120758872 120104758 118552176
40157 118552176 115707405 111516988 106220985 100209378 93880486 87572069 81630051 76499523
40149 76499523 72607843 70090542 68729368 68235891 68494146 69408765 70606033 71483352 71602424
$$ packed form
40210I2497881j429266K64445J447018J346724M08325j29752L47482J207402J442441
40201I7402700Q29655O241l73941k44249M4024J71472J3501m48195j165323j970871
40191I4265014k598165k812602k534295j857294r76794q1538P15903J346832J697418
40182H7164479J629179J168571O38749M72571Q35264J493586K094927K506264
40174I8003590K837818L224539L661411L972069L853235L065952J756625N26865
40166A20902104l7946N3832K61309J75260q4870k22229k88588o54114j552582
40157A18552176k844771m190417n296003o011607o328892o308417n942018n130528
40149G6499523l891680k517301j361174m93477K58255R14619J197268Q77319J19072
$$ plain form
40140 71602424 70937131 69719923 68168555 66433884 64719729 63323229 62537323 62556219 63460844
40131 63460844 65220806 67659929 70432114 73080540 75190522 76569727 77339278 77833008
40123 77833008 78331089 78836509 79127903 79080183 78953630 79353235 80868851 83674742 87348741
40114 87348741 91003291 93700917 94996359 95254509 95406522 96242467 97827305 99553023
40106 99553023 100718087 101055415 100788761 100303841 99818799 99328436 98764371 98081626 97109694
40097 97109694 95396664 92404230 87975046 82534459 76752964 71104479 65860745 61374370
40089 61374370 58082185 56158315 55348245 55264806 55754582 56896655 58754984 61256157 64235597
40080 64235597 67441588 70477106 72869460 74312100 74872558 74969056 75134464 75749198 76911791
$$ packed form
40140G1602424o65293j217208j551368j734671j714155j396500p85906J8896R04625
40131F3460844J759962K439123K772185K648426K109982J379205P69551M93730
40123G7833008M98081N05420K91394m7720j26553L99605J515616K805891L673999
40114H7348741L654550K697626J295442K58150J52013Q35945J584838J725718
40106I9553023J165064L37328k66654m84920m85042m90363n64065o82745r71932
40097I7109694j713030k992434m429184n440587n781495n648485n243734m486375
40089F1374370l292185j923870q10070q3439M89776J142073J858329K501173K979440
40080F4235597L205991L035518K392354J442640N60458R6498J65408O14734J162593
$$ plain form
40071 76911791 78464339 80053590 81171989 81311845 80316032 78648610 77175832 76526544
40063 76526544 76650800 77012628 77121266 76805494 76105258 75142256 74184742 73694160 74117693
40054 74117693 75561975 77681022 79879786 81607276 82488487 82295149 80930248 78496375
40046 78496375 75326588 71881850 68616554 65952787 64304837 63984003 64996366 66959694
40038 66959694 69290360 71543996 73645376 75820494 78261623 80793596 82859205 83851805
40030 83851805 83462731 81755159 79050482 75825992 72569457 69512644 66517938 63390149
40022 63390149 60272765 57526559 55207663 52934206 50396117 47771419 45440117 43444983
40014 43444983 41467836 39255358 36841989 34388156 32023935 29882393 28108783 26779284
$$ packed form
40071G6911791J552548J589251J118399J39856r95813j667422j472778o49288
40063G6526544J24256L61828J08638l15772p00236r63002r57514m90582M23533
40054G4117693J444282K119047K198764J727490Q81211j93338j364901k433873
40046G8496375l169787l444738l265296k663767j647950l20834J012363J963328
40038F6959694K330666K253636K101380K175118K441129K531973K065609R92600
40030H3851805l89074j707572k704677l224490l256535l056813k994706l127789
40022F3390149l117384k746206k318896k273457k538089k624698k331302j995134
40014D3444983j977147k212478k413369k453833k364221k141542j773610j329499
$$ plain form
40006 26779284 25926777 25656362 26077151 27059190 28189046 29059479 29544966 29765446 29887351
39997 29887351 30027350 30256163 30590763 31003030 31476171 31997172 32438527 32503877 31877824
39988 31877824 30447401 28392295 26140944 24270733 23314195 23483435 24570753 26227257
39980 26227257 28340125 30997668 34034837 36776613 38409317 38592437 37613601 36015378
39972 36015378 34246403 32643784 31462197 30724263 30174365 29568379 28941674 28450182 28068410
39963 28068410 27668821 27303777 27088242 26787584 25869346 24119546 21952605 19950197 18354062
39954 18354062 17233024 16876737 17635316 19429241 21709705 23872537 25482618 26207411
39946 26207411 25918884 24933923 23856121 23060625 22531425 22230250 22309055 22790772 23288938
$$ packed form
40006B6779284q52507k70415M20789R82039J129856Q70433M85487K20480J21905
39997B9887351J39999K28813L34600M12267M73141N21001M41355O5350o26053
39988C1877824j430423k055106k251351j870211r56538J69240J087318J656504
39980B6227257K112868K657543L037169K741776J632704J83120r78836j598223
39972C6015378j768975j602619j181587p37934n49898o05986o26705m91492l81772
39963B8068410l99589l65044k15535l00658r18238j749800k166941k002408j596135
39954A8354062j121038l56287P58579J793925K280464K162832J610081P24793
39946B6207411k88527r84961j077802p95496n29200l01175P8805M81717M98166
$$ plain form
39937 23288938 23293629 22655921 21665669 20761155 20258657 20203201 20314282 20177117 19649611 19048100
39927 19048100 18874087 19465339 20950820 23300128 26193897 28983942 31028600 32027134
39919 32027134 31879729 30392195 27469720 23630302 20021378 17740427 17184699 18020420
39911 18020420 19555193 21056088 21933280 21875899 20868081 19053791 16635525 13920474
39903 13920474 11355419 9404665 8383408 8406081 9414709 11186198 13343389 15441667
39895 15441667 17107589 18147755 18581799 18608193 18553677 18835574 19849750 21693510 23917455
39886 23917455 25692120 26377870 25912348 24616421 22823506 20904725 19471960 19116076
39878 19116076 19792806 20712670 21025719 20514488 19545627 18531600 17595980 16619174 15404534
$$ packed form
39937B3288938M691o37708r90252r04514n02498n5456J11081j37165n27506o01511
39927A9048100j74013N91252J485481K349308K893769K790045K044658R98534
39919C2027134j47405j487534k922475l839418l608924k280951n55728Q35721
39911A8020420J534773J500895Q77192n7381j007818j814290k418266k715051
39903A3920474k565055j950754j021257K2673J008628J771489K157191K098278
39895A5441667J665922J040166M34044K6394n4516K81897J014176J843760K223945
39886B3917455J774665O85750m65522j295927j792915j918781j432765l55884
39878A9116076O76730R19864L13049n11231r68861j014027r35620r76806j214640
$$ plain form
39869 15404534 13848858 12113807 10616542 9732522 9504421 9687413 9999945 10248801 10331797
39860 10331797 10305301 10417973 10898861 11683344 12481459 13157054 13927535 15115276 16733130
39851 16733130 18337034 19291120 19261100 18538361 17814798 17499264 17276769 16482986 14894485
39842 14894485 12951101 11140286 9369796 7130510 4204298 1059655 -1437993 -2622255
39834 -2622255 -2397378 -1184459 434839 2081622 3664212 5178747 6548184 7735261
39826 7735261 8923297 10413747 12295121 14289187 15948713 16946850 17202154 16897881 16487044
39817 16487044 16533183 17302705 18462282 19326460 19494480 19167355 18789865 18509886 18118559
39808 18118559 17414562 16403081 15132308 13581218 11854035 10320026 9334231 8845222
$$ packed form
39869A5404534j555676j735051j497265q84020k28101J82992L12532K48856Q2996
39860A0331797k6496J12672M80888P84483P98115O75595P70481J187741J617854
39851A6733130J603904R54086l0020p22739p23563l15534k22495p93783j588501
39842A4894485j943384j810815j770490k239286k926212l144643k497648j184262
39834b622255K24877J212919J619298J646783J582590J514535J369437J187077
39826G735261J188036J490450J881374J994066J659526R98137K55304l04273m10837
39817A6487044M6139P69522J159577Q64178J68020l27125l77490k79979l91327
39808A8118559p03997j011481j270773j551090j727183j534009r85795m89009
$$ plain form
39800 8845222 8464820 7962821 7553082 7632123 8359384 9598383 11180761 13051422 15100772
39791 15100772 16967473 18161914 18454866 18103561 17615238 17269865 16921725 16272164 15250375
39782 15250375 14075715 13031119 12267960 11763008 11324881 10665147 9644101 8533228 7922009
39773 7922009 8226839 9270323 10366841 10812709 10328458 9151378 7803514 6744600 6143265
39764 6143265 5888308 5754701 5543317 5139120 4542058 3843436 3099237 2253930 1312390
39755 1312390 584775 580412 1544590 3191172 4987650 6625421 8120016 9548212 10848590
39746 10848590 11886855 12637615 13320905 14406852 16378582 19303746 22593278 25271700
39738 25271700 26552653 26216495 24607617 22441719 20545332 19506758 19386308 19750755
$$ packed form
39800H845222l80402n01999m09739P9041P27261J238999J582378J870661K049350
39791A5100772J866701J194441K92952l51305m88323l45373l48140o49561j021789
39782A5250375j174660j044596p63159n04952m38127o59734j021046j110873o11219
39773G922009L04830J043484J096518M45868m84251j177080j347864j058914o01335
39764F143265k54957j33607k11384m04197n97062o98622p44199q45307r41540
39755A312390p27615m363R64178J646582J796478J637771J494595J428196J300378
39746A0848590J038265P50760O83290J085947J971730K925164L289532K678422
39738B5271700J280953l36158j608878k165898j896387j038574j20450L64447
$$ plain form
39730 19750755 20004756 19706032 18707793 17214781 15730720 14758899 14414354 14372755 14235251
39721 14235251 13857308 13297182 12608564 11839404 11172509 10908535 11273724 12294454 13831540
39712 13831540 15643922 17410519 18794321 19594767 19884325 19988763 20280717 20912438 21699234
39703 21699234 22265966 22330149 21889996 21245239 20928270 21531013 23347008 26007095 28533439
39694 28533439 29939412 29895145 28858272 27624849 26780632 26460971 26423413 26235505 25455625
39685 25455625 23783510 21166754 17834543 14236807 10900414 8265073 6573467 5838459
39677 5838459 5879384 6444695 7389718 8735229 10462810 12229114 13394456 13450877 12428377
39668 12428377 10850934 9328379 8212788 7550579 7223627 7114592 7222783 7658684 8474596
$$ packed form
39730A9750755K54001k98724r98239j493012j484061r71821l44545m1599j37504
39721A4235251l77943n60126o88618p69160o66895k63974L65189J020730J537086
39712A3831540J812382J766597J383802Q00446K89558J04438K91954O31721P86796
39703B1699234N66732O4183m40153o44757l16969O02743J815995K660087K526344
39694B8533439J405973m4267j036873j233423q44217l19661l7558j87908p79880
39685B5455625j672115k616756l332211l597736l336393k635341j691606p35008
39677E838459M0925N65311R45023J345511J727581J766304J165342N6421j022500
39668A2428377j577443j522555j115591o62209l26952j09035J08191M35901Q15912
$$ plain form
39659 8474596 9471100 10217227 10317525 9686557 8602959 7545341 6944843 6968376 7443716
39650 7443716 8033693 8581921 9291207 10458848 11971811 13127952 13063116 11389304 8418120
39641 8418120 4849558 1358786 -1592324 -3851131 -5725868 -7935098 -11090210 -15059598
39633 -15059598 -18916417 -21614336 -22727662 -22576053 -21770357 -20720666 -19486646 -17943577
39625 -17943577 -16036899 -13905746 -11775436 -9737269 -7677597 -5457923 -3134787 -957076
39617 -957076 845744 2246610 3414958 4572523 5848520 7210545 8466681 9333327
39609 9333327 9610701 9443663 9424521 10243737 12033580 14076359 15332634 15326832 14468751
39600 14468751 13563486 13164075 13379955 14043805 14860175 15474321 15571874 14952710 13509246
$$ packed form
39659H474596R96504P46127J00298o30968j083598j057618o00498K3533M75340
39650G443716N89977N48228P09286J167641J512963J156141o4836j673812k971184
39641H418120l568562l490772k951110k258807j874737k209230l155112l969388
39633a5059598l856819k697919j113326J51609Q05696J049691J234020J543069
39625a7943577J906678K131153K130310K038167K059672K219674K323136K177711
39617i57076J802820J400866J168348J157565J275997J362025J256136Q66646
39609I333327K77374j67038j9142Q19216J789843K042779J256275n802q58081
39600A4468751r05265l99411K15880O63850Q16370O14146R7553o19164j443464
$$ plain form
39591 13509246 11229237 8282590 5013866 1765794 -1230574 -3769258 -5635265 -6777858
39583 -6777858 -7390292 -7668088 -7598310 -7166213 -6672092 -6594393 -7115521 -7944224 -8603780 -8737315
39573 -8737315 -8160246 -6859011 -5049712 -3114346 -1404164 -169706 368690 98669 -776667
39564 -776667 -1807999 -2698510 -3511248 -4414740 -5409835 -6443228 -7608005 -8999806 -10435818
39555 -10435818 -11502232 -11855046 -11349302 -9965572 -7826466 -5267171 -2659038 -94603
39547 -94603 2581862 5342598 7707701 9020118 8953766 7774470 6282438 5561224 6510229
39538 6510229 9261106 12963946 16288981 18228260 18432193 16950942 13969996 9909853
39530 9909853 5539116 1686130 -1225428 -3290365 -4825087 -6068215 -7119687 -7972842
$$ packed form
39591A3509246k280009k946647l268724l248072k996368k538684j866007j142593
39583f777858o12434k77796O9778M32097M94121P7699n21128q28703o59556j33535
39573h737315N77069J301235J809299J935366J710182J234458N38396k70021q75336
39564g76667j031332q90511q12738r03492r95095j033393j164777j391801j436012
39555a0435818j066414l52814N05744J383730K139106K559295K608133K564435
39547i4603K676465K760736K365103J312417o6352j179296j492032p21214R49005
39538F510229K750877L702840L325035J939279K03933j481251k980946m060143
39530I909853m370737l852986k911558k064937j534722j243128j051472q53155
$$ plain form
39522 -7972842 -8499616 -8472072 -7675493 -6001688 -3475422 -318481 2968539 5733382 7554329
39513 7554329 8517228 9041275 9417752 9554905 9149119 8028132 6302553 4235927 2035090
39504 2035090 -192345 -2281572 -3892041 -4662343 -4536286 -3895557 -3332201 -3293235 -3888579
39495 -3888579 -4890580 -5837498 -6254423 -5956194 -5194517 -4479473 -4254900 -4714076 -5765812
39486 -5765812 -7010091 -7790418 -7494154 -5978146 -3741731 -1670680 -551758 -663090 -1629744
39477 -1629744 -2621452 -2810193 -1786548 357718 3242611 6418210 9433223 11857849
39469 11857849 13383642 13963599 13859028 13484858 13090726 12546213 11520563 9926314 8088930
39460 8088930 6398594 4910076 3427777 1893466 495190 -573063 -1250014 -1491436
$$ packed form
39522g972842n26774K7544P96579J673805K526266L156941L287020K764843J820947
39513G554329R62899N24047L76477J37153m05786j120987j725579k066626k200837
39504B035090k227435k089227j610469p70302J26057O40729N63356L8966n95344
39495c888579j002001r46918m16925K98229P61677P15044K24573m59176j051736
39486e765812j244279p80327K96264J516008K236415K071051J118922j11332r66654
39477a629744r91708j88741J023645K144266K884893L175599L015013K424626
39469A1857849J525793N79957j04571l74170l94132n44513j025650j594249j837384
39460H088930j690336j488518j482299j534311j398276j068253o76951k41422
$$ plain form
39452 -1491436 -1240704 -619028 19094 369730 457596 548451 851456 1371557 1958899 2390327
39442 2390327 2464731 2178750 1867969 2095049 3267212 5246429 7287389 8421135 8015109
39433 8015109 6038713 2875824 -952885 -4808407 -7901748 -9589002 -9778497 -8869021
39425 -8869021 -7243808 -5025574 -2402642 56040 1654921 2088147 1582282 620868 -336493
39416 -336493 -988481 -1316625 -1639612 -2376854 -3623240 -4959682 -5718140 -5471791 -4360842
39407 -4360842 -3019405 -2123240 -1860862 -1778915 -1179881 298068 2481955 4972024 7545782
39398 7545782 10228577 13035691 15729560 17852880 18968475 18855832 17551524 15328185
39390 15328185 12667191 10119211 8045527 6497778 5401382 4768548 4593509 4598644 4306192
$$ packed form
39452a491436K50732O21676O38122L50636Q7866R0855L03005N20101N87342M31428
39442B390327P4404k85981l10781K27080J172163J979217K040960J133746m06026
39433H015109j976396l162889l828709l855522l093341j687254j89495R09476
39425h869021J625213K218234K622932K458682J598881M33226n05865r61414r57361
39416c36493o51988l28144l22987p37242j246386j336442p58458K46349J110949
39407d360842J341437Q96165K62378Q1947N99034J477949K183887K490069K573758
39398G545782K682795K807114K693869K123320J115595j12643j304308k223339
39390A5328185k660994k547980k073684j547749j096396o32834j75039N135k92452
$$ plain form
39381 4306192 3458592 2282943 1299711 940514 1337284 2339479 3676074 5182902 6890985
39372 6890985 8802068 10594595 11702187 11720637 10650310 8818050 6795839 5355111
39364 5355111 5094995 5865756 6753030 6840060 5866039 4067770 1729862 -767175 -2701063
39355 -2701063 -3341948 -2639456 -1287766 -18175 963312 1805288 2566881 3123721 3378711
39346 3378711 3408640 3439553 3737805 4458296 5515976 6594097 7277549 7207563 6248974 4648286
39336 4648286 2970270 1703040 871354 80740 -1117710 -2989605 -5594204 -8716707
39328 -8716707 -11783481 -14094739 -15341514 -15875721 -16421159 -17541394 -19341178 -21524157
39320 -21524157 -23646822 -25374748 -26583076 -27272822 -27475444 -27272807 -26789154 -26046601 -24939516
$$ packed form
39381D306192q47600j175649r83232l59197L96770J002195J336595J506828J708083
39372F890985J911083J792527J107592J8450j070327j832260k022211j440728
39364E355111k60116P70761Q87274Q7030r74021j798269k337908k497037j933888
39355b701063o40885P02492J351690J269591R81487Q41976P61593N56840K54990
39346C378711K9929L0913K98252P20491J057680J078121O83452o9986r58589j600688
39336D648286j678016j267230q31686p90614j198450j871895k604599l122503
39328h716707l066774k311258j246775n34207n45438j120235j799784k182979
39320b1524157k122665j727926j208328o89746k02622K02637M83653P42553J107085
$$ plain form
39311 -24939516 -23527848 -22252934 -21573837 -21350049 -20843666 -19470953 -17402008 -15315452
39303 -15315452 -13709225 -12574732 -11613727 -10596201 -9532692 -8612903 -7987975 -7590080 -7217724
39294 -7217724 -6815761 -6559488 -6571963 -6633911 -6302215 -5335036 -3943250 -2586667 -1502923
39285 -1502923 -430227 1142519 3355197 5603289 6870298 6474063 4491487 1565998
39277 1565998 -1524724 -4136773 -5868486 -6611506 -6470587 -5569113 -3990883 -1940883 176117
39268 176117 1969875 3292644 4121029 4248515 3280990 1054514 -1991485 -4974615 -7170427
39259 -7170427 -8458852 -9193305 -9726177 -10158049 -10470285 -10668917 -10702144 -10415648 -9766563
39250 -9766563 -9004612 -8513872 -8560467 -9282710 -10706134 -12489599 -13799527 -13840866 -12602419
$$ packed form
39311b4939516J411668J274914O79097K23788N06383J372713K068945K086556
39303a5315452J606227J134493R61005J017526J063509R19789O24928L97895L72356
39294g217724M01963K56273j2475o1948L31696R67179J391786J356583J083744
39285a502923J072696J572746K212678K248092J267009l96235j982576k925489
39277A565998l090722k612049j731713p43020J40919R01474J578230K050000K117000
39268A76117J793758J322769Q28385J27486r67525k226476l045999k983130k195812
39259g170427j288425p34453n32872m31872l12236j98632l3227K86496O49085
39250i766563P61951M90740m6595p22243j423424j783465j309928m1339J238447
$$ plain form
39241 -12602419 -10838381 -9277428 -8084354 -7082977 -6138578 -5179671 -4159364 -3215134
39233 -3215134 -2650909 -2567730 -2696579 -2750937 -2718451 -2621047 -2254958 -1463503 -474045 366515
39223 366515 1067011 1866932 2711136 3208328 3143953 2747944 2404467 2339533 2622189 3184938
39213 3184938 3728216 3850379 3459391 2938085 2783423 3186928 4050663 5264747 6812188
39204 6812188 8672729 10759961 12913346 14830276 16029216 16037002 14727018 12483036 9999279
39195 9999279 7882761 6391511 5471990 4961382 4720433 4639045 4628116 4641611 4648783 4560979
39185 4560979 4242721 3623694 2768258 1857943 1173143 1009666 1386999 1787758 1437309
39176 1437309 63707 -1692190 -2763339 -2502415 -1006335 1174323 3406950 5171500
$$ packed form
39241a2602419J764038J560953J193074J001377R44399R58907J020307R44230
39233c215134N64225Q3179j28849n4358L2486R7404L66089P91455R89458Q40560
39223C66515P00496P99921Q44204M97192o4375l96009l43477o4934K82656N62749
39213C184938N43278J22163l90988n21306j54662M03505Q63735J214084J547441
39204F812188J860541K087232K153385J916930J198940P786j309984k243982k483757
39195I999279k116518j491250r19521n10608k40949q1388j0929J3495P172q7804
39185D560979l18258o19027q55436r10315o84800j63477L77333M00759l50449
39176A437309j373602j755897j071149K60924J496080K180658K232627J764550
$$ plain form
39168 5171500 6192701 6474156 6115561 5128656 3521632 1439609 -971621 -3737735 -6819624
39159 -6819624 -9715591 -11566113 -11736131 -10152857 -7113566 -3030149 1597119 6255248
39151 6255248 10642847 14653088 18027595 20237767 20896992 20173579 18646124 16838457
39143 16838457 14984417 13076825 10948975 8394384 5416444 2382229 -169214 -1875009
39135 -1875009 -2693257 -2824992 -2604054 -2371770 -2305857 -2375911 -2528688 -2852489 -3486743 -4466076
39125 -4466076 -5755563 -7318500 -8976611 -10294963 -10855384 -10687848 -10261785 -9997297 -9919995
39116 -9919995 -9832033 -9631403 -9301461 -8674517 -7425672 -5436320 -3175304 -1649964 -1828981
39107 -1828981 -3929011 -7174636 -10294504 -12337121 -13098127 -12910899 -12205300 -11311551 -10519944
$$ packed form
39168E171500J021201K81455l58595r86905j607024k082023k411230k766114l081889
39159f819624k895967j850522j70018J583274L039291M083417M627268M658129
39151F255248M387599M010241L374507K210172O59225p23413j527455j807667
39143A6838457j854040j907592k127850k554591k977940l034215k551443j705795
39135a875009q18248j31735K20938K32284O5913p0054j52777l23801o34254r79333
39125d466076j289487j562937j658111j318352n60421J67536M26063K64488P7302
39116i919995Q7962K00630L29942O26944J248845J989352K261016J525340j79017
39107a828981k100030l245625l119868k042617p61006J87228P05599Q93749P91607
$$ plain form
39098 -10519944 -10102024 -10183575 -10653603 -11274798 -11913215 -12667445 -13776224 -15376908 -17306889
39089 -17306889 -19120812 -20347776 -20804932 -20680867 -20270851 -19610145 -18420970 -16473517 -13956006
39080 -13956006 -11394792 -9192974 -7311991 -5419237 -3260450 -828135 1754083 4365952
39072 4365952 6849712 8897925 10097685 10192870 9363237 8233799 7548472 7773446 8945649
39063 8945649 10769402 12725228 14132303 14369754 13288062 11415469 9595512 8306942
39055 8306942 7349530 6215468 4715055 3179261 2071758 1488532 1095404 520520 -295961
39046 -295961 -1200674 -2194119 -3529146 -5347825 -7289006 -8591229 -8636561 -7366973 -5190651
39037 -5190651 -2597756 44662 2390051 3992177 4434074 3614427 1890376 -76289
$$ packed form
39098a0519944M17920q1551m70028o21195o38417p54230j108779j600684j929981
39089a7306889j813923j226964m57156J24065M10016O60706J189175J947453K517511
39080a3956006K561214K201818J880983J892754K158787K432315K582218K611869
39072D365952K483760K048213J199760R5185q29633j129438o85327K24974J172203
39063H945649J823753J955826J407075K37451j081692j872593j819957j288570
39055H306942r57412j134062j500413j535794j107503n83226l93128n74884q16481
39046b95961r04713r93445j335027j818679j941181j302223m5332J269588K176322
39037e190651K592895K642418K345389J602126M41897q19647j724051j966665
$$ plain form
39029 -76289 -1649717 -2488307 -2581462 -2057877 -967717 694100 2700119 4394944 4961444
39020 4961444 4013696 1946294 -306718 -1843485 -2202572 -1412608 195048 2244120 4493500
39011 4493500 6795421 8886425 10332499 10816315 10472744 9839857 9446347 9458354 9650321
39002 9650321 9617761 9086867 8203176 7556565 7772722 8982931 10747743 12511990 14017973
38993 14017973 15236134 16061827 16256796 15672824 14439917 12937523 11600661 10659640 9972050
38984 9972050 9175744 8134461 7206288 6935493 7463242 8373657 9171985 9772394 10368910
38975 10368910 10898754 10866948 9833521 7978171 6020399 4580044 3752217 3329098 3226898
38966 3226898 3495950 4001556 4361423 4293122 3886489 3447818 3183832 3122316 3211524 3317992
$$ packed form
39029g6289j573428q38590r3155N23585J090160J661817K006019J694825N66500
39020D961444r47748k067402k253012j536767l59087P89964J607656K049072K249380
39011D493500K301921K091004J446074M83816l43571o32887l93510J2007J91967
39002I650321l2560n30894q83691o46611K16157J210209J764812J764247J505983
38993A4017973J218161Q25693J94969n83972j232907j502394j336862r41021o87590
38984I972050p96306j041283r28173k70795N27749R10415P98328O00409N96516
38975A0368910N29844l1806j033427j855350j957772j440355q27827m23119j02200
38966C226898K69052N05606L59867o8301m06633m38671k63986o1516Q9208J06468
$$ plain form
38956 3317992 3162464 2464848 1261121 -21522 -949485 -1546227 -2239187 -3257439 -4188852
38947 -4188852 -4335618 -3528006 -2374431 -1598541 -1359517 -1464293 -2022996 -3393474 -5390277
38938 -5390277 -7016879 -7341857 -6444025 -5178150 -4145299 -3249204 -2216690 -1114133 -134105
38929 -134105 865416 2287301 4271163 6441014 8241018 9415311 10061737 10266462 9857331
38920 9857331 8640002 6797933 4853130 3167697 1641466 416 -1789037 -3589602
38912 -3589602 -5455677 -7632486 -10142499 -12590601 -14494891 -15684043 -16279148 -16409778
38904 -16409778 -16085672 -15309675 -14229612 -13187424 -12612131 -12731786 -13284702 -13604985 -13161395
38895 -13161395 -12039590 -10804106 -9864654 -9051493 -7839449 -5925777 -3561522 -1395705
$$ packed form
38956C317992j55528o97616j203727j282643r27963n96742o92960j018252r31413
38947d188852j46766Q07612J153575P75890K39024j04776n58703j370478j996803
38938e390277j626602l24978Q97832J265875J032851Q96095J032514J102557R80028
38929a34105R99521J421885J983862K169851J800004J174293O46426K04725m09131
38920I857331j217329j842069j944803j685433j526231j641050j789453j800565
38912c589602j866075k176809k510013k448102j904290j189152n95105j30630
38904a6409778L24106P75997J080063J042188N75293j19655n52916l20283M43590
38895a3161395J121805J235484R39452Q13161J212044J913672K364255K165817
$$ plain form
38887 -1395705 -61419 180444 -394043 -1040648 -901226 464426 2766178 5236416 7243767
38878 7243767 8646761 9611319 10294582 10835490 11476586 12402437 13430273 14093035 14153114
38869 14153114 13904975 13854956 14193537 14682904 14959075 14796182 14151755 13177200 12241307
38860 12241307 11765374 11869793 12199765 12181796 11448426 9980035 7914993 5391795 2643368
38851 2643368 116585 -1687876 -2555850 -2690138 -2486402 -2233498 -2036103 -1915426 -1868151
38842 -1868151 -1832100 -1672715 -1237115 -413894 835155 2452315 4270836 6020515 7346878
38833 7346878 7890892 7487990 6360982 5041732 4019985 3501460 3514625 4069749 5021656
38824 5021656 5870141 5978186 5100292 3595891 2095692 1060719 626319 636074 726071
$$ packed form
38887a395705J334286K41863n74487o46605J39422J365652K301752K470238K007351
38878G243767J402994R64558O83263N40908O41096R25851J027836O62762O0079
38869A4153114k48139n0019L38581M89367K76171j62893o44427r74555r35893
38860A2241307m75933J04419L29972j7969p33370j468391k065042k523198k748427
38851B643368k526783j804461q67974j34288K03736K52904J97395J20677M7275
38842a868151L6051J59385M35600Q23221J249049J617160J818521J749679J326363
38833G346878N44014m02902j127008j319250j021747n18525J3165N55124R51907
38824E021656Q48485J08045q77894j504401j500199j034973m34400R755Q9997
$$ plain form
38815 726071 573169 239672 178653 755764 1834428 2942110 3751321 4266825 4641349
38806 4641349 4986315 5309362 5462954 5200321 4485035 3736351 3542965 4067278 4903675
38797 4903675 5577842 5982973 6216691 6210522 5767262 4895577 3896599 3124672 2825314 3187178
38787 3187178 4299897 5893410 7240818 7573555 6735447 5406544 4598051 4861551 5948938
38778 5948938 7180131 8053589 8481357 8574051 8404651 8028460 7578776 7210573 6988906
38769 6988906 6892714 6850314 6690789 6174212 5255916 4305904 3877876 4171568 4788704 5029681
38759 5029681 4346007 2558633 -100440 -2983699 -5202756 -6069519 -5477694 -3859235 -1830404
38750 -1830404 92783 1611214 2728228 3749093 5018220 6546662 7946544 8769070
$$ packed form
38815G26071j52902l33497o1019N77111J078664J107682Q09211N15504L74524
38806D641349L44966L23047J53592k62633p15286p48684j93386N24313Q36397
38797D903675O74167M05131K33718o169m43260q71685r98978p71927k99358L61864
38787C187178J112719J593513J347408L32737q38108j328903q08493K63500J087387
38778E948938J231193Q73458M27768R2694j69400l76191m49684l68203k21667
38769F988906r6192m2400j59525n16577r18296r50012m28028K93692O17136K40977
38759E029681o83674j787374k659073k883259k219057q66763N91825J618459K028831
38750a830404J923187J518431J117014J020865J269127J528442J399882Q22526
$$ plain form
38742 8769070 8860044 8381695 7575598 6559292 5327825 3941111 2710613 2101390 2302596
38733 2302596 2918712 3274797 3093648 2720396 2601807 2727409 2753031 2531460 2252803 2051038
38723 2051038 1701606 846736 -528726 -1896668 -2468156 -1787624 -217805 1176575 1438186
38714 1438186 554746 -539681 -810032 107341 1896378 4005844 5904658 7129490 7490543
38705 7490543 7328069 7313819 7799926 8416521 8394722 7223629 4949744 1989240 -1157536
38696 -1157536 -4033809 -6286386 -7750269 -8476986 -8657670 -8525691 -8289274 -8052667 -7752898
38687 -7752898 -7214525 -6287984 -4898221 -2982782 -517842 2297478 4945872 6814838
38679 6814838 7598835 7537217 7305122 7605841 8671512 10053345 11030411 11376638 11644636
$$ packed form
38742H769070R0974m78349q06097j016306j231467j386714j230498o09223K01206
38733B302596O16116L56085j81149l73252j18589J25602K5622k21571k78657k01765
38723B051038l49432q54870j375462j367942n71488O80532J569819J394380K61611
38714A438186q83440j094427k70351R17373J789037K109466J898814J224832L61053
38705G490543j62474j4250M86107O16595k1799j171093k273885k960504l146776
38696a157536k876273k252577j463883p26717j80684J31979K36417K36607K99769
38687g752898N38373R26541J389763J915439K464940K815320K648394J868966
38679F814838P83997o1618k32095L00719J065671J381833R77066L46227K67998
$$ plain form
38670 11644636 12531976 14031079 15393574 15897342 15432809 14347399 13010191 11664608
38662 11664608 10468083 9427397 8361633 7104803 5744426 4598658 4016676 4226839
38654 4226839 5223872 6684124 8100231 9106184 9561706 9270145 7902851 5485993 2779678
38645 2779678 764813 -308328 -1123283 -2536046 -4832578 -7701911 -10573350 -12817664
38637 -12817664 -13902914 -13659471 -12378503 -10545840 -8526332 -6525510 -4685518 -3070685
38629 -3070685 -1609470 -109761 1724936 4250152 7619138 11456022 14965213 17516408
38621 17516408 19019596 19653547 19447074 18348286 16576920 14648266 13048598 12029017
38613 12029017 11654397 11860967 12473993 13346168 14520439 16149760 18234270 20497965 22483438
$$ packed form
38670A1644636Q87340J499103J362495N03768m64533j085410j337208j345583
38662A1664608j196525j040686j065764j256830j360377j145768n81982K10163
38654D226839R97033J460252J416107J005953M55522k91561j367294k416858k706315
38645B779678k014865j073141q14955j412763k296532k869333k871439k244314
38637a2817664j085250K43443J280968J832663K019508K000822J839992J614833
38629c070685J461215J499709J834697K525216L368986L836884L509191K551195
38621A7516408J503188O33951k06473j098788j771366j928654j599668j019581
38613A2029017l74620K06570O13026Q72175J174271J629321K084510K263695J985473
$$ plain form
38604 22483438 23688630 23703018 22397417 20013144 16980554 13678182 10463864 7859718
38596 7859718 6488627 6738885 8534113 11394335 14635627 17605483 19950797 21724786
38588 21724786 23124532 24100159 24306470 23400399 21245542 17870407 13462336 8492375
38580 8492375 3696521 -169888 -2524952 -3008365 -1632768 977380 3702447 5532271
38572 5532271 6116973 5776084 5149556 4889064 5418398 6710034 8332972 9898862 11443009
38563 11443009 13244201 15337230 17380316 18982212 19979454 20378246 20226540 19656540 18918819
38554 18918819 18198557 17400383 16246980 14680699 13138383 12315582 12553402 13451314 14168653
38545 14168653 14168905 13657410 13297516 13567303 14399621 15320475 15833027 15747927 15299932 14971683
$$ packed form
38604B2483438J205192J4388j305601k384273l032590l302372l214318k604146
38596G859718j371091K50258J795228K860222L241292K969856K345314J773989
38588B1724786J399746R75627K06311r06071k154857l375135m408071m969961
38580H492375m795854l866409k355064m83413J375597K610148K725067J829824
38572E532271N84702l40889o26528k60492N29334J291636J622938J565890J544147
38563A1443009J801192K093029K043086J601896R97242L98792j51706n70000p37721
38554A8918819p20262p98174j153403j566281j542316q22801K37820Q97912P17339
38545A4168653K52n11495l59894K69787Q32318R20854N12552q5100m47995l28249
$$ plain form
38535 14971683 15111591 15670956 16321349 16795073 17052061 17138766 16974822 16320963 14955250
38526 14955250 12927383 10691484 8908528 7936355 7435107 6583566 4833011 2486065
38518 2486065 491866 -345438 51572 1180875 2552652 4038474 5706556 7529100
38510 7529100 9403894 11378278 13635889 16182438 18653126 20513522 21387039 21129293
38502 21129293 19681604 17006499 13212166 8691683 4083672 20684 -3172089 -5531880
38494 -5531880 -7148217 -7852351 -7402294 -6002788 -4381912 -3152431 -2247306 -1192157 217942
38485 217942 1808181 3482672 5355433 7282741 8620072 8776087 7922895 6927746 6574343
38476 6574343 6935226 7415841 7269779 6153234 4394109 2762834 1824782 1410098 753571
$$ packed form
38535A4971683J39908N59365O50393M73724K56988Q6705j63944o53859j365713
38526A4955250k027867k235899j782956r72173n01248q51541j750555k346946
38518B486065j994199q37304L97010J129303J371777J485822J668082J822544
38510G529100J874794J974384K257611K546549K470688J860396Q73517k57746
38502B1129293j447689k675105l794333m520483m608011m062988l192773k359791
38494e531880j616337p04134M50057J399506J620876J229481R05125J055149J410099
38485B17942J590239J674491J872761J927308J337331J56015q53192r95149l53403
38476F574343L60883M80615j46062j116545j759125j631275r38052m14684o56527
$$ plain form
38467 753571 -795324 -3185730 -5714271 -7559264 -8297455 -8082771 -7490814 -7183737 -7560587
38458 -7560587 -8540510 -9589279 -10011770 -9390114 -7910011 -6321234 -5504527 -5930554 -7414929
38449 -7414929 -9345407 -11145266 -12526650 -13347378 -13382147 -12428318 -10656716 -8659876 -6991780
38440 -6991780 -5737962 -4676647 -3771166 -3281752 -3392060 -3961330 -4754300 -5752183 -7081006
38431 -7081006 -8693563 -10229794 -11173245 -11125535 -10022121 -8145684 -5864880 -3335413 -568930
38422 -568930 2179028 4291596 5223503 4948921 3852245 2325158 688843 -608440 -1078862
38413 -1078862 -607180 414480 1490563 2453067 3412656 4411917 5268486 5725078 5665986
38404 5665986 5218124 4728712 4647144 5349147 6989828 9458151 12442282 15578567 18597175
$$ packed form
38467G53571j548895k390406k528541j844993p38191K14684N91957L07077l76850
38458g560587r79923j048769m22491O21656J480103J588777Q16707m26027j484375
38449g414929j930478j799859j381384q20728l4769R53829J771602J996840J668096
38440f991780J253818J061315R05481M89414j10308n69270p92970r97883j328823
38431g081006j612557j536231r43451M7710J103414J876437K280804K529467K766483
38422e68930K747958K112568R31907k74582j096676j527087j636315j297283m70422
38413a078862M71682J021660J076083R62504R59589R99261Q56569M56592n9092
38404E665986m47862m89412q1568P02003J640681K468323K984131L136285L018608
$$ plain form
38395 18597175 21318367 23489860 24718179 24694949 23481620 21429818 18776811 15449360
38387 15449360 11364554 6840396 2575821 -787637 -3032705 -4335056 -4987962 -5222429
38379 -5222429 -5220751 -5129347 -4925079 -4320283 -3001467 -1086084 754767 1791878 1873952
38370 1873952 1510742 1375965 1812900 2711334 3607422 3834054 2791530 303738 -3222602
38361 -3222602 -6965276 -9984866 -11503500 -11205076 -9437164 -7017929 -4730225 -3038244
38353 -3038244 -2236733 -2568071 -3972713 -5894764 -7611214 -8733958 -9236366 -9116356 -8337740
38344 -8337740 -7106577 -5888298 -4988669 -4274058 -3409509 -2205950 -594869 1571827 4424585
38335 4424585 7715775 10662510 12239948 11725567 9128871 5226817 1145570 -2223378
$$ packed form
38395A8597175K721192K171493J228319k3230j213329k051802k653007l327451
38387A5449360m084806m524158m264575l363458k245068j302351o52906k34467
38379e222429J678R1404K04268O04796J318816J915383J840851J037111Q2074
38370A873952l63210j34777M36935Q98434Q96088K26632j042524k487792l526340
38361c222602l742674l019590j518634K98424J767912K419235K287704J691981
38353c038244Q01511l31338j404642j922051j716450j122744n02408J20010P78616
38344h337740J231163J218279Q99629P14611Q64549J203559J611081K166696K852758
38335D424585L291190K946735J577438n14381k596696l902054m081247l368948
$$ plain form
38327 -2223378 -4499626 -5637129 -5661026 -4665467 -2917673 -752891 1628769 4110458 6405586
38318 6405586 8041394 8696055 8470171 7770954 7025494 6558170 6585812 7130603 7941353
38309 7941353 8638854 8987259 8994103 8810386 8653242 8788940 9404747 10406479 11413141
38300 11413141 11979922 11750118 10428547 7849032 4236416 287203 -3197559 -5770248
38292 -5770248 -7394774 -8185808 -8251435 -7727473 -6801522 -5723434 -4890558 -4782438 -5540225
38283 -5540225 -6620226 -7136699 -6636483 -5358040 -3726031 -1915616 -76911 1331075
38275 1331075 1810509 1386582 644415 184461 186403 474705 828798 1199095 1740515 2657355
38265 2657355 3945915 5330296 6544594 7600572 8619238 9457832 9732351 9255102 8257665
$$ packed form
38327b223378k276248j137503k3897R95559J747794K164782K381660K481689K295128
38318F405586J635808O54661k25884o99217p45460m67324K7642N44791Q10750
38309G941353O97501L48405O844j83717j57144J35698O15807J001732J006662
38300A1413141N66781k29804j321571k579515l612616l949213l484762k572689
38292e770248j624526p91034o5627N23962R25951J078088Q32876J08120p57787
38283e540225j080001n16473N00216J278443J632009J810415J838705J407986
38275A331075M79434m23927p42167m59954J942K88302L54093L70297N41420R16840
38265B657355J288560J384381J214298J055978J018666Q38594K74519m77249r97437
$$ plain form
38256 8257665 7081124 5782784 4166348 2109470 -265368 -2702115 -4958815 -6804745
38248 -6804745 -7957639 -8158287 -7403113 -6082390 -4765413 -3777672 -3050076 -2406342 -1842058
38239 -1842058 -1399985 -954065 -413432 -116872 -692942 -2340293 -4388594 -5745758 -5768307
38230 -5768307 -4672825 -3215106 -2051953 -1308662 -621873 407167 1755086 2964934
38222 2964934 3563902 3425040 2752021 1871612 1107051 706997 744822 1104223 1617474 2172320
38212 2172320 2676242 3062897 3443354 4140190 5408953 7137855 8903924 10268355 10922069
38203 10922069 10641398 9326607 7166445 4668069 2436640 893443 125549 -101742
38195 -101742 -178962 -387961 -757148 -1228919 -1962831 -3356166 -5673174 -8678306 -11703825
$$ packed form
38256H257665j176541j298340j616436k056878k374838k436747k256700j845930
38248f804745j152894k00648P55174J320723J316977R87741P27596O43734N64284
38239a842058M42073M45920N40633K96560n76070j647351k048301j357164k2549
38230e768307J095482J457719J163153P43291O86789J029040J347919J209848
38222B964934N98968j38862o73019q80409p64561m00054L7825L59401N13251N54846
38212B172320N03922L86655L80457O96836J268763J728902J766069J364431O53714
38203A0922069k80671j314791k160162k498376k231429j543197p67894k27291
38195a01742p7220k08999l69187m71771p33912j393335k317008l005132l025519
$$ plain form
38186 -11703825 -14110948 -15699405 -16698991 -17402480 -17833575 -17767748 -17026982 -15698572 -14087466
38177 -14087466 -12544489 -11361715 -10716517 -10587357 -10728796 -10818902 -10665999 -10244971 -9544665
38168 -9544665 -8454903 -6868928 -4906290 -2988125 -1601151 -904190 -568290 -65404 874590
38159 874590 2121789 3383445 4415017 4972710 4779844 3755472 2225107 708623 -556354
38150 -556354 -1784096 -3292075 -5033247 -6485313 -6960379 -6054732 -3918986 -1179611 1420673
38141 1420673 3402247 4720537 5708100 6863380 8537415 10656433 12735996 14236011
38133 14236011 14903392 14755640 13843932 12187893 9931643 7419367 5064164 3212086
38125 3212086 2134925 2029888 2939761 4706329 7032396 9553947 11858423 13531747
$$ packed form
38186a1703825k407123j588457r99586p03489m31095O5827P40766J328410J611106
38177a4087466J542977J182774O45198J29160j41439r0106J52903M21028P00306
38168i544665J089762J585975J962638J918165J386974O96961L35900N02886R39994
38159H74590J247199J261656J031572N57693j92866j024372j530365j516484j264977
38150e56354j227742j507979j741172j452066m75066R05647K135746K739375K600284
38141A420673J981574J318290R87563J155280J674035K119018K079563J500015
38133A4236011O67381j47752r11708j656039k256250k512276k355203j852078
38125C212086j077161j05037R09873J766568K326067K521551K304476J673324
$$ plain form
38117 13531747 14272577 13981839 12787843 11064752 9394768 8332194 8066151 8347113 8814942
38108 8814942 9354474 10059231 10916402 11680744 12092882 12110848 11855611 11406928 10757854 9942298
38098 9942298 9088979 8316245 7661404 7158117 6881326 6811225 6722657 6359689 5717441 5011228
38088 5011228 4340332 3525158 2342066 791068 -955409 -2745168 -4470617 -6011067
38080 -6011067 -7299065 -8365748 -9168409 -9462669 -9076025 -8309935 -7841796 -8130632 -9048937
38071 -9048937 -10153521 -11157714 -12030663 -12766920 -13221117 -13137939 -12248746 -10383852 -7607411
38062 -7607411 -4263914 -846447 2186276 4470916 5713330 5716369 4472346 2233361 -480116
38053 -480116 -2967953 -4610201 -5222867 -5190764 -5147243 -5434354 -5858633 -5952108 -5397190 -4139829
$$ packed form
38117A3531747P40830k90738j193996j723091j669984j062574k66043K80962M67829
38108H814942N39532P04757Q57171P64342M12138J7966k55237m48683o49074q15556
38098I942298q53319p72734o54841n03287k76791p0101q8568l62968o42248p06213
38088E011228o70896q15174j183092j550998j746477j789759j725449j540450
38080f011067j287998j066683q02661k94260L86644P66090M68139k88836r18305
38071i048937j104584j004193q72949p36257m54197Q3178Q89193J864894K776441
38062g607411L343497L417467L032723K284640J242414L039j244023k238985k713477
38053d80116k487837j642248o12666L2103M3521k87111m24279r3475N54918J257361
$$ plain form
38043 -4139829 -2151466 729219 4542053 8801759 12542640 14944443 15912375 15950939 15498203
38034 15498203 14524156 12820760 10551156 8374094 7013191 6736148 7230234 7920376 8354827
38025 8354827 8263358 7317498 5057025 1301699 -3304369 -7325450 -9331471 -8813917 -6422163
38016 -6422163 -3387696 -712599 1217609 2433077 2981585 2817523 2008889 840579 -435992
38007 -435992 -1875734 -3695892 -5861696 -7959043 -9527429 -10443168 -10966098 -11488481 -12209720
37998 -12209720 -12912819 -13038501 -12136426 -10335940 -8292397 -6617438 -5436641 -4515431 -3669410
37989 -3669410 -2962991 -2611523 -2781233 -3400121 -4073656 -4259648 -3635250 -2293408 -575602
37980 -575602 1216727 2951095 4653408 6438789 8337952 10119436 11385228 11896104
$$ packed form
38043d139829J988363K880685L812834M259706L740881K401803R67932L8564m52736
38034A5498203r74047j703396k269604k177062j360903k77043M94086O90142M34451
38025H354827r1469r45860k260473l755326m606068m021081k006021N17554K391754
38016f422163L034467K675097J930208J215468N48508j64062q08634j168310j276571
38007d35992j439742j820158k165804k097347j568386r15739n22930n22383p21239
37998a2209720p03099j25682R02075J800486K043543J674959J180797R21210Q46021
37989c669410P06419L51468j69710o18888o73535j85992O24398J341842J717806
37980e75602J792329J734368J702313J785381J899163J781484J265792N10876
$$ [...]
##END NTUPLES=NMR SPECTRUM
##END=
