##TITLE=31Pdec_11P153H2
  D2O
  24 sc
 5.10.2023
##JCAMPDX= 6.0         $$ Bruker NMR JCAMP-DX V2.0
##DATA TYPE= NMR SPECTRUM
##DATA CLASS= NTUPLES
##ORIGIN= UXNMR, Bruker Analytische Messtechnik GmbH
##OWNER= root
$$ XWIN-NMR		Version 3.5
$$ Thu Oct  5 13:51:52 2023 Russian Standard Time (UT+4h)  she@DPX200
##.OBSERVE FREQUENCY= 81.013821
##.OBSERVE NUCLEUS= ^31P
##.ACQUISITION MODE= SIMULTANEOUS
##.ACQUISITION SCHEME= undefined
##.AVERAGES= 24
##.DIGITISER RES= 16
##SPECTROMETER/DATA SYSTEM= spect
##.PULSE SEQUENCE= zgpg30
##.SOLVENT NAME= CDCl3
##.SHIFT REFERENCE= (INTERNAL, CDCl3, 0, 248.564)
##AUDIT TRAIL= $$ (NUMBER, WHEN, WHO, WHERE, WHAT)
$$ ##TITLE= Audit trail, XWIN-NMR		Version 3.5
$$ ##JCAMPDX= 5.01
$$ ##ORIGIN= Bruker BioSpin GmbH
$$ ##OWNER= she
$$ F:/spectra/data/she/nmr/P31/1/pdata/1/auditp.txt
$$ ##AUDIT TRAIL=  $$ (NUMBER, WHEN, WHO, WHERE, WHAT)
(   1,<2023-10-05 13:49:14.98 +0400>,<she>,<DPX200>,
      <created by zg, POWCHK disabled, PULCHK disabled
       configuration hash MD5:
       00 E9 B6 7A A2 85 ED C7 34 08 36 98 17 FE 4E 26
       data hash MD5: 32K
       0B 38 91 E7 2E 81 60 6A F4 3C A4 E8 95 90 67 C6>)
(   2,<2023-10-05 13:49:17.32 +0400>,<she>,<DPX200>,
      <Start of raw data processing
       efp BC_mod = 2 LB = 5 FT_mod = 6 PKNL = 1 PHC0 = -10615.53 PHC1 = -13.7137 SI = 64K 
       data hash MD5: 64K
       C1 D2 EA 9D BB 1E 66 3A E2 88 69 90 5C 90 2C 12>)
(   3,<2023-10-05 13:49:45.35 +0400>,<she>,<DPX200>,
      <pk PHC0 = -60.6164 PHC1 = 80.40002 
       data hash MD5: 64K
       09 1F 30 F4 97 06 7A B0 70 AF E8 C5 7F D5 F3 83>)
(   4,<2023-10-05 13:49:50.95 +0400>,<she>,<DPX200>,
      <abs ABSG = 5 
       data hash MD5: 64K
       26 E7 41 69 C3 39 51 D7 F9 20 03 9D 8B 44 99 87>)
$$ ##END=
$$ 
$$ hash MD5
$$ FB 3A FD 79 85 0F 24 96 61 5C 94 59 25 72 38 73
##$RELAX= 
##$RELAX= 
##$RELAX= 
##$RELAX= 
##$RELAX= 
##$RELAX= 
##$RELAX= 
##$RELAX= 
##$RELAX= 
$$ Bruker specific parameters
$$ --------------------------
##$DU= <F:/spectra>
##$EXPNO= 1
##$NAME= <P31>
##$PROCNO= 1
##$TYPE= <nmr>
##$USER= <she>
##$AMP= (0..31)
100 100 100 100 100 100 100 100 100 100 100 100 100 100 100 100 100 100 
100 100 100 100 100 100 100 100 100 100 100 100 100 100 
##$AQSEQ= 0
##$AQ_mod= 1
##$AUNM= <au_zg>
##$AUTOPOS= <>
##$BF1= 81.014009
##$BF2= 200.13
##$BF3= 200.13
##$BF4= 200.13
##$BF5= 200.13
##$BF6= 200.13
##$BF7= 200.13
##$BF8= 200.13
##$BYTORDA= 1
##$CFDGTYP= 0
##$CFRGTYP= 5
##$CHEMSTR= <none>
##$CNST= (0..31)
1 1 145 1 1 1 1 1 1 1 1 1 1 1 1 1 1 1 1 1 1 1 1 1 1 1 1 1 1 1 1 1 
##$CPDPRG= <waltz16>
##$CPDPRG1= <>
##$CPDPRG2= <waltz16>
##$CPDPRG3= <>
##$CPDPRG4= <mlev>
##$CPDPRG5= <mlev>
##$CPDPRG6= <mlev>
##$CPDPRG7= <mlev>
##$CPDPRG8= <mlev>
##$CPDPRGB= <>
##$CPDPRGT= <>
##$D= (0..31)
0 1 0 0 0 0 0 0 0 0 0 0.03 2e-05 3e-06 0 0 0 0 0 0 0 0 0 0 0 0 0 0 0 0 
0 0 
##$DATE= 1696499354
##$DBL= (0..7)
120 120 120 11 120 120 24 19 
##$DBP= (0..7)
150 150 150 150 150 150 150 150 
##$DBP07= 0
##$DBPNAM0= <>
##$DBPNAM1= <>
$$ [...]
##$SUBNAM3= <"">
##$SUBNAM4= <"">
##$SUBNAM5= <"">
##$SUBNAM6= <"">
##$SUBNAM7= <"">
##$SUBNAM8= <"">
##$SUBNAM9= <"">
##$SW= 501.771253377433
##$SWIBOX= (0..15)
0 1 3 0 0 0 0 0 0 0 0 0 0 0 0 0 
##$SW_h= 40650.406504065
##$TD= 32768
##$TD0= 1
##$TE= 0
##$TE2= 300
##$TE3= 300
##$TEG= 300
##$TL= (0..7)
0 120 53 12 22 120 120 120 
##$TP= (0..7)
150 150 150 150 150 150 150 150 
##$TP07= 0
##$TPNAME0= <>
##$TPNAME1= <>
##$TPNAME2= <>
##$TPNAME3= <>
##$TPNAME4= <>
##$TPNAME5= <>
##$TPNAME6= <>
##$TPNAME7= <>
##$TPOAL= (0..7)
0.5 0.5 0.5 0.5 0.5 0.5 0.5 0.5 
##$TPOFFS= (0..7)
0 0 0 0 0 0 0 0 
##$TUNHIN= 0
##$TUNHOUT= 0
##$TUNXOUT= 0
##$USERA1= <user>
##$USERA2= <user>
##$USERA3= <user>
##$USERA4= <user>
##$USERA5= <user>
##$V9= 5
##$VALIST= <valist>
##$VCLIST= <CCCCCCCCCCCCCCC>
##$VD= 0
##$VDLIST= <DDDDDDDDDDDDDDD>
##$VPLIST= <PPPPPPPPPPPPPPP>
##$VTLIST= <TTTTTTTTTTTTTTT>
##$WBST= 1024
##$WBSW= 4
##$XGAIN= (0..3)
0 0 0 0 
##$XL= 0
##$YL= 0
##$YMAX_a= 1785
##$YMIN_a= -3222
##$ZGOPTNS= <>
##$ZL1= 120
##$ZL2= 120
##$ZL3= 120
##$ZL4= 120
##$ABSF1= 248.5645
##$ABSF2= -253.2056
##$ABSG= 5
##$ABSL= 3
##$ALPHA= 0
##$AQORDER= 0
##$ASSFAC= 0
##$ASSFACI= 0
##$ASSFACX= 0
##$ASSWID= 0
##$AUNMP= <proc_1d>
##$AZFE= 0.1
##$AZFW= 0.5
##$BCFW= 0
##$BC_mod= 2
##$BYTORDP= 0
##$COROFFS= 0
##$CY= -3
##$DATMOD= 1
##$DC= 0
##$DFILT= <>
##$DTYPP= 0
##$F1P= 0
##$F2P= 0
##$FCOR= 1
##$FTSIZE= 65536
##$FT_mod= 6
##$GAMMA= 0
##$GB= 0
##$INTBC= 1
##$INTSCL= 6.047779e-11
##$ISEN= 30
##$LB= 5
##$LEV0= 0
##$LPBIN= 0
##$MAXI= 10000
##$MC2= 0
##$MEAN= 0
##$ME_mod= 0
##$MI= 50
##$NCOEF= 0
##$NC_proc= -10
##$NLEV= 6
##$NOISF1= 182.463
##$NOISF2= 159.3651
##$NSP= 0
##$NTH_PI= 0
##$NZP= 0
##$OFFSET= 248.5645
##$PC= 4
##$PHC0= -10676.15
##$PHC1= 66.68632
##$PH_mod= 1
##$PKNL= yes
##$PPARMOD= 0
##$PSCAL= 0
##$PSIGN= 0
##$REVERSE= no
##$SF= 81.0140089999694
##$SI= 65536
##$SIGF1= 159.3651
##$SIGF2= -187.1042
##$SINO= 113.3802
##$SIOLD= 16384
##$SREGLST= <1H.CDCl3>
##$SSB= 0
##$STSI= 65536
##$STSR= 0
##$SW_p= 40650.406504065
##$SYMM= 0
##$S_DEV= 0
##$TDeff= 32768
##$TDoff= 0
##$TI= <>
##$TILT= no
##$TM1= 0
##$TM2= 0
##$TOPLEV= 0
##$USERP1= <user>
##$USERP2= <user>
##$USERP3= <user>
##$USERP4= <user>
##$USERP5= <user>
##$WDW= 1
##$XDIM= 65536
##$YMAX_p= 518778857
##$YMIN_p= -76396088
$$ End of Bruker specific parameters
$$ ---------------------------------
##NTUPLES= NMR SPECTRUM
##VAR_NAME=  FREQUENCY,     SPECTRUM/REAL,   SPECTRUM/IMAG
##SYMBOL=    X,             R,               I
##VAR_TYPE=  INDEPENDENT,   DEPENDENT,       DEPENDENT
##VAR_FORM=  AFFN,          ASDF,            ASDF
##VAR_DIM=   65536,         65536,           65536
##UNITS=     HZ,            ARBITRARY UNITS, ARBITRARY UNITS
##FACTOR=    0.620285442955139, 1,           1
##FIRST=     20137.2065510682, 0,            0
##LAST=      -20513.1999529968, 0,           0
##MIN=       -20513.1999529968, -76396088,   0
##MAX=       20137.2065510682, 518778857,    0
$$ Real data points
##PAGE= N=1
##DATA TABLE= (X++(R..R)), XYDATA
$$ [...]
$$ plain form
40963 -18166908 -17101347 -14600909 -10844799 -6395632 -2054593 1592256 4468583 6781414
40955 6781414 8580583 9684332 10013310 9823900 9543604 9485823 9800459 10599918 11987819
40946 11987819 13947929 16261959 18521366 20164548 20568578 19319769 16583986 13208110
40938 13208110 10289271 8472534 7597391 7018652 6255822 5342890 4654854 4528542 5038994
40929 5038994 5962549 6825236 7082089 6453318 5166032 3813299 2947772 2821895 3427111
40920 3427111 4592650 5981817 7159679 7871432 8297732 8958144 10291195 12266047 14333297
40911 14333297 15756517 16096008 15446312 14185361 12525323 10458659 8176040 6275651
40903 6275651 5282409 5042274 4894346 4489693 4176458 4453572 5275767 6109881 6540816
$$ packed form
40963a8166908J065561K500438L756110M449167M341039L646849K876327K312831
40955F781414J799169J103749L28978j89410k80296n7781L14636P99459J387901
40946A1987819J960110K314030K259407J643182M04030j248809k735783l375876
40938A3208110k918839j816737q75143n78739p62830r12932o88036j26312N10452
40929E038994R23555Q62687K56853o28771j287286j352733q65527j25877O05216
40920C427111J165539J389167J177862P11753M26300O60412J333051J974852K067250
40911A4333297J423220L39491o49696j260951j660038k066664k282619j900389
40903F275651r93242k40135j47928m04653l13235K77114Q22195Q34114M30935
$$ plain form
40894 6540816 6591727 6513823 6509663 6695214 7120619 7699006 8187612 8294580 7739147 6213128
40884 6213128 3477036 -319845 -4449344 -7914950 -10077124 -10987938 -11113088 -10780539 -9969439
40875 -9969439 -8635689 -7127280 -6112343 -6016854 -6584315 -7048366 -6698647 -5252811 -2839354
40866 -2839354 126479 3004034 5106519 6071841 6100264 5761479 5553258 5630253 5846380
40857 5846380 5953885 5810512 5513972 5340023 5456275 5667674 5494589 4513176 2590581
40848 2590581 -154411 -3460321 -6887683 -9741353 -11217042 -10831719 -8842172 -6226286
40840 -6226286 -4116918 -3132581 -3210255 -3978274 -5076852 -6069681 -6380185 -5727392 -4618142
40831 -4618142 -4046363 -4525277 -5588698 -6354171 -6382803 -5860165 -5187761 -4690397 -4606786 -5028971
$$ packed form
40894F540816N0911p7904m160J85551M25405N78387M88606J06968n55433j526019
40884F213128k736092l796881m129499l465606k162174r10814j25150L32549Q11100
40875i969439J333750J508409J014937R5489n67461m64051L49719J445836K413457
40866b839354K965833K877555K102485R65322K8423l38785k08221P6995K16127
40857E846380J07505j43373k96540j73949J16252K11399j73085r81413j922595
40848B590581k744992l305910l427362k853670j475689L85323J989547K615886
40840f226286K109368R84337p7674p68019j098578r92829l10504O52793J109250
40831d618142N71779m78914j063421p65473k8632N22638O72404M97364Q3611m22185
$$ plain form
40821 -5028971 -5776286 -6493384 -6886143 -6727494 -5713077 -3606189 -613224 2607195 5451130
40812 5451130 7760409 9628229 10990604 11581510 11222199 10037561 8450396 7048430
40804 7048430 6343480 6473637 7096057 7600649 7409859 6140742 3746404 710992 -2024127
40795 -2024127 -3620359 -3941068 -3569475 -3307515 -3728786 -5017964 -6901886 -8679739 -9579896
40786 -9579896 -9257723 -7883712 -5755688 -3024093 143784 3382646 6327807 8870611
40778 8870611 10994660 12409451 12595872 11333896 9110987 6921804 5621965 5397196
40770 5397196 5764082 6065631 6012362 5788205 5689437 5750929 5765150 5606315 5463209 5732942
40760 5732942 6645289 7914073 8779344 8544586 7164781 5253517 3513370 2305772 1790038
$$ packed form
40821e028971p47315p17098l92759J58649J014417K106888K992965L220419K843935
40812E451130K309279J867820J362375N90906l59311j184638j587165j401966
40804G048430p04950J30157O22420N04592j90790j269117k394338l035412k735119
40795b024127j596232l20709L71593K61960m21271j289178j883922j777853r00157
40786i579896L22173J374011K128024K731595L167877L238862K945161K542804
40778H870611K124049J414791J86421j261976k222909k189183j299839k24769
40770E397196L66886L01549n3269k24157r8768O1492J4221j58835j43106K69733
40760E732942R12347J268784Q65271k34758j379805j911264j740147j207598n15734
$$ plain form
40751 1790038 2170844 3518758 5484758 7534823 9492743 11586464 13900852 16042415
40743 16042415 17480181 18036879 17913357 17395827 16704643 16011687 15431482 15057735 15127517
40734 15127517 16023364 17891895 20283944 22370550 23556893 23775082 23219521 22023381
40726 22023381 20283070 18227369 16201133 14520768 13400833 12913304 12893689 12952248 12741393
40717 12741393 12257375 11822135 11780682 12283765 13304918 14665682 15943572 16520471 15976689
40708 15976689 14497865 12738452 11147211 9461161 6975643 3357865 -815769 -4310125
40700 -4310125 -6013834 -5600746 -3639403 -1189263 766363 1686933 1505433 458602 -1080263
40691 -1080263 -2708378 -4081384 -4957567 -5159052 -4552379 -3169279 -1336838 446989 1854557
$$ packed form
40751A790038L80806J347914J966000K050065J957920K093721K314388K141563
40743A6042415J437766N56698j23522n17530o91184o92956n80205l73747O9782
40734A5127517Q95847J868531K392049K086606J186343K18189n55561j196140
40726B2023381j740311k055701k026236j680365j119935m87529j9615N8559k10855
40717A2741393m84018m35240m1453N03083J021153J360764J277890N76899n43782
40708A5976689j478824j759413j591241j686050k485518l617778m173634l494356
40700d310125j703709M13088J961343K450140J955626R20570j81500j046831j538865
40691a080263j628115j373006q76183k01485O06673J383100J832441J783827J407568
$$ plain form
40682 1854557 2917639 3879824 4962344 6303662 7971105 9870953 11683310 13004755
40674 13004755 13553919 13199212 11909548 9861371 7554638 5591892 4238967 3306870
40666 3306870 2505761 1762622 1095339 336557 -785964 -2265548 -3645062 -4321093 -4045360
40657 -4045360 -3170427 -2436709 -2459288 -3307300 -4511914 -5467291 -5838621 -5661456 -5178723
40648 -5178723 -4630496 -4096090 -3426033 -2353354 -751651 1225777 3295906 5262469 7000579
40639 7000579 8313542 8986526 9012455 8630562 8076603 7376683 6427223 5180683 3685564
40630 3685564 2025994 313622 -1300649 -2687503 -3813585 -4743382 -5605096 -6529538 -7480207
40621 -7480207 -8090419 -7858494 -6705627 -5256157 -4342563 -4245323 -4617266 -5109486 -5730722
$$ packed form
40682A854557J063082R62185J082520J341318J667443J899848J812357J321445
40674A3004755N49164l54707j289664k048177k306733j962746j352925r32097
40666C306870q01109p43139o67283p58782j122521j479584j379514o76031K75733
40657d045360Q74933P33718k2579q48012j204614r55377l71330J77165M82733
40648e178723N48227N34406O70057J072679J601703J977428K070129J966563J738110
40639G000579J312963O72984K5929l81893n53959o99920r49460j246540j495119
40630C685564j659570j712372j614271j386854j126082r29797q61714r24442r50669
40621g480207o10212K31925J152867J449470R13594R7240l71943m92220o21236
$$ plain form
40612 -5730722 -6465861 -6897012 -6565473 -5580167 -4519531 -3757584 -3231128 -2930112 -3236396
40603 -3236396 -4504713 -6498902 -8526963 -10078202 -11115970 -11781198 -12027165 -11585783 -10156084
40594 -10156084 -7633052 -4339682 -1094762 1125042 1760820 938318 -793653 -2860881
40586 -2860881 -4803514 -6271141 -7130591 -7571326 -7936162 -8371838 -8691098 -8599587 -8016661
40577 -8016661 -7149975 -6281780 -5528076 -4855228 -4343775 -4351260 -5287203 -7201479 -9670940
40568 -9670940 -12095072 -14002104 -15083653 -15169374 -14364213 -13119264 -11967298 -11179826 -10787736
40559 -10787736 -10864185 -11563959 -12821657 -14175502 -15027788 -15070824 -14450259 -13575394 -12771017
40550 -12771017 -12020192 -11024499 -9609669 -8096471 -7154158 -7215473 -8115752 -9365483 -10672351
$$ packed form
40612e730722p35139m31151L31539R85306J060636P61947N26456L01016l06284
40603c236396j268317j994189k028061j551239j037768o65228k45967M41382J429699
40594a0156084K523032L293370L244920K219804O35778q22502j731971k067228
40586b860881j942633j467627q59450m40735l64836m35676l19260R1511N82926
40577h016661Q66686Q68195P53704O72848N11453p485r35943j914276k469461
40568i670940k424132j907032j081549q5721Q05161J244949J151966P87472L92090
40559a0787736p6449o99774j257698j353845q52286m3036O20565Q74865Q04377
40550a2771017P50825R95693J414830J513198R42313o1315r00279j249731j306868
$$ plain form
40541 -10672351 -12076584 -13616552 -14978002 -15505733 -14568178 -12014450 -8400947 -4778517
40533 -4778517 -2169911 -1153749 -1800360 -3778909 -6406628 -8755909 -9998082 -9764671
40525 -9764671 -8146271 -5397781 -1800516 2181465 5826059 8429252 9673473 9712547
40517 9712547 9002937 8137534 7701433 8009216 8851518 9599616 9693590 9044922 7950793
40508 7950793 6706828 5421882 4178962 3204113 2765599 2953037 3616192 4461089 5127417
40499 5127417 5243712 4582114 3245516 1668617 415972 -11998 707992 2544047 4892288
40490 4892288 6666690 6878233 5318102 2739388 367700 -863400 -803866 -7921 801334
40481 801334 1250597 1362170 1195151 625910 -448244 -1862415 -3313411 -4629085 -5711664
$$ packed form
40541a0672351j404233j539968j361450n27731R37555K553728L613503L622430
40533d778517K608606J016162o46611j978549k627719k349281j242173K33411
40525i764671J618400K748490L597265L981981L644594K603193J244221L9074
40517I712547p09610q65403m36101L07783Q42302P48098R3974o48668j094129
40508G950793j243965j284946j242920r74849m38514J87438O63155Q44897O66328
40499E127417J16295o61598j336598j576899j252645m27970P19990J836055K348241
40490D892288J774402K11543j560131k578714k371688j231100N9534P95945Q09255
40481H01334M49263J11573j67019n69241j074154j414171j450996j315674j082579
$$ plain form
40472 -5711664 -6316464 -6207446 -5586266 -5064962 -5042319 -5325384 -5554862 -5769659 -6228551 -6798559
40462 -6798559 -6925855 -6280124 -5093040 -3707645 -2094398 -87550 2091428 3904319
40454 3904319 5086272 5886538 6659701 7457476 8150446 8751855 9400738 10084830 10563612
40445 10563612 10584991 10081304 9163884 8032298 6894463 5862649 4868899 3728294 2318808
40436 2318808 697367 -897057 -2061116 -2310424 -1372499 463913 2387204 3613460
40428 3613460 3946622 3801139 3777053 4314025 5657096 7885255 10776052 13665811 15611169
40419 15611169 15880981 14448343 12074152 9861778 8604264 8435152 8997727 9862748 10787612
40410 10787612 11696559 12537378 13169202 13340977 12790458 11422694 9412582 7124926 4933516
$$ packed form
40472e711664o04800J09018O21180N21304K2643k83065k29478k14797m58892n70008
40462f798559j27296O45731J187084J385395J613247K006848K178978J812891
40454C904319J181953Q00266P73163P97775O92970O01409O48883O84092M78782
40445A0563612K1379n03687r17420j131586j137835j031814r93750j140605j409486
40436B318808j621441j594424j164059k49308R37925J836412J923291J226256
40428C613460L33162j45483k4086N36972J343071K228159K890797K889759J945358
40419A5611169K69812j432638k374191k212374j257514j69112N62575Q65021R24864
40410A0787612R08947Q40819O31824J71775n50519j367764k010112k287656k191410
$$ plain form
40401 4933516 3058666 1432406 -348061 -2781317 -5970393 -9382054 -12264610 -14334043
40393 -14334043 -15909183 -17354278 -18579509 -19185460 -18913712 -17761643 -15761446 -12915319
40385 -12915319 -9422775 -5815335 -2751899 -723921 22488 -562437 -2250023 -4391018
40377 -4391018 -6067145 -6604413 -5980688 -4660554 -3047004 -1197591 960898 3384579
40369 3384579 6021487 8957517 12145913 15014968 16646505 16483560 14736338 12068808
40361 12068808 9117418 6418843 4510489 3738816 3961281 4647074 5327353 5876334 6414510
40352 6414510 7079590 7863937 8538245 8754603 8365607 7638150 7020443 6688086 6413588
40343 6413588 5836572 4722130 3012340 844339 -1458485 -3612735 -5631404 -7646814
$$ packed form
40401D933516j874850j626260j780467k433256l189076l411661k882556k069433
40393a4334043j575140j445095j225231o05951K71748J152069K000197K846127
40385a2915319L492544L607440L063436K027978P46409n84925j687586k140995
40377d391018j676127n37268O23725J320134J613550J849413K158489K423681
40369C384579K636908K936030L188396K869055J631537j62945j747222k667530
40361A2068808k951390k698575j908354p71673K22465O85793O80279N48981N38176
40352F414510O65080P84347O74308K16358l88996p27457o17707l32357k74498
40343F413588n77016j114442j709790k168001k302824k154250k018669k015410
$$ plain form
40335 -7646814 -9423376 -10312243 -9888233 -8503883 -7072040 -6412662 -6876406 -8331942 -10238856
40326 -10238856 -11879706 -12867630 -13469161 -14247150 -15423991 -16795680 -18184113 -19635964
40318 -19635964 -21117248 -22321701 -22930423 -22831923 -21949475 -20119048 -17399504 -14341840 -11653153
40309 -11653153 -9619549 -8054328 -6737970 -5644624 -4737970 -3836700 -2823049 -1822278
40301 -1822278 -1051862 -608121 -501033 -769542 -1406514 -2235494 -3023128 -3718363 -4473773
40292 -4473773 -5429532 -6576727 -7838759 -9165179 -10485764 -11672409 -12659457 -13568195 -14585550
40283 -14585550 -15662399 -16390075 -16257553 -15069876 -13141322 -11128611 -9693281 -9235736
40275 -9235736 -9791749 -11077916 -12651494 -14091671 -15065624 -15274319 -14467894 -12645813 -10219975
$$ packed form
40335g646814j776562q88867M24010J384350J431843O59378m63744j455536j906914
40326a0238856j640850r87924o01531p77989j176841j371689j388433j451851
40318a9635964j481284j204453o08722R8500Q82448J830427K719544L057664K688687
40309a1653153K033604J565221J316358J093346R06654R01270J013651J000771
40301a822278P70416M43741J07088k68509o36972q28980p87634o95235p55410
40292d473773r55759j147195j262032j326420j320585j186645r87048r08738j017355
40283a4585550j076849p27676J32522J187677J928554K012711J435330M57545
40275i235736n56013j286167j573578j440177r73953k08695Q06425J822081K425838
$$ plain form
40266 -10219975 -7808551 -5726555 -3687798 -1090408 2367222 6334171 9984558 12480909
40258 12480909 13389498 12937167 12042029 11928997 13350157 15971473 18585946 20043704 19983335
40249 19983335 18716845 16673045 14202641 11792350 10048114 9252789 9110168 9104496 9007412
40240 9007412 8893297 8815202 8736200 8755188 9124117 9908670 10734942 10949467 10014106 7845851
40230 7845851 4975554 2369218 823327 361446 325064 139395 -138583 -77999 559961
40221 559961 1676118 3000563 4078443 4224846 2947901 570020 -1843574 -3376642
40213 -3376642 -3963666 -4115492 -4167237 -4048047 -3714975 -3519058 -3983600 -5263269 -6882885
40204 -6882885 -8027651 -8147550 -7361268 -6287950 -5457549 -4901730 -4348424 -3744199 -3437166
$$ packed form
40266a0219975K411424K081996K038757K597390L457630L966949L650387K496351
40258A2480909R08589m52331q95138j13032J421160K621316K614473J457758o0369
40249A9983335j266490k043800k470404k410291j744236p95325j42621n672r7084
40240I007412j14115p8095p9002J8988L68929P84553Q26272K14525r35361k168255
40230G845851k870297k606336j545891m61881l6382j85669k77978O0584O37960
40221E59961J116157J324445J077880J46403j276945k377881k413594j533068
40213c376642n87024j51826n1745J19190L33072J95917m64542j279669j619616
40204f882885j144766j19899P86282J073318Q30401N55819N53306O04225L07033
$$ plain form
40195 -3437166 -3780436 -4640355 -5422873 -5630907 -5363045 -5228832 -5774166 -7001850 -8442763
40186 -8442763 -9646291 -10535483 -11259342 -11774579 -11727593 -10851180 -9413064 -8102882 -7396704
40177 -7396704 -7112014 -6657614 -5638731 -4123691 -2421686 -795539 615212 1797398
40169 1797398 2879914 4009707 5125080 5958860 6320829 6225955 5662748 4444569 2499820
40160 2499820 181853 -1955642 -3652309 -5010304 -6131470 -6959645 -7532628 -8146061 -9112210
40151 -9112210 -10432344 -11739783 -12460036 -12056173 -10364769 -7844027 -5380668 -3706088
40143 -3706088 -2966830 -2775021 -2499416 -1532196 417869 3068676 5690790 7630781 8668315
40134 8668315 8846919 8168921 6636664 4477588 2143057 123531 -1144712 -1326614 -347188
$$ packed form
40195c437166l43270q59919p82518k08034K67862J34213n45334j227684j440913
40186h442763j203528q89192p23859n15237M6986Q76413J438116J310182P06178
40177g396704K84690M54400J018883J515040J702005J626147J410751J182186
40169A797398J082516J129793J115373Q33780L61969r4874n63207j218179j944749
40160B499820k317967k137495j696667j357995j121166q28175n72983o13433r66149
40151i112210j320134j307439p20253M03863J691404K520742K463359J674580
40143c706088P39258J91809K75605R67220J950065K650807K622114J939991J037534
40134H668315J78604o77998j532257k159076k334531k019526j268243j81902R79426
$$ plain form
40125 -347188 1518376 3847066 6338155 8800197 10964508 12467445 12991750 12337639 10454676
40116 10454676 7563137 4184748 888414 -1978935 -4226415 -5639863 -6128228 -6023803
40108 -6023803 -5970228 -6404344 -7255825 -8154396 -8759311 -8857475 -8349069 -7291994 -5899187
40099 -5899187 -4389856 -2814340 -986548 1429731 4637265 8354174 11823423 14374448
40091 14374448 15967130 17009180 17665980 17569876 16237315 13601403 10181163 7007361
40083 7007361 5368827 6181566 9286560 13514840 17628183 21063440 23692470 25247618
40075 25247618 25410980 24343154 22693661 21017074 19452678 18025551 16950619 16438283
40067 16438283 16349704 16228500 15625318 14287266 12106988 9075047 5369286 1418781 -2250278
$$ packed form
40125c47188J865564K328690K491089K462042K164311J502937N24305o54111j882963
40116A0454676k891539l378389l296334k867349k247480j413448m88365J04425
40108f023803N3575m34116q51481q98571o04915r8164N08406J057075J392807
40099e899187J509331J575516J827792K416279L207534L716909L469249K551025
40091A4374448J592682J042050O56800r6104j332561k635912l420240l173802
40083G007361j638534Q12739L104994M228280M113343L435257K629030J555148
40075B5247618J63362j067826j649493j676587j564396j427127j074932n12336
40067A6438283q8579j21204o03182j338052k180278l031941l705761l950505l669059
$$ plain form
40058 -2250278 -5306539 -7742227 -9702216 -11271409 -12529572 -13731014 -15197881 -16958153
40050 -16958153 -18660596 -19954091 -20782252 -21147072 -20762184 -19247293 -16681848 -13745054
40042 -13745054 -11237999 -9589231 -8810870 -8695078 -8911526 -9068563 -8900148 -8419248 -7798123
40033 -7798123 -7096775 -6196225 -5029459 -3801909 -2887749 -2483860 -2406659 -2239270 -1607104
40024 -1607104 -281074 1819359 4476959 7030793 8668541 9078206 8720167 8313986 8136851
40015 8136851 7930607 7329153 6127041 4201585 1497035 -1770081 -5025853 -7579488
40007 -7579488 -8964809 -9156121 -8634873 -8210709 -8503151 -9444494 -10404967 -10898901 -11055187
39998 -11055187 -11304451 -11735520 -11932217 -11445468 -10353894 -9362019 -9341632 -10661556 -12842225
$$ packed form
40058b250278l056261k435688j959989j569193j258163j201442j466867j760272
40050a6958153j702443j293495q28161l64820L84888J514891K565445K936794
40042a3745054K507055J648768P78361J15792k16448j57037J68415M80900O21125
40033g798123P01348R00550J166766J227550R14160M03889P7201J67389O32166
40024a607104J326030K100433K657600K553834J637748M09665l58039m06181j77135
40015H136851k06244o01454j202112j925456k704550l267116l255772k553635
40007g579488j385321j91312N21248M24164k92442r41343r60473m93934j56286
39998a1055187k49264m31069j96697M86749J091574R91875K0387j319924k180669
$$ plain form
39989 -12842225 -14842469 -15722863 -15124489 -13323598 -11043899 -9145691 -8148594 -7840926 -7479622
39980 -7479622 -6541486 -5236827 -4231020 -3990144 -4474290 -5266592 -5797462 -5590494 -4582561
39971 -4582561 -3211638 -1989166 -972357 186646 1712414 3452692 5148950 6671864
39963 6671864 7851461 8298196 7643820 5948365 3762402 1789939 467657 -298589 -1099527
39954 -1099527 -2590872 -4895860 -7426675 -9374495 -10333565 -10404554 -9866977 -8982609 -8055789
39945 -8055789 -7395551 -7101671 -7020537 -6959235 -6791134 -6316873 -5263121 -3598678 -1696303
39936 -1696303 26315 1513146 2878024 3895064 4040307 3166242 1870529 960654 649708
39927 649708 450889 -216551 -1502978 -3162718 -4897371 -6600971 -8391708 -10477643 -12925477
$$ packed form
39989a2842225k000244q80394N98374J800891K279699J898208R97097L07668L61304
39980g479622R38136J304659J005807K40876m84146p92302n30870K06968J007933
39971d582561J370923J222472J016809J159003J525768J740278J696258J522914
39963F671864J179597M46735o54376j695455k185963j972463j322282p66246q00938
39954a099527j491345k304988k530815j947820r59070p0989N37577Q84368R26820
39945h055789O60238K93880Q1134O1302J68101M74261J053752J664443J902375
39936a696303J722618J486831J364878J017040J45243q74065j295713r09875l10946
39927F49708j98819o67440j286427j659740j734653j703600j790737k085935k447834
$$ plain form
39918 -12925477 -15497100 -17713937 -19067016 -19168787 -17862144 -15419543 -12658081 -10607274
39910 -10607274 -9837452 -10118726 -10799634 -11438764 -11983611 -12470430 -12790141 -12784956 -12392949 -11594194
39900 -11594194 -10341001 -8701726 -7036805 -5843835 -5307277 -5049377 -4437997 -3169698
39892 -3169698 -1493560 150665 1616718 3092371 4727394 6363134 7643243 8262573
39884 8262573 8049572 6927107 4934973 2292515 -621401 -3347625 -5413403 -6448636
39876 -6448636 -6382950 -5526751 -4360160 -3211066 -2153656 -1141634 -115171 1003502 2265355
39867 2265355 3574098 4689109 5404065 5663926 5465764 4725172 3338756 1381562 -801267
39858 -801267 -2719339 -3988869 -4537735 -4606186 -4521070 -4440906 -4312218 -4023466 -3537613 -2921612
$$ packed form
39918a2925477k571623k216837j353079j01771J306643K442601K761462K050807
39910a0607274P69822k81274o80908o39130n44847m86819l19711N185L92007P98755
39900a1594194J253193J639275J664921J192970N36558K57900O11380J268299
39892c169698J676138J644225J466053J475653J635023J635740J280109O19330
39884H262573k13001j122465j992134k642458k913916k726224k065778j035233
39876f448636O5686Q56199J166591J149094J057410J012022J026463J118673J261853
39867B265355J308743J115011P14956K59861j98162p40592j386416j957194k182829
39858h01267j918072j269530n48866o8451Q5116Q0164J28688K88752M85853O16001
$$ plain form
39848 -2921612 -2368608 -2172594 -2489781 -3036030 -3195809 -2637487 -1799092 -1627194 -2811002
39839 -2811002 -5284309 -8327087 -10967636 -12377548 -12210707 -10765936 -8752647 -6791580
39831 -6791580 -5147993 -3900820 -3167693 -3023156 -3295528 -3610357 -3638159 -3230747 -2388034
39822 -2388034 -1261897 -228240 195639 -335550 -1715413 -3421912 -4817326 -5418319 -4970772
39813 -4970772 -3455244 -1195751 1046151 2320840 2099499 692490 -1059113 -2564662
39805 -2564662 -3886934 -5380544 -7112177 -8748220 -9872507 -10243911 -9830866 -8817316
39797 -8817316 -7596718 -6579813 -5928011 -5570708 -5510090 -5965420 -7126391 -8870686 -10854353
39788 -10854353 -12851014 -14899634 -17101101 -19315338 -21081724 -21869734 -21493303 -20334309
$$ packed form
39848b921612N53004J96014l17187n46249j59779N58322Q38395J71898j183808
39839b811002k473307l042778k640549j409912J66841J444771K013289J961067
39831f791580J643587J247173P33127J44537k72372l14829k7802M07412Q42713
39822b388034J126137J033657M23879n31189j379863j706499j395414o00993M47547
39813d970772J515528K259493K241902J274689k21341j407009j751603j505549
39805b564662j322272j493610j731633j636043j124287l71404M13045J013550
39797h817316J220598J016905O51802L57303O0618m55330j160971j744295j983667
39788a0854353j996661k048620k201467k214237j766386p88010L76431J158994
$$ plain form
39780 -20334309 -19102981 -18281883 -17769681 -17068993 -15789067 -13941646 -11812946 -9663602
39772 -9663602 -7601503 -5685691 -4045223 -2819477 -1985120 -1323944 -653730 -107889 -123104
39763 -123104 -1075531 -2885756 -4965350 -6569994 -7262831 -7074128 -6197566 -4548418 -1738874
39754 -1738874 2395550 7275332 11692922 14496087 15196182 14077189 11907702 9501876
39746 9501876 7304877 5267929 3193276 1189500 -387602 -1460402 -2420972 -3619542
39738 -3619542 -4862256 -5666984 -5908196 -5950743 -6206603 -6852385 -8012270 -9905335 -12594666
39729 -12594666 -15689323 -18435832 -20083442 -20160481 -18575909 -15640682 -11980829 -8297121
39721 -8297121 -5114723 -2699241 -1115356 -290637 -26995 20145 348052 1491859 3721696
$$ packed form
39780b0334309J231328Q21098N12202P00688J279926J847421K128700K149344
39772i663602K062099J915812J640468J225746Q34357O61176O70214N45841j5215
39763a23104r52427j810225k079594j604644o92837J88703Q76562J649148K809544
39754a738874M134424M879782M417590K803165P00095j118993k169487k405826
39746I501876k196999k036948k074653k003776j577102j072800r60570j198570
39738c619542j242714q04728k41212m2547k55860o45782j159885j893065k689331
39729a2594666l094657k746509j647610p7039J584572K935227L659853L683708
39721h297121L182398K415482J583885Q24719K63642M7140L27907J143807K229837
$$ plain form
39712 3721696 6745886 9784652 12081783 13419991 14155646 14795601 15579671 16410547 17032803
39703 17032803 17182722 16658323 15469280 14039513 13120061 13245414 14201656 15168086 15444699
39694 15444699 14898700 13635023 11484073 8120272 3646161 -1214528 -5576987 -8885337
39686 -8885337 -10941084 -11732243 -11457509 -10600658 -9704907 -8942652 -7944143 -6122902 -3239268
39677 -3239268 293716 3652296 6188333 7810565 8846550 9668881 10534396 11612790
39669 11612790 12885012 13977818 14336590 13710106 12378697 10856243 9500327 8461094
39661 8461094 7800829 7479071 7332180 7267554 7453188 8164944 9438508 10958697 12262966
39652 12262966 12965734 12844864 11886601 10327719 8598124 7144609 6229940 5789261 5434681
$$ packed form
39712C721696L024190L038766K297131J338208P35655O39955P84070Q30876O22256
39703A7032803J49919n24399j189043j429767r19452J25353R56242R66430K76613
39694A5444699n45999j263677k150950l363801m474111m860689m362459l308350
39686h885337k055747p91159K74734Q56851Q95751P62255R98509J821241K883634
39677c239268L532984L358580K536037J622232J035985Q22331Q65515J078394
39669A1612790J272222J092806L58772o26484j331409j522454j355916j039233
39661H461094o60265l21758j46891o4626J85634P11756J273564J520189J304269
39652A2262966P02768j20870r58263j558882j729595j453515r14669m40679l54580
$$ plain form
39643 5434681 4709746 3475097 2039493 842361 32629 -576638 -1186007 -1753368 -2085160
39634 -2085160 -2149515 -2296626 -3133893 -5041454 -7697947 -10150869 -11494496 -11519783 -10710129
39625 -10710129 -9717464 -8938009 -8469411 -8238364 -8099092 -7916125 -7612279 -7110664 -6279930
39616 -6279930 -5057969 -3641533 -2449959 -1866388 -2075200 -3136274 -5074683 -7789403
39608 -7789403 -10898356 -13752138 -15677370 -16309358 -15777925 -14564194 -13109245 -11528119
39600 -11528119 -9684054 -7474933 -5014480 -2620891 -715233 337702 421657 -276924
39592 -276924 -1446692 -2841938 -4260685 -5454695 -6207915 -6461595 -6252216 -5608385 -4671480
39583 -4671480 -3841454 -3557632 -3886446 -4482009 -4965093 -5172157 -5044081 -4536977 -3770624
$$ packed form
39643E434681p24935j234649j435604j197132q09732o09267o09369n67361l31792
39634b085160o4355j47111q37267j907561k656493k452922j343627k5287Q09654
39625a0710129R92665P79455M68598K31047J39272J82967L03846N01615Q30734
39616f279930J221961J416436J191574N83571k08812j061074j938409k714720
39608g789403l108953k853782j925232o31988N31433J213731J454949J581126
39600a1528119J844065K209121K460453K393589J905658J052935Q3955o98581
39592b76924j169768j395246j418747j194010p53220k53680K09379O43831R36905
39583d671480Q30026K83822l28814n95563m83084k07064J28076N07104P66353
$$ plain form
39574 -3770624 -3082765 -2779738 -2903687 -3271608 -3569710 -3360393 -2277347 -456779 1362110
39565 1362110 2404427 2474106 1846155 691124 -1072451 -3316763 -5378298 -6390447 -5906970
39556 -5906970 -4179522 -1950818 -49696 951383 913198 114751 -907976 -1577666 -1500885
39547 -1500885 -674086 455109 1209040 1103752 167598 -1105206 -2136143 -2677989 -2928129
39538 -2928129 -3262868 -3874549 -4660914 -5384200 -5832902 -5868889 -5499526 -4981298 -4701308 -4799327
39528 -4799327 -4956960 -4678143 -3746755 -2336093 -780666 577550 1382792 1393980 751918
39519 751918 -58557 -711797 -1450216 -2795270 -4807191 -6798357 -7946709 -8170096 -8240115
39510 -8240115 -8968832 -10402886 -11929646 -13051600 -13817384 -14506343 -15205849 -15884346 -16640928
$$ packed form
39574c770624O87859L03027j23949l67921k98102K09317J083046J820568J818889
39565A362110J042317O9679o27951j155031j763575k244312k061535j012149M83477
39556e906970J727448K228704J901122J001079l8185p98447j022727o69690P6781
39547a500885Q26799J129195P53931j05288r36154j272804j030937n41846k50140
39538b928129l34739o11681p86365p23286m48702l5987L69363N18228K79990r8019
39528d799327j57633K78817R31388J410662J555427J358216Q05242J1188o42062
39519G51918q10475o53240p38419j345054k011921j991166j148352k23387p0019
39510h240115p28717j434054j526760j121954p65784o88959o99506o78497p56582
$$ plain form
39501 -16640928 -17548146 -18293747 -18297779 -17289638 -15572984 -13618565 -11569672 -9285782 -6727921
39492 -6727921 -4107568 -1722043 150274 1180852 1040554 -296510 -2322011 -4206542
39484 -4206542 -5353524 -5789613 -6030436 -6574344 -7511130 -8566240 -9447775 -10103531 -10652414
39475 -10652414 -11116435 -11283950 -10896870 -9980668 -8896658 -7953715 -6992358 -5497222 -3154246
39466 -3154246 -146434 3160168 6593323 10010649 12922092 14667743 15077456 14691930
39458 14691930 14162663 13607672 12727255 11382675 9791515 8197989 6631484 5098588
39450 5098588 3847329 3276128 3587201 4589028 5839426 6976725 7951088 8960116 10131964
39441 10131964 11239865 11739225 11132868 9361452 6882209 4356316 2204039 431092
$$ packed form
39501a6640928r07218p45601m032J008141J716654J954419K048893K283890K557861
39492f727921K620353K385525J872317J030578j40298j337064k025501j884531
39484d206542j146982m36089k40823n43908r36786j055110q81535o55756n48883
39475a0652414m64021j67515L87080R16202J084010R42943R61357J495136K342976
39466c154246L007812L306602L433155L417326K911443J745651M09713l85526
39458A4691930n29267n54991q80417j344580j591160j593526j566505j532896
39450E098588j251259n71201L11073J001827J250398J137299R74363J009028J171848
39441A0131964J107901M99360o06357j771416k479243k525893k152277j772947
$$ plain form
39433 431092 -1122072 -2432256 -3289576 -3581181 -3353037 -2496801 -615700 2510395 6395782
39424 6395782 10099175 13093119 15664731 18331848 21042598 23100821 23729289 22539910
39416 22539910 19630572 15551948 11204551 7484807 4839435 3200270 2355503 2235815
39408 2235815 2779147 3696842 4579345 5234009 5791964 6405673 6839200 6400977 4408639
39399 4408639 883158 -3193496 -6452063 -8073173 -8149440 -7212640 -5692291 -4002136 -2880460
39390 -2880460 -3154536 -4960520 -7338998 -8756397 -8063883 -5091407 -628082 3991586
39382 3991586 7487864 9233753 9494917 9052585 8484321 7772223 6608564 5029738 3633787
39373 3633787 3082272 3418610 3995364 4103009 3549926 2566242 1335238 -122297 -1640150
$$ packed form
39433D31092j553164j310184q57320k91605K28144Q56236J881101L126095L885387
39424F395782L703393K993944K571612K667117K710750K058223O28468j189379
39416B2539910k909338m078624m347397l719744k645372j639165q44767j19688
39408B235815N43332R17695Q82503O54664N57955O13709M33527m38223j992338
39399D408639l525481m076654l258567j621110p6267R36800J520349J690155J121676
39390b880460k74076j805984k378478j417399O92514K972476M463325M619668
39382C991586L496278J745889K61164m42332n68264p12098j163659j578826j395951
39373C633787n51515L36338N76754J07645n53083r83684j231004j457535j517853
$$ plain form
39364 -1640150 -2778441 -3143570 -2689028 -1588553 36843 2089830 4275190 6103036
39356 6103036 7146980 7224125 6372247 4812156 2967060 1359876 322440 -231874 -697696
39347 -697696 -1391451 -2254737 -2946044 -3218661 -3145559 -2913552 -2463129 -1484781 192295 2328691
39337 2328691 4443432 6131305 7143718 7325422 6682731 5495258 4207280 3181965
39329 3181965 2617582 2613871 3135158 3898745 4473772 4581992 4244464 3645045 2997166 2592123
39319 2592123 2795025 3781676 5256549 6543169 7052259 6727063 6087664 5848393 6425902
39310 6425902 7727363 9330339 10795853 11828471 12316665 12426228 12647011 13523804 15157666
39301 15157666 16982397 18128222 18065993 16948243 15390477 13931225 12634058 11154799
$$ packed form
39364a640150j138291l65129M54542J100475J625396K052987K185360J827846
39356F103036J043944P7145q51878j560091j845096j607184j037436n54314m65822
39347f97696o93755q63286o91307k72617P3102K32007M50423R78348J677076K136396
39337B328691K114741J687873J012413J81704o42691j187473j287978j025315
39329C181965n64383l711N21287P63587N75027J08220l37528n99419o47879m05043
39319B592123K02902R86651J474873J286620N09090l25196o39399k39271N77509
39310F425902J301461J602976J465514J032618M88194J09563K20783Q76793J633862
39301A5157666J824731J145825o2229j117750j557766j459252j297167j479259
$$ plain form
39293 11154799 9194523 6889298 4756525 3311333 2784279 3124996 4090890 5255750
39285 5255750 6057804 6021759 5042497 3502515 2105984 1483996 1814144 2795312 4036396
39276 4036396 5410497 6936120 8436340 9590345 10351308 11023461 11757053 12183080 11800151
39267 11800151 10640067 9338619 8572400 8558005 9005649 9341554 9017031 7881521 6377327
39258 6377327 5240434 4933159 5441126 6569883 8171877 9951964 11295511 11629260 11006576
39249 11006576 10154197 9839077 10257412 11091458 12052065 13202476 14735568 16603513 18535321
39240 18535321 20378795 22219256 24069639 25614073 26466349 26640591 26557410 26530953 26406603
39231 26406603 25794664 24545412 22889909 21213357 19840440 18998367 18790148 19086975 19507156
$$ packed form
39293A1154799j960276k305225k132773j445192n27054L40717R65894J164860
39285E255750Q02054l6045r79262j539982j396531o21988L30148R81168J241084
39276D036396J374101J525623J500220J154005P60963O72153P33592M26027l82929
39267A1800151j160084j301448p66219j4395M47644L35905l24523j135510j504194
39258F377327j136893l07275N07967J128757J601994J780087J343547L33749o22684
39249A1006576q52379l15120M18335Q34046R60607J150411J533092J867945J931808
39240A8535321J843474J840461J850383J544434Q52276J74242q3181k6457j24350
39231B6406603o11939j249252j655503j676552j372917q42073k08219K96827M20181
$$ plain form
39222 19507156 19621347 19239413 18494076 17632574 16743658 15723583 14507840 13274207 12369147
39213 12369147 12070516 12470508 13525466 15086327 16850358 18373761 19183210 18862282 17129126
39204 17129126 14068660 10393549 7275870 5644066 5575633 6437115 7570100 8750937
39196 8750937 10089823 11720092 13628057 15588903 17167988 17951437 17949738 17711751 17893251
39187 17893251 18721671 19962580 21322406 22679084 23874520 24467569 23883456 21850088
39179 21850088 18684061 15206177 12400820 11008732 11188875 12414366 13762736 14521298
39171 14521298 14690705 14936193 15976507 17943172 20291327 22278526 23457850 23722453
39163 23722453 23048266 21406780 18970619 16256583 13921088 12394118 11723707 11704065 12067155
$$ packed form
39222A9507156J14191l81934p45337q61502q88916j020075j215743j233633r05060
39213A2369147k98631L99992J054958J560861J764031J523403Q09449l20928j733156
39204A7129126l060466l675111l117679j631804o8433Q61482J132985J180837
39196H750937J338886J630269J907965J960846J579085P83449j699k37987J81500
39187A7893251Q28420J240909J359826J356678J195436N93049n84113k033368
39179B1850088l166027l477884k805357j392088J80143J225491J348370P58562
39171A4521298J69407K45488J040314J966665K348155J987199J179324K64603
39163B3722453o74187j641486k436161k714036k335495j526970o70411j9642L63090
$$ plain form
39154 12067155 12590483 13156890 13757570 14327893 14487495 13546526 11001029 7145163 3111407
39145 3111407 166432 -1080776 -805157 535750 2628174 5229308 7906521 10073776
39137 10073776 11324140 11690374 11609030 11632351 12037273 12586728 12746301 12276070 11556286
39128 11556286 11168267 11192887 11122643 10456564 9125957 7275616 4964833 2372291 103507
39119 103507 -1116922 -1170257 -781584 -945527 -2170355 -4219014 -6383924 -7966769 -8677945
39110 -8677945 -8713496 -8403312 -7757186 -6454927 -4321288 -1683917 816551 2647340 3503410
39101 3503410 3154779 1450517 -1422537 -4792960 -7730662 -9466904 -9699913 -8702722 -7273653
39092 -7273653 -6460541 -7010606 -8832736 -10986339 -12344183 -12379227 -11350175 -9813608 -8088747
$$ packed form
39154A2067155N23328N66407O00680N70323J59602r40969k545497l855866m033756
39145C111407k944975j247208K75619J340907K092424K601134K677213K167255
39137A0073776J250364L66234q1344K3321M04922N49455J59573m70231p19784
39128A1556286l88019K4620p0244o66079j330607j850341k310783k592542k268784
39119A03507j220429n3335L88673j63943j224828k048659k164910j582845p11176
39110h677945l5551L10184O46126J302259K133639K637371K500468J830789Q56070
39101C503410l48631j704262k873054l370423k937702j736242k33009R97191J429069
39092g273653Q13112n50065j822130k153603j357844l5044J029052J536567J724861
$$ plain form
39083 -8088747 -6187960 -4068984 -1793155 513786 2741275 4840954 6830987 8683562
39075 8683562 10172814 10990031 11149942 11143024 11456930 12003764 12250422 11885300 11097286 10189890
39065 10189890 9239339 8263589 7443416 6939850 6659984 6423355 6220627 6047959 5554146
39056 5554146 4154024 1615689 -1563036 -4425543 -6201040 -6774477 -6655711 -6492369 -6543506
39047 -6543506 -6629920 -6575060 -6509322 -6579427 -6476677 -5515569 -3261973 -4033 3381747 5935322
39037 5935322 7071111 6801059 5655272 4307220 3157564 2229560 1395118 599973 -135412
39028 -135412 -829178 -1563462 -2362574 -3019781 -3090664 -2235102 -708105 575606 671148 -615355
39018 -615355 -2577888 -4170823 -4655282 -3836436 -1927020 709816 3736142 6803785 9407523
$$ packed form
39083h088747J900787K118976K275829K306941K227489K099679J990033J852575
39075H683562J489252Q17217J59911o918L13906N46834K46658l65122p88014r07396
39065A0189890r50551r75750q20173n03566k79866k36629k02728j72668m93813
39056E554146j400122k538335l178725k862507j775497n73437J18766J63342n1137
39047f543506q6414N4860O5738p0105J02750R61108K253596L257940L385780K553575
39037E935322J135789k70052j145787j348052j149656r28004q34442p95145p35385
39028a35412o93766p34284p99112o57207p0883Q55562J526997J283711R5542j286503
39018f15355j962533j592935m84459Q18846J909416K636836L026326L067643K603738
$$ plain form
39009 9407523 10983797 11344245 10920837 10378948 10032730 9812253 9672624 9688919 9755533 9618226
38999 9618226 9417530 9890189 11694283 14616725 17667926 19907118 21025214 21233609 20850623
38990 20850623 20060714 18927257 17515467 15956773 14351222 12629293 10635614 8409288
38982 8409288 6279819 4614176 3559597 3093494 3198713 3879345 5088470 6717093 8540397
38973 8540397 10106503 10883817 10732562 10119058 9628460 9304250 8681481 7464466 5959262
38964 5959262 4775607 4235341 4117642 3888160 3166336 2066610 1089301 604611 493492
38955 493492 413001 346835 692845 1784652 3489243 5308147 6725285 7434302 7428807 7008052
38945 7008052 6611557 6554251 6942510 7804809 9136752 10768932 12353315 13587556 14354366
$$ packed form
39009I407523J576274L60448m23408n41889l46218k20477j39629J6295O6614j37307
38999I618226k00696M72659J804094K922442L051201K239192J118096K08395l82986
38990B0850623p89909j133457j411790j558694j605551j721929j993679k226326
38982H409288k129469j665643j054579m66103J05219O80632J209125J628623J823304
38973H540397J566106P77314j51255o13504m90598l24210o22769j217015j505204
38964E959262j183655n40266j17699k29482p21824j099726r77309m84690j11119
38955D93492q0491o6166L46010J091807J704591J818904J417138P09017n495m20755
38945G008052l96495n7306L88259Q62299J331943J632180J584383J234241P66810
$$ plain form
38936 14354366 14572988 14055020 12645403 10442479 7782385 5057470 2586200 511626
38928 511626 -1315992 -3259937 -5512577 -7769180 -9363653 -9715970 -8632216 -6322891
38920 -6322891 -3300920 -178302 2669563 5283810 7834478 10151451 11713103 12157939
38912 12157939 11673481 10834485 10218948 10256776 11222825 13084153 15338175 17200483 18071422
38903 18071422 17807618 16581205 14614009 12113938 9385262 6898893 5225240 4841281
38895 4841281 5846899 7754232 9643267 10738925 10957006 10864762 11099391 11884540 13078076
38886 13078076 14471224 15855960 16903738 17257522 16852170 16012704 15145617 14433866 13905253
38877 13905253 13637529 13691716 13896419 13933854 13728699 13621432 14054301 15150734 16680417
$$ packed form
38936A4354366K18622n17968j409617k202924k660094k724915k471270k074574
38928E11626j827618j943945k252640k256603j594473l52317J083754K309325
38920f322891L021971L122618K847865K614247K550668K316973J561652M44836
38912A2157939m84458q38996o15537L7828R66049J861328K254022J862308Q70939
38903A8071422k63804j226413j967196k500071k728676k486369j673653l83959
38895D841281J005618J907333J889035J095658K18081r2244K34629P85149J193536
38886A3078076J393148J384736J047778L53784m05352q39466q67087p11751n28613
38877A3905253k67724N4187K04703L7435k05155j07267M32869J096433J529683
$$ plain form
38868 16680417 18374125 20155899 22046838 23914996 25400646 26147722 26142482 25796669 25627411
38859 25627411 25829635 26191788 26419351 26471400 26572022 26987660 27853264 29146117 30742613
38850 30742613 32515341 34416895 36441919 38493316 40371641 41953909 43276489 44320954
38842 44320954 44821501 44528065 43731190 43352603 44339213 46936996 50561044 54306842 57547982
38833 57547982 60137057 62218605 64015139 65852913 68276592 71885541 76914413 83115637
38825 83115637 90252378 98604509 108700081 120552686 133517424 147068623 161426870
38818 161426870 177121494 194086930 211497895 228413579 244206316 258216288 269206495
38811 269206495 275391323 275100964 267596902 253544626 234860135 213976263 192976496
$$ packed form
38868A6680417J693708J781774J890939J868158J485650P47076n240l45813j69258
38859B5627411K02224L62153K27563N2049J00622M15638Q65604J292853J596496
38850C0742613J772728J901554K025024K051397J878325J582268J322580J044465
38842D4320954N00547k93436p96875l78587R86610K597783L624048L745798L241140
38833E7547982K589075K081548J796534J837774K423679L608949N028872O201224
38825H3115637P136741Q352131J0095572J1852605J2964738J3551199J4358247
38818A61426870J5694624J6965436J7410965J6915684J5792737J4009972J0990207
38811B69206495O184828k90359p504062j4052276j8684491k0883872k0999767
$$ plain form
38804 192976496 173111484 154807847 137943286 122230117 107603245 94338246 82753072
38797 82753072 72877516 64552177 57736836 52450254 48413604 45044191 41897988 38909777
38789 38909777 36145778 33597640 31351096 29681116 28765644 28511721 28861613 30008887
38781 30008887 31973207 34116221 35474037 35582250 34709520 33342213 31810730 30460225
38773 30460225 29749757 29878937 30496860 31038257 31302276 31572560 32247265 33462595 34978264
38764 34978264 36292976 36968239 37042790 37130899 37925206 39494934 41142532 42053590 42122377
38755 42122377 42155062 43314300 46405000 51632352 58827777 67638055 77432100 87296200
38747 87296200 96500546 105109454 114003376 124179516 136051399 149426561 164004775
$$ packed form
38804A92976496j9865012j8303637j6864561j5713169j4626872j3264999j1585174
38797H2753072r875556q325339o815341n286582m036650l369413l146203k988211
38789C8909777k763999k548138k246544j669980r15472k53923L49892J147274
38781C0008887J964320K143014J357816J08213q72730j367307j531483j350505
38773C0460225p10468J29180O17923N41397K64019K70284O74705J215330J515669
38764C4978264J314712O75263P4551Q8109P94307J569728J647598R11058O8787
38755D2122377L2685J159238L090700N227352P195425Q810278R794045R864100
38747H7296200R204346Q608908Q893922J0176140J1871883J3375162J4578214
$$ plain form
38740 164004775 179721231 196583957 214238763 231673343 247266536 259144561 265674987
38733 265674987 265903756 259802177 248271607 232891499 215451797 197438786 179726665
38726 179726665 162627676 146230321 130770285 116740172 104625813 94512464 85992684
38719 85992684 78504542 71723693 65602697 60148960 55320681 51112806 47578548 44718030
38711 44718030 42456645 40770859 39713745 39243947 39129135 39113748 39122619 39219057 39420336
38702 39420336 39652772 39864197 40088649 40385134 40751536 41084277 41182769 40823627 39896124
38693 39896124 38460485 36620569 34355650 31578005 28424451 25438188 23324933 22412940
38685 22412940 22333908 22292114 21689737 20486161 18986079 17408115 15745482 13937217 11977299
$$ packed form
38740A64004775J5716456J6862726J7654806J7434580J5593193J1878025O530426
38733B65674987K28769o101579j1530570j5380108j7439702j8013011j7712121
38726A79726665j7098989j6397355j5460036j4030113j2114359j0113349q519780
38719H5992684p488142o780849o120996n453737m828279m207875l534258k860518
38711D4718030k261385j685786j057114m69798j14812j5387Q871R6438K01279
38702C9420336K32436K11425K24452K96485L66402L32741R8492l59142r27503
38693C9896124j435639j839916k264919k777645l153554k986263k113255r11993
38685B2412940p9032m1794o02377j203576j500082j577964j662633j808265j959918
$$ plain form
38676 11977299 9819622 7325573 4426128 1328215 -1461167 -3309899 -3748083 -2772303
38668 -2772303 -971350 708292 1416981 714844 -1349438 -4185923 -6675243 -7607030 -6488805
38659 -6488805 -3949567 -1178993 1053766 2773346 4350093 5939190 7365712 8310574
38651 8310574 8488080 7803548 6491072 5025765 3792647 2896609 2358082 2350524 3046396
38642 3046396 4270851 5540836 6549061 7491063 8820624 10759440 13107343 15402261
38634 15402261 17119203 17827646 17453164 16511847 15919206 16356785 17777685 19534707 20904108
38625 20904108 21443264 21024203 19791067 18143547 16593477 15501505 14959174 14924612 15378758
38616 15378758 16292539 17505633 18709113 19533595 19640048 18797598 16975528 14407534 11567025
$$ packed form
38676A1977299k157677k494049k899445l097913k789382j848732m38184R75780
38668b772303J800953J679642P08689p02137k064282k836485k489320r31787J118225
38659f488805K539238K770574K232759J719580J576747J589097J426522R44862
38651H310574J77506o84532j312476j465307j233118q96038n38527p558O95872
38642C046396J224455J269985J008225R42002J329561J938816K347903K294918
38634A5402261J716942P08443l74482r41317n92641M37579J420900J757022J369401
38625B0904108N39156m19061j233136j647520j550070j091972n42331l4562M54146
38616A5378758R13781J213094J203480Q24482J06453q42450j822070k567994k840509
$$ plain form
38607 11567025 9046433 7356323 6690334 6802106 7153709 7289203 7164213 7186660 7936521
38598 7936521 9734865 12367393 15244105 17926015 20501248 23372183 26696334 30145325
38590 30145325 33195833 35491947 36876507 37271381 36737345 35617169 34437533 33570926
38582 33570926 32996855 32386015 31397074 29932406 28197202 26586139 25534715 25408402 26351303
38573 26351303 28071397 29805002 30700401 30391653 29206195 27818216 26764325 26261403
38565 26261403 26289663 26669329 27063207 27020681 26124666 24210941 21558207 18850176 16806217
38556 16806217 15751038 15550963 15929462 16738698 17945301 19512623 21334378 23137387
38548 23137387 24416649 24664083 23793995 22257424 20713438 19752249 19919874 21603129 24560182
$$ packed form
38607A1567025k520592j690110o65989J11772L51603J35494j24990K2447P49861
38598G936521J798344K632528K876712K681910K575233K870935L324151L448991
38590C0145325L050508K296114J384560L94874n34036j120176j179636q66607
38582C3570926n74071o10840r88941j464668j735204j611063j051424j26313R42901
38573B6351303J720094J733605Q95399l08748j185458j387979j053891n02922
38565B6261403K8260L79666L93878m2526q96015j913725k652734k708031k043959
38556A6806217j055179k00075L78499Q09236J206603J567322J821755J803009
38548B3137387J279262K47434q70088j536571j543986r61189J67625J683255K957053
$$ plain form
38539 24560182 27753661 30008117 30826653 30381126 28880956 26361742 23113193 19887778
38531 19887778 17404562 15770505 14546937 13312925 12090565 11335876 11629455 13299251
38523 13299251 16182056 19651729 22848759 24963089 25555424 24883984 23926213 23825076 25093643
38514 25093643 27312030 29594124 31338196 32611066 33948315 35807521 38134132 40435992
38506 40435992 42297685 43749053 45075423 46416584 47731451 49039102 50410558 51709469
38498 51709469 52589841 52815342 52385337 51320651 49599453 47422433 45259739 43383292
38490 43383292 41510294 39182204 36448311 33946365 32309428 31698374 31955620 32988489
38482 32988489 34789847 37115840 39339129 40762541 41071844 40420374 39122306 37431346
$$ packed form
38539B4560182L193479K254456Q18536m45527j500170k519214l248549l225415
38531A9887778k483216j634057j223568j234012j222360p54689K93579J669796
38523A3299251K882805L469673L197030K114330N92335o71440r57771j01137J268567
38514B5093643K218387K282094J744072J272870J337249J859206K326611K301860
38506D0435992J861693J451368J326370J341161J314867J307651J371456J298911
38498E1709469Q80372K25501m30005j064686j721198k177020k162694j876447
38490D3383292j872998k328090k733893k501946j636937o11054K57246J032869
38482C2988489J801358K325993K223289J423412L09303o51470j298068j690960
$$ plain form
38474 37431346 35674993 34413053 34252915 35534559 38287899 42347095 47282976 52364698
38466 52364698 56998129 61308899 65999471 71509241 77620176 84078880 91249295 99695374
38458 99695374 109194326 118598799 126846066 133919420 140729972 148255643 156960432 166903994
38450 166903994 178104281 190652191 204622444 220123778 237497691 257268742 279703758
38443 279703758 304481334 330956863 358673051 387349805 416337549 444328972 469722102
38436 469722102 491081540 507157846 516736414 518778857 512708045 498466110 476459303
38429 476459303 447678247 413806973 376954962 339159652 302116696 267191151 235401707
38422 235401707 207318874 183097105 162650509 145743211 131947005 120641046 111118160
$$ packed form
38474C7431346j756353j261940j60138J281644K753340M059196M935881N081722
38466E2364698M633431M310770M690572N509770O110935O458704P170415Q446079
38458I9695374R498952R404473Q247267P073354O810552P525671Q704789R943562
38450A66903994J1200287J2547910J3970253J5501334J7373913J9771051K2435016
38443B79703758K4777576K6475529K7716188K8676754K8987744K7991423K5393130
38436D69722102K1359438J6076306R578568K042443o070812j4241935k2006807
38429D76459303k8781056l3871274l6852011l7795310l7042956l4925545l1789444
38422B35401707k8082833k4221769k0446596j6907298j3796206j1305959r522886
$$ plain form
38415 111118160 102718444 94969064 87695734 80942425 74688110 68700437 62770301 57032448
38407 57032448 51934308 47909449 45136222 43492804 42579230 41849128 40933934 39890989
38399 39890989 39037981 38555345 38345900 38215536 38006641 37555501 36713106 35485813 34040934
38390 34040934 32523440 30972337 29457443 28172035 27286272 26750218 26319324 25811407 25382942
38381 25382942 25562506 26882358 29309286 32056852 34125523 35088080 35269527 35183455 34970760
38372 34970760 34465071 33651331 32881472 32633042 33134432 34238560 35616342 37042841 38509907
38363 38509907 40134572 42053307 44388871 47152093 50061467 52568266 54216599 54935576
38355 54935576 54852868 53903563 51844336 48694095 45010409 41675087 39480063 38866664 39851790
$$ packed form
38415A11118160q399716p749380p273330o753309o254315n987673n930136n737853
38407E7032448n098140m024859k773227j643418r13574p30102r15194j042945
38399C9890989q53008m82636k09445j30364k08895m51140q42395j227293j444879
38390C4040934j517494j551103j514894j285408q85763n36054m30894n07917m28465
38381B5382942J79564J319852K426928K747566K068671R62557J81447q6072k12695
38372C4970760n05689q13740p69859k48430N01390J104128J377782J426499J467066
38363C8509907J624665J918735K335564K763222K909374K506799J648333P18977
38355E4935576q2708r49305k059227l150241l683686l335322k195024o13399R85126
$$ plain form
38346 39851790 42105899 45198014 48823025 52734381 56497396 59492870 61242758 61650865
38338 61650865 60940530 59532286 58009112 56946915 56556469 56535357 56376801 55784500 54764899
38329 54764899 53470859 52077523 50685846 49177861 47240849 44734828 42052028 39940930
38321 39940930 38858341 38512791 38074280 36816740 34569532 31636426 28423383 25262266
38313 25262266 22541746 20735853 20045817 20071131 20109405 19862109 19639923 19779423 20102892
38304 20102892 20181884 19981319 19945058 20442161 21354897 22258347 22812673 22887951 22461692 21558717
38294 21558717 20269296 18730057 17066855 15369157 13688329 12031634 10385528 8775059
38286 8775059 7280608 5979596 4912926 4145955 3804499 3938627 4330804 4559027 4371731
$$ packed form
38346C9851790K254109L092115L625011L911356L763015K995474J749888M08107
38338F1650865p10335j408244j523174j062197l90446k1112j58556n92301j019601
38329E4764899j294040j393336j391677j507985j937012k506021k682800k111098
38321C9940930j082589l45550m38511j257540k247208k933106l213043l161117
38313B5262266k720520j805893o90036K5314L8274k47296k22186J39500L23469
38304B0102892P8992k00565l6261M97103R12736R03450N54326P5278m26259r02975
38294B1558717j289421j539239j663202j697698j680828j656695j646106j610469
38286H775059j494451j301012j066670p66971l41456J34128L92177K28223j87296
$$ plain form
38277 4371731 3982755 3906828 4510187 5790568 7521942 9408806 11081693 12235140 12999554
38268 12999554 14000905 15733564 17880942 19504935 19929505 19208237 17697137 15471654
38260 15471654 12359328 8389721 4030732 25036 -2990465 -4898157 -6228696 -7650088
38252 -7650088 -9146838 -9910912 -9290301 -7667888 -6074981 -5032256 -4146979 -2846980 -1075367
38243 -1075367 918328 3092841 5555717 8156449 10509672 12428861 14053478 15482954
38235 15482954 16543765 17086105 17344822 17777912 18569203 19446764 19978142 19880131 19039230
38226 19039230 17487995 15563315 13966781 13414606 14175270 16054791 18785013 22199652
38218 22199652 25952017 29273511 31262636 31491358 30338470 28778362 27805395 27860042 28635162
$$ packed form
38277D371731l88976p5927O03359J280381J731374J886864J672887J153447P64414
38268A2999554J001351J732659K147378J623993M24570p21268j511100k225483
38260A5471654l112326l969607m358989m005696l015501j907692j330539j421392
38252g650088j496750p64074O20611J622413J592907J042725Q85277J299999J771613
38243a075367J993695K174513K462876K600732K353223J919189J624617J429476
38235A5482954J060811N42340K58717M33090P91291Q77561N31378r8011q40901
38226A9039230j551235j924680j596534n52175P60664J879521K730222L414639
38218B2199652L752365L321494J989125K28722j152888j560108r72967N4647P75120
$$ plain form
38209 28635162 29437289 29782080 29623054 29081609 28212531 27176868 26420700 26349063 26790128
38200 26790128 26991001 26223374 24293694 21471421 18130512 14604873 11286631 8654422
38192 8654422 7084704 6608979 6866914 7347881 7746336 8109820 8653832 9490194 10576529
38183 10576529 11852737 13303815 14892947 16552442 18295134 20270864 22662082 25548742
38175 25548742 28876734 32477396 36054262 39209151 41624116 43326402 44772543 46570773
38167 46570773 49004459 51778795 54236481 55805006 56238255 55565042 54024617 52100734
38159 52100734 50411017 49358144 48907336 48799240 48919902 49334951 50003187 50633444 50897953
38150 50897953 50714961 50275458 49850168 49637479 49788276 50470662 51730998 53179587 53951360
$$ packed form
38209B8635162Q02127L44791j59026n41445q69078j035663p56168p1637M41065
38200B6790128K00873p67627j929680k822273l340909l525639l318242k632209
38192H654422j569718m75725K57935M80967L98455L63484N44012Q36362J086335
38183A0576529J276208J451078J589132J659495J742692J975730K391218K886660
38175B5548742L327992L600662L576866L154889K414965J702286J446141J798230
38167D6570773K433686K774336K457686J568525M33249o73213j540425j923883
38159E2100734j689717j052873m50808j08096J20662M15049O68236O30257K64509
38150E0897953j82992m39503m25290k12689J50797O82386J260336J448589P71773
$$ plain form
38141 53951360 53285957 51275565 48871956 47034177 46023115 45628891 45784562 46578708 47759285
38132 47759285 48644115 48658736 47762674 46321822 44834429 43857264 43851532 44775880 45900140
38123 45900140 46242218 45251849 43096816 40444707 38052659 36377647 35335888 34416407
38115 34416407 33130969 31381597 29425021 27619766 26248904 25372776 24653547 23450197
38107 23450197 21362362 18735711 16494323 15427876 15671462 16759167 17981215 18729839
38099 18729839 18803421 18576021 18755559 19756067 21244004 22370526 22492971 21653581 20357839
38090 20357839 18959310 17354328 15273988 12721199 9961005 7129451 4069728 640181
38082 640181 -2980170 -6426401 -9454580 -11929701 -13590545 -14075689 -13257449 -11424640 -9080225
$$ packed form
38141E3951360o65403k010392k403609j837779j011062l94224J55671P94146J180577
38132D7759285Q84830J4621q96062j440852j487393r77165n732R24348J124260
38123D5900140L42078r90369k155033k652109k392048j675012j041759r19481
38115C4416407j285438j749372j956576j805255j370862q76128p19229j203350
38107B3450197k087835k626651k241388j066447K43586J087705J222048P48624
38099A8729839P3582k27400J79538J000508J487937J126522J22445q39390j295742
38090B0357839j398529j604982k080340k552789k760194k831554l059723l429547
38082F40181l620351l446231l028179k475121j660844m85144Q18240J832809K344415
$$ plain form
38073 -9080225 -6643937 -4377904 -2497244 -1265123 -951151 -1621624 -2900741 -4047624
38065 -4047624 -4476149 -4229729 -3818658 -3615598 -3599326 -3677783 -3961325 -4553657 -5275890 -5793581
38055 -5793581 -5894232 -5503464 -4621291 -3471328 -2540205 -2132867 -1929324 -1296592 -64819
38046 -64819 1286466 2243194 2735956 2907253 2752841 2247819 1589956 1010645 456521 -279013
38036 -279013 -1189460 -2088175 -2982389 -4155882 -5816282 -7803788 -9648021 -10766691 -10661436
38027 -10661436 -9174179 -6636947 -3620759 -494120 2639761 5618615 8145859 10187581
38019 10187581 12212913 14786244 17957764 21165554 23647392 24845597 24566397 23001973
38011 23001973 20633324 17961556 15242345 12471683 9591554 6705454 4199352 2692357
$$ packed form
38073i080225K436288K266033J880660J232121L13972o70473j279117j146883
38065d047624m28525K46420M11071K03060J6272p8457k83542n92332p22233n17691
38055e793581j00651L90768Q82173J149963R31123M07338K03543O32732J231773
38046f4819J351285R56728M92762J71297j54412n05022o57863n79311n54124p35534
38036b79013r10447q98715q94214j173493j660400j987506j844233j118670J05255
38027a0661436J487257K537232L016188L126639L133881K978854K527244K041722
38019A0187581K025332K573331L171520L207790K481838J198205k79200j564424
38011B3001973k368649k671768k719211k770662k880129k886100k506102j506995
$$ plain form
38003 2692357 2682097 4025023 5804170 6901406 6769898 5620131 3957229 2135183 376225
37994 376225 -998037 -1571681 -1117891 165077 1748844 3156295 4278461 5309201 6402686
37985 6402686 7483082 8388227 9061536 9532293 9825616 9986695 10087657 10105982 9907182
37976 9907182 9473058 9030086 8788663 8654543 8383241 7923170 7360053 6548324 5054434
37967 5054434 2543862 -895662 -4786982 -8460772 -11313205 -13177553 -14495476 -15854206
37959 -15854206 -17244787 -17979324 -17421766 -15591250 -12990931 -10154875 -7548098 -5608235
37951 -5608235 -4515390 -3967290 -3400100 -2391978 -737228 1671900 4712258 7806434
37943 7806434 10128440 11154709 10941757 9930292 8667037 7670203 7258397 7333109 7441070
$$ packed form
38003B692357j0260J342926J779147J097236j31508j149767j662902j822046j758958
37994C76225j374262n73644M53790J282968J583767J407451J122166J030740J093485
37985F402686J080396R05145O73309M70757K93323J61079J00962J8325j98800
37976I907182m34124m42972k41423j34120k71302m60071n63117q11729j493890
37967E054434k510572l439524l891320l673790k852433j864348j317923j358730
37959a5854206j390581p34537N57558J830516K600319K836056K606777J939863
37951e608235J092845N48100N67190J008122J654750K409128L040358L094176
37943G806434K322006J026269k12952j011465j263255r96834m11806P4712J07961
$$ plain form
37934 7441070 7188420 6590950 6024384 5918130 6486817 7592689 8767097 9473002 9499277
37925 9499277 9110370 8736641 8498287 8068120 7022444 5327763 3487010 2203958 1880485
37916 1880485 2404447 3373149 4467047 5608327 6832839 8080475 9129638 9759591 10021562
37907 10021562 10310227 11016722 12033727 12732318 12590968 11808790 11136319 11085655 11463149
37898 11463149 11756957 11852015 12189434 13206420 14740233 16082222 16613377 16340066 15830232
37889 15830232 15735121 16425963 17944615 20034565 22091404 23213072 22526933 19638081 14899359
37880 14899359 9365138 4433125 1254110 198850 799583 2230147 3847355 5328170
37872 5328170 6489444 7168173 7269879 6837954 6095897 5478499 5510724 6449539 7986530
$$ packed form
37934G441070k52650n97470n66566j06254N68687J105872J174408P05905K6275
37925I499277l88907l73729k38354m30167j045676j694681j840753j283052l23473
37916A880485N23962R68702J093898J141280J224512J247636J049163O29953K61971
37907A0021562K88665P06495J017005O98591j41350p82178o72471n0664L77494
37898A1463149K93808R5058L37419J016986J533813J341989N31155k73311n09834
37889A5830232r5111O90842J518652K089950K056839J121668o86139k888852m738722
37880A4899359n534221m932013l179015j055260O00733J430564J617208J480815
37872E328170J161274O78729J01706m31925p42057o17398L2225R38815J536991
$$ plain form
37863 7986530 9399522 10059928 9804144 8901253 7778356 6736109 5765147 4585482 2965260
37854 2965260 1056690 -641531 -1684935 -2004040 -1840863 -1456553 -915732 -61214 1357140
37845 1357140 3475418 6175067 9135551 12002539 14484337 16368811 17592062 18314400
37837 18314400 18809314 19196141 19311914 18870268 17730886 16073671 14426471 13492760 13737189
37828 13737189 14983760 16475021 17432820 17568398 17064162 16211236 15196212 14139814 13101140
37819 13101140 11943033 10322222 7994316 5184363 2573969 807540 -28136 -386726
37811 -386726 -698446 -893033 -557262 504528 2013954 3514065 4746127 5658621 6212080
37802 6212080 6375458 6304192 6371748 6947418 8147898 9774881 11437313 12745684 13445497
$$ packed form
37863G986530J412992O60406k55784r02891j122897j042247r70962j179665j620222
37854B965260j908570j698221j043404l19105J63177L84310N40821Q54518J418354
37845A357140K118278K699649K960484K866988K481798J884474J223251P22338
37837A8314400M94914L86827J15773m41646j139382j657215j647200r33711K44429
37828A3737189J246571J491261R57799J35578n04236q52926j015024j056398j038674
37819A3101140j158107j620811k327906k809953k610394j766429q35676l58590
37811c86726l11720j94587L35771J061790J509426J500111J232062R12494N53459
37802F212080J63378p1266O7556N75670J200480J626983J662432J308371O99813
$$ plain form
37793 13445497 13391563 12443207 10515056 7804112 4829611 2045063 -576869 -3383518
37785 -3383518 -6426754 -9202302 -11122021 -12093671 -12465710 -12518984 -12262749 -11727421 -11193023
37776 -11193023 -10972911 -11087797 -11287490 -11336735 -11180260 -10881565 -10510657 -10074933 -9480875
37767 -9480875 -8590486 -7391688 -6070326 -4812005 -3570370 -2166803 -608544 868925
37759 868925 2149386 3473766 5172509 7195693 9041571 10199318 10628269 10777923 11134387
37750 11134387 11740920 12172345 11987433 11155959 9987823 8718523 7320352 5726539 4049683
37741 4049683 2444714 840976 -1059154 -3521465 -6550128 -9817373 -12715348 -14558624
37733 -14558624 -14945187 -14059631 -12645404 -11638823 -11711846 -12985771 -15072055 -17421171 -19703704
$$ packed form
37793A3445497n3934r48356j928151k710944k974501k784548k621932k806649
37785c383518l043236k775548j919719r71650l72039n3274K56235N35328N34398
37776a1193023K20112j14886j99693m9245J56475K98695L70908M35724N94058
37767i480875Q90389J198798J321362J258321J241635J403567J558259J477469
37759H68925J280461J324380J698743K023184J845878J157747M28951J49654L56464
37750A1134387O06533M31425j84912q31474j168136j269300j398171j593813j676856
37741D049683j604969j603738j900130k462311l028663l267245k897975j843276
37733a4558624l86563Q85556J414227J006581p3023j273925k086284k349116k282533
$$ plain form
37724 -19703704 -21886562 -24010225 -25992662 -27604287 -28455953 -28017720 -25942570 -22568343
37716 -22568343 -18918897 -15951073 -13828610 -12056549 -10189096 -8203069 -6331303 -4880988
37708 -4880988 -4230957 -4676106 -6102475 -7955630 -9612937 -10680154 -10956916 -10409547 -9363324
37699 -9363324 -8543469 -8649033 -9797795 -11399684 -12539569 -12513706 -11170964 -8890204 -6225041
37690 -6225041 -3507266 -762050 2052454 4802634 7157708 8760087 9514926 9845131
37682 9845131 10532042 11995329 13677221 14413700 13574182 11678481 9794136 8535911 7805253
37673 7805253 7254537 6659822 5884231 4809497 3467349 2133832 1182077 836666 1075908
37664 1075908 1760906 2861625 4514164 6764483 9269397 11399838 12694220 13084136
$$ packed form
37724a9703704k182858k123663j982437j611625q51666M38233K075150L374227
37716b2568343L649446K967824K122463J772061J867453J986027J871766J450315
37708d880988O50031m45149j426369j853155j657307j067217k76762N47369J046223
37699i363324Q19855j05564j148762j601889j139885K5863J342742K280760K665163
37690f225041K717775K745216K814504K750180K355074J602379P54839L30205
37682I845131O86911J463287J681892P36479q39518j895701j884345j258225p30658
37673G805253n50716n94715p75591j074734j342148j333517r51755l45411K39242
37664A075908O84998J100719J652539K250319K504914K130441J294382L89916
$$ plain form
37656 13084136 12651914 11412578 9511162 7424596 5656243 4262686 2920613 1440283
37648 1440283 -46651 -1443816 -2946669 -4760860 -6722166 -8407273 -9594885 -10472442
37640 -10472442 -11367912 -12368694 -13244841 -13706425 -13702111 -13480892 -13400038 -13688210 -14346690 -15176481
37630 -15176481 -15831748 -15891534 -14999741 -13034646 -10186031 -6868234 -3509743 -341400 2672982
37621 2672982 5705532 8844922 11967475 14752858 16784804 17713542 17456884 16292213
37613 16292213 14718929 13224069 12140906 11528734 10991742 9761908 7345830 4205491
37605 4205491 1532396 187810 59017 567497 1504743 3085773 5395289 8140097 10855747
37596 10855747 13018151 14001556 13319932 11037908 7725615 3967824 161171 -3195721
$$ packed form
37656A3084136m32222j239336j901416k086566j768353j393557j342073j480330
37648A440283j486934j397165j502853j814191j961306j685107j187612q77557
37640a0472442q95470j000782q76147m61584M314K21219Q0854k88172o58480q29791
37630a5176481o55267n9786Q91793J965095K848615L317797L358491L168343L014382
37621B672982L032550L139390L122553K785383K031946R28738k56658j164671
37613A6292213j573284j494860j083163o12172n36992j229834k416078l140339
37605D205491k673095j344586j28793N08480R37246J581030K309516K744808K715650
37596A0855747K162404R83405o81624k282024l312293l757791l806653l356892
$$ plain form
37588 -3195721 -5409694 -6062834 -5406413 -4082622 -2576122 -1099096 150905 907080 1027234
37579 1027234 611497 -101022 -864886 -1464262 -1695996 -1332316 -123392 2024756 4782561
37570 4782561 7449313 9483509 10963855 12343037 13724440 14571945 14240578 12668869
37562 12668869 10414595 8092634 5964793 4092625 2671188 1992180 2082612 2552189 2898244
37553 2898244 2897425 2641579 2306609 2051588 2100642 2683266 3753360 4879533 5582036 5781678
37543 5781678 5819267 6023334 6335097 6373203 5799276 4604831 3133523 1898574 1306473
37534 1306473 1392689 1747377 1790548 1264643 488677 48810 195785 593595 676843 168539
37524 168539 -808095 -2016830 -3345629 -4761295 -6174551 -7438121 -8444881 -9194331 -9780842
$$ packed form
37588c195721k213973o53140O56421J323791J506500J477026J250001P56175J20154
37579A027234m15737p12519p63864n99376k31734L63680J208924K148148K757805
37570D782561K666752K034196J480346J379182J381403Q47505l31367j571709
37562A2668869k254274k321961k127841j872168j421437o79008R0432M69577L46055
37553B898244q19k55846l34970k55021M9054N82624J070094J126173P02503J99642
37543E781678L7589K04067L11763L8106n73927j194445j471308j234949n92101
37534A306473Q6216L54688M3171n25905p75966m39867J46975L97810Q3248n08304
37524A68539r76634j208735j328799j415666j413256j263570j006760p49450n86511
$$ plain form
37515 -9780842 -10296573 -10665743 -10553653 -9535053 -7458555 -4664870 -1817337 501357 2060956
37506 2060956 2939359 3291408 3183541 2616452 1638103 376941 -1019398 -2398856 -3538124
37497 -3538124 -4169064 -4190807 -3840434 -3558093 -3662187 -4199379 -5080490 -6256654 -7725183
37488 -7725183 -9420173 -11121182 -12427011 -12830369 -11930186 -9686051 -6521162 -3192658
37480 -3192658 -499084 1077082 1633798 1762652 2066193 2723887 3586530 4587079 5785369
37471 5785369 6945050 7377292 6514899 4582601 2453500 822359 -287084 -1171075 -1867666
37462 -1867666 -2158912 -2080318 -2179679 -3107592 -4941996 -6949986 -8035683 -7496942 -5506718
37453 -5506718 -2991994 -997872 42596 596815 1613067 3733313 6862223 10428252
$$ packed form
37515i780842n15731l69170J12090J018600K076498K793685K847533K318694J559599
37506B060956Q78403L52049j07867n67089r78349j261162j396339j379458j139268
37497c538124o30940k1743L50373K82341j04094n37192q81111j176164j468529
37488g725183j694990j701009j305829m03358R00183K244135L164889L328504
37480c192658K693574J576166N56716J28854L03541O57694Q62643J000549J198290
37471E785369J159681M32242q62393j932298k129101j631141j109443q83991o96591
37462a867666k91246P8594r9361r27913j834404k007990j085697N38741J990224
37453e506718K514724J994122J040468N54219J016252K120246L128910L566029
$$ plain form
37445 10428252 13885286 16839035 18860268 19540331 18896841 17568456 16422423 15965553
37437 15965553 16154333 16638616 17053185 17156622 16872433 16226491 15158493 13417878 10774780
37428 10774780 7363314 3722427 465511 -2021249 -3566490 -4065430 -3474131 -1915041
37420 -1915041 296827 2727918 4906682 6432110 7166166 7364550 7511613 7923174 8524621
37411 8524621 9073501 9562183 10284505 11456794 12860983 13967709 14394045 14148950 13440900
37402 13440900 12388264 11002396 9350819 7595393 5901197 4445120 3510226 3399838
37394 3399838 4166146 5525972 7127905 8795698 10411079 11721795 12515849 12935251 13328160
37385 13328160 13742997 13876566 13668417 13597378 14017954 14396140 13696673 11588741 8869704
$$ packed form
37445A0428252L457034K953749K021233O80063o43490j328385j146033m56870
37437A5965553J88780M84283M14569J03437k84189o45942j067998j740615k643098
37428A0774780l411466l640887l256916k486760j545241m98940N91299J559090
37420a915041K211868K431091K178764J525428P34056J98384J47063M11561O01447
37411H524621N48880M88682P22322J172289J404189J106726M26336k45095p08050
37402A3440900j052636j385868j651577j755426j694196j456077r34894j10388
37394C399838P66308J359826J601933J667793J615381J310716P94054M19402L92909
37385A3328160M14837J33569k08149p1039M20576L78186o99467k107932k719037
$$ plain form
37376 8869704 6549050 4879395 3549677 2525669 2280607 3249959 5354956 8046868
37368 8046868 10582047 12297530 12935292 12818330 12543263 12417812 12295104 11920605 11225258
37359 11225258 10252625 9054569 7795059 6775180 6203317 6074666 6414819 7483836 9493881
37350 9493881 12124583 14480905 15600013 15018345 12986060 10305532 7937305 6550038
37342 6550038 6261894 6730595 7449877 7967369 7925242 7033662 5086116 2045837 -1825236
37333 -1825236 -5919411 -9468435 -11898147 -13060659 -13178951 -12662724 -11986877 -11584851 -11672076
37324 -11672076 -12129969 -12602359 -12697673 -12092854 -10553505 -8021649 -4755389 -1338431 1528520
37315 1528520 3342834 4019170 3855463 3268191 2554604 1924032 1666143 2087426 3192981
$$ packed form
37376H869704k320654j669655j329718j024008k45062R69352K104997K691912
37368H046868K535179J715483O37762j16962k75067j25451j22708l74499o95347
37359A1225258r72633j198056j259510j019879n71863j28651L40153J069017K010045
37350I493881K630702K356322J119108n81668k032285k680528k368227j387267
37342F550038k88144M68701P19282N17492m2127q91580j947546l040279l871073
37333a825236m094175l549024k429712j162512j18292N16227O75847M02026q7225
37324a1672076m57893m72390r5314O04819J539349K531856L266260L416958K866951
37315A528520J814314O76336j63707n87272p13587o30572k57889M21283J105555
$$ plain form
37306 3192981 4556676 5639496 6199219 6326581 6189121 5892408 5544604 5267382 5072196
37297 5072196 4818477 4366567 3746207 3142875 2719755 2429851 1962085 888422 -1055969
37288 -1055969 -3748428 -6662685 -9071765 -10398712 -10568841 -10081985 -9613222 -9436474 -9278654
37279 -9278654 -8746924 -7752425 -6445065 -4949036 -3416112 -2257991 -2013885 -2853883 -4320719
37270 -4320719 -5619974 -6096389 -5475089 -3873018 -1724143 412462 2144699 3395878
37262 3395878 4263327 4806312 5043490 5100116 5231450 5651053 6377431 7287272 8288168
37253 8288168 9361435 10400672 11093398 11108104 10436419 9441135 8493544 7647922 6746010
37244 6746010 5720828 4634649 3472967 2094868 428526 -1402819 -3177128 -4703217
$$ packed form
37306C192981J363695J082820N59723J27362j37460k96713l47804k77222j95186
37297E072196k53719m51910o20360o03332m23120k89904m67766j073663j944391
37288a055969k692459k914257k409080j326947j70129M86856M68763J76748J57820
37279i278654N31730R94499J307360J496029J532924J158121K44106q39998j466836
37270d320719j299255m76415O21300J602071K148875K136605J732237J251179
37262C395878Q67449N42985K37178N6626J31334M19603P26378R09841J000896
37253H288168J073267J039237O92726J4706o71685r95284r47591q45622r01912
37244F746010j025182j086179j161682j378099j666342j831345j774309j526089
$$ plain form
37236 -4703217 -5868302 -6697427 -7392265 -8184983 -9130937 -10182459 -11471838 -13286818 -15618943
37227 -15618943 -17891502 -19319064 -19480570 -18460252 -16615318 -14445648 -12575553 -11501063
37219 -11501063 -11221671 -11288704 -11292678 -11152926 -10895913 -10404981 -9570642 -8503061 -7347965
37210 -7347965 -5988387 -4188156 -1987053 341934 2767261 5602167 8933937 12177650
37202 12177650 14478498 15470754 15399648 14567815 12982725 10638769 7889955 5325883 3329381
37193 3329381 1861920 654844 -432831 -1193555 -1175810 -73746 1960851 4445602 6966853
37184 6966853 9320030 11284591 12501103 12685344 11798628 9912082 7130029 3852612
37176 3852612 917769 -854350 -1270940 -732667 360668 1950186 4106392 6757647
$$ packed form
37236d703217j165085q29125o94838p92718r45954j051522j289379j814980k332125
37227a5618943k272559j427562j61506J020318J844934K169670J870095J074490
37219a1501063K79392o7033l974J39752K57013M90932Q34339J067581J155096
37210g347965J359578J800231K201103K328987K425327K834906L331770L243713
37202A2177650K300848R92256p1106q31833j585090k343956k748814k564072j996502
37193C329381j467461j207076j087675p60724J7745J102064K034597K484751K521251
37184F966853K353177J964561J216512J84241q86716j886546k782053l277417
37176C852612k934843j772119m16590N38273J093335J589518K156206K651255
$$ plain form
37168 6757647 9669798 12419283 14280054 14438572 12645797 9651079 6818997 5231518
37160 5231518 5078361 5715154 6171657 5732092 4287499 2271970 270179 -1328588 -2369887
37151 -2369887 -2815228 -2728105 -2338007 -1976715 -1874130 -2019285 -2228561 -2349604 -2406446 -2541180
37141 -2541180 -2815213 -3127149 -3390086 -3741082 -4461787 -5689675 -7302773 -9065909 -10721213
37132 -10721213 -11880332 -12007912 -10686848 -7882159 -3905152 762711 5517672 9676557
37124 9676557 12739248 14649313 15652530 15883981 15252077 13782474 11919064 10349445
37116 10349445 9568400 9636330 10203738 10602751 10031297 7995031 4775255 1344958 -1381146
37107 -1381146 -3229452 -4629321 -5897088 -6886880 -7364477 -7433475 -7371155 -7199830 -6701587
$$ packed form
37168F757647K912151K749485J860771J58518j792775k994718k832082j587479
37160E231518j53157O36793M56503m39565j444593k015529k001791j598767j041299
37151b369887m45341Q7123L90098L61292J02585j45155k09276j21043n6842j34734
37141b541180k74033l11936k62937l50996p20705j227888j613098j763136j655304
37132a0721213j159119j27580J321064K804689L977007M667863M754961M158885
37124I676557L062691J910065J003217K31451o31904j469603j863410j569619
37116A0349445p81045O7930N67408L99013n71454k036266l219776l430297k726104
37107a381146j848306j399869j267767r89792m77597o8998O2320J71325M98243
$$ plain form
37098 -6701587 -5833410 -4861228 -4005339 -3168786 -2170408 -1119956 -381444 -178489 -343326
37089 -343326 -455345 -152007 701133 2076576 3957646 6408693 9451484 12895735 16346817
37080 16346817 19388944 21731985 23218887 23798347 23529468 22541432 20926516 18672999
37072 18672999 15682253 11812741 6974430 1332595 -4537462 -9801348 -13744168 -16006625
37064 -16006625 -16567287 -15715004 -14052194 -12228858 -10435150 -8265919 -5299330 -1777217
37056 -1777217 1453086 3664544 4801230 5356871 5880970 6627759 7541684 8489199 9504721
37047 9504721 10759603 12209794 13340343 13435402 12167998 9872235 7273720 5074563
37039 5074563 3732224 3329469 3451510 3339306 2444610 901974 -663096 -1823060 -2742594
$$ packed form
37098f701587Q68177R72182Q55889Q36553R98378J050452P38512K02955j64837
37089c43326j12019L03338Q53140J375443J881070K451047L042791L444251L451082
37080A6346817L042127K343041J486902N79460k68879r88036j614916k253517
37072A8672999k990746l869512m838311n641835n870057n263886l942820k262457
37064a6006625n60662Q52283J662810J823336J793708K169231K966589L522113
37056a777217L230303K211458J136686N55641N24099P46789R13925R47515J015522
37047I504721J254882J450191J130549R5059j267404k295763k598515k199157
37039E074563j342339m02755J22041j12204q94696j542636j565070j159964r19534
$$ plain form
37030 -2742594 -3852914 -5246166 -6477616 -6894009 -6064657 -3985538 -1087116 1887270
37022 1887270 4214713 5641130 6498183 7238543 7877579 8068933 7735492 7362437 7479879
37013 7479879 8007572 8354772 8137412 7588053 7244848 7441377 8171101 9248608 10423731
37004 10423731 11427510 12101294 12520133 12915145 13473241 14254006 15220457 16188870 16741315
36995 16741315 16392360 15027548 13158194 11617688 10945259 11042499 11330159 11134964 10008224
36986 10008224 7919081 5293143 2787119 877403 -389700 -1270382 -2009880 -2639007
36978 -2639007 -2937930 -2529807 -1150269 1026955 3396924 5374057 6760484 7554717 7568238
36969 7568238 6552413 4722328 2850223 1662944 1253978 1140782 746647 -200153 -1473613
$$ packed form
37030b742594j110320j393252j231450m16393Q29352K079119K898422K974386
37022A887270K327443J426417Q57053P40360O39036J91354l33441l73055J17442
37013G479879N27693L47200k17360n49359l43205J96529P29724J077507J175123
37004A0423731J003779O73784M18839L95012N58096P80765R66451R68413N52445
36995A6741315l48955j364812j869354j540506o72429R7240K87660j95195j126740
36986A0008224k089143k625938k506024j909716j267103q80682p39498o29127
36978b639007k98923M08123J379538K177224K369969J977133J386427P94233J3521
36969G568238j015825j830085j872105j187279m08966j13196l94135r46800j273460
$$ plain form
36960 -1473613 -2369532 -2116800 -552244 1616726 3362951 4147412 4148312 3844299 3537452
36951 3537452 3210446 2686950 1938713 1290076 1211475 1822395 2755613 3651875 4585190 5750126
36941 5750126 6914309 7568529 7590587 7392350 7363623 7515423 7737880 7983566 7953299 6967831
36931 6967831 4573007 1163026 -2307914 -5166167 -7323376 -8873675 -9775425 -9975642
36923 -9975642 -9503473 -8283030 -6104497 -2977000 668128 4344289 7975436 11790331
36915 11790331 15828787 19792034 23382771 26553983 29336110 31614196 33220908 34128204
36907 34128204 34413396 34155502 33539744 32962456 32768671 32851040 32723972 32088366 31165146
36898 31165146 30378198 29879836 29558851 29409142 29676381 30626434 32301192 34522647 37029964
$$ packed form
36960a473613q95919K52732J564556K168970J746225P84461R00l04013l06847
36951C537452l27006n23496p48237o48637p8601O10920R33218Q96262R33315J164936
36941E750126J164183O54220K2058j98237k8727J51800K22457K45686l0267r85468
36931F967831k394824l409981l470940k858253k157209j550299r01750k00217
36923i975642M72169J220443K178533L127497L645128L676161L631147L814895
36915A1790331M038456L963247L590737L171212K782127K278086J606712R07296
36907C4128204K85192k57894o15758n77288j93785Q2369j27068o35606r23220
36898C1165146p86948m98362l20985j49709K67239R50053J674758K221455K507317
$$ plain form
36889 37029964 39567593 41900894 43804235 45065020 45547814 45272833 44375938 42969229
36881 42969229 41134651 39134389 37564217 37200887 38685287 42307071 47910090 54881004
36873 54881004 62374662 69782637 77014924 84271168 91676892 99356150 107799002 117879867
36865 117879867 130398315 145680130 163573420 183596268 204990714 226764484 247734071
36858 247734071 266397134 280773092 288706408 288720478 280761778 266181493 247061538 225484954
36850 225484954 203151987 181351716 161086774 143080455 127558629 114093703 101891509
36843 101891509 90376048 79477705 69394233 60243547 51988587 44500635 37565354
36836 37565354 30978178 24814824 19548479 15741837 13583692 12717371 12432138 12020778
$$ packed form
36889C7029964K537629K333301J903341J260785M82794k74981q96895j406709
36881D2969229j834578k000262j570172l63330J484400L621784N603019O970914
36873E4881004P493658P407975P232287P256244P405724P679258Q442852J0080865
36865A17879867J2518448J5281815J7893290K0022848K1394446K1773770K0969587
36858B47734071J8663063J4375958P933316J4070p958700j4580285j9119955k1576584
36850B25484954k2332967k1800271k0264942j8006319j5521826j3464926j2202194
36843A01891509j1515461j0898343j0083472r150686q254960p487952o935281
36836C7565354o587176o163354n266345l806642k158145q66321k85233m11360
$$ plain form
36828 12020778 11144288 9982402 8915646 7960348 6675558 4793830 2804298 1666370
36820 1666370 1938779 3278504 4666369 4965596 3488289 475085 -2871098 -5154975
36812 -5154975 -5859876 -5617714 -5392601 -5570204 -5905881 -6075620 -5964986 -5485772 -4437924
36803 -4437924 -2733378 -681430 1069156 1915249 1665565 612443 -680510 -1668195 -2020749
36794 -2020749 -1714306 -1044872 -500208 -451110 -850564 -1227305 -1001017 165750 2237816
36785 2237816 4902340 7754471 10460174 12808464 14637664 15780537 16180052 16058129
36777 16058129 15855274 15927235 16317535 16800771 17039047 16702466 15658098 14223920 13122828
36768 13122828 12933401 13531409 14203477 14329447 13825245 12947448 11947947 11095238 10813338
$$ packed form
36828A2020778q76490j161886j066756r55298j284790j881728j989532j137928
36820A666370K72409J339725J387865K99227j477307l013204l346183k283877
36812e154975p04901K42162K25113j77603l35677j69739J10634M79214J047848
36803d437924J704546K051948J750586Q46093k49684j053122j292953r87685l52554
36794b020749L06443O69434N44664M9098l99454l76741K26288J166767K072066
36785B237816K664524K852131K705703K348290J829200J142873L99515j21923
36777A6058129k02855P1961L90300M83236K38276l36581j044368j434178j101092
36768A3122828j89427N98008O72068J25970n04202q77797r99501q52709k81900
$$ plain form
36759 10813338 11438685 12765288 14018749 14382881 13494498 11466320 8659047 5569403
36751 5569403 2780777 762731 -367153 -829927 -920185 -764143 -275314 714971 2210659
36742 2210659 3808337 4733669 4316244 2579890 351523 -1303928 -1831052 -1441774 -719671
36733 -719671 -48198 541009 1038403 1202165 846618 333445 469525 1716459 3633838
36724 3633838 5301733 6219772 6609949 6929828 7374545 7889956 8389529 8774931 8878625
36715 8878625 8568131 7899797 7104550 6435488 6017260 5761634 5431652 4896359 4335236
36706 4335236 4086359 4303279 4897404 5775061 6877892 7937019 8489068 8348914 7880716
36697 7880716 7571410 7449613 7126849 6304113 5028644 3574265 2373772 2065268 3300744
$$ packed form
36759A0813338O25347J326603J253461L64132q88383k028178k807273l089644
36751E569403k788626k018046j129884m62774r0258J56042M88829R90285J495688
36742B210659J597678R25332m17425j736354k228367j655451n27124L89278P22103
36733g19671O71473N89207M97394J63762l55547n13173J36080J246934J917379
36724C633838J667895R18039L90177L19879M44717N15411M99573L85402J03694
36715H878625l10494o68334p95247o69062m18228k55626l29982n35293n61123
36706D335236k48877K16920N94125Q77657J102831J059127N52049j40154m68198
36697G880716l09306j21797l22764q22736j275469j454379j200493l08504J235476
$$ plain form
36688 3300744 6346998 10948091 16568084 22618010 28475955 33565918 37601914 40672399
36680 40672399 42989555 44631402 45596328 45998444 46055877 45863193 45222266 43711712 40952847
36671 40952847 36904991 31984461 26886249 22219443 18233621 14814354 11693156 8686285
36663 8686285 5787235 3058989 480589 -2010779 -4289582 -5944662 -6515580 -5828242
36655 -5828242 -4095377 -1796520 453055 2037315 2577033 2144391 1239470 574352 847516
36646 847516 2500655 5425882 8886008 11892782 13754195 14267169 13548873 11943732 10091515
36637 10091515 8765977 8389093 8722684 9113565 8988639 8083477 6342526 3791528 549817
36628 549817 -3109093 -6783098 -10077419 -12747623 -14708611 -15936934 -16489469 -16675866 -17008852
$$ packed form
36688C300744L046254M601093N619993O049926N857945N089963M035996L070485
36680D0672399K317156J641847R64926M02116N7433j92684o40927j510554k758865
36671D0952847m047856m920530n098212m666806l985822l419267l121198l006871
36663H686285k899050k728246k578400k491368k278803j655080n70918O87338
36655e828242J732865K298857K249575J584260N39718m32642r04921o65118K73164
36646H47516J653139K925227L460126L006774J861413N12974p18296j605141j852217
36637A0091515j325538l76884L33591L90881j24926r05162j740951k550998l241711
36628E49817l658910l674005l294321k670204j960988j228323n52535j86397l32986
$$ plain form
36619 -17008852 -17683598 -18089998 -17133169 -14258766 -10118760 -6141664 -3487083 -2398228
36611 -2398228 -2339197 -2523107 -2329036 -1440403 196420 2431271 4924482 7215250 8923686
36602 8923686 9930213 10322501 10214959 9734875 9159434 8877635 9104030 9689629 10265924
36593 10265924 10527134 10385262 9991379 9685910 9839048 10635273 11996689 13679929 15373535
36584 15373535 16757464 17646836 18119840 18365647 18383003 18010638 17307420 16660218 16335692
36575 16335692 16096481 15498380 14501703 13583855 13272071 13747296 14899190 16544433 18445469
36566 18445469 20194965 21265724 21332517 20618348 19858779 19771259 20484727 21517351 22264236
36557 22264236 22378468 21740118 20358579 18462771 16470592 14627064 12755405 10559887
$$ packed form
36619a7008852o74746m06400R56829K874403M140006L977096K654581J088855
36611b398228N9031j83910J94071Q88633J636823K234851K493211K290768J708436
36602H923686J006527L92288j07542m80084n75441k81799K26395N85599N76295
36593A0265924K61210j41872l93883l05469J53138P96225J361416J683240J693606
36584A5373535J383929Q89372M73004K45807J7356l72365p03218o47202l24526
36575A6335692k39211n98101r96677r17848l11784M75225J151894J645243J901036
36566A8445469J749496J070759O6793p14169p59569q7520P13468J032624P46885
36557B2264236J14232o38350j381539j895808j992179j843528j871659k195518
$$ plain form
36549 10559887 8140939 6079616 5046834 5371291 6809968 8576676 9765640 10020267
36541 10020267 9759719 9583443 9540438 9155016 8010857 6037879 3394879 505255 -1826054
36532 -1826054 -2866988 -2776433 -2631777 -3364907 -4874460 -6383196 -7394449 -7970065 -8252923
36523 -8252923 -8149993 -7546418 -6539961 -5318659 -3929057 -2257610 -205895 2108573
36515 2108573 4275445 5783943 6422653 6470438 6369861 6225039 5761786 4798091 3594287
36506 3594287 2642044 2189788 2059117 1864106 1311778 319914 -1027808 -2564582 -4108136
36497 -4108136 -5497549 -6561237 -7032235 -6548871 -4856020 -2078286 1228726 4333709
36489 4333709 6633499 7770478 7654188 6527013 4908870 3246987 1587823 -227822
$$ packed form
36549A0559887k418948k061323j032782L24457J438677J766708J188964K54627
36541A0020267k60548j76276m3005l85422j144159j972978k643000k889624k331309
36532a826054j040934R0555J44656p33130j509553j508736j011253n75616k82858
36523h252923J02930O03575J006457J221302J389602J671447K051715K314468
36515B108573K166872J508498O38710M7785j00577j44822m63253r63695j203804
36506C594287r52243m52256j30671j95011n52328r91864j347722j536774j543554
36497d108136j389413j063688m70998M83364J692851K777734L307012L104983
36489D333709K299790J136979j16290j127175j618143j661883j659164j815645
$$ plain form
36481 -227822 -1989044 -2928463 -2289485 -55000 2945262 5585040 7079958 7282263 6592947
36472 6592947 5635343 4926915 4798662 5509352 7176604 9426919 11285883 11737695 10486654
36463 10486654 8042789 5052703 1721256 -2057640 -6193153 -10178481 -13310083 -15042454
36455 -15042454 -15257427 -14396224 -13350479 -13044631 -13940040 -15857652 -18236787 -20531909 -22393629
36446 -22393629 -23601749 -23990511 -23519435 -22354123 -20747032 -18791081 -16378344 -13495954
36438 -13495954 -10517573 -8066399 -6534685 -5802090 -5474710 -5347965 -5567817 -6359755 -7675041
36429 -7675041 -9132286 -10270896 -10829875 -10814081 -10385093 -9755499 -9126718 -8574426 -7938907
36420 -7938907 -6966651 -5704815 -4679348 -4477715 -5108652 -5913190 -6167993 -5670791 -4713711
$$ packed form
36481b27822j761222r39419O38978K234485L000262K639778J494918K02305o89316
36472F592947r57604p08428j28253P10690J667252K250315J858964M51812j251041
36463A0486654k443865k990086l331447l778896m135513l985328l131602j732371
36455a5042454k14973Q61203J045745L05848q95409j917612k379135k295122j861720
36446b2393629j208120l88762M71076J165312J607091J955951K412737K882390
36438a3495954K978381K451174J531714P32595L27380J26745k19852p91938j315286
36429g675041j457245j138610n58979J5794M28988O29594O28781N52292O35519
36420g938907R72256J261836J025467K01633o30937q04538k54803M97202R57080
$$ plain form
36411 -4713711 -3686556 -2861408 -2414122 -2402392 -2711852 -3179844 -3757980 -4378162 -4670635
36402 -4670635 -4087048 -2486105 -487880 916141 1095733 109331 -1515663 -3121179 -4109258
36393 -4109258 -4094657 -3077359 -1459328 190924 1451782 2202777 2541484 2558663 2192361
36384 2192361 1371254 360550 -123384 684628 2998076 6268866 9511883 11806676 12676918
36375 12676918 12295838 11403640 10813242 10824329 11140214 11316836 11083566 10189036 8277258
36366 8277258 5243421 1604344 -1776289 -4324440 -5928724 -6587331 -6247016 -5081735
36358 -5081735 -3623138 -2394702 -1538032 -900395 -295593 488385 1739112 3567017 5599625
36349 5599625 7129880 7623303 7014233 5589718 3763710 1943819 429758 -595559
$$ packed form
36411d713711J027155Q25148M47286J1730l09460m67992n78136o20182k92473
36402d670635N83587J600943J998225J404021J79592r86402j624994j605516r88079
36393d109258J4601J017298J618031J650252J260858P50995L38707J7179l66302
36384B192361q21107j010704m83934Q08012K313448L270790L243017K294793Q70242
36375A2676918l81080q92198n90398J1087L15885J76622k33270q94530j911778
36366H277258l033837l639077l380633k548151j604284o58607L40315J165281
36358e081735J458597J228436Q56670O37637O04802P83978J250727J827905K032608
36349E599625J530255M93423o09070j424515j826008j819891j514061j025317
$$ plain form
36341 -595559 -862173 114413 2637270 6177818 9397954 11136056 11370798 11082604 11245151
36332 11245151 12101550 13273430 14195195 14312929 13153324 10541474 6806806 2662482
36324 2662482 -1160473 -4185255 -6257188 -7521474 -8311957 -8882194 -9154507 -8797889 -7606530
36315 -7606530 -5760982 -3697026 -1787745 -202400 990471 1689753 1782660 1323967 732987
36306 732987 783858 2239529 5304680 9365235 13300131 16096342 17232126 16641876 14546005
36297 14546005 11414610 7956771 4894757 2593207 914420 -489210 -1705281 -2394081
36289 -2394081 -2093124 -665477 1554970 4004663 6215093 7931586 9042590 9530750
36281 9530750 9559617 9572997 10162594 11629883 13565500 14964332 14969933 13607670 11742920
$$ packed form
36341e95559k66614R76586K522857L540548L220136J738102K34742k88194J62547
36332A1245151Q56399J171880R21765J17734j159605k611850l734668m144324
36324B662482l822955l024782k071933j264286p90483n70237k72313L56618J191359
36315g606530J845548K063956J909281J585345J192871O99282R2907m58693n90980
36306G32987N0871J455671L065151M060555L934896K796211J135784n90250k095871
36297A4546005l131395l457839l062014k301550j678787j403630j216071o88800
36289b394081L00957J427647K220447K449693K210430J716493J111004M88160
36281I530750K8867J3380N89597J467289J935617J398832N601j362263j864750
$$ plain form
36272 11742920 10295721 9533507 9077361 8426941 7407171 6240988 5331704 4945296 5023161
36263 5023161 5324648 5766650 6512443 7648901 8890617 9731400 9812013 9021892 7361883
36254 7361883 4947319 2155584 -439614 -2386645 -3547933 -3986076 -3786407 -3025679 -1831147
36245 -1831147 -461811 625147 923290 331425 -558969 -919107 -552811 -116472 -335352
36236 -335352 -1168245 -1899721 -1888632 -998658 605160 2774903 5379868 8125106 10518962
36227 10518962 12095799 12731249 12734814 12513049 12051588 10807767 8245839 4503455 510944
36218 510944 -2520000 -3767691 -3169393 -1317807 996649 3210610 5002319 6025447
36210 6025447 5899192 4581465 2570012 564960 -967034 -1816444 -1888097 -1337887 -724581
$$ packed form
36272A1742920j447199p62214m56146o50420j019770j166183r09284l86408P7865
36263E023161L01487M42002P45793J136458J241716Q40783Q0613p90121j660009
36254G361883k414564k791735k595198j947031j161288m38143J99669P60728J194532
36245a831147J369336J086958K98143n91865q90394l60138L66296M36339k18880
36236c35352q32893p31476J1089Q89974J603818K169743K604965K745238K393856
36227A0518962J576837O35450L565k21765m61461j243821k561928l742384l992511
36218E10944l030944j247691N98298J851586K314456K213961J791709J023128
36210F025447j26255j317727k011453k005052j531994q49410p1653N50210O13306
$$ plain form
36201 -724581 -665594 -1285953 -2214183 -3101398 -3882967 -4513053 -4750268 -4353243 -3297250 -1680064
36191 -1680064 418546 2882342 5543064 8346757 11376066 14568399 17567936 20039447
36183 20039447 22021636 23774898 25335489 26412437 26726313 26282975 25251007 23668454
36175 23668454 21367287 18207674 14367841 10344921 6599574 3216679 3181 -3084069
36167 -3084069 -5705846 -7323588 -7499696 -6078400 -3341213 -80275 2739656 4618152
36159 4618152 5704987 6214604 5876284 4274540 1640311 -1060243 -2925775 -3817241 -4228971
36150 -4228971 -4692033 -5379086 -6058320 -6243389 -5503959 -3827306 -1692424 273987 1690141
36141 1690141 2466958 2622970 2232805 1544059 957033 733455 721271 468660 -299075 -1326886
$$ packed form
36201g24581N8987o20359r28230q87215p81569o30086k37215L97025J055993J617186
36191a680064K098610K463796K660722K803693L029309L192333K999537K471511
36183B0039447J982189J753262J560591J076948L13876m43338j031968j582553
36175B3668454k301167l159613l839833m022920l745347l382895l213498l087250
36167c084069k621777j617742j76108J421296K737187L260938K819931J878496
36159D618152J086835N09617l38320j601744k634229k700554j865532q91466m11730
36150d228971m63062o87053o79234j85069P39430J676653K134882J966411J416154
36141A690141P76817J56012l90165o88746n87026k23578j2184k52611p67735j027811
$$ plain form
36131 -1326886 -2045523 -2181288 -2071023 -2295567 -3073779 -4137067 -5152096 -6087189 -7104522
36122 -7104522 -8224252 -9211976 -9760888 -9697740 -8992307 -7606315 -5413014 -2385904 1068641
36113 1068641 4071137 5741100 5772095 4513962 2571367 478699 -1270998 -2153475 -1779401
36104 -1779401 -123365 2431626 5185611 7275846 8006861 7281890 5692882 4051876
36096 4051876 2830688 2093133 1829971 2133148 2985710 3980774 4324709 3196354 296583
36087 296583 -3789837 -7858915 -10936857 -12951295 -14516246 -16110146 -17581348 -18369429
36079 -18369429 -17971733 -16205757 -13356623 -10283568 -8160070 -7748130 -8839316 -10520113
36071 -10520113 -11987846 -13015993 -13696087 -13970619 -13567745 -12335962 -10542134 -8809518
$$ packed form
36131a326886p18637j35765J10265k24544p78212j063288j015029r35093j017333
36122g104522j119730r87724n48912O3148P05433J385992K193301L027110L454545
36113A068641L002496J669963L0995j258133j942595k092668j749697q82477L74074
36104a779401J656036K554991K753985K090235P31015p24971j589008j641006
36096D051876j221188p37555k63162L03177Q52562R95064L43935j128355k899771
36087B96583m086420m069078l077942k014438j564951j593900j471202p88081
36079a8369429L97696J765976K849134L073055K123498M11940j091186j680797
36071a0520113j467733j028147o80094k74532M02874J231783J793828J732616
$$ plain form
36063 -8809518 -7722027 -7397427 -7407515 -7167108 -6434232 -5390927 -4233527 -2790980 -645678
36054 -645678 2392135 5997206 9499689 12296059 14146014 15194001 15761078 16080543 16211236
36045 16211236 16215419 16345409 16880786 17697031 18135320 17518244 15860495 13988141 12906425
36036 12906425 13056740 14103049 15249768 15714890 15130585 13787952 12542158 12278822 13289421
36027 13289421 15122190 17010608 18369066 18904124 18488510 17190105 15436024 13933500
36019 13933500 13259220 13527279 14477335 15783981 17184394 18412014 19233031 19610537 19677643
36010 19677643 19457628 18764387 17551871 16261150 15566446 15730560 16406033 17161269 18019924
36001 18019924 19309908 21079912 22851549 23923147 23781087 22284834 19726298 16848827
$$ packed form
36063h809518J087491L24600j0088K40407P32876J043305J157400J442547K145302
36054f45678L037813L605071L502483K796370J849955J047987N67077L19465J30693
36045A6211236M183J29990N35377Q16245M38289o17076j657749j872354j081716
36036A2906425J50315J046309J146719M65122n84305j342633j245794k63336J010599
36027A3289421J832769J888418J358458N35058m15614j298405j754081j502524
36019A3933500o74280K68059R50056J306646J400413J227620Q21017L77506O7106
36010A9677643k20015o93241j212516j290721o94704J64114O75473P55236Q58655
36001A8019924J289984J770004J771637J071598j42060j496253k558536k877471
$$ plain form
35993 16848827 14647162 13901531 14791540 16918233 19606276 22136598 23852435 24358376
35985 24358376 23820115 22996998 22749149 23363192 24386212 25180284 25575344 25863612 26202437
35976 26202437 26234547 25396606 23462808 20667484 17449387 14302026 11792222 10387471
35968 10387471 10099398 10450685 10954305 11574004 12634035 14357392 16586258 18883239 20805950
35959 20805950 22160719 23152435 24309217 26144657 28802461 31982897 35125506 37593942
35951 37593942 38788244 38326721 36303127 33370115 30463035 28319397 27164823 26792058
35943 26792058 26892302 27265576 27718751 27890665 27363310 26004081 24103305 22109867 20288630
35934 20288630 18663020 17184035 15872731 14884984 14545034 15252234 17208016 20178903
$$ packed form
35993A6848827k201665p45631Q90009K126693K688043K530322J715837N05941
35985B4358376n38261q23117k47849O14043J023020P94072L95060K88268L38825
35976B6202437L2110q37941j933798k795324l218097l147361k509804j404751
35968A0387471k88073L51287N03620O19699J060031J723357K228866K296981J922711
35959B0805950J354769R91716J156782J835440K657804L180436L142609K468436
35951C7593942J194302m61523k023594k933012k907080k143638j154574l72765
35943B6792058J00244L73274M53175J71914n27355j359229j900776j993438j821237
35934B0288630j625610j478985j311304r87747l39950P07200J955782K970887
$$ plain form
35926 20178903 23516074 26346864 27775524 27149617 24412344 20238802 15715893 11843232
35918 11843232 9286617 8357205 8946655 10505873 12326741 13938838 15186705 16039618
35910 16039618 16552232 16963565 17533026 18182237 18511992 18279059 17689131 17135223 16805018
35901 16805018 16596430 16218610 15326378 13841920 12296232 11564593 12001048 13022991 13787533
35892 13787533 14054813 14064516 13784067 12796612 10979225 8879248 7270387 6617811 7081593
$$ packed form
35926B0178903L337171K830790J428660o25907k737273m173542m522909l872661
35918A1843232k556615r29412N89450J559218J820868J612097J247867Q52913
35910A6039618N12614M11333N69461O49211L29755k32933n89928n53908l30205
35901A6805018k08588l77820q92232j484458j545688p31639M36455J021943P64542
35892A3787533K67280R703k80449r87455j817387k099977j608861o52576M63782
$$ [...]
##END NTUPLES=NMR SPECTRUM
##END=
