##TITLE=31Pdec_11P153H-NaOH
  D2O
  128 sc
 3.10.2023
##JCAMPDX= 6.0         $$ Bruker NMR JCAMP-DX V2.0
##DATA TYPE= NMR SPECTRUM
##DATA CLASS= NTUPLES
##ORIGIN= UXNMR, Bruker Analytische Messtechnik GmbH
##OWNER= root
$$ XWIN-NMR		Version 3.5
$$ Tue Oct  3 16:18:54 2023 Russian Standard Time (UT+4h)  she@DPX200
##.OBSERVE FREQUENCY= 81.013821
##.OBSERVE NUCLEUS= ^31P
##.ACQUISITION MODE= SIMULTANEOUS
##.ACQUISITION SCHEME= undefined
##.AVERAGES= 128
##.DIGITISER RES= 16
##SPECTROMETER/DATA SYSTEM= spect
##.PULSE SEQUENCE= zgpg30
##.SOLVENT NAME= CDCl3
##.SHIFT REFERENCE= (INTERNAL, CDCl3, 0, 248.564)
##AUDIT TRAIL= $$ (NUMBER, WHEN, WHO, WHERE, WHAT)
$$ ##TITLE= Audit trail, XWIN-NMR		Version 3.5
$$ ##JCAMPDX= 5.01
$$ ##ORIGIN= Bruker BioSpin GmbH
$$ ##OWNER= she
$$ F:/spectra/data/she/nmr/P31/1/pdata/1/auditp.txt
$$ ##AUDIT TRAIL=  $$ (NUMBER, WHEN, WHO, WHERE, WHAT)
(   1,<2023-10-03 16:17:48.89 +0400>,<she>,<DPX200>,
      <continue with go, POWCHK disabled, PULCHK disabled
       configuration hash MD5:
       00 E9 B6 7A A2 85 ED C7 34 08 36 98 17 FE 4E 26
       data hash MD5: 32K
       0D 5F 05 C9 9C 2E FF 20 61 0E F0 90 E2 EF EE 2F>)
(   2,<2023-10-03 16:17:52.79 +0400>,<she>,<DPX200>,
      <Start of raw data processing
       efp BC_mod = 2 LB = 5 FT_mod = 6 PKNL = 1 PHC0 = -10724.48 PHC1 = 237.8864 SI = 64K 
       data hash MD5: 64K
       F5 F9 ED E4 A4 81 32 46 AA 4F AB 91 B3 35 60 82>)
(   3,<2023-10-03 16:18:10.00 +0400>,<she>,<DPX200>,
      <pk PHC0 = -51.52301 PHC1 = 0 
       data hash MD5: 64K
       8D C9 9D AE 12 BC D5 A4 22 0A AA E1 C5 61 D0 5B>)
$$ ##END=
$$ 
$$ hash MD5
$$ C4 1C E4 01 21 93 9B F5 88 00 E8 56 CE 58 5B AC
##$RELAX= 
##$RELAX= 
##$RELAX= 
##$RELAX= 
##$RELAX= 
##$RELAX= 
##$RELAX= 
##$RELAX= 
##$RELAX= 
$$ Bruker specific parameters
$$ --------------------------
##$DU= <F:/spectra>
##$EXPNO= 1
##$NAME= <P31>
##$PROCNO= 1
##$TYPE= <nmr>
##$USER= <she>
##$AMP= (0..31)
100 100 100 100 100 100 100 100 100 100 100 100 100 100 100 100 100 100 
100 100 100 100 100 100 100 100 100 100 100 100 100 100 
##$AQSEQ= 0
##$AQ_mod= 1
##$AUNM= <au_zg>
##$AUTOPOS= <>
##$BF1= 81.014009
##$BF2= 200.13
##$BF3= 200.13
##$BF4= 200.13
##$BF5= 200.13
##$BF6= 200.13
##$BF7= 200.13
##$BF8= 200.13
##$BYTORDA= 1
##$CFDGTYP= 0
##$CFRGTYP= 5
##$CHEMSTR= <none>
##$CNST= (0..31)
1 1 145 1 1 1 1 1 1 1 1 1 1 1 1 1 1 1 1 1 1 1 1 1 1 1 1 1 1 1 1 1 
##$CPDPRG= <waltz16>
##$CPDPRG1= <>
##$CPDPRG2= <waltz16>
##$CPDPRG3= <>
##$CPDPRG4= <mlev>
##$CPDPRG5= <mlev>
##$CPDPRG6= <mlev>
##$CPDPRG7= <mlev>
##$CPDPRG8= <mlev>
##$CPDPRGB= <>
##$CPDPRGT= <>
##$D= (0..31)
0 1 0 0 0 0 0 0 0 0 0 0.03 2e-05 3e-06 0 0 0 0 0 0 0 0 0 0 0 0 0 0 0 0 
0 0 
##$DATE= 1696335276
##$DBL= (0..7)
120 120 120 11 120 120 24 19 
##$DBP= (0..7)
150 150 150 150 150 150 150 150 
##$DBP07= 0
##$DBPNAM0= <>
##$DBPNAM1= <>
##$DBPNAM2= <>
##$DBPNAM3= <>
##$DBPNAM4= <>
##$DBPNAM5= <>
##$DBPNAM6= <>
##$DBPNAM7= <>
##$DBPOAL= (0..7)
0.5 0.5 0.5 0.5 0.5 0.5 0.5 0.5 
$$ [...]
##$SUBNAM2= <"">
##$SUBNAM3= <"">
##$SUBNAM4= <"">
##$SUBNAM5= <"">
##$SUBNAM6= <"">
##$SUBNAM7= <"">
##$SUBNAM8= <"">
##$SUBNAM9= <"">
##$SW= 501.771253377433
##$SWIBOX= (0..15)
0 1 3 0 0 0 0 0 0 0 0 0 0 0 0 0 
##$SW_h= 40650.406504065
##$TD= 32768
##$TD0= 1
##$TE= 0
##$TE2= 300
##$TE3= 300
##$TEG= 300
##$TL= (0..7)
0 120 53 12 22 120 120 120 
##$TP= (0..7)
150 150 150 150 150 150 150 150 
##$TP07= 0
##$TPNAME0= <>
##$TPNAME1= <>
##$TPNAME2= <>
##$TPNAME3= <>
##$TPNAME4= <>
##$TPNAME5= <>
##$TPNAME6= <>
##$TPNAME7= <>
##$TPOAL= (0..7)
0.5 0.5 0.5 0.5 0.5 0.5 0.5 0.5 
##$TPOFFS= (0..7)
0 0 0 0 0 0 0 0 
##$TUNHIN= 0
##$TUNHOUT= 0
##$TUNXOUT= 0
##$USERA1= <user>
##$USERA2= <user>
##$USERA3= <user>
##$USERA4= <user>
##$USERA5= <user>
##$V9= 5
##$VALIST= <valist>
##$VCLIST= <CCCCCCCCCCCCCCC>
##$VD= 0
##$VDLIST= <DDDDDDDDDDDDDDD>
##$VPLIST= <PPPPPPPPPPPPPPP>
##$VTLIST= <TTTTTTTTTTTTTTT>
##$WBST= 1024
##$WBSW= 4
##$XGAIN= (0..3)
0 0 0 0 
##$XL= 0
##$YL= 0
##$YMAX_a= 2492
##$YMIN_a= -14163
##$ZGOPTNS= <>
##$ZL1= 120
##$ZL2= 120
##$ZL3= 120
##$ZL4= 120
##$ABSF1= 0
##$ABSF2= 0
##$ABSG= 0
##$ABSL= 0
##$ALPHA= 0
##$AQORDER= 0
##$ASSFAC= 0
##$ASSFACI= 0
##$ASSFACX= 0
##$ASSWID= 0
##$AUNMP= <proc_1d>
##$AZFE= 0.1
##$AZFW= 0.5
##$BCFW= 0
##$BC_mod= 2
##$BYTORDP= 0
##$COROFFS= 0
##$CY= -3
##$DATMOD= 1
##$DC= 0
##$DFILT= <>
##$DTYPP= 0
##$F1P= 0
##$F2P= 0
##$FCOR= 1
##$FTSIZE= 65536
##$FT_mod= 6
##$GAMMA= 0
##$GB= 0
##$INTBC= 1
##$INTSCL= 6.047779e-11
##$ISEN= 30
##$LB= 5
##$LEV0= 0
##$LPBIN= 0
##$MAXI= 10000
##$MC2= 0
##$MEAN= 0
##$ME_mod= 0
##$MI= 50
##$NCOEF= 0
##$NC_proc= -11
##$NLEV= 6
##$NOISF1= 182.463
##$NOISF2= 159.3651
##$NSP= 0
##$NTH_PI= 0
##$NZP= 0
##$OFFSET= 248.5645
##$PC= 4
##$PHC0= -10776
##$PHC1= 237.8864
##$PH_mod= 1
##$PKNL= yes
##$PPARMOD= 0
##$PSCAL= 0
##$PSIGN= 0
##$REVERSE= no
##$SF= 81.0140089999694
##$SI= 65536
##$SIGF1= 159.3651
##$SIGF2= -187.1042
##$SINO= 113.3802
##$SIOLD= 16384
##$SREGLST= <1H.CDCl3>
##$SSB= 0
##$STSI= 65536
##$STSR= 0
##$SW_p= 40650.406504065
##$SYMM= 0
##$S_DEV= 0
##$TDeff= 32768
##$TDoff= 0
##$TI= <>
##$TILT= no
##$TM1= 0
##$TM2= 0
##$TOPLEV= 0
##$USERP1= <user>
##$USERP2= <user>
##$USERP3= <user>
##$USERP4= <user>
##$USERP5= <user>
##$WDW= 1
##$XDIM= 65536
##$YMAX_p= 382633498
##$YMIN_p= -449920248
$$ End of Bruker specific parameters
$$ ---------------------------------
##NTUPLES= NMR SPECTRUM
##VAR_NAME=  FREQUENCY,     SPECTRUM/REAL,   SPECTRUM/IMAG
##SYMBOL=    X,             R,               I
##VAR_TYPE=  INDEPENDENT,   DEPENDENT,       DEPENDENT
##VAR_FORM=  AFFN,          ASDF,            ASDF
##VAR_DIM=   65536,         65536,           65536
##UNITS=     HZ,            ARBITRARY UNITS, ARBITRARY UNITS
##FACTOR=    0.620285442955139, 1,           1
##FIRST=     20137.2065510682, 0,            0
##LAST=      -20513.1999529968, 0,           0
##MIN=       -20513.1999529968, -449920248,  0
##MAX=       20137.2065510682, 382633498,    0
$$ Real data points
##PAGE= N=1
##DATA TABLE= (X++(R..R)), XYDATA
$$ [...]
$$ plain form
12204 25721212 20817541 16275693 13650125 13396982 16108868 22815684 33786343 47749206
12196 47749206 62658025 76707804 88468532 96995590 102552608 106591830 110118297 112383810
12188 112383810 112040396 109375276 106410815 104592186 103136390 99995253 93825918 84568675
12180 84568675 72657937 58525889 42974147 27491332 13930827 4112949 -225553
12173 -225553 2178709 10844732 22608433 32880305 38684153 40508564 41067940 42689265
12165 42689265 46162466 51196553 56654464 60382963 60217361 56062838 50608485 47486332
12157 47486332 48788514 54118220 61076117 66242295 66638083 61406386 52263584 42109811
12149 42109811 33392955 27728717 26068394 28324120 33194140 39131769 45342330 51332117
$$ packed form
12204B5721212m903671m541848k625568k53143K711886O706816J0970659J3962863
12196D7749206J4908819J4049779J1760728Q527058N557018M039222L526467K265513
12188A12383810l43414k665120k964461j818629j455796l141137o169335r257243
12180H4568675j1910738j4132048j5551742j5482815j3560505r817878m338502
12173b25553K404262Q666023J1763701J0271872N803848J824411N59376J621325
12165D2689265L473201N034087N457911L728499j65602m154523n454353l122153
12157D7486332J302182N329706O957897N166178L95788n231697r142802j0153773
12149D2109811q716856n664238j660323K255726M870020N937629O210561N989787
$$ plain form
12141 51332117 55875872 57211157 54152809 46509471 34801554 20388854 5558490 -7677671
12133 -7677671 -19106609 -29825220 -40074275 -48493394 -54012024 -57782615 -62584271 -70490991
12125 -70490991 -81211912 -92134737 -99788821 -102166184 -100502708 -98505586 -99024947 -101289860
12117 -101289860 -101621262 -96774959 -86591167 -74052061 -63378968 -57569087 -56609623 -57633514
12109 -57633514 -57257452 -54081635 -48815175 -42287813 -34232145 -24333129 -13616983 -3888579
12101 -3888579 3933917 9998355 13970514 14327485 9977620 2247922 -5453384 -9997645
12093 -9997645 -10269064 -6984416 -1841946 2820086 4492977 1818897 -4286318 -11144629
12085 -11144629 -15978369 -17015522 -13596734 -6277100 2813709 10436762 14010742 13349254
$$ packed form
12141E1332117M543755J335285l058348p643338j1707917j4412700j4830364j3236161
12133g677671j1428938j0718611j0249055q419119n518630l770591m801656p906720
12125g0490991j0720921j0922825p654084k377363J663476J997122n19361k264913
12117a01289860l31402M846303J0183792J2539106J0673093N809881R59464j023891
12109e7633514L76062L175817N266460O527362Q055668R899016J0716146R728404
12101c888579P822496O064438L972159L56971m349865p729698p701306m544261
12093i997645k71419L284648N142470M662032J672891k674080o105215o858311
12085a1144629m833740j037153L418788P319634R090809P623053L573980o61488
$$ plain form
12077 13349254 10716150 9117591 10245486 13635960 17659547 21456075 25811990 31791838
12069 31791838 38547904 43095799 42710362 37405402 29928112 23713566 21128610 23097143
12061 23097143 29384016 38880932 50100314 61858856 73460001 84122737 92464442
12054 92464442 96867630 96466471 91761288 84304211 75802640 67373739 59332258 51324912
12046 51324912 42492020 31709210 18172281 2177159 -14543440 -29389260 -40185107
12039 -40185107 -46527916 -50264736 -54287178 -60018690 -65790961 -68213976 -65504805 -59054297
12031 -59054297 -51435055 -43621470 -35083133 -26229504 -19456788 -17278551 -20068481 -26029906
12023 -26029906 -32818379 -38763868 -43112062 -45973890 -48187477 -50796199 -54335612 -58454727
$$ packed form
12077A3349254k633104j598559J127895L390474M023587L796528M355915N979848
12069C1791838O756066M547895l85437n304960p477290o214546k584956J968533
12061B3097143O286873R496916J1219382J1758542J1601145J0662736Q341705
12054I2464442M403188m01159m705183p457077q501571q428901q041481q007346
12046E1324912q832892j0782810j3536929j5995122j6720599j4845820j0795847
12039d0185107o342809l736820m022442n731512n772271k423015K709171O450508
12031e9054297P619242P813585Q538337Q853629O772716K178237k789930n961425
12023b6029906o788473n945489m348194k861828k213587k608722l539413m119115
$$ plain form
12015 -58454727 -62047213 -63813133 -63020530 -59764424 -54223387 -45948601 -34834861 -23126058
12007 -23126058 -15483911 -16013417 -25241258 -40261169 -57099774 -72155479 -82247783 -85316661
11999 -85316661 -81956682 -75430460 -69349545 -65432345 -63459354 -62515047 -61654644 -59968020
11991 -59968020 -57006473 -53391640 -50592830 -49734645 -50459059 -50992896 -49716264 -47068594
11983 -47068594 -45681311 -48009416 -53765674 -60134692 -64435930 -65980742 -65456981 -63519188
11975 -63519188 -60386251 -56077540 -50614004 -44577155 -39624650 -37397341 -37348672 -36740394
11967 -36740394 -33733241 -29585180 -26680251 -25280775 -23838763 -22073868 -21829705 -24472158
11959 -24472158 -28816662 -32193371 -32554131 -29123894 -22155259 -12947933 -3495816 4716116
$$ packed form
12015e8454727l592486j765920P92603L256106N541037Q274786J1113740J1708803
12007b3126058P642147n29506r227841j5019911j6838605j5055705j0092304l068878
11999h5316661L359979O526222O080915L917200J972991R44307Q60403J686624
11991e9968020K961547L614833K798810Q58185p24414n33837J276632K647670
11983d7068594J387283k328105n756258o369018m301238j544812N23761J937793
11975f3519188L132937M308711N463536O036849M952505K227309M8669O08278
11967c6740394L007153M148061K904929J399476J442012J764895K44163k642453
11959b4472158m344504l376709l60760L430237O968635R207326R452117Q211932
$$ plain form
11951 4716116 11488607 17373751 22824079 27897491 32050367 34070393 33165264 30530800
11943 30530800 28853450 29537363 31208003 31753998 31126876 31139639 33015269 36221656 39472961
11934 39472961 41780055 42451678 41019776 37598671 33016154 28591359 26005801 26849859
11926 26849859 31320563 37258360 41146917 40340560 34270637 24212992 12976398 4509741
11918 4509741 2048858 5553692 11578113 16506427 19728260 23283648 28947421 36345171
11910 36345171 43546143 48559552 50075068 47421056 40404178 29379147 15611594 1633267
11902 1633267 -9199825 -14337787 -13800334 -10280343 -7108383 -5750485 -5126184 -3372599
11894 -3372599 -323741 1795739 270359 -5441829 -13008696 -19329495 -23508576 -27876781
$$ packed form
11951D716116O772491N885144N450328N073412M152876K020026r05129k634464
11943C0530800j677350O83913J670640N45995o27122J2763J875630L206387L251305
11934C9472961K307094O71623j431902l421105m582517m424795k585558Q44058
11926B6849859M470704N937797L888557q06357o069923j0057645j1236594q466657
11918D509741k460883L504834O024421M928314L221833L555388N663773P397750
11910C6345171P200972N013409J515516k654012p016878j1025031j3767553j3978327
11902A633267j0833092n137962N37453L519991L171960J357898O24301J753585
11894c372599L048858K119480j525380n712188p566867o320799m179081m368205
$$ plain form
11886 -27876781 -36001795 -49316417 -65296124 -78916986 -86281848 -87305344 -85244278 -83824355
11878 -83824355 -84651554 -86772228 -88107092 -87267243 -84413787 -80694059 -76985780 -73427472
11870 -73427472 -70282038 -68681085 -69557091 -71595392 -71045359 -64462120 -51856964 -37036958
11862 -37036958 -24904491 -18283173 -16620132 -16958791 -16144599 -12741909 -7401302 -1684854
11854 -1684854 3156082 6173250 6157855 2117032 -5319165 -13569852 -19886830 -23513226
11846 -23513226 -25803668 -28340673 -31366362 -34090395 -36012595 -37591398 -39927594 -44222878
11838 -44222878 -51293642 -60890257 -71308561 -80291050 -86749598 -91136383 -93572698 -92193159
11830 -92193159 -84627481 -71488577 -57420645 -47793388 -44544998 -45653406 -48064677 -50128733
$$ packed form
11886b7876781q125014j3314622j5979707j3620862p364862j023496K061066J419923
11878h3824355q27199k120674j334864Q39849K853456L719728L708279L558308
11870g3427472L145434J600953q76006k038301N50033O583239J2605156J4820006
11862c7036958J2132467O621318J663041l38659Q14192L402690N340607N716448
11854a684854M840936L017168j5395m040823p436197q250687o316978l626396
11846b3513226k290442k537005l025689k724033j922200j578803k336196m295284
11838d4222878p070764r596615j0418304q982489o458548m386785k436315J379539
11830i2193159P565678J3138904J4067932R627257L248390j108408k411271k064056
$$ plain form
11822 -50128733 -51291814 -50664729 -46783075 -38608416 -26466000 -12288770 775615 9396290
11814 9396290 11419508 6662973 -3336212 -16127948 -29280862 -41569231 -53807685 -67752344
11806 -67752344 -83136787 -96033257 -101316901 -97211553 -86917419 -75700520 -67090381
11799 -67090381 -61893124 -59388518 -58109966 -55959222 -51146182 -43686670 -35480530 -28568188
11791 -28568188 -23517388 -19443610 -15078617 -9752944 -4014740 247761 664988 -4019732
11783 -4019732 -12952769 -23598094 -32900780 -38222983 -38075781 -32890674 -25223898 -18689105
11775 -18689105 -16141303 -18532642 -25266444 -35546487 -49356011 -66906475 -86838286
11768 -86838286 -105209121 -117177541 -120542901 -117815167 -114567424 -115429712 -121065346 -128155468
$$ packed form
11822e0128733j163081O27085L881654Q174659J2142416J4177230J3064385Q620675
11814I396290K023218m756535r999185j2791736j3152914j2288369j2238454j3944659
11806f7752344j5384443j2896470n283644M105348J0294134J1216899Q610139
11799f7090381N197257K504606J278552K150744M813040P459512Q206140O912342
11791b8568188N050800M073778M364993N325673N738204M262501M17227m684720
11783d019732q933037j0645325r302686n322203J47202N185107P666776O534793
11775a8689105K547802k391339o733802j0280043j3809524j7550464j9931811
11768h6838286j8370835j1968420l365360K727734L247743q62288n635634p090122
$$ plain form
11760 -128155468 -131958463 -129527822 -121368020 -110305274 -98728439 -87051679 -74748462
11753 -74748462 -62113982 -50404074 -40759300 -33927271 -30902239 -32733566 -39214518 -48399898
11745 -48399898 -57946677 -66530225 -73494561 -77643330 -77448982 -72932391 -66922622 -63698262
11737 -63698262 -65782646 -71856633 -78002697 -81276989 -82088363 -83042628 -85802987 -89531465
11729 -89531465 -92152305 -92271836 -89552982 -84023458 -75953911 -66387111 -57148895 -50058759
11721 -50058759 -46199613 -45726893 -47944189 -51627308 -55857062 -60805983 -67333345 -75468963
11713 -75468963 -83551520 -89272828 -91483786 -90609192 -87428367 -82192855 -75407164 -68947052
11705 -68947052 -65362609 -65621741 -67977463 -69589171 -69191245 -67860437 -67336361 -68144968 -69558157
$$ packed form
11760a28155468l802995K430641Q159802J1062746J1576835J1676760J2303217
11753g4748462J2634480J1709908R644774O832029L025032j831327o480952r185380
11745d8399898r546779q583548o964336m148769J94348M516591O009769L224360
11737f3698262k084384o073987o146064l274292q11374r54265k760359l728478
11729h9531465k620840j19531K718854N529524Q069547R566800R238216P090136
11721e0058759L859146M72720k217296l683119m229754m948921o527362q135618
11713g5468963q082557n721308k210958Q74594L180825N235512O785691O460112
11705f8947052L584443k59132k355722j611708L97926J330808N24076q08607j413189
$$ plain form
11696 -69558157 -70974712 -72851984 -76153384 -80965816 -85760444 -88209088 -86986932 -82832296
11688 -82832296 -77706346 -72928270 -68271417 -62671453 -55234622 -45361592 -32553952 -16962454
11680 -16962454 -228097 14835510 25915408 32609733 36147124 37963866 38889847 39646712
11672 39646712 41462855 45370757 50652613 54503817 53867963 47710167 37389873 25235994
11664 25235994 13416920 3934311 -1584947 -2968908 -1898826 -482848 319259 275462
11656 275462 -1576912 -6716243 -15241230 -25232823 -34587620 -42724451 -49791833 -55028044
11648 -55028044 -57363103 -57761698 -59615484 -65723973 -75105036 -83467642 -86795763 -83933962
11640 -83933962 -75766059 -62990877 -45850334 -25991086 -7392401 5664445 11702471
$$ packed form
11696f9558157j416555j877272l301400m812432m794628k448644J222156M154636
11688h2832296N125950M778076M656853N599964P436831R873030J2807640J5591498
11680a6962454J6734357J5063607J1079898O694325L537391J816742R25981P56865
11672C9646712J816143L907902N281856L851204o35854o157796j0320294j2153879
11664B5235994j1819074r482609n519258j383961J070082J415978Q02107m3797
11656B75462j852374n139331q524987r991593r354797q136831p067382n236211
11648e5028044k335059l98595j853786o108489r381063q362606l328121K861801
11640h3933962Q167903J2775182J7140543J9859248J8598685J3056846O038026
$$ plain form
11633 11702471 12793246 12280935 12172254 12628971 13114282 13287089 12972623 11961218 10143667
11624 10143667 7667648 4823264 1807121 -1446333 -5245171 -9731732 -14248849 -17335349
11616 -17335349 -17889356 -16535450 -15579186 -17392250 -22806427 -30816183 -39318872 -46036114
11608 -46036114 -49341807 -48921263 -45832908 -41826650 -38548087 -37178900 -38281420 -41604198
11600 -41604198 -46247776 -51312841 -56197038 -60073335 -61601538 -59888011 -55673204 -50960512
11592 -50960512 -47382811 -45313045 -44311501 -43532574 -41619136 -37440215 -31829948 -27867158
11584 -27867158 -28262663 -32538895 -37534400 -40447016 -40443743 -37521081 -31377595 -22259896 -11949877
11575 -11949877 -2743279 4322150 9502212 13008858 14642997 14746049 14548936 15195059
$$ packed form
11633A1702471J090775n12311j08681M56717M85311J72807l14466j011405j817551
11624A0143667k476019k844384l016143l253454l798838m486561m517117l086500
11616a7335349n54007J353906R56264j813064n414177q009756q502689o717242
11608d6036114l305693M20544L088355M006258L278563J369187j102520l322778
11600d1604198m643578n065065m884197l876297j528203J713527M214807M712692
11592e0960512L577701K069766J001544P78927J913438M178921N610267L962790
11584b7867158l95505m276232m995505k912616L273K922662O143486R117699J0310019
11575a1949877R206598P065429N180062L506646J634139J03052j97113O46123
$$ plain form
11567 15195059 16941800 19450797 22128776 23870464 23336841 20344129 16627006 14413392
11559 14413392 14245194 14687622 14054394 11970132 9616738 9334112 13793854 24123283
11551 24123283 37931474 49884933 55377067 53836141 48123080 40979053 32708974 22279589
11543 22279589 9902224 -2017692 -10454390 -14152654 -14433088 -13498789 -11915868 -8149241
11535 -8149241 -879072 8725623 17816496 24811266 30571744 36234257 40589564 40453835
11527 40453835 33675462 21511119 8232064 -1330976 -4347724 -1254852 4771882 9854055
11519 9854055 11782454 11097019 10039691 10293738 11582583 12374282 11659314 9583512 6333632
11510 6333632 1162184 -6736962 -16587766 -26071209 -33308052 -38499621 -43573901 -50638520
$$ packed form
11567A5195059J746741K508997K677979J741688n33623k992712l717123k213614
11559A4413392j68198M42428o33228k084262k353394k82626M459742J0329429
11551B4123283J3808191J1953459N492134j540926n713061p144027q270079j0429385
11543B2279589j2377365j1919916q436698l698264k80434R34299J582921L766627
11535h149241P270169R604695R090873O994770N760478N662513M355307j35729
11527D0453835o778373j2164343j3279055r563040l016748L092872O026734N082173
11519I854055J928399o85435j057328K54047J288845P91699p14968k075802l249880
11510F333632n171448p899146r850804r483443p236843n191569n074280p064619
$$ plain form
11502 -50638520 -60787579 -73690381 -87756244 -100871191 -111388706 -118582766 -122395585
11495 -122395585 -123134866 -121283425 -116971787 -109594602 -98709931 -85492240 -72250722 -59807128
11487 -59807128 -46255786 -29490825 -10606216 6273337 17386099 21670311 20153180
11480 20153180 14596800 7127744 -246775 -6913563 -13975893 -22625601 -32651164 -43089180
11472 -43089180 -53602839 -64151665 -73662631 -80402095 -84131016 -87016935 -91615985 -98121095
11464 -98121095 -104027104 -106405057 -104215432 -98558512 -91156660 -82822145 -73193603 -61644421
11456 -61644421 -48336571 -34517052 -21985229 -12306020 -6260231 -3596543 -3087595 -3102553
11448 -3102553 -2629755 -1934806 -2047953 -3591807 -6455158 -10696751 -17084473 -25975054 -35871352
$$ packed form
11502e0638520j0149059j2902802j4065863j3114947j0517515p194060l812819
11495a22395585p39281J851441M311638P377185J0884671J3217691J3241518J2443594
11487e9807128J3551342J6764961J8884609J6879553J1112762M284212j517131
11480B0153180n556380p469056p374519o666788p062330q649708j0025563j0438016
11472d3089180j0513659j0548826r510966o739464l728921k885919m599050o505110
11464i8121095n906009k377953K189625N656920P401852Q334515R628542J1549182
11456f1644421J3307850J3819519J2531823R679209O045789K663688N08948j4958
11448c102553M72798O94949j13147j543854k863351m241593o387722q890581r896298
$$ plain form
11439 -35871352 -44038034 -48943387 -51608945 -54289606 -58357608 -63757655 -69691617 -74878873
11431 -74878873 -77487698 -76000444 -70600102 -63170848 -55580955 -48287289 -40842359 -33386197
11423 -33386197 -27212863 -23911733 -24152760 -27239398 -31566179 -35307817 -36780440 -34725269
11415 -34725269 -28991381 -21053962 -13165584 -6507591 -624808 4821289 8298607 7295364
11407 7295364 801848 -9885092 -22648095 -35799908 -47802880 -57102932 -63173854 -67104764
11399 -67104764 -70251735 -72485033 -72359861 -68875912 -62624508 -55438322 -49443226 -46195070
11391 -46195070 -45781621 -46212242 -44101014 -36914691 -25419768 -14232785 -9522709 -15291631
11383 -15291631 -31187958 -53506040 -77841398 -100550070 -118385320 -128237151 -128267035 -119317986
$$ packed form
11439c5871352q166682m905353k665558k680661m068002n400047n933962n187256
11431g4878873k608825J487254N400342P429254P589893P293666P444930P456162
11423c3386197O173334L301130k41027l086638m326781l741638j472623K055171
11415c4725269N733888P937419P888378O657993N882783N446097L477318j003243
11407G295364o493516j0686940j2763003j3151813j2002972r300052o070922l930910
11399f7104764l146971k233298J25172L483949O251404P186186N995096L248156
11391d6195070M13449m30621K111228P186323J1494923J1186983M710076n768922
11383a5291631j5896327k2318082k4335358k2708672j7835250r851831k9884Q949049
$$ plain form
11375 -119317986 -104925843 -89725640 -77120237 -67343399 -57423866 -43906802 -26483688
11368 -26483688 -8908587 3892279 9400949 8384816 3290310 -3474489 -10290610 -16427261
11360 -16427261 -21541183 -24827795 -25098941 -22242519 -18162438 -15466690 -15323865 -17138222
11352 -17138222 -19970950 -23453048 -27485435 -31984122 -37022241 -42467760 -47445615 -51067096
11344 -51067096 -54002001 -58560120 -66722182 -78449389 -91954269 -104779587 -114243220 -117869800
11336 -117869800 -114638404 -105886371 -94420277 -82677364 -71973051 -63155744 -57193490
11329 -57193490 -54800331 -55775689 -59022778 -63321466 -68136537 -73652363 -79929181 -86127258
11321 -86127258 -90814920 -92958256 -92206662 -88316412 -81180618 -71945165 -63258603 -57105578
$$ packed form
11375a19317986J4392143J5200203J2605403R776838R919533J3517064J7423114
11368b6483688J7575101J2800866N508670j016133n094506o764799o816121o136651
11360a6427261n113922l286612k71146K856422M080081K695748J42825j814357
11352a7138222k832728l482098m032387m498687n038119n445519m977855l621481
11344e1067096k934905m558119q162062j1727207j3504880j2825318r463633l626580
11336a17869800L231396Q752033J1466094J1742913J0704313Q817307N962254
11329e7193490K393159r75358l247089m298688m815071n515826o276818o198077
11321h6127258m687662k143336P51594L890250P135794R235453Q686562O153025
$$ plain form
11313 -57105578 -52257211 -44980763 -33128808 -19277509 -9269933 -7686396 -14862624 -27592253
11305 -27592253 -41447597 -52143798 -56159567 -52030473 -41597372 -28979073 -17418813
11298 -17418813 -7354623 2068593 10301066 15270568 15900821 13727833 11539384 10912213
11290 10912213 11397583 11599717 10593478 8621088 6789775 5762643 4396373 186183
11282 186183 -8196584 -19007295 -28836965 -35922831 -41253018 -46160626 -49758402 -49655604
11274 -49655604 -44982258 -37948326 -32289430 -30545548 -32726548 -36881631 -40590805 -42460023
11266 -42460023 -42956826 -43922637 -46860100 -51449774 -55813649 -58205425 -58254489 -56677891 -54350131
11257 -54350131 -52040283 -50649900 -50862085 -52234736 -53205379 -52768982 -52248333 -54716219 -61916643
$$ packed form
11313e7105578M848367P276448J1851955J3851299J0007576J583537p176228j2729629
11305b7592253j3855344j0696201m015769M129094J0433101J2618299J1560260
11298a7418813J0064190R423216Q232473M969502O30253k172988k188449o27171
11290A0912213M85370K02134j006239j972390j831313j027132j366270m210190
11282A86183q382767j0810711r829670p085866n330187m907608l597776J02798
11274d9655604M673346P033932N658896J743882k181000m155083l709174j869218
11266d2460023m96803r65811k937463m589674m363875k391776m9064J576598K327760
11257e4350131K309848J390383k12185j372651r70643M36397N20649k467886p200424
$$ plain form
11248 -61916643 -71639740 -78591346 -78307709 -70426948 -58387251 -46390578 -36831396 -30076290
11240 -30076290 -25735419 -23596470 -23504802 -24794254 -26165104 -26297175 -24642232 -21617799
11232 -21617799 -18226066 -15859790 -16360175 -21297877 -30345402 -40712017 -49135147 -54542749
11224 -54542749 -58242115 -61879378 -66406248 -73009461 -83218849 -96747871 -110032948 -118363045
11216 -118363045 -119576371 -115150597 -108137597 -100870453 -94238967 -87933598 -81115787 -73525574
11208 -73525574 -66046578 -59723562 -54484532 -49568446 -44939833 -41290620 -38756761 -36769430
11200 -36769430 -35273526 -34873221 -35398008 -35488655 -34176698 -31770664 -28409753 -22830227 -13809021
11191 -13809021 -2350731 8580780 16216227 19178710 17298395 11676941 4923249 17964
$$ packed form
11248f1916643r723097o951606K83637P880761J2039697J1996673R559182O755106
11240c0076290M340871K138949R1668j289452j370850j32071J654943L024433
11232b1617799L391733K366276n00385m937702r047525j0366615q423130n407602
11224e4542749l699366l637263m526870o603213j0209388j3529022j3285077q330097
11216a18363045j213326M425774P013000P267144O631486O305369O817811P590213
11208g3525574P478996O323016N239030M916086M628613L649213K533859J987331
11200c6769430J495904M00305n24787r0647J311957K406034L360911N579526R021206
11191a3809021J1458290J0931511P635447K962483j880315n621454o753692m905285
$$ plain form
11183 17964 -1688505 -966096 759925 2660972 4297216 5213194 5508181 6523030 10344169
11174 10344169 18284879 29525052 40953585 48661888 50369210 46743239 40204715 32623787
11166 32623787 24722256 17568036 13532459 14879839 21537042 30703732 38670345 42989467
11158 42989467 43393578 41304291 38621094 36603943 35441964 34532514 33002949 30139682
11150 30139682 25735171 20280144 14807865 10529057 8538261 9408061 12483457 15646743
11142 15646743 16498498 14164442 9613733 3990596 -2907111 -12132484 -23973916 -37236551
11134 -37236551 -49738263 -59085168 -63636319 -63927944 -63296476 -66024661 -74050137 -85580077
11126 -85580077 -96958555 -105343844 -109542913 -109493835 -106194092 -101798708 -98409890 -96199378
$$ packed form
11183A7964j706469P22409J726021J901047J636244R15978K94987J014849L821139
11174A0344169P940710J1240173J1428533P708303J707322l625971o538524p580928
11166C2623787p901531p154220m035577J347380O657203R166690P966613M319122
11158D2989467M04111k089287k683197k017151j161979r09450j529565k863267
11150C0139682m404511n455027n472279m278808j990796Q69800L075396L163286
11142A5646743Q51755k334056m550709n623137o897707r225373j1841432j3262635
11134c7236551j2501712r346905m551151k91625O31468k728185q025476j1529940
11126h5580077j1378478q385289m199069M9078L299743M395384L388818K210512
$$ plain form
11118 -96199378 -93340922 -88281671 -81746166 -76160227 -73385326 -73309063 -74305807 -74540889 -72851777
11109 -72851777 -68867580 -62732995 -54944477 -46429016 -38375086 -31456620 -25237084 -18888655
11101 -18888655 -12640228 -7866076 -5313019 -3822690 -1544823 1815901 4601307 4840793
11093 4840793 1575870 -5294066 -15413731 -27621764 -39643653 -48763800 -53113238 -52740164
11085 -52740164 -49968324 -48520158 -51312733 -58453336 -67486868 -75619509 -81391880 -84560647
11077 -84560647 -85598089 -85843715 -87065711 -89686102 -91740429 -90542898 -85347775 -77737440
11069 -77737440 -69645007 -61908959 -54751682 -48582884 -43742325 -40047756 -37225443 -35533406
11061 -35533406 -35439377 -36691360 -37992678 -37670781 -34732907 -29619102 -24237626 -21094733
$$ packed form
11118i6199378K858456N059251O535505N585939K774901P6263r96744k35082J689112
11109g2851777L984197O134585P788518Q515461Q053930O918466O219536O348429
11101a8888655O248427M774152K553057J490329K277867L360724K785406K39486
11093D840793l264923o869936j0119665j2208033j2021889r120147m349438L73074
11085e2740164K771840J448166k792575p140603r033532q132641n772371l168767
11077h4560647j037442k45626j221996k620391k054327J197531N195123P610335
11069g7737440Q092433P736048P157277O168798M840559L694569K822313J692037
11061c5533406R4029j251983j301318L21897K937874N113805N381476L142893
$$ plain form
11053 -21094733 -21865824 -26402449 -33047485 -40067403 -46974168 -54550838 -63613711 -73834353
11045 -73834353 -83806281 -91928064 -96681668 -96127732 -88201301 -72660263 -52845702 -34707849
11037 -34707849 -23398992 -20611561 -24976905 -34417018 -47610399 -63408460 -79684866
11030 -79684866 -93569488 -103022203 -107870593 -109152172 -107873279 -104814726 -100994164 -97221468
11022 -97221468 -93104277 -87639047 -81384493 -76981838 -76271139 -77275425 -75315572 -67321151
11014 -67321151 -54296165 -39612854 -26004925 -14655643 -6161233 -1177558 7386
11007 7386 -1932628 -5439587 -8878760 -11528913 -13854510 -16705116 -20413593 -24894758 -30180397
10998 -30180397 -36090671 -41481180 -44691798 -44938984 -42517015 -37456702 -29020814 -17229371
$$ packed form
11053b1094733p71091m536625o645036p019918o906765p576670r062873j0220642
11045g3834353r971928q121783m753604N53936P926431J5541038J9814561J8137853
11037c4707849J1308857K787431m365344r440113j3193381j5798061j6276406
11030g9684866j3884622r452715m848390j281579J278893L058553L820562L772696
11022i7221468M117191N465230O254554M402655P10699j004286J959853P994421
11014f7321151J3024986J4683311J3607929J1349282Q494410M983675J184944
11007G386j940014l506959l439173k650153k325597k850606l708477m481165n285639
10998c0180397n910274n390509l210618k47186K421969N060313Q435888J1791443
$$ plain form
10990 -17229371 -4178465 7025580 14376773 17532410 16897391 13119101 7284465 592957
10982 592957 -6482512 -14200542 -22537844 -30538619 -36767353 -40123123 -40263791 -37668302
10974 -37668302 -33393543 -28462651 -23366827 -18276172 -13588100 -9972356 -7995700 -8006107
10966 -8006107 -10132031 -13799437 -17300166 -18574470 -16801461 -12893878 -8257139 -3500850
10958 -3500850 1358121 5941548 9428074 11391913 12220504 12485111 12128252 10530772 7385796
10949 7385796 3294929 -781312 -4781306 -9986692 -17700136 -27193510 -35179676 -37804918
10941 -37804918 -33567206 -24453781 -14205933 -5349312 2209586 9797515 17418710 22872900
10933 22872900 23617222 19525862 13759189 10778831 13065131 19145763 24661283 25931994
$$ packed form
10990a7229371J3050906J1204045P351193L155637o35019l778290n834636o691508
10982E92957p075469p718030q337302q000775o228734l355770j40668K595489
10974c7668302M274759M930892N095824N090655M688072L615744J976656j0407
10966h006107k125924l667406l500729j274304J773009L907583M636739M756289
10958c500850M858971M583427L486526J963839Q28591K64607l56859j597480l144976
10949G385796m090867m076241l999994n205386p713444r493374p986166k625242
10941c7804918M237712R113425J0247848Q856621P558898P587929P621195N454190
10933B2872900P44322m091360n766673k980358K286300O080632N515520J270711
$$ plain form
10925 25931994 23114576 19835979 19394096 21412665 22521581 20021335 14181012 6927722
10917 6927722 -847274 -10076058 -22023193 -36626735 -52208822 -66353215 -77179120
10910 -77179120 -84455426 -89844900 -95599384 -102228005 -107126144 -105860567 -95451040 -76853731
10902 -76853731 -54384770 -32707128 -14249249 838889 12873709 21348103 25525379
10895 25525379 25955297 24852600 24500634 25186062 25093861 22602005 18389408 14646820 12260516
10886 12260516 9612456 4552805 -3120652 -11698686 -19370938 -25014706 -27543487 -25887032
10878 -25887032 -20346435 -13467336 -8897691 -9129133 -14023070 -21045065 -26988952 -30142784
10870 -30142784 -31210123 -32085174 -33875483 -36412262 -39270590 -42298558 -44974750 -46102502
$$ packed form
10925B5931994k817418l278597m41883K018569J108916k500246n840323p253290
10917F927722p774996r228784j1947135j4603542j5582087j4144393j0825905
10910g7179120p276306n389474n754484o628621m898139J265577J0409527J8597309
10902g6853731K2468961K1677642J8457879J5088138J2034820Q474394M177276
10895B5525379M29918j102697l51966O85428r2201k491856m212597l742588k386304
10886A2260516k648060n059651p673457q578034p672252n643768k528781J656455
10878b5887032N540597O879099M569645k31442m893937p021995n943887l153832
10870c0142784j067339q75051j790309k536779k858328l027968k676192j127752
$$ plain form
10862 -46102502 -44596182 -40071651 -32524166 -22310872 -10950896 -1073688 5309576 8074425
10854 8074425 7965102 5073196 -588962 -7439112 -12662498 -14626880 -14351039 -14441714 -17016800
10845 -17016800 -22342927 -28440617 -31858488 -29970109 -23382045 -15822494 -11252947 -11230365
10837 -11230365 -15023229 -21545678 -30623982 -42627724 -57191363 -72205447 -84284907
10830 -84284907 -91114239 -93832567 -96541955 -102776874 -112497555 -122573062 -129475197 -131020719
10822 -131020719 -126466104 -116468836 -103277179 -89987616 -78851273 -70272149 -63346199
10815 -63346199 -56976376 -50568088 -44323724 -39079946 -35288855 -31895715 -26907191 -19692713
10807 -19692713 -12255479 -7369212 -5564098 -4848003 -3618641 -2899204 -4847874 -9458425
$$ packed form
10862d6102502J506320M524531P547485J0213294J1359976R877208O383264K764849
10854H074425j09323k891906n662158o850150n223386j964382K75841r0675k575086
10845a7016800n326127o097690l417871J888379O588064P559551M569547K2582
10837a1230365l792864o522449r078304j2003742j4563639j5014084j2079460
10830h4284907o829332k718328k709388o234919r720681j0075507o902135j545522
10822a31020719M554615R997268J3191657J3289563J1136343Q579124O925950
10815f3346199O369823O408288O244364N243778L791091L393140M988524P214478
10807a9692713P437234M886267J805114P16095J229362P19437j948670m610551
$$ plain form
10799 -9458425 -13777718 -14693182 -11891676 -7628249 -3920522 -492710 4521920 12176673
10791 12176673 21107436 28235829 31115205 29670342 25631192 20526277 14815150 9005570
10783 9005570 4520133 2384288 1484552 -515568 -4169482 -7050022 -5947322 524535
10775 524535 11815717 26588151 42573473 55849311 62105880 59515229 49822216 36252444
10767 36252444 20935226 4790734 -10780996 -23264083 -30509404 -32577918 -31853015 -31330156
10759 -31330156 -32742435 -36027268 -40170553 -44383970 -48736248 -54042576 -61123059 -69794754
10751 -69794754 -78536157 -85578490 -90519882 -94461097 -98364080 -101879596 -104260232 -105794013
10743 -105794013 -107485181 -109723202 -112367127 -116043515 -122003497 -130124438 -138072854 -143311937
$$ packed form
10799i458425m319293r15464K801506M263427L707727L427812N014630P654753
10791A2176673Q930763P128393K879376j444863m039150n104915n711127n809580
10783I005570m485437k135845q99736k000120l653914k880540J102700O471857
10775E24535J1291182J4772434J5985322J3275838O256569k590651r693013j3569772
10767C6252444j5317218j6144492j5571730j2483087p245321k068514P24903N22859
10759c1330156j412279l284833m143285m213417m352278n306328p080483q671695
10751f9794754q741403p042333m941392l941215l902983l515516k380636j533781
10743a05794013j691168k238021k643925l676388n959982q120941p948416n239083
$$ plain form
10735 -143311937 -145327226 -145045434 -142597154 -136756098 -126551906 -112611702 -96953563 -82332143
10727 -82332143 -71776215 -67428628 -68814376 -72655545 -75235631 -75027390 -72809310 -69720205
10719 -69720205 -65924355 -60935945 -54308645 -45804471 -35665922 -25093331 -15718277 -7992524
10711 -7992524 -727631 6874983 13159479 15227990 12415454 7489105 3877121 2555447
10703 2555447 2233418 1516847 -417849 -4664950 -12240968 -22377617 -32404432 -40139898
10695 -40139898 -45660349 -50047004 -53226809 -54111216 -52378886 -48897763 -44498629 -39612849
10687 -39612849 -35367785 -33593695 -34594984 -35567926 -32467084 -23446706 -9719814 6616929
10679 6616929 24115302 40842727 53281385 58298035 56471358 52331752 50573494 52222531
$$ packed form
10735a43311937k015289K81792K448280N841056J0204192J3940204J5658139J4621420
10727h2332143J0555928M347587j385748l841169k580086K08241K218080L089105
10719f9720205L795850M988410O627300Q504174J0138549J0572591R375054P725753
10711g992524P264893P602614O284496K068511k812536m926349l611984j321674
10703B555447l22029p16571j934696m247101p576018j0136649j0026815p735466
10695d0139898n520451m386655l179805q84407J732330L481123M399134M885780
10687c9612849M245064J774090j001289r72942L100842R020378J3726892J6336743
10679F616929J7498373J6727425J2438658N016650j826677m139606j758258J649037
$$ plain form
10671 52222531 54544545 54032039 49112800 40630468 30606235 20641679 11116702 1796060
10663 1796060 -6861826 -13530557 -17604286 -20537062 -24803994 -31558498 -40014193 -49138702
10655 -49138702 -58944530 -69423016 -78729553 -83356180 -80469805 -70170641 -55834882 -42543736
10647 -42543736 -34716815 -34234390 -39958618 -48679917 -56706864 -61377550 -62158937 -60754106
10639 -60754106 -59546417 -59107980 -57142603 -50386725 -37918877 -22671500 -9759156 -3270445
10631 -3270445 -4151193 -10361336 -18577232 -25930122 -30811501 -32817461 -32337217 -29915588
10623 -29915588 -25428659 -17823036 -6240092 8256584 22413765 32595500 36719051
10616 36719051 34490083 26700790 15237942 3342643 -5549260 -9961967 -11071749 -11078202
$$ packed form
10671E2222531K322014n12506m919239q482332j0024233r964556r524977r320642
10663A796060q657886o668731m073729k932776m266932o754504q455695r124509
10655d9138702r805828j0478486r306537m626627K886375J0299164J4335759J3291146
10647d2543736P826921M82425n724228q721299q026947m670686p81387J404831
10639f0754106J207689M38437J965377O755878J2467848J5247377J2912344O488711
10631c270445q80748o210143q215896p352890m881379k005960M80244K421629
10623b9915588M486929P605623J1582944J4496676J4157181J0181735M123551
10616C6719051k228968p789293j1462848j1895299q891903m412707j109782o453
$$ plain form
10608 -11078202 -11318220 -12020977 -13003127 -13815217 -13579335 -11557276 -8038908 -4263092 -1467562
10599 -1467562 -407549 -1629793 -5337241 -10478045 -14515178 -15015565 -11847107 -7710632
10591 -7710632 -6446326 -10707050 -20725016 -34572149 -49376932 -62756269 -73649927
10584 -73649927 -82033604 -87957784 -91006600 -90585591 -86419585 -78826657 -69071010 -59650573
10576 -59650573 -53429440 -51449563 -51563961 -50087803 -45341960 -39326720 -35595317 -35604092 -37279048
10567 -37279048 -36932310 -32401350 -24582437 -16322505 -9967077 -5892613 -3182799 -1227687
10559 -1227687 -112733 463728 1759401 4694515 8176017 9537244 7122224 2220328
10551 2220328 -1905670 -2859392 -768802 2663091 6059956 8913266 10777814 10980723
$$ packed form
10608a1078202k40018p02757r82150q12090K35882K022059L518368L775816K795530
10599a467562J060013j222244l707448n140804m037133n00387L168458M136475
10591g710632J264306m260724j0017966j3847133j4804783j3379337j0893658
10584g3649927q383677n924180l048816M21009M166006P592928R755647R420437
10576e9650573O221133J979877j14398J476158M745843O015240L731403q775j674956
10567c7279048L46738M530960P818913Q259932O355428M074464K709814J955112
10559a227687J114954N76461J295673K935114L481502J361227k415020m901896
10551B220328m125998r53722K090590L431893L396865K853310J864548K02909
$$ plain form
10543 10980723 9479993 7337651 5697399 4487418 2510088 -1470152 -8110897 -17463760
10535 -17463760 -28680049 -39710565 -48013229 -51939447 -51387558 -47391796 -41433286 -34646789
10527 -34646789 -26829635 -16450388 -2680870 12491000 25183503 32995134 36747767
10520 36747767 38822683 40850030 43333379 46188962 48621295 49225538 47238910 43390911
10512 43390911 38963725 34512093 29963200 25177576 19654089 12425651 3267707 -6340345
10504 -6340345 -14217516 -19124784 -20962394 -20040568 -16780098 -11303189 -2566746 11097708
10496 11097708 29549547 49925069 69401535 88194877 109272627 137056905 177470721
10489 177470721 234974912 303619834 361707155 382633498 356116742 297360051 233289372
$$ packed form
10543A0980723j500730k142342j640252j209981j977330l980240o640745r352863
10535a7463760j1216289j1030516q302664l926218N51889L995762N958510O786497
10527c4646789P817154J0379247J3769518J5171870J2692503P811631L752633
10520C6747767K074916K027347K483349K855583K432333O04243j986628l847999
10512D3390911m427186m451632m548893m785624n523487p228438r157944r608052
10504f340345p877171m907268j837610R21826L260470N476909Q736443J3664454
10496A1097708J8451839K0375522J9476466J8793342K1077750K7784278M0413816
10489A77470721N7504191O8644922N8087321K0926343k6516756n8756691o4070679
$$ plain form
10482 233289372 181595042 144047756 115088364 90650537 69140535 49643049 32146302
10475 32146302 17467254 5263424 -6350432 -17918567 -26849090 -30154681 -28304128
10468 -28304128 -24940485 -22974931 -22037051 -19872620 -15457970 -10322302 -7042368 -6742291
10460 -6742291 -8103495 -8532703 -5881633 820661 11250731 23478627 34276927 41055667
10452 41055667 43931324 45291349 47060205 48865725 49036980 46889433 43874155 42988481
10444 42988481 47068216 56632906 68563895 77351538 78779303 73039933 64334109 57467326
10436 57467326 54727720 55387920 57282918 58505245 58086209 55800087 51584105 44923239
10428 44923239 34662904 19714071 303586 -21484430 -42606814 -60498531 -73680592
$$ packed form
10482B33289372n1694330l7547286k8959392k4437827k1510002j9497486j7496747
10475C2146302j4679048j2203830j1613856j1568135q930523l305591J850553
10468b8304128L363643J965554R37880K164431M414650N135668L279934L00077
10460f742291j361204m29208K651070O702294J0430070J2227896J0798300O778740
10452D1055667K875657J360025J768856J805520J71255k147547l015278q85674
10444D2988481M079735R564690J1930989Q787643J427765n739370q705824o866783
10436E7467326k739606O60200J894998J222327m19036k286122m215982o660866
10428D4923239j0260335j4948833j9410485k1788016k1122384j7891717j3182061
$$ plain form
10421 -73680592 -81550519 -84312231 -83072352 -79321509 -74080669 -67926880 -61781735 -56884487
10413 -56884487 -53660660 -51277049 -48804912 -46366866 -44705280 -44049793 -43841778 -43203000
10405 -43203000 -41398797 -38495847 -36114889 -36875488 -42180311 -50674098 -59332237 -65613782
10397 -65613782 -68029204 -65435019 -57119414 -43614646 -26577935 -7925080 10241926
10390 10241926 25345728 35436907 40974823 44537603 48245907 51967911 54121240 53420825
10382 53420825 49622057 43461928 36415788 29910358 24269162 18786281 12980468 7099013
10374 7099013 1092665 -6077423 -15397006 -26437958 -37491733 -46610499 -52081009 -52552422
10366 -52552422 -47763469 -39282829 -29939216 -22172917 -16851017 -13343790 -10414498 -7231376
$$ packed form
10421g3680592p869927k761712J239879L750843N240840O153789O145145M897248
10413e6884487L223827K383611K472137K438046J661586O55487K08015O38778
10405d3203000J804203K902950K380958p60599n304823q493787q658139o281545
10397f5613782k415422K594185Q315605J3504768J7036711J8652855J8167006
10390A0241926J5103802J0091179N537916L562780L708304L722004K153329p00415
10382E3420825l798768o160129p046140o505430n641196n482881n805813n881455
10374G099013o006348p170088r319583j1040952j1053775r118766n470510m71413
10366e2552422M788953Q480640R343613P766299N321900L507227K929292L183122
$$ plain form
10358 -7231376 -3928196 -1219804 639684 2289889 4362612 6294267 6448448 3606859
10350 3606859 -1699333 -7349770 -11163865 -12484639 -12473696 -12936781 -14866485 -17964451 -21154298
10341 -21154298 -23321964 -24027477 -24184431 -25927840 -30987396 -38813919 -46735194 -52253036
10333 -52253036 -54871375 -55541454 -54959567 -53103304 -50297977 -47998209 -47978454 -50722796 -54901715
10324 -54901715 -58691008 -61456232 -63693863 -65369495 -65156340 -61803063 -55434618 -46519271
10316 -46519271 -34145944 -16878834 4371206 25498123 41918708 51718243 56057735
10309 56057735 57385832 57611898 57087646 54564275 48495741 38840992 27277046 15461053
10301 15461053 3600690 -9147265 -23623284 -40192843 -58256696 -75560029 -88792069
$$ packed form
10358g231376L303180K708392J859488J650205K072723J931655J54181k841589
10350C606859n306192n650437l814095j320774J0943m63085j929704l097966l189847
10341b1154298k167666p05513j56954j743409n059556p826523p921275n517842
10333e2253036k618339o70079N81887J856263K805327K299768J9755k744342m178919
10324e4901715l789293k765224k237631j675632K13155L353277O368445Q915347
10316d6519271J2373327J7267110K1250040K1126917J6420585R799535M339492
10309E6057735J328097K26066n24252k523371o068534r654749j1563946j1815993
10301A5461053j1860363j2747955j4476019j6569559j8063853j7303333j3232040
$$ plain form
10294 -88792069 -95686895 -96162206 -91177280 -81587691 -69002573 -56826819 -49052917 -47921337
10286 -47921337 -52957585 -61381689 -68884758 -71558539 -69019946 -65285355 -64940508 -68443870
10278 -68443870 -72346095 -73646627 -72144093 -68505803 -62112120 -51847378 -37923427 -22167250
10270 -22167250 -7310546 3685200 8864508 8701159 5511943 864209 -5554939 -13931665
10262 -13931665 -22407546 -28392391 -31181272 -32176097 -32938134 -34024348 -35287965 -35996116
10254 -35996116 -34586681 -29517898 -20976047 -11287706 -3337111 1228148 2492148 1862364
10246 1862364 1490209 3358219 8093677 14598261 21247872 27672176 35184890 45097979
10238 45097979 56360495 65039513 66719987 59944212 47459855 34156780 23878782
$$ packed form
10294h8792069o894826m75311M984926R589589J2585118J2175754P773902J131580
10286d7921337n036248q424104p503069k673781K538593L734591L44847l503362
10278f8443870l902225j300532J502534L638290O393683J0264742J3923951J5756177
10270b2167250J4856704J0995746N179308j63349l189216m647734o419148q376726
10262a3931665q475881n984845k788881r94825p62037j086214j263617p08151
10254c5996116J409435N068783Q541851R688341P950595M565259J264000o29784
10246A862364l72155J868010M735458O504584O649611O424304P512714R913089
10238D5097979J1262516Q679018J680474o775775j2484357j3303075j0277998
$$ plain form
10231 23878782 17944520 15866170 16673569 19476320 23201238 26190584 26414872 22545547
10223 22545547 15039994 5926963 -2649453 -9434626 -13671117 -14545215 -11714903 -5908940
10215 -5908940 1845493 11279574 22093645 32169250 38031824 37987478 33981524 29321786
10207 29321786 25018543 19465409 11545061 2762546 -4136710 -7763844 -8751382 -8625038
10199 -8625038 -8849779 -10439922 -13271896 -15488292 -14334821 -8195663 2107009 13790613
10191 13790613 23508538 28684023 28676017 25343351 21974729 20903479 22052125 23811545
10183 23811545 24727181 23753618 19456764 10409260 -2802280 -16388551 -25107826 -25809107
10175 -25809107 -19388637 -9255257 1929650 13642697 25765558 36472873 42990211
$$ packed form
10231B3878782n934262k078350Q07399K802751L724918K989346K24288l869325
10223B2545547p505553r113031q576416o785173m236491q74098K830312N805963
10215e908940P754433R434081J0814071J0075605N862574m4346m005954m659738
10207B9321786m303243n553134p920348q782515o899256l627134r87538J26344
10199h625038k24741j590143k831974k216396J153471O139158J0302672J1683604
10191A3790613R717925N175485q006l332666l368622j071250J148646J759420
10183B3811545R15636r73563m296854r047504j3211540j3586271q719275p01281
10175b5809107O420470J0133380J1184907J1713047J2122861J0707315O517338
$$ plain form
10168 42990211 44452471 43004306 41681979 41972606 43753849 46392132 48757488 48989740
10160 48989740 45963012 41181735 38070375 38991339 43616801 50166453 57123150 63435050
10152 63435050 68268384 71507901 73897831 75828497 76264304 73565047 67323217 59058679
10144 59058679 51269407 45928040 43342116 41944558 39515100 35129467 29739842 24562884
10136 24562884 19455334 13639132 7703696 3750538 3061337 4191347 4010189 622705
10128 622705 -5032540 -10501158 -14457853 -17813600 -22258623 -28069398 -33625200 -36853378
10120 -36853378 -36745349 -33670903 -28973985 -24505903 -21849738 -21306340 -21750778 -21841175 -21242347
10111 -21242347 -20439074 -19637467 -18277961 -15603407 -11550027 -7289026 -5055347 -6999445
$$ packed form
10168D2990211J462260j448165j322327K90627J781243K638283K365356K32252
10160D8989740l026728m781277l111360R20964M625462O549652O956697O311900
10152F3435050M833334L239517K389930J930666M35807k699257o241830q264538
10144E9058679p789272n341367k585924j397558k429458m385633n389625n176958
10136B4562884n107550n816202n935436l953158o89201J130010j81158l387484
10128F22705n655245n468618l956695l355747m445023n810775n555802l228178
10120c6853378J08029L074446M696918M468082K656165N43398m44438r0397N98828
10111b1242347Q03273Q01607J359506K674554M053380M261001K233679j944098
$$ plain form
10103 -6999445 -13561595 -22793718 -31373314 -36255031 -35567283 -28800948 -17038973 -3059536
10095 -3059536 9358293 16752987 17181256 10971035 758358 -9791840 -18225842 -24477209
10087 -24477209 -29541433 -33131045 -33092348 -27139942 -14905192 1506468 18543984 33022453
10079 33022453 43651207 51079554 56347217 59563335 60494367 59959020 59556016 59776411
10071 59776411 59238778 56325783 51061729 44843253 38676196 32250947 24618689 15308662
10063 15308662 4837494 -5436913 -13924923 -19761321 -23523636 -26811742 -30667701 -34268077
10055 -34268077 -35463831 -32856961 -27118687 -19911722 -11803512 -2070824 9172740 19439939
10047 19439939 25257317 24970541 19723429 11826553 2592836 -8391099 -22333067 -39503288
$$ packed form
10103f999445o562150r232123q579596m881717O87748O766335J1761975J3979437
10095c059536J2417829P394694M28269o210221j0212677j0550198q434002o251367
10087b4477209n064224l589612L8697N952406J2234750J6411660J7037516J4478469
10079C3022453J0628754P428347N267663L216118R31032n35347m03004K20395
10071E9776411n37633k912995n264054o218476o167057o425249p632258r310027
10063A5308662j0471168j0274407q488010n836398l762315l288106l855959l600376
10055c4268077j195754K606870N738274P206965Q108210R732688J1243564J0267199
10047A9439939N817378k86776n247112p896876r233717j0983935j3941968j7170221
$$ plain form
10039 -39503288 -58128126 -75370802 -89944402 -103280691 -117149690 -130327005 -138845606
10032 -138845606 -139855219 -134200146 -124743220 -113261878 -99894346 -84749496 -68637757
10025 -68637757 -52248111 -35690198 -19216594 -3862480 8857366 17613519 21796706
10018 21796706 22052134 20361723 18836611 17908100 16077897 11945653 6278402 1591952
10010 1591952 -206037 856997 4040446 9820579 19805109 34554960 51923592 67873463
10002 67873463 78791710 82966296 80487857 72710785 61986450 50973800 41201534 32274790
9994 32274790 23096648 14005359 7141433 4308891 4818807 5913280 5074387 1308625
9986 1308625 -5642758 -16150802 -29871961 -44556966 -56759487 -64042089 -66156475 -64266737
$$ packed form
10039c9503288j8624838j7242676j4573600j3336289j3868999j3177315q518601
10032a38845606j009613N655073R456926J1481342J3367532J5144850J6111739
10025f8637757J6389646J6557913J6473604J5354114J2719846Q756153M183187
10018B1796706K55428j690411j525112r28511j830203m132244n667251m686450
10010A591952j797989J063034L183449N780133R984530J4749851J7368632J5949871
10002F7873463J0918247M174586k478439p777072j0724335j1012650r772266q926744
9994C2274790r178142r091289o863926k832542N09916J094473q38893l765762
9986A308625o951383j0508044j3721159j4685005j2202521p282602k114386J889738
$$ plain form
9978 -64266737 -59822724 -54333005 -49329486 -45808535 -43846030 -42898463 -42014928 -39648458
9970 -39648458 -34184864 -25437641 -15147105 -5268561 3838145 12715080 20669636 25507038
9962 25507038 25793504 22836267 20042062 20333360 23910910 28123849 29715211 27697165
9954 27697165 24052543 21592943 21811300 25279355 32956405 45281030 59900204 71965084
9946 71965084 77731336 77452989 74386472 71493186 69358857 66589401 61548517 53821437
9938 53821437 44291750 33942735 22987642 11491192 264468 -9633771 -17833689 -24086778
9930 -24086778 -27174096 -25854353 -21093484 -16054442 -13352842 -13135023 -14007909 -14796381 -15111935
9921 -15111935 -15285072 -16178657 -18236000 -20543916 -21751274 -21856364 -21916522 -22207431 -22289922
$$ packed form
9978f4266737M444013N489719N003519L520951J962505R47567Q83535K366470
9970c9648458N463594Q747223J0290536R878544R106706Q876935P954556M837402
9962B5507038K86466k957237k794205K91298L577550M212939J591362k018046
9954B7697165l644622k459600K18357L468055P677050J2324625J4619174J2064880
9946G1965084N766252k78347l066517k893286k134329k769456n040884p727080
9938E3821437r529687j0349015j0955093j1496450j1226724r898239q199918o253089
9930b4086778l087318J319743M760869N039042K701600K17819q72886p88472l15554
9921a5111935j73137q93585k057343k307916j207358j05090o0158k90909q2491
$$ plain form
9912 -22289922 -22723607 -24485318 -26318926 -25081010 -19687545 -12637271 -6731722 -2491225
9904 -2491225 404220 1964571 3440785 6778507 10585068 9735328 367539 -20016649
9896 -20016649 -60453762 -135940674 -247571822 -364952331 -440924191 -449920248 -406983481
9889 -406983481 -347018624 -292840463 -247684035 -209551879 -180645980 -162822604 -152743761
9882 -152743761 -145319039 -138377663 -132041079 -126145659 -119829581 -112105583 -102294692 -91321722
9874 -91321722 -82464512 -79007088 -81142929 -86707535 -94312654 -103501592 -112227060 -117050320
9866 -117050320 -116508722 -112180333 -105888430 -97890395 -88382948 -78613118 -69428439 -60390623
9858 -60390623 -51286746 -43020387 -36131945 -29959733 -24276556 -20335309 -19115119 -19673786
$$ packed form
9912b2289922m33685j761711j833608J237916N393465P050274N905549M240497
9904b491225K895445J560351J476214L337722L806561q49740r367789k0384188
9896b0016649m0437113p5486912j11631148j17380509p5971860q996057M2936767
9889d06983481N9964857N4178161M5156428L8132156K8905899J7823376J0078843
9882a52743761P424722O941376O336584N895420O316078P723998R810891J0972970
9874i1321722Q857210L457424k135841n564606p605119r188938q725468m823260
9866a17050320N41598M328389O291903P998035R507447R769830R184679R037816
9858f0390623R103877Q266359O888442O172212N683177L941247J220190n58667
$$ plain form
9850 -19673786 -20387112 -20935535 -22202417 -25271744 -31437086 -41900294 -55949498 -70100835
9842 -70100835 -80356831 -84972404 -84280223 -78900122 -69711627 -59031891 -49921218 -43873089
9834 -43873089 -40212077 -38003081 -37586443 -39763120 -44040623 -48173217 -49444478 -46610223
9826 -46610223 -40957152 -35358904 -31938513 -30645830 -30093874 -29195259 -27528066 -24654488
9818 -24654488 -19975500 -13375459 -5698625 1281370 5238930 4333545 -1294049 -9172012
9810 -9172012 -16205021 -20687737 -22467665 -21916307 -19802586 -17935611 -18668424 -23190534 -30654181
9801 -30654181 -38916727 -45456035 -47594100 -42985569 -30874227 -12912056 7370276 25689693
9793 25689693 37959947 41512395 36637844 26839076 16605460 8381856 1782247 -4384916
$$ packed form
9850a9673786p13326n48423j266882l069327o165342j0463208j4049204j4151337
9842g0100835j0255996m615573O92181N380101R188495J0679736R110673O048129
9834d3873089L661012K208996M16638k176677m277503m132594j271261K834255
9826d6610223N653071N598248L420391J292683N51956Q98615J667193K873578
9818b4654488M678988O600041P676834O979995L957560r05385n627594p877963
9810i172012p033009m482716j779928N51358K113721J866975p32813m522110p463647
9801c0654181q262546o539308k138065M608531J2111342J7962171K0282332J8319417
9793B5689693J2270254L552448m874551r798768j0233616q223604o599609o167163
$$ plain form
9785 -4384916 -10059678 -14384704 -17597405 -21154138 -25403231 -28059201 -26231845 -19841712
9777 -19841712 -11839484 -4838901 1132393 6746210 10482602 9225289 1536291 -10866259
9769 -10866259 -24821010 -37761025 -48050081 -54758444 -57974820 -58813470 -58729243 -59298414
9761 -59298414 -62542878 -70068952 -80961475 -91292263 -96718949 -95391861 -88040235 -76239792
9753 -76239792 -61777818 -47241588 -35827682 -30126974 -31296479 -38704014 -49295653 -57843015
9745 -57843015 -59716126 -54334164 -45262872 -36625489 -30082976 -25172481 -20992121 -16711455
9737 -16711455 -11792615 -7250905 -6095881 -10839531 -20226823 -29347960 -33351016 -30763911
9729 -30763911 -23634070 -15546356 -9657077 -7453696 -8355406 -10506328 -12344036 -13607892
$$ packed form
9785d384916n674762m325026l212701l556733m249093k655970J827356O390133
9777a9841712Q002228P000583N971294N613817L736392j257313p688998j2402550
9769a0866259j3954751j2940015j0289056o708363l216376q38650Q4227n69171
9761e9298414l244464p526074j0892523j0330788n426686J327088P351626J1800443
9753g6239792J4461974J4536230J1413906N700708j169505p407535j0591639q547362
9745e7843015j873111N381962R071292Q637383O542513M910495M180360M280666
9737a6711455M918840M541710J155024m743650r387292r121137m003056K587105
9729c0763911P129841Q087714N889279K203381r01710k150922j837708j263856
$$ plain form
9721 -13607892 -15128645 -17958799 -22469800 -27804270 -32396253 -35591264 -38458622 -42092119
9713 -42092119 -45222278 -44758930 -39168426 -30362593 -21754090 -15472079 -12179548 -12335729
9705 -12335729 -15998037 -21752858 -27380830 -31752889 -34957121 -36496847 -34817318 -29413050
9697 -29413050 -22462112 -17304292 -15501328 -15928649 -16358182 -15265098 -12482792 -9202859
9689 -9202859 -7623024 -9696491 -15417055 -22596957 -29043155 -34944108 -42431072 -52596062
9681 -52596062 -63687994 -72824475 -78903630 -82993600 -86300867 -89030101 -91312953 -93794751
9673 -93794751 -96463940 -97910569 -96852790 -93822616 -90216222 -85967179 -79271738 -68650043
9665 -68650043 -54488690 -38692492 -23746149 -11984051 -4480739 -162232 3077044 5803280
$$ packed form
9721a3607892j520753k830154m511001n334470m591983l195011k867358l633497
9713d2092119l130159M63348N590504Q805833Q608503O282011L292531j56181
9705a2335729l662308n754821n627972m372059l204232j539726J679529N404268
9697b9413050O950938N157820J802964m27321m29533J093084K782306L279933
9689i202859J579835k073467n720564p179902o446198n900953p486964j0164990
9681e2596062j1091932r136481o079155m089970l307267k729234k282852k481798
9673i3794751k669189j446629J057779L030174L606394M249043O695441J0621695
9665f8650043J4161353J5796198J4946343J1762098P503312M318507L239276K726236
$$ plain form
9657 5803280 6289840 2955496 -2958253 -7831719 -8618511 -4959119 1404785 8785134 16861058
9648 16861058 25729307 33713834 36906704 32050706 20116511 6149925 -4965076 -12144829
9640 -12144829 -17362968 -22206204 -25976818 -26796843 -23806434 -18307214 -13106217 -10427845
9632 -10427845 -9860054 -8372741 -2857148 7001075 18023861 25222615 24348711 14065669
9624 14065669 -3052214 -21490544 -35507292 -41717523 -39903818 -32387419 -23047920 -15993990
9616 -15993990 -13674336 -15605581 -19119645 -21539372 -21788436 -20511081 -19372358 -20274016
9608 -20274016 -24583048 -32424068 -42246697 -50848612 -54240967 -49681855 -37918741 -23483800
9600 -23483800 -12159740 -7579254 -9721990 -15947308 -23111470 -29220085 -33848594 -37276559
$$ packed form
9657E803280M86560l334344n913749m873466p86792L659392O363904P380349Q075924
9648A6861058Q868249P984527L192870m855998j1934195j3966586j1115001p179753
9640a2144829n218139m843236l770614q20025K990409N499220N200997K678372
9632a0427845N67791J487313N515593R858223J1022786P198754q73904j0283042
9624A4065669j7117883j8438330j4016748o210231J813705P516399R339499P053930
9616a5993990K319654j931245l514064k419727k49064J277355J138723r01658
9608b0274016m309032p841020r822629q601915l392355M559112J1763114J4434941
9600b3483800J1324060M580486k142736o225318p164162o108615m628509l427965
$$ plain form
9592 -37276559 -39318052 -39367670 -37720101 -36239881 -37131380 -41244433 -47992638 -56667843 -67298524
9583 -67298524 -80189733 -94769225 -108702926 -118264700 -120507573 -115737358 -107246586 -97812769
9575 -97812769 -86901301 -72186509 -53447552 -33888474 -17710620 -7411676 -3386242
9568 -3386242 -4648879 -8965322 -13003796 -13716316 -10326214 -5154981 -2373070 -5327282
9560 -5327282 -14309406 -26645877 -38981075 -49260117 -56586882 -60289863 -60262704 -57722884
9552 -57722884 -54224530 -49840999 -43610836 -36166108 -30702015 -30493857 -36059794 -45268410
9544 -45268410 -55394493 -64229770 -69917512 -71233805 -68655378 -64706084 -62621463 -64144679
9536 -64144679 -68199726 -71793724 -72809375 -72201980 -73090155 -77425696 -83816084 -88694082
$$ packed form
9592c7276559k041493m9618J647569J480220q91499m113053o748205q675205j0630681
9583f7298524j2891209j4579492j3933701r561774k242873M770215Q490772R433817
9575i7812769J0911468J4714792J8738957J9559078J6177854J0298944M025434
9568c386242j262637m316443m038474p12520L390102N171233K781911k954212
9560e327282q982124j2336471j2335198j0279042p326765l702981K7159K539820
9552e7722884L498354M383531O230163P444728N464093K08158n565937r208616
9544d5268410j0126083q835277n687742j316293K578427L949294K084621j523216
9536f4144679m055047l593998j015651O07395q88175m335541o390388m877998
$$ plain form
9528 -88694082 -89171489 -84643006 -76376221 -66286913 -55958763 -46259190 -37596355 -30355649
9520 -30355649 -24820197 -20823866 -18116253 -17260852 -19606443 -26045005 -36222508 -49152624
9512 -49152624 -63891111 -79061472 -92331884 -101287601 -104861821 -103477095 -97883064 -88287308
9504 -88287308 -74660766 -57746441 -39896269 -24849769 -15983585 -14187270 -17682022 -24191534
9496 -24191534 -32742704 -42813020 -52417771 -58320864 -58465803 -53687525 -46942814 -41245152
9488 -41245152 -38119741 -37162008 -36662190 -35055790 -32117585 -28649284 -25107289 -21077181
9480 -21077181 -16355359 -12157787 -10788678 -13981181 -21472767 -30980689 -39548424 -45269511
9472 -45269511 -48119262 -49361956 -50237102 -50990296 -50588784 -47075381 -38836747 -26499014
$$ packed form
9528h8694082m77407M528483Q266785J0089308J0328150R699573Q662835P240706
9520c0355649N535452L996331K707613Q55401k345591o438562j0177503j2930116
9512d9152624j4738487j5170361j3270412q955717l574220J384726N594031R595756
9504h8287308J3626542J6914325J7850172J5046500Q866184J796315l494752o509512
9496b4191534q551170j0070316r604751n903093j44939M778278O744711N697662
9488d1245152L125411R57733M99818J606400K938205L468301L541995M030108
9480b1077181M721822M197572J369109l192503p491586r507922q567735n721087
9472d5269511k849751j242694q75146p53194M01512L513403Q238634J2337733
$$ plain form
9464 -26499014 -13558740 -4037489 1285404 5936618 14312384 27041146 39926168 47203609
9456 47203609 45455912 34830859 17786350 -2495349 -23014871 -41532187 -56855988
9449 -56855988 -68445582 -75779938 -78592998 -77821511 -75617864 -73752829 -72150797 -69463647
9441 -69463647 -64978363 -59520400 -54576546 -51019341 -48629105 -46216280 -42011512 -34585074
9433 -34585074 -24057637 -12479316 -2834827 2476916 2653342 -1241187 -6770268 -11517895
9425 -11517895 -14676132 -17300117 -20760748 -24937174 -27940786 -27455888 -22453213 -14093683
9417 -14093683 -5157641 1902605 6821619 11277841 16503170 21381576 23330329 20924426
9409 20924426 15199606 8354048 1594602 -5523725 -13905566 -23465456 -32963116 -40998813
$$ packed form
9464b6499014J2940274R521251N322893M651214Q375766J2728762J2885022P277441
9456D7203609j747697j0625053j7044509k0281699k0519522j8517316j5323801
9449e6855988j1589594p334356k813060P71487K203647J865035J602032K687150
9441f9463647M485284N457963M943854L557205K390236K412825M204768P426438
9433c4585074J0527437J1578321R644489N311743J76426l894529n529081m747627
9425a1517895l158237k623985l460631m176426l003612M84898N002675Q359530
9417a4093683Q936042P060246M919014M456222N225329M878406J948753k405903
9409B0924426n724820o845558o759446p118327q381841r559890r497660q035697
$$ plain form
9401 -40998813 -46793622 -50020803 -50465103 -48335324 -44627004 -40603606 -36962328 -33855685
9393 -33855685 -31373402 -29249948 -26279949 -21031043 -13379968 -4582120 4310645 13126230
9385 13126230 21363683 27503422 30435839 30904798 30747411 31285395 33126485 36641311 41354453
9376 41354453 45271644 46182694 43806058 39772597 35404347 30251977 22839387 12136646
9368 12136646 -1626058 -16691431 -30155901 -39508161 -44326069 -46147529 -46563804 -45849991
9360 -45849991 -43442373 -39131299 -33600191 -28295172 -24937511 -24637380 -27058833 -30474558
9352 -30474558 -32644109 -31693467 -26738915 -18318647 -8013931 2961242 14626258 27119396
9344 27119396 39049366 47880084 51984572 51626967 48080915 42694723 36698588 30704796
$$ packed form
9401d0998813n794809l227181m44300K129779L708320M023398L641278L106643
9393c3855685K482283K123454K969999N248906P651075Q797848Q892765Q815585
9385A3126230Q237453O139739K932417M68959j57387N37984J841090L514826M713142
9376D1354453L917191R11050k376636m033461m368250n152370p412590j0702741
9368A2136646j3762704j5065373j3464470r352260m817908j821460m16275P13813
9360d5849991K407618M311074N531108N305019L357661L00131k421453l415725
9352c0474558k169551R50642M954552Q420268J0304716J0975173J1665016J2493138
9344B7119396J1929970Q830718M104488l57605l546052n386192n996135n993792
$$ plain form
9336 30704796 24125277 16231947 8255223 3285990 3270583 6877403 11135355 14556336
9328 14556336 17844764 22088254 27251083 32371980 36597319 40026261 43834765 49258231
9320 49258231 56040616 62191953 65718264 66355067 65257804 63311407 60149456 54638975
9312 54638975 46192812 36068943 27440762 23156346 22662287 21891612 17203870 9005761
9304 9005761 552629 -6248599 -12392084 -19241270 -26171938 -31621810 -35431145 -38863048
9296 -38863048 -42411196 -44468158 -42552790 -35743437 -25915810 -16746957 -11447152 -11095093
9288 -11095093 -14616110 -19862163 -24721249 -27888858 -29310667 -29923397 -30601432 -31337726 -31641829
9279 -31641829 -31406234 -30677348 -28475960 -22623908 -11582662 3293020 17567408 26226812
$$ packed form
9336C0704796o579519p893330p976724m969233j5407L606820M257952L420981
9328A4556336L288428M243490N162829N120897M225339L428942L808504N423466
9320D9258231O782385O151337L526311O36803j097263j946397l161951n510481
9312E4638975q446163j0123869q628181m284416m94059p70675m687742q198109
9304I005761q453132o801228o143485o849186o930668n449872l809335l431903
9296c8863048l548148k056962J915368O809353R827627R168853N299805L52059
9288a1095093l521017n246053m859086l167609j421809o12730o78035p36294l04103
9279c1641829K35595P28886K201388N852052J1041246J4875682J4274388Q659404
$$ plain form
9271 26226812 26952405 21408088 13459080 6103470 108845 -4757557 -8110534 -9213721
9263 -9213721 -8434570 -7536243 -8362235 -11759993 -17873202 -26741396 -37940602 -49718400
9255 -49718400 -58964590 -62452063 -58529005 -48019004 -33578106 -17970254 -2796786 11266226
9247 11266226 23469296 32719158 38179861 39673479 37571009 32894328 27561458 23656283
9239 23656283 21784940 20501763 17966949 14052718 10376582 8477513 8618327 10370520
9231 10370520 13496048 17589627 21205245 22177505 19182328 12809736 5023762 -2166465
9223 -2166465 -7436642 -10163188 -10527357 -9757903 -9676845 -11471987 -14985072 -19436813 -24631575
9214 -24631575 -31007894 -38497609 -45771777 -50903266 -52723638 -51540345 -48805790 -46288350
$$ packed form
9271B6226812P25593n544317p949008p355610n994625m866402l352977j103187
9263i213721P79151Q98327q25992l397758o113209q868194j1199206j1777798
9255d9718400r246190l487473L923058J0510001J4440898J5607852J5173468J4063012
9247A1266226J2203070R249862N460703J493618k102470m676681n332870l905175
9239B3656283j871343j283177k534814l914231l676136j899069J40814J752193
9231A0370520L125528M093579L615618R72260k995177o372592p785974p190227
9223b166465n270177k726546l64169P69454Q1058j795142l513085m451741n194762
9214b4631575o376319p489715p274168n131489j820372J183293K734555K517440
$$ plain form
9206 -46288350 -45330945 -46355279 -48600125 -50257259 -49259664 -44538442 -36832260 -28171846
9198 -28171846 -20449953 -14578248 -10902070 -9741537 -10894018 -12889661 -13647134 -12315233
9190 -12315233 -10206998 -9722542 -12527526 -18645254 -26570723 -33791004 -37777114 -37499593
9182 -37499593 -34347597 -31231398 -30469910 -32430478 -35916269 -39481782 -42449719 -45149611
9174 -45149611 -48375956 -52332875 -55981597 -57785731 -57382135 -56257806 -56418582 -58458781
9166 -58458781 -61118479 -62502389 -61424013 -57872431 -52893710 -48248842 -45724814 -46327218
9158 -46327218 -50028354 -56068176 -63084897 -69106374 -72341580 -72599158 -71410422 -69934312
9150 -69934312 -66872009 -59256282 -45537204 -27427567 -8617803 7723751 19955059
$$ packed form
9206d6288350R57405j024334k244846j657134R97595M721222P706182Q660414
9198b8171846P721893N871705L676178J160533j152481j995643p57473J331901
9190a2315233K108235M84456k804984o117728p925469p220281l986110K77521
9182c7499593L151996L116199P61488j960568l485791l565513k967937k699892
9174d5149611l226345l956919l648722j804134M03596J124329j60776k040199
9166e8458781k659698j383910J078376L551582M978721M644868K524028o02404
9158d6327218l701136o039822p016721o021477l235206k57578J188736J476110
9150f9934312L062303P615727J3719078J8109637J8809764J6341554J2231308
$$ plain form
9143 19955059 27373048 29794325 27959688 23648557 18638206 13350148 6754290 -2184215
9135 -2184215 -13080735 -24415025 -35147921 -45499184 -55787940 -65015801 -71381192 -74152259
9127 -74152259 -74291776 -73054178 -70697815 -67013801 -62448726 -57888768 -53611077 -49390476
9119 -49390476 -45891012 -45229195 -49423041 -58194228 -68585765 -76962170 -81485350 -82717020
9111 -82717020 -81918406 -78945452 -71991037 -59393993 -41549642 -21026978 -1015518 16225069
9103 16225069 29583829 38143739 40380842 34770571 21602380 4152249 -12432619 -23831114
9095 -23831114 -28378553 -26788682 -20943801 -13205796 -6047583 -1303607 444144 -466963
9087 -466963 -3465589 -7699325 -11704115 -14031146 -14362737 -13268891 -10556375 -4702241 5193918
$$ packed form
9143A9955059P417989K421277j834637m311131n010351n288058o595858q938505
9135b184215j0896520j1334290j0732896j0351263j0288756r227861o365391k771067
9127g4152259j39517J237598K356363L684014M565075M559958M277691M220601
9119d9390476L499464O61817m193846q771187j0391537q376405m523180j231670
9111h2717020P98614K972954O954415J2597044J7844351K0522664K0011460J7240587
9103A6225069J3358760Q559910K237103n610271j3168191j7450131j6584868j1398495
9095b3831114m547439J589871N844881P738005P158213M743976J747751r11107
9087d66963k998626m233736m004790k327031l31591J093846K712516N854134R896159
$$ plain form
9078 5193918 17222094 27459933 33307325 35505314 36585219 37892466 38598958 37018249
9070 37018249 31877772 22433780 8673601 -7724089 -23214372 -34144748 -38819515 -37654424
9062 -37654424 -31954736 -23488425 -14976340 -9576656 -8996440 -12358213 -17170235 -21083161
9054 -21083161 -22778009 -22134974 -20300711 -19173284 -19970083 -22030017 -23104522 -20804091
9046 -20804091 -14010350 -3511468 8573016 20556074 32547126 45332183 57628073
9039 57628073 65578299 66092934 60276184 52611093 47027932 44571945 44358770 45217066 45974972
9030 45974972 45399329 42977945 39621554 37056208 36428544 37500808 38987824 39599828 38865614
9021 38865614 36865564 33142908 26435802 16117556 3684138 -7880334 -16251354 -20860600
$$ packed form
9078E193918J2028176J0237839N847392K197989J079905J307247P06492j580709
9070C7018249n140477r443992j3760179j6397690j5490283j0930376m674767J165091
9062c7654424N699688Q466311Q512085N399684N80216l361773m812022l912926
9054b1083161j694848O43035J834263J127427p96799k059934j074505K300431
9046b0804091O793741J0498882J2084484J1983058J1991052J2785057J2295890
9039E7628073P950226N14635n816750p665091n583161k455987k13175Q58296P57906
9030D5974972n75643k421384l356391k565346o27664J072264J487016O12004p34214
9021C8865614k000050l722656o707106j0318246j2433418j1564472q371020m609246
$$ plain form
9013 -20860600 -22207403 -21143982 -19229022 -19075220 -23521647 -33996534 -49141747 -64657673
9005 -64657673 -75130962 -77217081 -71381686 -60149219 -45088890 -26711236 -7283550
8998 -7283550 7981910 13821338 8688726 -4662729 -21468675 -37227810 -48864388 -55314403
8990 -55314403 -57330923 -56243963 -52969364 -48395030 -43914938 -40548668 -37808499 -34468065
8982 -34468065 -30430171 -26800506 -23883385 -20218987 -14528410 -8236942 -5166309 -8386293
8974 -8386293 -17471339 -28761154 -38043622 -43084872 -44217058 -43236074 -41900639 -40927370
8966 -40927370 -39795948 -37497751 -33801555 -29759283 -26682322 -24773846 -23226216 -21520741
8958 -21520741 -19929657 -18637013 -17113658 -14713177 -11279052 -6783071 -1023141 5690295
$$ packed form
9013b0860600j346803J063421J914960J53802m446427j0474887j5145213j5515926
9005f4657673j0473289k086119N835395J1232467J5060329J8377654J9427686
8998g283550J5265460N839428n132612j3351455j6805946j5759135j1636578o450015
8990e5314403k016520J086960L274599M574334M480092L366270K740169L340434
8982c4468065M037894L629665K917121L664398N690577O291468L070633l219984
8974h386293r085046j1289815r282468n041250j132186R80984J335435R73269
8966d0927370J131422K298197L696196M042272L076961J908476J547630J705475
8958b1520741J591084J292644J523355K400481L434125M495981N759930O713436
$$ plain form
8950 5690295 11990366 16281630 17944757 17309053 14806183 10778799 5955926 1534585
8942 1534585 -1270722 -1657674 287317 3059781 4141996 1675984 -4326768 -12684814
8934 -12684814 -22277070 -31853288 -39417663 -43345826 -44230865 -44389730 -45156997 -45615016 -44326904
8925 -44326904 -41259988 -37355474 -33107322 -28486003 -23744108 -19398782 -15667599 -12700902
8917 -12700902 -11248829 -12322726 -15994333 -20939982 -25332763 -28053682 -29229925 -30040716
8909 -30040716 -32033512 -36205902 -42428715 -49686152 -56749569 -62476857 -65683468 -65344831
8901 -65344831 -61494643 -56012014 -52040156 -51887946 -55116776 -58950661 -60918490 -60910749 -60401786
8892 -60401786 -60264496 -60318020 -60797667 -62802665 -66539721 -70106873 -71147225 -69341609 -66303860
$$ packed form
8950E690295O300071M291264J663127o35704k502870m027384m822873m421341
8942A534585k805307l86952J944991K772464J082215k466012o002752q358046
8934a2684814r592256r576218p564375l928163q85039j58865p67267m58019J288112
8925d4326904L066916L904514M248152M621319M741895M345326L731183K966697
8917a2700902J452073j073897l671607m945649m392781k720919j176243q10791
8909c0040716j992796m172390o222813p257437p063417n727288l206611L38637
8901f5344831L850188N482629L971858J52210l228830l833885j967829P741N08963
8892f0401786J37290n3524m79647k004998l737056l567152j040352J805616L037749
$$ plain form
8883 -66303860 -63210335 -59499040 -53906239 -45797426 -35185857 -22338404 -8029691 6272105
8875 6272105 19160634 30221602 39882175 48286835 54372760 56031012 51446881 40812251
8867 40812251 26766661 12599268 -153045 -11754536 -21813997 -27902234 -27709151 -22112752
8859 -22112752 -14847107 -9051504 -5257474 -3026063 -3136541 -6864972 -13604987 -20544512
8851 -20544512 -25012463 -26544765 -26640715 -27313961 -30121211 -35604789 -42623426 -48318793 -49560974
8842 -49560974 -44899640 -35126059 -22121999 -7550876 7309941 20946006 31349921
8835 31349921 36714278 36682581 33099417 29201554 27347949 27121491 25832062 21134310 13078406
8826 13078406 3588531 -5578850 -13830001 -20906076 -25863479 -27413106 -25199144 -20522196
$$ packed form
8883f6303860L093525L711295N592801Q108813J0611569J2847453J4308713J4301796
8875F272105J2888529J1060968R660573Q404660O085925J658252m584131j0634630
8867D0812251j4045590j4167393j2752313j1601491j0059461o088237J93083N596399
8859b2112752P265645N795603L794030K231411j10478l728431o740015o939525
8851b0544512m467951j532302r5950o73246k807250n483578p018637n695367j242181
8842d9560974M661334R773581J3004060J4571123J4860817J3636065J0403915
8835C1349921N364357l1697l583164l897863j853605k26458j289429m697752q055904
8826A3078406r489875r167381q251151p076075m957403j549627K213962M676948
$$ plain form
8818 -20522196 -15798100 -13292059 -14103886 -18015053 -24072272 -31164295 -38059498 -43368583
8810 -43368583 -46213435 -47136026 -47728963 -48775049 -48978580 -46078342 -39132297 -29263549 -18385463
8801 -18385463 -7974513 878045 7286612 11254075 14053698 17030231 19945060 21036156
8793 21036156 18925979 14407302 10565755 11308765 19173487 33606512 51071291 67166772
8785 67166772 78857979 84868820 84846891 79249962 69847781 58962934 47586992 35091803
8777 35091803 21507647 9370510 2233354 1325049 4193869 6521140 4922607 -1455791
8769 -1455791 -10948317 -20604742 -28043919 -32688278 -35448303 -37647542 -40595164 -45523277
8761 -45523277 -52607103 -59674670 -62917179 -59878190 -51660052 -41767693 -32999183 -25838604
$$ packed form
8818b0522196M724096K506041q11827l911167o057219p092023o895203n309085
8810d3368583k844852r22591n92937j046086k03531K900238O946045R868748J0878086
8801a8385463J0410950Q852558O408567L967463K799623K976533K914829J091096
8793B1036156k110177m518677l841547P43010P864722J4433025J7464779J6095481
8785F7166772J1691207O010841k1929n596929r402181j0884847j1375942j2495189
8777C5091803j3584156j2137137p137156r08305K868820K327271j598533o378398
8769a455791r492526r656425p439177m644359k760025k199239k947622m928113
8761d5523277p083826p067567l242509L038989Q218138R892359Q768510P160579
$$ plain form
8753 -25838604 -19478892 -13552860 -8671680 -5919002 -6346064 -10686854 -18845389 -29230737
8745 -29230737 -38750490 -43974738 -42838348 -35615854 -24588203 -12956662 -3744671 1176756
8737 1176756 1805584 -277414 -3453615 -7401105 -12466624 -17813963 -21142159 -20877792 -18090854
8728 -18090854 -15368004 -13925044 -12652720 -10105446 -6588853 -3803820 -2984428 -4007831
8720 -4007831 -6070771 -8613344 -11577792 -15224432 -19737392 -24550418 -27833454 -26957360
8712 -26957360 -19932246 -6799506 9940751 26107714 37693171 43045632 43683534 42597177
8704 42597177 41556184 40370521 38529384 36386101 34157220 30922183 26046106 21186895
8696 21186895 19247248 20875715 23182312 22730089 19217427 15630129 15281559 19212845
$$ packed form
8753b5838604O359712N926032M881180K752678m27062m340790q158535j0385348
8745b9230737r519753n224248J136390P222494J1027651J1631541R211991M921427
8737A176756O28828k082998l176201l947490n065519n347339l328196K64367K786938
8728a8090854K722850J442960J272324K547274L516593K785033Q19392j023403
8720d007831k062940k542573k964448l646640m512960m813026l283036Q76094
8712b6957360P025114J3132740J6740257J6166963J1585457N352461O37902j086357
8704D2597177j040993j185663j841137k143283k228881l235037m876077m859211
8696B1186895j939647J628467K306597m52223l512662l587298l48570L931286
$$ plain form
8688 19212845 25807364 31919183 34448035 31795483 24572036 15200248 6863947 2268551
8680 2268551 2234365 4818679 6375603 4292148 -1303057 -8619248 -16259451 -23655202 -30336828
8671 -30336828 -36053416 -41404450 -47127744 -52632253 -56307110 -57563475 -57578314 -57597024 -57431168
8662 -57431168 -56205674 -53673384 -49856811 -43950213 -34674043 -21744762 -6367576 9599852
8654 9599852 24216215 35124748 39606833 36034115 25764765 13503997 5159668 4339550
8646 4339550 10117610 17960673 22989162 22785141 17923419 10714867 3416334 -3397780
8638 -3397780 -11439855 -23162687 -38706140 -54329911 -64388910 -65082291 -56493567 -41862396
8630 -41862396 -25712864 -12177216 -3594679 191942 976607 347484 -1205492 -3624760
$$ packed form
8688A9212845O594519O111819K528852k652552p223447r371788q336301m595396
8680B268551l4186K584314J556924k083455n595205p316191p640203p395751o681626
8671c0336828n716588n351034n723294n504509l674857j256365j4839j8710J65856
8662e7431168J225494K532290L816573N906598R276170J2929281J5377186J5967428
8654I599852J4616363J0908533M482085l572718j0269350j2260768q344329q20118
8646D339550N778060P843063N028489k04021m861722p208552p298533o814114
8638c397780q042075j1722832j5543453j5623771j0058999o93381Q588724J4631171
8630d1862396J6149532J3535648Q582537L786621P84665o29123j552976k419268
$$ plain form
8622 -3624760 -6616858 -10069937 -14418723 -19696546 -24360036 -25962400 -23514764 -18952416
8614 -18952416 -15903455 -16935220 -21940987 -28854148 -35513125 -40828103 -44636353 -47023860
8606 -47023860 -48058601 -48072835 -47920147 -48643501 -50616373 -52918890 -53755020 -51798818 -47328992
8597 -47328992 -42161272 -38583654 -38177625 -40979143 -45122477 -47490452 -45589676 -39341535
8589 -39341535 -30926241 -22797272 -16105838 -10947444 -7327251 -5266618 -4287548 -3407794
8581 -3407794 -1686459 1399864 5807054 10720095 14717324 16708811 16833818 16173855 15532791
8572 15532791 14569658 11939372 6188180 -3062831 -14459588 -25790151 -35895286 -45228406
8564 -45228406 -53992514 -60470227 -62491238 -60514002 -58076245 -58885600 -64273231 -73430225
$$ packed form
8622c624760k992098l453079m348786n277823m663490j602364K447636M562348
8614a8952416L048961j031765n005767o913161o658977n314978l808250k387507
8606d7023860j034741j4234J52688p23354j972872k302517q36130J956202M469826
8597d7328992N167720L577618M06029k801518m143334k367975J900776O248141
8589c9341535Q415294Q128969O691434N158394L620193K060633R79070Q79754
8581c407794J721335L086323M407190M913041L997229J991487J25007o59963o41064
8572A5532791r63133k630286n751192r251011j1396757j1330563j0105135r333120
8564d5228406q764108o477713k021011J977236K437757q09355n387631r156994
$$ plain form
8556 -73430225 -84585012 -95108936 -101716736 -102088161 -96218208 -85634958 -72022143 -57541708
8548 -57541708 -45597007 -39313218 -38784353 -40952206 -42717019 -43416340 -44012091 -44947440 -45642167
8539 -45642167 -45512759 -44667307 -43787994 -43784185 -45221835 -47615257 -49666105 -50808298 -52232808
8530 -52232808 -55739653 -61780959 -69257213 -76853092 -83409394 -86867195 -84266726 -73974363
8522 -73974363 -57579831 -38821561 -20876266 -5353245 6557373 13472481 15097933
8515 15097933 13367347 11305025 10680592 11126470 11298831 10247680 7648629 3529047 -1516291
8506 -1516291 -5936548 -7604863 -5004102 1699633 10480114 18272755 22438289 22211398
8498 22211398 19253525 16749861 17477073 22115319 28956246 35167508 38688269 39401755
$$ packed form
8556g3430225j1154787j0523924o607800l71425N869953J0583250J3612815J4480435
8548e7541708J1944701O283789N28865k167853j764813o99321n95751r35349o94727
8539d5642167J29408Q45452Q79313L809j437650k393422k050848j142193j424510
8530e2232808l506845o041306p476254p595879o556302l457801K600469J0292363
8522g3974363J6394532J8758270J7945295J5523021J1910618O915108J625452
8515A5097933j730586k062322o24433M45878J72361j051151k599051m119582n045338
8506a516291m420257j668315K600761O703735Q780481P792641M165534k26891
8498B2211398k957873k503664P27212M638246O840927O211262L520761P13486
$$ plain form
8490 39401755 38821933 38763516 40196819 42953034 45934655 47406592 45643535 40138858 32468668
8481 32468668 25564112 21626681 20502780 19911570 17120767 10698749 1367261 -8411043
8473 -8411043 -15977226 -20141429 -21509348 -21322422 -20513658 -20186007 -22179082 -27788241 -35560033
8464 -35560033 -41265221 -40860662 -33385673 -20885476 -6349256 7394031 17251856 19949411
8456 19949411 13688355 -144231 -17136101 -31899538 -40476865 -41547445 -35836870 -24579942
8448 -24579942 -8923673 8893374 24417528 32396589 30098264 18969809 2839166
8441 2839166 -14936820 -32296669 -47551953 -58969800 -65303606 -66030049 -61222802 -52034623
8433 -52034623 -41162696 -31576296 -24184163 -17519595 -10325334 -3824563 -770690 -2713528
$$ packed form
8490C9401755n79822n8417J433303K756215K981621J471937j763057n504677p670190
8481C2468668o904556l937431j123901n91210k790803o422018r331488r778304
8473h411043p566183m164203j367919J86926Q08764L27651j993075n609159p771792
8464c5560033n705188M04559P474989J2500197J4536220J3743287R857825K697555
8456A9949411o261056j3832586j6991870j4763437q577327j070580N710575J1256928
8448b4579942J5656269J7817047J5524154P979061k298325j1128455j6130643
8441B839166j7775986j7359849j5255284j1417847o333806p26443M807247R188179
8433e2034623J0871927R586400P392133O664568P194261O500771L053873j942838
$$ plain form
8425 -2713528 -8805246 -16736092 -23966431 -28471576 -29548477 -28190514 -25922755 -23083655
8417 -23083655 -18895241 -13150225 -6685178 187717 8380079 17948566 26007350 28225501
8409 28225501 22689993 11601937 -754848 -10851427 -16885792 -18532547 -16949806 -14620158
8401 -14620158 -14088290 -16387583 -20693439 -25265533 -28487780 -29324997 -27425512 -23213786
8393 -23213786 -18120549 -14805902 -16579030 -25308512 -39039082 -52130097 -58777647 -56814640
8385 -56814640 -48120949 -36024457 -23235271 -11993170 -4565443 -2289069 -4239672 -7564528
8377 -7564528 -9417366 -8642525 -5970839 -3033442 -1189567 -970473 -2285606 -4754094 -7549067
8368 -7549067 -9270008 -8836344 -6868457 -5569483 -6594751 -9308365 -11797454 -13547496
$$ packed form
8425b713528o091718p930846p230339m505145j076901J357963K267759K839100
8417b3083655M188414N745016O465047O872895Q192362R568487Q058784K218151
8409B8225501n535508j1088056j2356785j0096579o034365j646755J582741K329648
8401a4620158N31868k299293m305856m572094l222247q37217J899485M211726
8393b3213786N093237L314647j773128q729482j3730570j3091015o647550J963007
8385e6814640Q693691J2096492J2789186J1242101P427727K276374j950603l324856
8377g564528j852838P74841K671686K937397J843875K19094j315133k468488k794973
8368g549067j720941M33664J967887J298974j025268k713614k489089j750042
$$ plain form
8360 -13547496 -16431000 -22717853 -32380063 -42634335 -50145399 -53717380 -54964600 -56352413
8352 -56352413 -58553815 -59928410 -58738732 -55492298 -52532765 -51380180 -51075241 -49361779
8344 -49361779 -45085255 -39215752 -33956590 -31202208 -31432796 -33399607 -34772252 -33508697
8336 -33508697 -28896902 -21414261 -11993570 -1876773 7139657 13424458 17220473 21212829
8328 21212829 28443959 39326815 51063615 60132868 64946444 65974935 64085097 59708050
8320 59708050 53600398 47553957 43779345 43637165 46890695 51684527 55104853 54524910
8312 54524910 49324789 41400328 33489966 26764120 20189849 12204258 2646906 -7147803
8304 -7147803 -15956069 -24008584 -32460615 -41372783 -48364404 -49780220 -43673780 -31727985
$$ packed form
8360a3547496k883504o286853r662210j0254272p511064l571981j247220j387813
8352e6352413k201402j374595J189678L246434K959533J152585L04939J713462
8344d9361779M276524N869503N259162K754382k30588j966811j372645J263555
8336c3508697M611795P482641R420691J0116797R016430O284801L796015L992356
8328B1212829P231130J0882856J1736800R069253M813576J028491j889838m377047
8320E9708050o107652o046441l774612j42180L253530M793832L420326n79943
8312E4524910n200121p924461p910362o725846o574271p985591r557352r794709
8304g147803q808266q052515q452031q912168o991621j415816O106440J1945795
$$ plain form
8296 -31727985 -18167043 -6880768 429715 3910068 4193440 1590834 -3718918 -10969484
8288 -10969484 -18396366 -23873903 -26311261 -26268749 -24806412 -21836810 -16102761 -6854582
8280 -6854582 4753767 15829927 22921892 23419092 16922102 5787819 -6207103 -16271452
8272 -16271452 -23544214 -27754736 -27923940 -23244618 -14974766 -6719980 -2617059 -5110359
8264 -5110359 -13771109 -25570656 -36525282 -43741034 -46065988 -42995170 -34025803 -20047680
8256 -20047680 -4665753 7544740 14668248 18589473 22264399 26650158 30555184 32358397
8248 32358397 30944838 25697914 16959403 6748251 -1752266 -5961885 -5272671 -997928
8240 -997928 4624365 9620039 13240469 16158214 19583766 24085243 29317459 34661391
$$ packed form
8296c1727985J3560942J1286275P310483L480353K83372k602606n309752p250566
8288a0969484p426882n477537k437358M2512J462337K969602N734049R248179
8280f854582J1608349J1076160P091965M97200o496990j1134283j1994922j0064349
8272a6271452p272762m210522j69204M679322Q269852Q254786M102921k493300
8264e110359q660750j1799547j0954626p215752k324954L070818Q969367J3978123
8256b0047680J5381927J2210493P123508L921225L674926M385759L905026J803213
8248C2358397j413559n246924q738511j0211152q500517m209619O89214M274743
8240i97928N622293M995674L620430K917745L425552M501477N232216N343932
$$ plain form
8232 34661391 39684464 44029571 47489209 50541483 54354844 59628157 65437426 69706960
8224 69706960 70979259 69441454 66189849 62045701 57481372 53147384 49524059 46043241
8216 46043241 41546665 36097933 31495314 29122227 27876260 25444330 21552631 18728643
8208 18728643 19517884 24007825 30551043 37654383 44006253 47561327 46434339 41027479
8200 41027479 34152862 28534062 24808938 22238894 20551407 20398783 22358341 26050685
8192 26050685 30150055 33024190 33725202 32942609 33077809 37035648 46532379 61055241
8184 61055241 77815508 92517386 100900720 100743285 93202697 82318849 72698286 66805917
8176 66805917 63721240 60293131 53751161 43510150 30860277 17678917 5948295 -2262685
$$ packed form
8232C4661391N023073M345107L459638L052274L813361N273313N809269M269534
8224F9706960J272299j537805l251605m144148m564329m333988l623325l480818
8216D6043241m496576n448732m602619k373087j245967k431930l891699k823988
8208A8728643P89241M489941O543218P103340O351870L555074j126988n406860
8200D1027479o874617n618800l725124k570044j687487j52624J959558L692344
8192B6050685M099370K874135P01012p82593J35200L957839R496731J4522862
8184F1055241J6760267J4701878Q383334j57435p540588j0883848r620563n892369
8176F6805917l084677l428109o541970j0241011j2649873j3181360j1730622q210980
$$ plain form
8168 -2262685 -5956557 -6878755 -8891166 -14599776 -22951100 -30788778 -36079867 -38457800
8160 -38457800 -37087089 -29950676 -16304597 955416 16415740 25657167 27548185 23846855
8152 23846855 17436902 10640371 4016946 -3908504 -15374834 -31143617 -49222459 -65879848
8144 -65879848 -78069475 -85077044 -88186569 -89163840 -89164859 -88692948 -87940945 -86849422 -85136053
8135 -85136053 -82783117 -80609557 -80012015 -81731634 -84667407 -85900082 -82138677 -71688498
8127 -71688498 -55563469 -36930677 -19439666 -5862764 2244123 4455997 1509596 -5046601
8119 -5046601 -13851005 -24237140 -35338608 -45112530 -51201162 -52894115 -51518637 -48742272
8111 -48742272 -45259220 -41367601 -37795250 -35085778 -32675367 -29415050 -24847167 -19527104
$$ packed form
8168b262685l693872r22198k012411n708610q351324p837678n291089k377933
8160c8457800J370711P136413J3646079J7260013J5460324R241427J891018l701330
8152B3846855o409953o796531o623425p925450j1466330j5768783j8078842j6657389
8144f5879848j2189627p007569l109525r77271j019M71911P52003J091523J713369
8135h5136053K352936K173560N97542j719619k935773j232675L761405J0450179
8127g1688498J6125029J8632792J7491011J3576902Q106887K211874k946401o556197
8119e046601q804404j0386135j1101468r773922o088632j692953J375478K776365
8111d8742272L483052L891619L572351K709472K410411L260317M567883N320063
$$ plain form
8103 -19527104 -14595163 -11718071 -12797441 -18338661 -25899981 -31221057 -31527398 -27516477
8095 -27516477 -22338521 -19509123 -21672959 -29692038 -41617510 -53162247 -60504057 -62879218
8087 -62879218 -62079729 -59874576 -56764473 -52913563 -48939942 -45247945 -41426347 -37044200
8079 -37044200 -32630010 -29221944 -27221809 -26400150 -26989904 -29985715 -35910151 -43689057
8071 -43689057 -51379968 -58120923 -64978088 -73541671 -83721819 -93184532 -99154302 -100799210
8063 -100799210 -99784148 -98462810 -97604133 -95999890 -92294313 -87008676 -82544569 -81143572
8055 -81143572 -82886868 -85542519 -86045847 -82174817 -73535038 -61789723 -50004844 -41028318
8047 -41028318 -35862193 -33551177 -32629884 -32229639 -31492150 -28538918 -21159739 -9051450
$$ packed form
8103a9527104M931941K877092j079370n541220p561320n321076l06341M010921
8095b7516477N177956K829398k163836q019079j1925472j1544737p341810k375161
8087f2879218P99489K205153L110103L850910L973621L691997L821598M382147
8079c7044200M414190L408066K000135Q21659n89754k995811n924436p778906
8071d3689057p690911o740955o857165q563583j0180148r462713n969770j644908
8063a00799210J015062J321338Q58677J604243L705577N285637M464107J400997
8055h1143572j743296k655651n03328L871030Q639779J1745315J1784879Q976526
8047d1028318N166125K311016R21293M00245P37489K953232P379179J2108289
$$ plain form
8039 -9051450 4953220 16296997 21405131 19217861 10801044 -1845451 -16730663 -32453537
8031 -32453537 -48389802 -64131654 -78476083 -89285108 -94954039 -96088717 -95181419 -94282284
8023 -94282284 -93290828 -90805671 -86183196 -80152393 -73768178 -67804157 -63377245 -62085118
8015 -62085118 -64617309 -69671949 -75140300 -80260494 -85799006 -91976024 -96889630 -97377218
8007 -97377218 -91275643 -79014761 -63644039 -49371210 -39237942 -33587742 -31016853 -30965416
7999 -30965416 -34760906 -43684967 -56634863 -70413308 -81950959 -89558068 -92536188 -90907053
7991 -90907053 -85782172 -78867005 -70824439 -60676568 -47564028 -32891934 -20125783 -12362302
7983 -12362302 -10228676 -11866438 -14486666 -15933194 -15223803 -12178627 -7084825 -1042973
$$ packed form
8039i051450J4004670J1343777N108134k187270q416817j2646495j4885212j5722874
8031c2453537j5936265j5741852j4344429j0809025n668931j134678R07298Q99135
8023i4282284R91456K485157M622475O030803O384215N964021M426912J292127
8015f2085118k532191n054640n468351n120194n538512o177018m913606m87588
8007i7377218O101575J2260882J5370722J4272829J0133268N650200K570889N1437
7999c0965416l795490q924061j2949896j3778445j1537651p607109k978120J629135
7991i0907053N124881O915167Q042566J0147871J3112540J4672094J2766151P763481
7983a2362302K133626j637762k620228j446528P09391L045176N093802O041852
$$ plain form
7975 -1042973 3696725 4617493 738898 -6514642 -14292991 -19855447 -21213359 -17255799
7967 -17255799 -8302092 3429814 14582384 22330557 25501587 24488470 20457562 14402681
7959 14402681 6497494 -3580863 -15434516 -27307873 -36990042 -42911687 -43863655 -38560724
7951 -38560724 -27263569 -14123251 -6111811 -7920117 -17998708 -30404575 -40336827 -47261389
7943 -47261389 -53224181 -59614507 -66079014 -71501935 -74863007 -75245324 -71977310 -65331539
7935 -65331539 -56817193 -48314154 -40853686 -34430972 -28891594 -24555898 -21855404 -20853766
7927 -20853766 -21529727 -24200645 -29187734 -36310709 -45207607 -55793135 -67577502 -78725231
7919 -78725231 -86938230 -91615153 -94197000 -95909070 -96117457 -93662260 -88945391 -83604747
$$ packed form
7975a042973M739698R20768l878595p253540p778349n562456j357912L957560
7967a7255799Q953707J1731906J1152570P748173L171030j013117m030908o054881
7959A4402681p905187j0078357j1853653j1873357r682169n921645r51968N302931
7951c8560724J1297155J3140318Q011440j808306j0078591j2405867r932252o924562
7943d7261389n962792o390326o464507n422921l361072l82317L268014O645771
7935f5331539Q514346Q503039P460468O422714N539378M335696K700494J001638
7927b0853766o75961k670918m987089p122975q896898j0585528j1784367j1147729
7919g8725231q212999m676923k581847j712070k08387K455197M716869N340644
$$ plain form
7911 -83604747 -78642338 -74088347 -70327658 -68447386 -68849114 -70279451 -70628917 -68287625
7903 -68287625 -62707882 -54347774 -44378472 -34006933 -23878454 -14445163 -6727411 -1813547
7895 -1813547 752883 3362449 8416876 16132893 24509067 31232616 35447085 38005657
7887 38005657 40316157 42773715 44156587 42713422 37847182 30483342 21994024 13456560
7879 13456560 6039877 1214258 -64368 1986058 6456367 12379618 18592090 23850501
7871 23850501 28011510 32577382 38878656 45647966 49349233 47278092 39826730 29587762
7863 29587762 18953633 8980871 -61534 -7905760 -14162605 -18585821 -21249969 -22520726
7855 -22520726 -22869236 -22632492 -21878660 -20513657 -18642244 -16914645 -16284995 -16988257 -17736237
$$ packed form
7911h3604747M962409M553991L760689J880272m01728j430337l49466K341292
7903f8287625N579743Q360108R969302J0371539J0128479R433291P717752M913864
7895a813547K566430K609566N054427P716017Q376174O723549M214469K558572
7887C8005657K310500K457558J382872j443165m866240p363840q489318q537464
7879A3456560p416683m825619j278626K050426M470309N923251O212472N258411
7871B3850501M161009M565872O301274O769310L701267k071141p451362j0238968
7863B9587762j0634129r972762r042405p844226o256845m423216k664148j270757
7855b2520726l48510K36744P53832J365003J871413J727599O29650p03262p47980
$$ plain form
7846 -17736237 -16494348 -12430240 -6754520 -1322068 3088825 6486245 8105530 6210514
7838 6210514 -332639 -11016675 -24478765 -39551215 -54945787 -68446417 -77396616 -80350856
7830 -80350856 -78100881 -73039676 -67565018 -62900639 -59105660 -55905242 -53168751 -50365353
7822 -50365353 -45946640 -38157097 -26919014 -14530714 -4046491 2886559 6433662 7416855
7814 7416855 6495972 4342795 1833567 -256028 -1495089 -1810374 -1756240 -2710764 -5919579
7805 -5919579 -10783734 -14613140 -14810181 -11262104 -6290480 -2621606 -1874104 -4333680 -8747937
7796 -8747937 -12003768 -10329315 -2089624 10710081 24248649 35918227 45050429 51278144
7788 51278144 53450846 50416474 42084829 29565448 15167465 2589576 -4079968 -2827526
$$ packed form
7846a7736237J241889M064108N675720N432452M410893L397420J619285j895016
7838F210514o543153j0684036j3462090j5072450j5394572j3500630q950199k954240
7830h0350856K249975N061205N474658M664379L794979L200418K736491K803398
7822e0365353M418713P789543J1238083J2388300J0484223O933050L547103R83193
7814G416855r20883k153177k509228k089595j239061l15285N4134r54524l208815
7805e919579m864155l829406j97041L548077M971624L668874P47502k459576m414257
7796h747937l255831J674453Q239691J2799705J3538568J1669578R132202O227715
7788E1278144K172702l034372q331645j2519381j4397983j2577889o669544J252442
$$ plain form
7780 -2827526 4881199 15725603 27272116 38581471 48789809 56526573 61059952 62982356
7772 62982356 63082352 61044337 55752389 46421382 32982486 16006453 -2737613 -19690333
7764 -19690333 -30486276 -32307444 -25434847 -12748757 1738064 13890226 20200773 19043107
7756 19043107 11729830 1805218 -7368673 -14488083 -19847540 -23503471 -24475975 -21697909
7748 -21697909 -15110277 -5586390 5612336 16760528 25570595 30264108 31108952 30343476
7740 30343476 30191038 31241074 32887460 34577384 35829553 35447971 32016039 25793501
7732 25793501 19510142 16433209 17468973 20314817 21334210 18175652 11080915 2369308
7724 2369308 -5337974 -11054547 -15966630 -21678857 -27583783 -30281996 -26133381 -14556575
$$ packed form
7780b827526P708725J0844404J1546513J1309355J0208338P736764M533379J922404
7772F2982356R9996k038015n291948r331007j3438896j6976033j8744066j6952720
7764a9690333j0795943j821168O872597J2686090J4486821J2152162O310547j157666
7756A9043107p313277r924612r173891p119410n359457l655931r72504K778066
7748b1697909O587632R523887J1198726J1148192Q810067M693513Q44844p65476
7740C0343476j52438J050036J646386J689924J252169l81582l431932o222538
7732B5793501o283359l076933J035764K845844J019393l158558p094737q711607
7724B369308p707282n716573m912083n712227n904926k698213M148615J1576806
$$ plain form
7716 -14556575 1088667 15498138 24214089 25312898 19542869 9204469 -3474785 -17110055
7708 -17110055 -30363136 -40924466 -46214350 -45415938 -40369659 -34204531 -29317893 -26541486
7700 -26541486 -25480323 -25239235 -25243309 -25663503 -26739886 -27763690 -27591077 -26410265 -25864581
7691 -25864581 -26623179 -26883080 -24655477 -20987706 -19313766 -21493659 -25722279 -28488844
7683 -28488844 -27344228 -21523364 -11553428 400467 10523502 15153631 13163864 6693411
7675 6693411 -58245 -2947167 -188102 6310404 12283621 14596148 13304660 10110212
7667 10110212 5780052 133496 -6165704 -11447906 -14865719 -17231748 -19721562 -22714999
7659 -22714999 -26272954 -30719341 -36041079 -41512138 -46825142 -53030672 -61110141 -69499003
$$ packed form
7716a4556575J5645242J4409471Q715951J098809n770029j0338400j2679254j3635270
7708a7110055j3253081j0561330n289884P98412N046279O165128M886638K776407
7700b6541486J061163K41088m074m20194j076383j023804J72613J180812N45684
7691b5864581p58598k59901K227603L667771J673940k179893m228620k766565
7683b8488844J144616N820864R969936J1953895J0123035M630129j989767o470453
7675F693411o751656k888922K759065O498506N973217K312527j291488l194448
7667A0110212m330160n646556o299200n282202l417813k366029k489814k993437
7659b2714999l557955m446387n321738n471059n313004o205530q079469q388862
$$ plain form
7651 -69499003 -74107775 -71639603 -62798041 -51906663 -43523224 -39709002 -40251283 -44453479
7643 -44453479 -51745527 -60705509 -68655140 -73159132 -73771283 -71680034 -67678204 -61166085
7635 -61166085 -51431314 -39387739 -27499599 -18036833 -11680016 -7764833 -5526642 -4830935
7627 -4830935 -5656205 -7043520 -6871215 -2905974 5892568 19015353 34909302 51452823
7619 51452823 66221361 77055152 82805240 83487121 79863513 73364710 66410173 61932848
7611 61932848 61714081 65119970 69772697 73381139 74751371 73514148 69813931 64641485
7603 64641485 59936777 57615988 58173642 60260099 61691608 60973294 58088889 54149472
7595 54149472 50505096 48135346 47507481 48507979 50225710 50911921 48515588 41684790
$$ packed form
7651f9499003m608772K468172Q841562J0891378Q383439L814222n42281m202196
7643d4453479p292048q959982p949631m503992o12151K091249M001830O512119
7635f1166085R734771J2043575J1888140R462766O356817L915183K238191O95707
7627d830935q25270j387315J72305L965241Q798542J3122785J5893949J6543521
7619E1452823J4768538J0833791N750088O81881l623608o498803o954537m477325
7611F1932848k18767L405889M652727L608442J370232j237223l700217n172446
7603F4641485m704708k320789N57654K086457J431509p18314k884405l939417
7595E4149472l644376k369750o27865J000498J717731O86211k396333o830798
$$ plain form
7587 41684790 30620983 17095840 3408700 -9004791 -19992249 -29640846 -37057219
7580 -37057219 -40638780 -39571791 -34611019 -27286177 -18878076 -10440994 -3229368 1536986
7572 1536986 3146783 1306183 -3914372 -11316891 -18117563 -21361208 -20177009 -16178933
7564 -16178933 -11669449 -8168330 -6655816 -7953440 -11939763 -17025435 -21412899 -24803584
7556 -24803584 -28321275 -33012029 -39026555 -46007229 -53497286 -60993317 -68248016 -75441386
7548 -75441386 -82229174 -86524844 -85262359 -77180662 -64575132 -51752659 -41810780 -35123509
7540 -35123509 -30598087 -27723041 -27060178 -28887477 -31774749 -32975535 -30440772 -24241792
7532 -24241792 -15972025 -7411979 -283161 3620381 3699108 2128933 2723748 7386114 14441891
$$ packed form
7587D1684790j1063807j3525143j3687140j2413491j0987458r648597p416373
7580c7057219l581561J066989M960772P324842Q408101Q437082P211626M766354
7572A536986J609797j840600n220555p402519o800672l243645J184199L998076
7564a6178933M509484L501119J512514j297624l986323n085672m387464l390685
7556b4803584l517691m690754o014526o980674p490057p496031p254699p193370
7548g5441386o787788m295670J262485Q081697J2605530J2822473R941879O687271
7540c5123509M525422K875046O62863j827299k887272j200786K534763O198980
7532b4241792Q269767Q560046P128818L903542P8727j570175N94815M662366P055777
$$ [...]
##END NTUPLES=NMR SPECTRUM
##END=
