##TITLE=31Pdec_11P153
 CDCl3 64 sc
 10.8.2023
##JCAMPDX= 6.0         $$ Bruker NMR JCAMP-DX V2.0
##DATA TYPE= NMR SPECTRUM
##DATA CLASS= NTUPLES
##ORIGIN= UXNMR, Bruker Analytische Messtechnik GmbH
##OWNER= root
$$ XWIN-NMR		Version 3.5
$$ Thu Aug 10 16:33:01 2023 Russian Standard Time (UT+4h)  she@DPX200
##.OBSERVE FREQUENCY= 81.013821
##.OBSERVE NUCLEUS= ^31P
##.ACQUISITION MODE= SIMULTANEOUS
##.ACQUISITION SCHEME= undefined
##.AVERAGES= 72
##.DIGITISER RES= 16
##SPECTROMETER/DATA SYSTEM= spect
##.PULSE SEQUENCE= zgpg30
##.SOLVENT NAME= CDCl3
##.SHIFT REFERENCE= (INTERNAL, CDCl3, 0, 248.564)
##AUDIT TRAIL= $$ (NUMBER, WHEN, WHO, WHERE, WHAT)
$$ ##TITLE= Audit trail, XWIN-NMR		Version 3.5
$$ ##JCAMPDX= 5.01
$$ ##ORIGIN= Bruker BioSpin GmbH
$$ ##OWNER= she
$$ F:/spectra/data/she/nmr/P31/1/pdata/1/auditp.txt
$$ ##AUDIT TRAIL=  $$ (NUMBER, WHEN, WHO, WHERE, WHAT)
(   1,<2023-08-10 16:31:49.76 +0400>,<she>,<DPX200>,
      <continue with go, POWCHK disabled, PULCHK disabled
       configuration hash MD5:
       00 E9 B6 7A A2 85 ED C7 34 08 36 98 17 FE 4E 26
       data hash MD5: 32K
       70 A5 51 C7 64 11 BA D4 B1 6C E7 91 0F 1D 0B B9>)
(   2,<2023-08-10 16:31:53.78 +0400>,<she>,<DPX200>,
      <Start of raw data processing
       efp BC_mod = 2 LB = 5 FT_mod = 6 PKNL = 1 PHC0 = -10630.45 PHC1 = 69.28483 SI = 64K 
       data hash MD5: 64K
       EC 49 A3 3B CE 20 10 70 BC 0D 89 57 7C D8 E5 AA>)
(   3,<2023-08-10 16:32:32.39 +0400>,<she>,<DPX200>,
      <pk PHC0 = -2.757423 PHC1 = -58.19998 
       data hash MD5: 64K
       CF 2D 3F 23 36 1F 14 37 C5 42 E3 D4 08 7E 8B 47>)
(   4,<2023-08-10 16:32:35.93 +0400>,<she>,<DPX200>,
      <abs ABSG = 5 
       data hash MD5: 64K
       75 84 81 C5 D3 83 62 38 DF A8 41 E1 50 D9 52 07>)
$$ ##END=
$$ 
$$ hash MD5
$$ 4D 90 4B 38 CD 57 F3 4F C6 1F 86 B6 62 23 37 2D
##$RELAX= 
##$RELAX= 
##$RELAX= 
##$RELAX= 
##$RELAX= 
##$RELAX= 
##$RELAX= 
##$RELAX= 
##$RELAX= 
$$ Bruker specific parameters
$$ --------------------------
##$DU= <F:/spectra>
##$EXPNO= 1
##$NAME= <P31>
##$PROCNO= 1
##$TYPE= <nmr>
##$USER= <she>
##$AMP= (0..31)
100 100 100 100 100 100 100 100 100 100 100 100 100 100 100 100 100 100 
100 100 100 100 100 100 100 100 100 100 100 100 100 100 
##$AQSEQ= 0
##$AQ_mod= 1
##$AUNM= <au_zg>
##$AUTOPOS= <>
##$BF1= 81.014009
##$BF2= 200.13
##$BF3= 200.13
##$BF4= 200.13
##$BF5= 200.13
##$BF6= 200.13
##$BF7= 200.13
##$BF8= 200.13
##$BYTORDA= 1
##$CFDGTYP= 0
##$CFRGTYP= 5
##$CHEMSTR= <none>
##$CNST= (0..31)
1 1 145 1 1 1 1 1 1 1 1 1 1 1 1 1 1 1 1 1 1 1 1 1 1 1 1 1 1 1 1 1 
##$CPDPRG= <waltz16>
##$CPDPRG1= <>
##$CPDPRG2= <waltz16>
##$CPDPRG3= <>
##$CPDPRG4= <mlev>
##$CPDPRG5= <mlev>
##$CPDPRG6= <mlev>
##$CPDPRG7= <mlev>
##$CPDPRG8= <mlev>
##$CPDPRGB= <>
##$CPDPRGT= <>
##$D= (0..31)
0 1 0 0 0 0 0 0 0 0 0 0.03 2e-05 3e-06 0 0 0 0 0 0 0 0 0 0 0 0 0 0 0 0 
0 0 
##$DATE= 1691670604
##$DBL= (0..7)
120 120 120 11 120 120 24 19 
##$DBP= (0..7)
150 150 150 150 150 150 150 150 
##$DBP07= 0
##$DBPNAM0= <>
##$DBPNAM1= <>
$$ [...]
##$SUBNAM3= <"">
##$SUBNAM4= <"">
##$SUBNAM5= <"">
##$SUBNAM6= <"">
##$SUBNAM7= <"">
##$SUBNAM8= <"">
##$SUBNAM9= <"">
##$SW= 501.771253377433
##$SWIBOX= (0..15)
0 1 3 0 0 0 0 0 0 0 0 0 0 0 0 0 
##$SW_h= 40650.406504065
##$TD= 32768
##$TD0= 1
##$TE= 0
##$TE2= 300
##$TE3= 300
##$TEG= 300
##$TL= (0..7)
0 120 53 12 22 120 120 120 
##$TP= (0..7)
150 150 150 150 150 150 150 150 
##$TP07= 0
##$TPNAME0= <>
##$TPNAME1= <>
##$TPNAME2= <>
##$TPNAME3= <>
##$TPNAME4= <>
##$TPNAME5= <>
##$TPNAME6= <>
##$TPNAME7= <>
##$TPOAL= (0..7)
0.5 0.5 0.5 0.5 0.5 0.5 0.5 0.5 
##$TPOFFS= (0..7)
0 0 0 0 0 0 0 0 
##$TUNHIN= 0
##$TUNHOUT= 0
##$TUNXOUT= 0
##$USERA1= <user>
##$USERA2= <user>
##$USERA3= <user>
##$USERA4= <user>
##$USERA5= <user>
##$V9= 5
##$VALIST= <valist>
##$VCLIST= <CCCCCCCCCCCCCCC>
##$VD= 0
##$VDLIST= <DDDDDDDDDDDDDDD>
##$VPLIST= <PPPPPPPPPPPPPPP>
##$VTLIST= <TTTTTTTTTTTTTTT>
##$WBST= 1024
##$WBSW= 4
##$XGAIN= (0..3)
0 0 0 0 
##$XL= 0
##$YL= 0
##$YMAX_a= 4452
##$YMIN_a= -6306
##$ZGOPTNS= <>
##$ZL1= 120
##$ZL2= 120
##$ZL3= 120
##$ZL4= 120
##$ABSF1= 248.5645
##$ABSF2= -253.2056
##$ABSG= 5
##$ABSL= 3
##$ALPHA= 0
##$AQORDER= 0
##$ASSFAC= 0
##$ASSFACI= 0
##$ASSFACX= 0
##$ASSWID= 0
##$AUNMP= <proc_1d>
##$AZFE= 0.1
##$AZFW= 0.5
##$BCFW= 0
##$BC_mod= 2
##$BYTORDP= 0
##$COROFFS= 0
##$CY= -3
##$DATMOD= 1
##$DC= 0
##$DFILT= <>
##$DTYPP= 0
##$F1P= 0
##$F2P= 0
##$FCOR= 1
##$FTSIZE= 65536
##$FT_mod= 6
##$GAMMA= 0
##$GB= 0
##$INTBC= 1
##$INTSCL= 6.047779e-11
##$ISEN= 30
##$LB= 5
##$LEV0= 0
##$LPBIN= 0
##$MAXI= 10000
##$MC2= 0
##$MEAN= 0
##$ME_mod= 0
##$MI= 50
##$NCOEF= 0
##$NC_proc= -10
##$NLEV= 6
##$NOISF1= 182.463
##$NOISF2= 159.3651
##$NSP= 0
##$NTH_PI= 0
##$NZP= 0
##$OFFSET= 248.5645
##$PC= 4
##$PHC0= -10633.21
##$PHC1= 11.08485
##$PH_mod= 1
##$PKNL= yes
##$PPARMOD= 0
##$PSCAL= 0
##$PSIGN= 0
##$REVERSE= no
##$SF= 81.0140089999694
##$SI= 65536
##$SIGF1= 159.3651
##$SIGF2= -187.1042
##$SINO= 113.3802
##$SIOLD= 16384
##$SREGLST= <1H.CDCl3>
##$SSB= 0
##$STSI= 65536
##$STSR= 0
##$SW_p= 40650.406504065
##$SYMM= 0
##$S_DEV= 0
##$TDeff= 32768
##$TDoff= 0
##$TI= <>
##$TILT= no
##$TM1= 0
##$TM2= 0
##$TOPLEV= 0
##$USERP1= <user>
##$USERP2= <user>
##$USERP3= <user>
##$USERP4= <user>
##$USERP5= <user>
##$WDW= 1
##$XDIM= 65536
##$YMAX_p= 397981670
##$YMIN_p= -53431697
$$ End of Bruker specific parameters
$$ ---------------------------------
##NTUPLES= NMR SPECTRUM
##VAR_NAME=  FREQUENCY,     SPECTRUM/REAL,   SPECTRUM/IMAG
##SYMBOL=    X,             R,               I
##VAR_TYPE=  INDEPENDENT,   DEPENDENT,       DEPENDENT
##VAR_FORM=  AFFN,          ASDF,            ASDF
##VAR_DIM=   65536,         65536,           65536
##UNITS=     HZ,            ARBITRARY UNITS, ARBITRARY UNITS
##FACTOR=    0.620285442955139, 1,           1
##FIRST=     20137.2065510682, 0,            0
##LAST=      -20513.1999529968, 0,           0
##MIN=       -20513.1999529968, -53431697,   0
##MAX=       20137.2065510682, 397981670,    0
$$ Real data points
##PAGE= N=1
##DATA TABLE= (X++(R..R)), XYDATA
$$ [...]
42290B2812573l146174l363799l014265j912868j01974J938402L428601L747167
42282B0387663K843485J277182j49955r39419j225821j545214k158575k630720
42274A5858626k253912r43481M61988R58379L81112m83876p70101l49708K63120
42265A3122147O33129P84147Q66412P51542K46486l68825l79747N95122K052872
42256A8303285L037798L046385K348158J548331J102681J180579J613585J862075
42248C4042877J369107J93339r11827j283638j055748q59682j018188j362051
42240B9114189j701987k024110k182270j870530j150995o81397j073703k149584
42232A6279613l079391l181277k426141j314443m75138k22632k20765K74882J462781
$$ y = [22812573, 19666399, 16302600, 13288335, 11375467, 11273493, 13211895, 16640496, 20387663, 23231148, 24508330, 24358375, 23418956, 22193135, 20647921, 18489346, 15858626, 13604714, 12661233, 13123221, 14081600, 14462712, 13978836, 13208735, 12859027, 13122147, 13755276, 14539423, 15405835, 16157377, 16403863, 16035038, 15655291, 16250413, 18303285, 21341083, 24387468, 26735626, 28283957, 29386638, 30567217, 32180802, 34042877, 35411984, 35605323, 34693496, 33409858, 32354110, 31494428, 30476240, 29114189, 27412202, 25388092, 23205822, 21335292, 20184297, 19502900, 18429197, 16279613, 13200222, 10018945, 7592804, 6278361, 5803223, 5580591, 5359826, 5634708, 7097489]
42223G097489K345933J518228j220011m345046n888262n018835k333744R38375
42215f905873L691956N311228N884491O058952O324039O431075N770601M202737
42207C6769206K147945m1048k286769m319381n575977n865371n709027n637072
42199I482506n455082m643185l265413j979428j202629p57839m11924k96605n65974
42190i095573r79966j133751q98092l44382N87185J935214L229364L597720K672577
42181d29704J227084N84887J341300K823483L802842L519388J987590l05400k620171
42172A1931299m052465l930053k357902j73121J758930L029246L476375K948886
42164A2631195J619302K39143m28895m28147m90200j090967j989780k749161l265695
$$ y = [7097489, 9443422, 10961650, 9741639, 5396593, -491669, -5510504, -7844248, -6905873, -3213917, 2097311, 7981802, 14040754, 20364793, 26795868, 32566469, 36769206, 38917151, 38876103, 36589334, 32269953, 26693976, 20828605, 15119578, 9482506, 4027424, -615761, -3881174, -5860602, -7063231, -7821070, -8232994, -8529599, -9095573, -10075539, -11209290, -12107382, -12451764, -11864579, -9929365, -6700001, -3102281, -429704, 797380, 1382267, 2723567, 5547050, 9349892, 12869280, 14856870, 14551470, 11931299, 7878834, 3948781, 1590879, 1417758, 3176688, 6205934, 9682309, 12631195, 14250497, 14489640, 14060745, 13632598, 13142398, 12051431, 10061651, 7312490, 4046795]
42155D046795l555824l391009k533933j162623K98478J678173L039175M196425
42147B615657M662037M218309L246010K263564J343696K35806j076301k252804
42139A5255974l017994l399038l464110l130326k481266k063138k435664l334483
42131h070045l617555k354935R8966K368421L414731L425419L277011L366683
42123A908696L279924K576539J543699R10043R33096J056213N55369o00363j594674
42114A0568542j405833L54680L046052N358382O228225N549047L972198K077831
42106C5749124k6556k284822m280357n530633n928559n578057m469591k778529
42098D872020j280030q36143j411779k116769k296903k043182j536796o16896
$$ y = [4046795, 490971, -2900038, -5433971, -6596594, -6298116, -4619943, -1580768, 2615657, 7277694, 11496003, 14742013, 17005577, 18349273, 18585079, 17508778, 15255974, 12237980, 8838942, 5374832, 2244506, -236760, -2299898, -4735562, -8070045, -11687600, -14042535, -13943569, -11575148, -8160417, -4734998, -1457987, 1908696, 5188620, 7765159, 9308858, 10218901, 11151997, 12208210, 12763579, 12163216, 10568542, 9162709, 9517389, 12563441, 17921823, 24150048, 29699095, 33671293, 35749124, 35722568, 33437746, 29157389, 23626756, 17698197, 12120140, 7650549, 4872020, 3591990, 2755847, 1344068, -772701, -3069604, -5112786, -6649582, -7266478]
42090g266478O19670J437610J295371O56354L70685N64899P71106Q77889J174732
42081E01838J514751J233820J15775j151394j742229j482654o86649L23453J232401
42072a40888J638786J336571N70450j95562o69173q26084q07814q00764q29359
42063g23837o26945P4064J090827J845571J880426J128486j83509j535713k160013
42054G89357j645288n39317J88026L47138O11415J331468K044583K465980L143760
42045H737122M520949N975984O507500N924917M688882L038754J099833n09662
42037C9984279j178772j350105k146189l819463n331962n628605m617012k728854
42029A3183317l33561J985594L259960K909867J442094n7518r46714j264171j222410
$$ y = [-7266478, -6646808, -5209198, -3913827, -3257473, -2886788, -2321889, -1550783, -672894, 501838, 2016589, 3250409, 3366184, 2214790, 472561, -1010093, -1696742, -1373289, -140888, 1497898, 2834469, 3404919, 3209357, 2540184, 1714100, 906286, 105522, -723837, -1350782, -1276718, -185891, 1659680, 3540106, 4668592, 4485083, 2949370, 789357, -855931, -1395248, -1207222, -860084, -248669, 1082799, 3127382, 5593362, 8737122, 13258071, 19234055, 25741555, 31666472, 36355354, 39394108, 40493941, 39984279, 38805507, 37455402, 35309213, 31489750, 26157788, 20529183, 15912171, 13183317, 12849756, 14835350, 18095310, 21005177, 22447271, 22389753, 21443039, 20178868, 18956458]
42020A8956458q71784k18813N68703J114334J022104K85626n31793q18165o03439
42011A8903231l58495j18681O13915J871900K727071K298968Q86221m69937j341565
42002B5012628k239482l594407m961505n468403m757972l241998j542661Q1986
41994g11814J671890L036185L566557K824827J225236k07057q41100r45954j126684
41985H492086j563308j936891j802751q89630O15505J865375J831127L33445j712249
41976E232709l409139m827698o317837p254684o328493l177922R16790M198457
41968b0967817N837522O037007N322684M172737L038931K230172J735355J354281
41960H760872R84474O78669M94141L72979J12591n33907j543595k372329k289830
$$ y = [18956458, 18084674, 17865861, 18434564, 19548898, 20571002, 20856628, 20324835, 19506670, 18903231, 18544736, 18426055, 19039970, 20911870, 23638941, 25937909, 26824130, 26354193, 25012628, 22773146, 19178739, 14217234, 8748831, 3990859, 748861, -793800, -711814, 960076, 3996261, 7562818, 10387645, 11612881, 11405824, 10564724, 9618770, 8492086, 6928778, 4991887, 3189136, 2299506, 2915011, 4780386, 6611513, 6944958, 5232709, 1823570, -3004128, -9321965, -16576649, -22905142, -26083064, -25166274, -20967817, -15130295, -9093288, -3770604, 402133, 3441064, 5671236, 7406591, 8760872, 9745346, 10424015, 10918156, 11291135, 11403726, 10869819, 9326224, 6953895, 4664065]
41951D664065j179260J51224P14632L96205P3899O27195J925008K893800K590245
41942A2857013J134827m69988j357176j453303j162313p45373k45505K33160N48993
41933I340335P34579Q46795O87615P2547o53799q51656m42641p0383k18956o37859
41923H806577r31713j237306j822604k351869k165171j191368m0597Q10254J415424
41914A291627J860702J864689J140887j39611j482845k496002l065088l332599
41906d358240l603956m017931m190436l515300k048390p54019m79858r05584r82970
41897b4856684l26512L88520N29733M58577R78737K153910L196404L504863L357347
41888a0615105L401045L774961M033779L789763L090300K137842R63714l95108
$$ y = [4664065, 3484805, 3636029, 4350661, 4746866, 4820765, 5447960, 7372968, 10266768, 12857013, 13991840, 13521852, 12164676, 10711373, 9549060, 8803687, 8558182, 8791342, 9340335, 10074914, 10921709, 11609324, 11681871, 11028072, 10176416, 9733775, 9663392, 9444436, 8806577, 7874864, 6637558, 4814954, 2463085, 297914, -893454, -934051, -123797, 1291627, 3152329, 5017018, 6157905, 6018294, 4535449, 2039447, -1025641, -4358240, -7962196, -11980127, -16170563, -19685863, -21734253, -22488272, -22968130, -23873714, -24856684, -25183196, -24794676, -24264943, -23806366, -22827629, -20673719, -17477315, -13972452, -10615105, -7214060, -3439099, 594680, 4384443, 7474743, 9612585, 10576299, 10181191]
41880A0181191j566415k006656j542429n33655N93095J759870K990973L933414
41872A3809388M018614L215195K315683K173207K736068L112032K591832J319610
41864C5291629j51996j612351l092850m156009l895471k014428L98810J698667
41856B2466001J331925K70193l29518m73470r81928k086916k967624k766588j596831
41847A2865244k67676O68479J222238J494615J362428P42304j36599r28820j512302
41838A5509911j979785k379592k629753k687426k680714k806007l102785l335050
41830f091201l106111k150883n76172J199423K795942M165302N481265O720121
41822H437686P441821P125959N756679L946182K356697J080162k20977j578618
$$ y = [10181191, 8614776, 6608120, 5065691, 4532036, 5125131, 6885001, 9875974, 13809388, 17828002, 21043197, 23358880, 25532087, 28268155, 31380187, 33972019, 35291629, 35139633, 33527282, 30434432, 26278423, 22382952, 20368524, 20767334, 22466001, 23797926, 24068119, 23738601, 23265131, 22283203, 20196287, 17228663, 14462075, 12865244, 12597568, 13266047, 14488285, 15982900, 17345328, 18087632, 17951033, 17022213, 15509911, 13530126, 11150534, 8520781, 5833355, 3152641, 346634, -2756151, -6091201, -9197312, -11348195, -11924367, -10724944, -7929002, -3763700, 1717565, 8437686, 15879507, 23005466, 28762145, 32708327, 35065024, 36145186, 35924209, 34345591]
41814C4345591k422912k242271j397244r73317j743605l424093n016813n762506
41806A1362830n672486n243296m838464m412145l732554k694563j322841L83616
41798a6169903K326800L976336M476660L400394J329016n56628j454813j365344
41790d037482o82366K81528J337789K334268L193090L833571L952844L125340
41782A3338582J304368r20877k693095l384138k734987q78089J536190L531731
41774I099685M501841M632689M433441M061002L408046K600583J891947J114793
41766C5744027k28764k190663m094832n208406n370299m807818l731923k431645
41758G679677j468029j320318j865542k501307k794757k802655k747225k575366
$$ y = [34345591, 31922679, 29680408, 28283164, 27309847, 25566242, 22142149, 17125336, 11362830, 5690344, 447048, -4391416, -8803561, -12536115, -15230678, -16553519, -16169903, -13843103, -9866767, -5390107, -1989713, -660697, -1217325, -2672138, -4037482, -4719848, -4438320, -3100531, -766263, 2426827, 6260398, 10213242, 13338582, 14642950, 13722073, 11028978, 7644840, 4909853, 4031764, 5567954, 9099685, 13601526, 18234215, 22667656, 26728658, 30136704, 32737287, 34629234, 35744027, 35515263, 33324600, 29229768, 24021362, 18651063, 13843245, 10111322, 7679677, 6211648, 4891330, 3025788, 524481, -2270276, -5072931, -7820156, -10395522]
41750a0395522j932094n42764J351478K936621L370757K537489J176955J66977
41742a330103j83926l977O96361K011219L586727M529921M134209K539603N24497
41733A6504531j217120k481907l442568m347937n246356n802497n416057l702737
41725a5152648r21027K093757M365876N193930M458908K823087J467401J208200
41717E537484J768945K170657J887767J335993J165535J470723J928917K339263
41709A9605284K591623K311798J069317r89889l063323m340471m525720l781055
41701H877564k541414j475693j219463j829830k637226k814179k016081m72723
41693f129045J257754K500318K755525K074444J000734l6896j072026k154004
$$ y = [-10395522, -12327616, -12870380, -11518902, -8582281, -5211524, -2674035, -1497080, -1330103, -1514029, -1518006, -821645, 1189574, 4776301, 9306222, 13440431, 15980034, 16504531, 15287411, 12805504, 9362936, 5014999, -231357, -6033854, -11449911, -15152648, -16073675, -13979918, -9614042, -4420112, 38796, 2861883, 4329284, 5537484, 7306429, 9477086, 11364853, 12700846, 13866381, 15337104, 17266021, 19605284, 22196907, 24508705, 25578022, 24588133, 21524810, 17184339, 12658619, 8877564, 6336150, 4860457, 3640994, 1811164, -826062, -3640241, -5656322, -6129045, -4871291, -2370973, 384552, 2458996, 3459730, 3422834, 2350808, 196804]
41685A96804k847977k565214j280303M18263J931264K999128L519411L390882
41677E762258K640565J494908K65783p12916j112701p95838M5838J083178K057915
41668A0728990K631208K327563J098321k10499n57647M3195N03410M1564r37891
41659A5668214j560255j476518p20826Q49756L197453N367192N911124M308115
41651C1544255J546669r10107k421507l238240l620641l348316k168374m36355
41643A6947384R78358J482801J308300J133761J245844J272537P30483m23736
41635B4675732j867246l249710m233772m400960l471751j689295J65733J230317
41627G159048J098341Q1028r88656j387636j104077p27898o86783q00434p10346
$$ y = [196804, -2651173, -5216387, -6496690, -6078427, -4147163, -1148035, 2371376, 5762258, 8402823, 9897731, 10163514, 9450598, 8337897, 7542059, 7587897, 8671075, 10728990, 13360198, 15687761, 16786082, 16575583, 16017936, 16061131, 16564541, 16606105, 15668214, 14107959, 12631441, 11910615, 12760371, 15957824, 21325016, 27236140, 31544255, 33090924, 32180817, 29759310, 26521070, 22900429, 19552113, 17383739, 16947384, 17925742, 19408543, 20716843, 21850604, 23096448, 24368985, 25099468, 24675732, 22808486, 19558776, 15325004, 10924044, 7452293, 5762998, 5928731, 7159048, 8257389, 8338417, 7349761, 5962125, 4858048, 4130150, 3443367, 2642933, 1932587]
41618A932587m39476k14317K6734N00267J041997J198991R68860J042999K064611
41609H123253L845018N491088O162675N596405M083883K148366J99089j603656
41601C4046121l138596m060053l996889l119608k269083k249058l016867l740292
41593H455675l649465k715749j514194n74099N8693O97365J579289K614198L525558
41584H477271M132463M426210M448858M227154L809826L222824K341106R43058
41576C6028770r67293k902745m065340l895696k564757r67210j27106m34958j382873
41567A8720792k055747j885284r73537J26015P76300N52217m78866j650799k102022
41558A1029069j504263l50475N67183Q70160O92626K40261m58705j319574j981545
$$ y = [1932587, 1493111, 1278794, 1305528, 1805795, 2847792, 4046783, 5015643, 6058642, 8123253, 11968271, 17459359, 23622034, 29218439, 33302322, 35450688, 35649777, 34046121, 30907525, 26847472, 22850583, 19730975, 17461892, 15212834, 12195967, 8455675, 4806210, 2090461, 576267, 2168, 60861, 758226, 2337515, 4951713, 8477271, 12609734, 17035944, 21484802, 25711956, 29521782, 32744606, 35085712, 36028770, 35061477, 32158732, 28093392, 24197696, 21632939, 20665729, 20538623, 20103665, 18720792, 16665045, 14779761, 13806224, 13932239, 14708539, 15260756, 14781890, 13131091, 11029069, 9524806, 9174331, 9741514, 10611674, 11304300, 11544561, 11085856, 9766282, 7784737]
41549G784737k062548j590626r80050n34407j61055K93625O16493M39386j36646
41540C668909m65284p7824P31974J257351J179218Q26240P61209J311532K374675
41531A1568000L416204L734856L023639J666417K45149j178991k963713n077550
41523A4434011o791871p315692o438918m450434j807214Q80305K893592L842461
41515d753760L947439L637533L016649J992905P89250q333R3639J177456K937937
41506A2830715M768234N911361N851751M638817K716481N37363j479060k825976
41498C2949686l186048k857371k550003k658961k985014l183625l140814k819141
41490I568709k126582j179724m18807k03185m88664j094373j994978l013004l463823
$$ y = [7784737, 5722189, 4131563, 3151513, 2617106, 2456051, 2749676, 3366169, 3805555, 3668909, 3203625, 3125801, 3857775, 5115126, 6294344, 7120584, 7881793, 9193325, 11568000, 14984204, 18719060, 21742699, 23409116, 23654265, 22475274, 19511561, 14434011, 7642140, 326448, -6112470, -10562904, -12370118, -11489813, -8596221, -4753760, -806321, 2831212, 5847861, 7840766, 8630016, 8621683, 8715322, 9892778, 12830715, 17598949, 23510310, 29362061, 34000878, 36717359, 37254722, 35775662, 32949686, 29763638, 26906267, 24356264, 21697303, 18712289, 15528664, 12387850, 9568709, 7442127, 6262403, 5843596, 5640411, 5151747, 4057374, 2062396, -950608, -4414431]
41481d414431k625542o37424J395339K307249J716016K0287k071253l844124m714524
41472a2868407m434264l222064j578492O0149J481757K615411L411125L806580
41464a0728205L749024L240128K406728J554148J104054J356046K178638K930312
41456G790873K837612J597944l63856k211473l179840k818575j124604J268794
41448C796875L211972L756436K855027J211799m33015j570795j699341n56968
41440A0571990J149068J864933O46430j730937l592396m096655l647187k782832
41432a617586j424656N77251K746908M232737M486176L498349J723558K2438p20566
41423A3524609l78972J90681Q2365o24914j096150q50941k30340J97338K81138
$$ y = [-4414431, -7039973, -7677397, -6282058, -3974809, -2258793, -2238506, -4309759, -8153883, -12868407, -17302671, -20524735, -22103227, -22043078, -20561321, -17945910, -14534785, -10728205, -6979181, -3739053, -1332325, 221823, 1325877, 2681923, 4860561, 7790873, 10628485, 12226429, 11862573, 9651100, 6471260, 3652685, 2528081, 3796875, 7008847, 10765283, 13620310, 14832109, 14399094, 12828299, 11128958, 10571990, 11721058, 13585991, 14232421, 12501484, 8909088, 4812433, 1165246, -1617586, -3042242, -2464991, 281917, 4514654, 9000830, 12499179, 14222737, 14245175, 13524609, 13145637, 13336318, 13418683, 12793769, 11697619, 10846678, 10616338, 10813676, 11094814]
41414A1094814K75896N12495J137397J875710K012656R88726q23966k265244k538027
41405A2270457j973392j430433j218649r89531n41880k53543n79918j422409k204017
41396A656685k446496k125809j549742j044110p31265m67108L5459Q95776J801449
41387c975161K161485J669452O89236n4910j66784J86553P01225J326654K099009
41378D636759K841287L298562L428865L268508K609871J186217p76582k515836
41370A7977651l368716l253807k499662j509621o83908k77936p0426N13222J597192
41361H423989K421955K159613J041997J75368J82874N16596L47593k49843m02280
41352A4617862M17576J726897K565627K447294J659131P69608M0297o36139j353854
$$ y = [11094814, 11370710, 11883205, 13020602, 14896312, 16908968, 17897694, 17073728, 14808484, 12270457, 10297065, 8866632, 7647983, 6658452, 6116572, 5863029, 5283111, 3860702, 1656685, -789811, -2915620, -4465362, -5509472, -6240737, -6707845, -6672386, -5776610, -3975161, -1813676, -144224, 545012, 490102, 323318, 509871, 1211096, 2537750, 4636759, 7478046, 10776608, 14205473, 17473981, 20083852, 21270069, 20493487, 17977651, 14608935, 11355128, 8855466, 7345845, 6661937, 6384001, 6313575, 6826797, 8423989, 10845944, 13005557, 14047554, 14222922, 14405796, 14922392, 15269985, 15020142, 14617862, 15035438, 16762335, 19327962, 21775256, 23434387, 24203995, 24244292, 23608153, 22254299]
41343B2254299j944287k183888k117625j973310j745889j082590K65934J992995
41335A3465639L426765M162156M336683M248199L879824K941680J294532q12182
41327C6943296k877300m376494m908376m382670l211733k147676j688357j633303
41319A1717387j361697n49713N14210J323707J688868J777629J724080J342328
41311A8176799K86415j489693l412096m475901l897020j709557J223506L769747
41303H472200N138425N122110L988576K249123M39719j037214j984128k410068
41295A9978743k477874k360372k054224j362852j51720J357699K555261K693772
41287A8178433J298751j374369m173561n650910n189413l477664j668820k54418
$$ y = [22254299, 20310012, 18126124, 16008499, 14035189, 12289300, 11206710, 11472644, 13465639, 16892404, 21054560, 25391243, 29639442, 33519266, 36460946, 37755478, 36943296, 34065996, 29689502, 24781126, 20398456, 17186723, 15039047, 13350690, 11717387, 10355690, 9805977, 10320187, 11643894, 13332762, 15110391, 16834471, 18176799, 18463214, 16973521, 13561425, 9085524, 5188504, 3478947, 4702453, 8472200, 13610625, 18732735, 22721311, 24970434, 25410153, 24372939, 22388811, 19978743, 17500869, 15140497, 13086273, 11723421, 11571701, 12929400, 15484661, 18178433, 19477184, 18102815, 13929254, 8278344, 3088931, -388733, -2057553, -2311971]
41279b311971R47147K004915K726625L246691L997461M798673M626987K833865
41271B2870393K09601j708010k157652j527483m83767O22337J505362J737713
41263B1068494J072522k75181j780204k877058l167717k692258j975521j456551
41255G916526q65252M43503K464413M260503M888659M290613L109721J989716
41247B8498402J309609J244838J619284J797120J157094j97651j410530j670762
41239C2347404r70257l4486M05099J80666m38885j258678k279316l249110l433195
41230B1269242k248500j28325J582621J726938J92006k242195m538815n826815
41222I786157n654113m203484k145074q4771J727926L099477L661245L244924
$$ y = [-2311971, -1364824, 640091, 3366716, 6613407, 10610868, 15409541, 20036528, 22870393, 23079994, 21371984, 19214332, 17686849, 17203082, 17825419, 19330781, 21068494, 22141016, 21865835, 20085631, 17208573, 14040856, 11348598, 9373077, 7916526, 7051274, 7494777, 9959190, 14219693, 19108352, 23398965, 26508686, 28498402, 29808011, 31052849, 32672133, 34469253, 35626347, 35428696, 34018166, 32347404, 31377147, 31342661, 31747760, 31928426, 31489541, 30230863, 27951547, 24702437, 21269242, 19020742, 18892417, 20475038, 22201976, 22393982, 20151787, 15612972, 9786157, 4132044, -71440, -2216514, -2301285, -573359, 2526118, 6187363, 9432287]
41214I432287K271833J424806J019805R33107R63895R25160N20715m02971j435844
41205A5652793j842233j397579p30093o56022j337288k209175k581472k203107
41197B695824j378327o49726l00931j47663Q4870K59148j5429o89871j122226
41188a264331q65154l32500l33501j085107k039585k608961k640887k126673r05167
41179a4201866J013799L056362M385792M622258M095318L406113K898147K533570
41171A1809493K087363J376379M10400n57793j108918q37282L93632K160977L436617
41162A9170868L186114J384265o55624j367125m72317P99466J113638L67387n27041
41153B2999631q81389q99559j202811k015868k912456l241733k768759j927562
$$ y = [9432287, 11704120, 13128926, 14148731, 15081838, 16045733, 16970893, 17491608, 17088637, 15652793, 13810560, 12412981, 11682888, 11026866, 9689578, 7480403, 4898931, 2695824, 1317497, 667771, 366840, 219177, 304047, 563195, 547766, -142105, -1264331, -2129485, -2461985, -2795486, -3880593, -5920178, -8529139, -11170026, -13296699, -14201866, -13188067, -10131705, -5745913, -1123655, 2971663, 6377776, 9275923, 11809493, 13896856, 15273235, 15683635, 15125842, 14016924, 13179642, 13573274, 15734251, 19170868, 22356982, 23741247, 23085623, 21718498, 21246181, 22045647, 23159285, 23526672, 22999631, 22118242, 21218683, 20015872, 18000004, 15087548, 11845815, 9077056, 7149494]
41145G149494j381832j304567j227301o64954L13286J278296J980374K447856
41137H590652K718746K785255K733287K658216K490027K159690J873132J918494
41129B7927499K221888K395320K237856J905585J566738J178954O58079J4222
41121D0106141p07426j377574j698585j469595r26673n19075m17244o15248j352921
41112C1021800k770602m115842m114219k495027m63592Q14444J536639K440022
41104B1853623L284276L105042J715021J7579j153331j683249j628650r02720
41096B4607591J92760Q67800P47711L72061L56726M86465J07221r23439k177527
41087B4637369l279943m021249l981943k718992n57897J228709J410527r0413
$$ y = [7149494, 5767662, 4463095, 3235794, 2570840, 2884126, 4162422, 6142796, 8590652, 11309398, 14094653, 16827940, 19486156, 21976183, 24135873, 26009005, 27927499, 30149387, 32544707, 34782563, 36688148, 38254886, 39433840, 40091919, 40106141, 39398715, 38021141, 36322556, 34852961, 33926288, 33407213, 32989969, 32374721, 31021800, 28251198, 24135356, 20021137, 17526110, 17062518, 17876962, 19413601, 21853623, 25137899, 28242941, 29957962, 29975541, 28822210, 27138961, 25510311, 24607591, 24800351, 25668151, 26415862, 26787923, 27144649, 27631114, 27738335, 26814896, 24637369, 21357426, 17336177, 13354234, 10635242, 10077345, 11306054, 12716581, 12626168]
41079A2626168k197804l657548l888393l053107j668930l28693L98556J82470
41071a587281p37767j547427j425882k55805J228801K017014J601768L37550q69904
41062a238933j290449r04828k47528K35230N22240P04197O32173J30154o28665
41053b086409j298479j844870k496624l200988l504663l111739k232234j173884
41045b0949890J02867J684895L146804L734764L206616K224199J760727K252729
41037b836289L420428M709127N639110N803125M931104L219828J394175Q7890
41029B6368498q18443j933217l402077m571294m729841l835760k305140m96146
41021D276580J198376K118939J866763J011550O52300J135102J713733J663992
$$ y = [12626168, 10428364, 6770816, 2882423, -170684, -1839614, -2168307, -1769751, -1587281, -2325048, -3872475, -5298357, -5554162, -4325361, -2308347, -706579, -369029, -1238933, -2529382, -3434210, -3681738, -3446508, -2924268, -2220071, -1587898, -1457744, -2086409, -3384888, -5229758, -7726382, -10927370, -14432033, -17543772, -19776006, -20949890, -20847023, -19162128, -16015324, -12280560, -9073944, -6849745, -5089018, -2836289, 584139, 5293266, 10932376, 16735501, 21666605, 24886433, 26280608, 26368498, 25550055, 23616838, 20214761, 15643467, 10913626, 7077866, 4772726, 4276580, 5474956, 7593895, 9460658, 10472208, 11124508, 12259610, 13973343, 15637335]
41013A5637335J211564J005616J104835J005777M86654r6830l82171m70108o89871
41004A8812801j153886j721045k257300k725411l001428k748962j636938K52657
40996C820488K298945L725783M134465L652919K652589J428636J09139j252715
40988B0570249k505586l289124l241516k480459j735434j712519k332612k828886
40980D44113k586008j661678n49538K38062L65186j20373o33313m83833L13229
40971d674153R65261Q55784K52244k29741n58980j239182k430811l522563l629638
40962a4211779k320600P2678K601501M222559M550660M243614M419077N487962
40954I065672O626110O551257M859800K515305R17005N06540M82517j1015p03897
$$ y = [15637335, 16848899, 17854515, 18959350, 19965127, 20451781, 20354951, 19972780, 19502672, 18812801, 17658915, 15937870, 13680570, 10955159, 7953731, 5204769, 3567831, 3820488, 6119433, 9845216, 13979681, 17632600, 20285189, 21713825, 21822964, 20570249, 18064663, 14775539, 11534023, 9053564, 7318130, 5605611, 3272999, 444113, -2141895, -3803573, -4353111, -4115049, -3749863, -3870236, -4503549, -4987382, -4674153, -3708892, -2853108, -2600864, -2830605, -3389585, -4628767, -7059578, -10582141, -14211779, -16532379, -16459701, -13858200, -9635641, -5084981, -841367, 3577710, 9065672, 15691782, 22243039, 27102839, 29618144, 30535149, 31041689, 31524206, 31513191, 30809294]
40945C0809294o06013N07606J580522J485166L48275o97862q63072m37670k92066
40936C1834180r60306k227107l437046m184155m683299n289655n691691n033373
40928C27548l085199q68228L37428L37693q6250l74396o42121j011047j189762
40919f254334r47577m97350j06218L11462R09981J510644J829251J937691K153304
40910H46854K499836K566183J988652R04214k12350j098876j912692k798227l412631
40901f29037l172913k015635o30987K13541L77626K64804L35919Q99138J999282
40892b358262L126583L363278K360075R68083L00660K82583j73358j515570k844779
40883C509293l122602k415431j513670q69350m53178k69149l91231o35872o83316
$$ y = [30809294, 30203281, 30710887, 32291409, 33776575, 34124850, 33426988, 32563916, 32126246, 31834180, 30873874, 28646767, 25209721, 21025566, 16342267, 11052612, 5360921, 327548, -2757651, -3625879, -3288451, -2950758, -3037008, -3411404, -4053525, -5064572, -6254334, -7201911, -7699261, -7805479, -7494017, -6584036, -5073392, -3244141, -1306450, 846854, 3346690, 5912873, 7901525, 8805739, 8593389, 7494513, 5581821, 2783594, -629037, -3801950, -5817585, -6448572, -6235031, -5857405, -5592601, -5256682, -4357544, -2358262, 768321, 4131599, 6491674, 7459757, 7760417, 8043000, 7869642, 6354072, 3509293, 386691, -2028740, -3542410, -4411760, -4864938, -5134087, -5525318, -6161190, -6844506]
40874f844506m62205q2774M60661J158388J708955J783367J489485J215613J119979
40865A546963J174512J589145K630239L935710M541854L859015K279745N84684
40857B2141867r29911k422238l851257m772956m817491m145840l368971l069904
40849e236701l339912l691774l498476k618457j535666q17249n28657k66368L57924
40840b1175336J390781K554855L408466L604477L234697K863472K963484L338241
40832B183137L379911K892460K299436J954777J680966J239387Q30994O94793
40824A7155861N56235J00423j71302O65301K532851L990050L682319J703394q40434
40815B9374698l117601m866317n802274n556682m289516k798524j801720j389105
$$ y = [-6844506, -7306711, -7389485, -6928824, -5770436, -4061481, -2278114, -788629, 426984, 1546963, 2721475, 4310620, 6940859, 10876569, 15418423, 19277438, 21557183, 22141867, 21211956, 18789718, 14938461, 10165505, 5348014, 1202174, -2166797, -5236701, -8576613, -12268387, -15766863, -18385320, -19920986, -20738235, -21266892, -21533260, -21175336, -19784555, -17229700, -13821234, -10216757, -6982060, -4118588, -1155104, 2183137, 5563048, 8455508, 10754944, 12709721, 14390687, 15630074, 16461068, 17155861, 17712096, 17812519, 17641217, 18306518, 20839369, 24829419, 28511738, 30215132, 29374698, 26257097, 21390780, 15588506, 10031824, 5742308, 2943784, 1142064, -247041]
40807b47041j215925r01308j95466Q82559J960688K655528L066752L631121M443305
40798A4080213N095944N290830N179535M881947M086428K503535M67750j268849
40790D0317333k183496k139422j126237O91988K654603L715215L124085J045103
40782D6099172j401843k671757j690024J316178M763834O726068O226115L685323
40774F3053066L38666k621611m545980n429267n707333n801765n720139n117952
40766B8447685l752434j810995J72087J594537J980118J086775r70733l631737
40758B3115303n998601p230487p041930n874519m487915l340222k415595j570065
40750a4844031p90772l9992Q92716K153838L551078M680648N217177M929490L605050
$$ y = [-247041, -1462966, -2364274, -2559740, -1677181, 283507, 2939035, 6005787, 9636908, 14080213, 19176157, 24466987, 29646522, 34528469, 38614897, 41118432, 41586182, 40317333, 38133837, 35994415, 34868178, 35560166, 38214769, 41929984, 45054069, 46099172, 44697329, 42025572, 40335548, 41651726, 46415560, 53141628, 59367743, 63053066, 63391732, 60770121, 56224141, 50794874, 45087541, 39285776, 33565637, 28447685, 24695251, 22884256, 23056343, 24650880, 26630998, 27717773, 26747040, 23115303, 17116702, 9886215, 2844285, -3030234, -7518149, -10858371, -13273966, -14844031, -15634803, -15674795, -14782079, -12628241, -9077163, -4396515, 820662, 5750152, 9355202]
40741I355202J298786j332060l222041l592506k456428n35107J173844J867867
40733B557557J346598J52078q00835q87089j29522R91572J925555K270941J850118
40724I276973P57329o76810k036574k959490l200139k715805j758855p72416o2162
40715d147949M13965Q44473J183339J131883O09994J42294N41336K099463M209442
40706G028240N898570O647568O576390N994740N063427L882433K602087J322486
40698D5015941Q3279r49031j497133j513440j317557j240447j289158j288754
40690C6003700j143622p80627q2736Q15110J330000R07071l13591j577302k249606
40681C2908397k236547j758175j085773n71540n56756r93901j341446j060742
$$ y = [9355202, 10653988, 9321928, 6099887, 2507381, 50953, -484154, 689690, 2557557, 3904155, 4056233, 3255398, 2368309, 2238787, 3230359, 5155914, 7426855, 9276973, 10034302, 9357492, 7320918, 4361428, 1161289, -1554516, -3313371, -4085787, -4147949, -3733984, -2889511, -1706172, -574289, 35705, 177999, 719335, 2818798, 7028240, 12926810, 19574378, 26150768, 32145508, 37208935, 41091368, 43693455, 45015941, 45099220, 44150189, 42653056, 41139616, 39822059, 38581612, 37292454, 36003700, 34860078, 34079451, 33996715, 34811825, 36141825, 37048896, 36735305, 35158003, 32908397, 30671850, 28913675, 27827902, 27256362, 26699606, 25705705, 24364259, 23303517]
40673B3303517j55573Q95410J649036K031048K256571K551464K910218L034872
40665C8476563K555856J410572l548j107803j562722j399369q28021m3447P83434
40656C8281515J455622J797345J727867J228089K88799r62312k065650k379033
40648C9372242j643728l56541O23555Q73833O94547O40462R77327J616237K310296
40639D5108230K750084K646253J952066J007333L71803M74884J303338K261719
40631E7875710K468247J583277M18851L01187J569302L037985L275188K138709
40623G2668456O73307k52213o63171r02951r27673m35704N78164J639471K106971
40614G4484657J634770M32632r24542k037349k988071m018388n027911n573028
$$ y = [23303517, 23147944, 24043354, 25692390, 27723438, 29980009, 32531473, 35441691, 38476563, 41032419, 42442991, 42439443, 41331640, 39768918, 38369549, 37541528, 37498081, 38281515, 39737137, 41534482, 43262349, 44490438, 44779237, 43816925, 41751275, 39372242, 37728514, 37371973, 37995528, 38869361, 39563908, 40204370, 41181697, 42797934, 45108230, 47858314, 50504567, 52456633, 53463966, 53835769, 54310653, 55613991, 57875710, 60343957, 61927234, 62346085, 62647272, 64216574, 67254559, 70529747, 72668456, 73341763, 73089550, 72426379, 71523428, 70595755, 70160051, 70738215, 72377686, 74484657, 76119427, 76552059, 75627517, 73590168, 70602097, 66583709, 61555798, 55982770]
40606E5982770n276820m072226k165902j981J796741K666775K299052O20500k081545
40597D9767364m801930o017411m837671j913889J181600L367663M501230M759649
40589D6006605M347466L809482L815418M293095M328895L285921J612377K57454
40581G1756713k98138j45653M31959R89140R21983j0115j272043k035037j978832
40572F8359977j353177m65884M70940J089036R53606R1942q01796r11007p6517
40563F7357120J008115J478416J270643J272080K218439L500715L501529J279694
40555H2886751k412675n945772q250786r196227q987220p763833n730151l264275
40547C1335812q07226J217523K453420K762775K304387J417527N57320K79105
$$ y = [55982770, 50705950, 46633724, 44467822, 44465841, 46262582, 48929357, 51228409, 51848909, 49767364, 44965434, 38948023, 34110352, 32196463, 33378063, 36745726, 41246956, 46006605, 50354071, 54163553, 57978971, 62272066, 66600961, 69886882, 71499259, 71756713, 71458575, 71312922, 71744881, 72734021, 73656004, 73645889, 72373846, 70338809, 68359977, 67006800, 66540916, 67011856, 68100892, 69054498, 69146440, 68344644, 67433637, 67357120, 68365235, 69843651, 71114294, 72386374, 74604813, 78105528, 81607057, 82886751, 80474076, 74528304, 66277518, 57081291, 48094071, 40330238, 34600087, 31335812, 30528586, 31746109, 34199529, 36962304, 39266691, 40684218, 41241538, 41520643]
40539D1520643Q62496J787765K042928J303673M35894L90715R15635R02424j61902
40530E0000271j634384k530689k409426j506213n26129l47005j380191k984985
40522C6681249l852504l182735j306289Q57376K606131L631844L808472L151447
40514D2394991J899520M53092p72917j460959j499087j017371k54907N45986J055000
40505D1343348R12864J71730m92005m16184K31827O89679O75340P68368J531304
40496D5416271K630178L144056K585353J382361M16468J90855L95937K77723m90594
40487E5948608j410092j815825j751308j761632j874070j380677J15590J923479
40479D7994073K944977K841599K120048J308506N81777J66895N54295J982893
$$ y = [41520643, 42383139, 44170904, 46213832, 47517505, 47953399, 48344114, 49259749, 50162173, 50000271, 48365887, 45835198, 43425772, 41919559, 41393430, 41046425, 39666234, 36681249, 32828745, 29646010, 28339721, 29197097, 31803228, 35435072, 39243544, 42394991, 44294511, 44747603, 43974686, 42513727, 41014640, 39997269, 39742362, 40288348, 41343348, 42256212, 42427942, 41935937, 41519753, 41751580, 42441259, 43116599, 43884967, 45416271, 48046449, 51190505, 53775858, 55158219, 55574687, 55765542, 56161479, 56439202, 55948608, 54538516, 52722691, 50971383, 49209751, 47335681, 45955004, 46070594, 47994073, 50939050, 53780649, 55900697, 57209203, 57790980, 57957875, 58512170, 60495063]
40471F0495063L927435N415570N916045N796050N798141O074166N876680M360702
40463A03659852J658348j033831k510353k589363k079013j915416k448217l379128
40455H9362879m121148m184821l414683k052760o51512J40328r7432j253334k698865
40446G1028652l743033m149019m180956m159816m037560l418883k006232q2579
40438D5250574J493819K002741J649963J368925J661603J983051J633505Q94484
40430E7938665O13019P70525K76190j534965l823135n112503m847767l660233
40422D0619796k411546j479159q28728k82452L35207R82899J252890O55782q49109
40413C7995580k658220l812020l470389j368220J909426N152140P250818P789506
$$ y = [60495063, 64422498, 69838068, 75754113, 81550163, 87348304, 93422470, 99299150, 103659852, 105318200, 104284369, 101774016, 99184653, 97105640, 95190224, 92742007, 89362879, 85241731, 81056910, 77642227, 75589467, 74937955, 75078283, 74980851, 73727517, 71028652, 67285619, 63136600, 58955644, 54795828, 50758268, 47339385, 45333153, 45250574, 46744393, 48747134, 50397097, 51766022, 53427625, 55410676, 57044181, 57938665, 58551684, 59322209, 59598399, 58063434, 54240299, 49127796, 44280029, 40619796, 38208250, 36729091, 35900363, 35617911, 35953118, 36936017, 38188907, 38844689, 37995580, 35337360, 31525340, 28054951, 26686731, 28596157, 33748297, 40999115, 48788621]
40405D8788621O993353N355650L470892J962198J195744J054171J171882J351589
40397G1344100J615666J971192K329563K582023K590278K225879J608986J139931
40389H7407618J007411P92197p0978j441817k444732k413128j625616r74729j065930
40380G9170296j746896k393558k531238k192990j716248j250611o07870L54579
40372F7085464J403469K143245K383248K101884J288934J86907m74775n587J381589
40363G7494378K598376K700194J601901k29349k305241m094619m929056m454163
40355F8382421l086011j662760o85386j82260k14574j044832k603802m076346
40347E4826450m344080k872317r3635K980466N372311O465909O102557M672258
$$ y = [48788621, 55781974, 61137624, 64608516, 66570714, 67766458, 68820629, 69992511, 71344100, 72959766, 74930958, 77260521, 79842544, 82432822, 84658701, 86267687, 87407618, 88415029, 89207226, 89136248, 87694431, 85249699, 82836571, 81210955, 80236226, 79170296, 77423400, 75029842, 72498604, 70305614, 68589366, 67338755, 66730885, 67085464, 68488933, 70632178, 73015426, 75117310, 76406244, 76593151, 76118376, 76112789, 77494378, 80092754, 82792948, 84394849, 84165500, 81860259, 77765640, 72836584, 68382421, 65296410, 63633650, 62948264, 62766004, 62551430, 61506598, 58902796, 54826450, 50482370, 47610053, 47516418, 50496884, 55869195, 62335104, 68437661, 73109919]
40339G3109919L078476K296783K698752L766062M516415M212669K726476M57132
40331I6862684j885286l499453l793431k663557n06241K022874M254964N675308
40323I6467862O092003N711944M935006M004841K913552J657411M84264k03758
40315A22063125k15990J61208L10942k07337j275861k410377l274757l802072
40307A11348881l845107l130334j803156o48540l20460n30915m53464J86047R05561
40298A01708513J268250J299953J064954M94311r4896Q3718J379255L091514M188673
40289A14484245M317677L719093K557890R55599n46990j266054j166636q74991
40281A22179833q47970r67415r79578q40746n06508J58138J056546J827217K343995
$$ y = [73109919, 76188395, 78485178, 81183930, 84949992, 89466407, 93679076, 96405552, 96862684, 94977398, 91477945, 87684514, 85020957, 84514716, 86537590, 90792554, 96467862, 102559865, 108271809, 113206815, 117211656, 120125208, 121782619, 122266883, 122063125, 121847135, 122008343, 122319285, 122111948, 120836087, 118425710, 115150953, 111348881, 107503774, 104373440, 102570284, 101921744, 101601284, 101070369, 100616905, 100802952, 101708513, 102976763, 104276716, 105341670, 105835981, 105741085, 105824803, 107204058, 110295572, 114484245, 118801922, 122521015, 125078905, 126034504, 125487514, 124221460, 123054824, 122179833, 121331863, 120364448, 119384870, 118544124, 118037616, 118195754, 119252300, 121079517, 123423512]
40272A23423512K923565L824251M818614N433019N312565M220111K119645m28963
40264A51646319k367108l089423l052470l009778k913129k156267p81123K61892
40256A34538913K45748m69678j009078j046651r45710j054167j239541j126530
40248A27893306n83257Q8779M11440K06991j95646l46223k49990l66198r89782
40239A25869420j859519k489370k667911k459096j904965r81912K07644J375168
40231A15089459K153084K218767J496151L78546m50045o58556o14977q75162j476861
40222A17260406k025573k371188k864296l937499n638438p448320q292292p013669
40214G7669131l489451O78701L238632L378971K371354J952116K563478L452341
$$ y = [123423512, 126347077, 130171328, 134989942, 140422961, 145735526, 149955637, 152075282, 151646319, 149279211, 146189788, 143137318, 140127540, 137214411, 135058144, 134277021, 134538913, 134784661, 134314983, 133305905, 132259254, 131313544, 130259377, 129019836, 127893306, 127310049, 127398828, 127810268, 128017259, 127821613, 127475390, 127225400, 126859202, 125869420, 124009901, 121520531, 118852620, 116393524, 114488559, 113506647, 113714291, 115089459, 117242543, 119461310, 120957461, 121336007, 120885962, 120227406, 119612429, 118737267, 117260406, 115234833, 112863645, 109999349, 106061850, 100423412, 92975092, 84682800, 77669131, 74179680, 74858381, 78097013, 81475984, 83847338, 85799454, 88362932, 91815273]
40206I1815273L864091L552645K591035J455874J080561K013276L480803L957017
40198A13810575K781897O80292j316113k701644l078620j850011R32791L904832
40190A13163999N381399M951661L587919K326807J422195P68089M94643Q09375
40182A32906087J550069K193077K248119J590686N48364k90506n17009k65954
40174A39962933j05184n47982j677989l123693m275961m659639m294836l630781
40166A17646868k975069k145673r29953L07243R03809P59674M84185O14602J088045
40157A15753731J590016J972352K094343J679476P11639l04443q73290j138776
40149A21485048j649979k629806l772460m606766m723065l805447j902630L10989
$$ y = [91815273, 95679364, 99232009, 101823044, 103278918, 104359479, 106372755, 109853558, 113810575, 116592472, 117272764, 115956651, 113255007, 110176387, 108326376, 109259167, 113163999, 118545398, 123497059, 127084978, 129411785, 130833980, 131602069, 132096712, 132906087, 134456156, 136649233, 138897352, 140488038, 141036402, 140745896, 140228887, 139962933, 139857749, 139309767, 137631778, 134508085, 130232124, 125572485, 121277649, 117646868, 114671799, 112526126, 111596173, 111903416, 112807225, 113566899, 114051084, 114665686, 115753731, 117343747, 119316099, 121410442, 123089918, 123801557, 123497114, 122623824, 121485048, 119835069, 117205263, 113432803, 108826037, 104102972, 100297525, 98394895, 98705884]
40141I8705884J910348K441283K082531J231687L14544j07965L49745J284026
40133A08212083J690527J110926K80583K96844J359442K643141L231728K857575
40125A21682849J878539R29218N98710J087642J985819K486842J941857K94126
40117A32885602j861549l579556m141720l561399k433696j184464K86889J987528
40109A18397635L204552L094006J884840Q90568J051174J895161K317238K047677
40101A34782851J801260K026093K074780R33267j472357m051371n631046o008523
40093A24454954n818673n575999n137669m104869k453050n90741J016864K065278
40085A03856095K399847K093758J530860J149522J051469J062613J189045J726609
$$ y = [98705884, 100616232, 103057515, 105140046, 106371733, 106686277, 106578312, 106928057, 108212083, 109902610, 111013536, 111294119, 111590963, 112950405, 115593546, 118825274, 121682849, 123561388, 124490606, 125089316, 126176958, 128162777, 130649619, 132591476, 132885602, 131024053, 127444497, 123302777, 119741378, 117307682, 116123218, 116410107, 118397635, 121602187, 124696193, 126581033, 127471601, 128522775, 130417936, 132735174, 134782851, 136584111, 138610204, 140684984, 141618251, 140145894, 136094523, 130463477, 124454954, 118636281, 113060282, 107922613, 103817744, 101364694, 100773953, 101790817, 103856095, 106255942, 108349700, 109880560, 111030082, 112081551, 113144164, 114333209, 116059818]
40077A16059818K781712L900894M374126L835216K504855R99671j5423j95091
40069A34245778K66650Q63960J325090J801041K431099K965299L069129K871668
40061A49839714K929037L629260M760211N602177N354141L670659J041621j462622
40053A75364198l089367l981101m633832m979305m490853l208833k091921k008245
40045A46880741k678532k978704k176579o31471O13238P04217m29625k045174
40037A37258111l104204l041403k159287j286000j085431j664700k619146l284261
40029A19013679l118844k139555r81752l27639k60226l33668k26696p3230j12203
40020A11439866k80501l20618j53214l322k43676j187727k865412m791372o014847
$$ y = [116059818, 118841530, 122742424, 127116550, 130951766, 133456621, 134456292, 134440869, 134245778, 134512428, 135376388, 136701478, 138502519, 140933618, 143898917, 146968046, 149839714, 152768751, 156398011, 161158222, 166760399, 172114540, 175785199, 176826820, 175364198, 172274831, 168293730, 163659898, 158680593, 154189740, 150980907, 148888986, 146880741, 144202209, 141223505, 139046926, 138415455, 139028693, 139732910, 139303285, 137258111, 134153907, 131112504, 128953217, 127667217, 126581786, 124917086, 122297940, 119013679, 115894835, 113755280, 112773528, 112445889, 112185663, 111851995, 111625299, 111552069, 111439866, 111159365, 110838747, 110685533, 110682211, 110438535, 109250808, 106385396, 101594024, 95579177]
40011I5579177n670764l685108r68779J153586J847894J305400N14516M74419
40003I0550341J488607L054934M292155M457715L286569J154138j026458k323760
39995A04934241k438545j840205j235203j007166j176046j627776k173783k587766
39987I0847751k895224l525385m796143o187800o489120m926689k032943P76395
39979F0770842K426082K906252K936803L138194L549651L794475L566331K912147
39971H6000777K103085J360825P79090M04661K45855K42044L75957P91546J622686
39962I3926526K676370L429797L378656K320412M22406j728596l210052l306315
39954I7909204k153633o25412N17621J109637J197255O87425k82729j014441q07081
$$ y = [95579177, 89908413, 86223305, 85254526, 86408112, 88256006, 89561406, 90075922, 90550341, 92038948, 95093882, 99386037, 103843752, 107130321, 108284459, 107258001, 104934241, 102495696, 100655491, 99420288, 98413122, 97237076, 95609300, 93435517, 90847751, 87952527, 84427142, 79630999, 73443199, 66954079, 62027390, 59994447, 60770842, 63196924, 66103176, 69039979, 72178173, 75727824, 79522299, 83088630, 86000777, 88103862, 89464687, 90243777, 90648438, 90894293, 91136337, 91512294, 92303840, 93926526, 96602896, 100032693, 103411349, 105731761, 106154167, 104425571, 101215519, 97909204, 95755571, 95130159, 95647780, 96757417, 97954672, 98642097, 98359368, 97344927, 96537846]
39945I6537846K45631J359604J838830J485543N33900l24968n6812J884090M697674
39936A08201338O687637O725429M963513K207629p59727l100738l969414l257007
39928A17698660j929847j079249q26984n92882j87094m2408l89687p59133m97026
39919A11394350N47466K026130L540537M890888O009344O846362P359708P568685
39911A50183470P569993P431269P051284O218543M879346L302305J961475J334870
39903A89932555J768403L293400N478480P676801R563194J1215783J2495366J2635498
39895B54059480J0876356P511176L989227J817511J356906J571869Q30043j846600
39887B80165968n910808r525366j0896304r656954p114600n247456n372385p396475
$$ y = [96537846, 96783477, 98143081, 99981911, 101467454, 102001354, 101676386, 101619574, 103503664, 108201338, 114888975, 121614404, 126577917, 128785546, 128025819, 124925081, 120955667, 117698660, 115768813, 114689564, 113862580, 113269698, 113082604, 113040196, 112650509, 111891376, 111394350, 111941816, 113967946, 117508483, 122399371, 128408715, 135255077, 142614785, 150183470, 157753463, 165184732, 172236016, 178454559, 183333905, 186636210, 188597685, 189932555, 191700958, 194994358, 200472838, 208149639, 217712833, 228928616, 241423982, 254059480, 264935836, 272447012, 276436239, 278253750, 279610656, 281182525, 282012568, 280165968, 274255160, 264729794, 253833490, 244176536, 237061936, 231814480, 226442095, 219045620]
39879B19045620r982564j1477900j1026918r043521o710318n080224m530953m686486
39871A56506736m624224l451864j119642J346454K704262K606857J709047Q34249
39863A56511875L72084M17029J029597K137218L395205M369862M882090N206539
39855A78321499N974365P699199J0163047J2355596J3267477J2721648J1301227
39848B51804058R697995Q455083Q088275Q843326J0254299J1413877J1814137
39841C20371050J1551962J0671912Q828613N799069J867729k531659p084139j1201100
39833C38273437j3892095j4605822j3951316j3062739j2388153j1571936j0400607
39826B48400769r294035q775228q910912r460167j0239024j1095287j1716676
$$ y = [219045620, 209063056, 197585156, 186558238, 177514717, 170804399, 165724175, 161193222, 156506736, 151882512, 148430648, 147311006, 148657460, 151361722, 153968579, 155677626, 156511875, 156883959, 157300988, 158330585, 160467803, 163863008, 168232870, 173114960, 178321499, 184295864, 191995063, 202158110, 214513706, 227781183, 240502831, 251804058, 261502053, 269957136, 278045411, 286888737, 297143036, 308556913, 320371050, 331923012, 342594924, 351423537, 357222606, 359090335, 356558676, 349474537, 338273437, 324381342, 309775520, 295824204, 282761465, 270373312, 258801376, 248400769, 239106734, 230331506, 221420594, 211960427, 201721403, 190626116, 178909440]
39819A78909440j1717334j0918977r485520p821705o353926n321092m701858m319165
39811A18269863l976854l497740k748530j733473o14311M41900J389643K231509
39803A09762007K907745L338991L494244L332405K772227J826000O74710n07145
39795A27601184j718513k983496m089609m634828m380753l520923k601816k151906
39787A01519340k275343k575737k586772k291631k054666k021842j869555j327955
39779H4515839p19658o82705j440074k590364l580723m155717m336965m185596
39771F2824037l706425k945385k150486j780033k165014l039249l550557k955051
39763D0531837j315301N43904J694036J713239R10505J46135K15547J105361J943461
$$ y = [178909440, 167192106, 156273129, 146787609, 138965904, 132611978, 127290886, 122589028, 118269863, 114293009, 110795269, 108046739, 106313266, 105698955, 106140855, 107530498, 109762007, 112669752, 116008743, 119502987, 122835392, 125607619, 127433619, 128108329, 127601184, 125882671, 122899175, 118809566, 114174738, 109793985, 106273062, 103671246, 101519340, 99243997, 96668260, 94081488, 91789857, 89735191, 87713349, 85843794, 84515839, 83796181, 83113476, 81673402, 79083038, 75502315, 71346598, 67009633, 62824037, 59117612, 56172227, 54021741, 52241708, 50076694, 47037445, 43486888, 40531837, 39216536, 39760440, 41454476, 43167715, 44078220, 44224355, 44439902, 45545263, 47488724]
39754D7488724J930194J210841N53659L03561P3847n12324j214389j503016j198202
39745D7132895n51544R5881M71747K97204o32568k149901l586716m123291l418619
39736C3535088j919408m33867O36344J495813K365909L018855L171831L089505
39728D4960070L339399M000970M567331M687763M555874M384639L918461K789865
39720G7204372J090748p35682k377489l712549m558450m756127m469503m055858
39712E3629462l605272k913816j967751j102964m78677L26267J833263L828003
39704D9548515N311811N400944M136191K341456Q42041o3417n30745q56251j281122
39695F4849423j910029k679935l448807m151985m784053n180605m950865l782731
$$ y = [47488724, 49418918, 50629759, 51183418, 51486979, 51560826, 51048502, 49834113, 48331097, 47132895, 46581351, 46677232, 47148979, 47446183, 46813615, 44663714, 41076998, 36953707, 33535088, 31615680, 31181813, 31818157, 33313970, 35679879, 38698734, 41870565, 44960070, 48299469, 52300439, 56867770, 61555533, 66111407, 70496046, 74414507, 77204372, 78295120, 77559438, 75181949, 71469400, 66910950, 62154823, 57685320, 53629462, 50024190, 47110374, 45142623, 44039659, 43560982, 43887249, 45720512, 49548515, 54860326, 60261270, 64397461, 66738917, 67580958, 67517541, 66986796, 66130545, 64849423, 62939394, 60259459, 56810652, 52658667, 47874614, 42694009, 37743144, 33960413]
39687C3960413j811385L92123K196477L254965L557185L247358K427148J155044
39679D8379328l38305j537172j949245j572085q87651l60534j54341l59149j083021
39670D0137825k040009k424216j712701m58421K41728P6152j82352K12070J114019
39661C4964095J998696K831332L914590N107443N745517N384523M267691K974013
39653F7187900J873539J036001M46713J17795N3027K22540N52873Q91520J029225
39644G3411133Q32633L58290j85083n55814n39201O129R78952J881626K059935
39635G8248600J327694K87185k01483J43218R41696J837508K828262L774071M080925
39626I3267676L329147J934399O78658k44523j164383k008156k120021j163346
$$ y = [33960413, 32149028, 32541151, 34737628, 37992593, 41549778, 44797136, 47224284, 48379328, 48041023, 46503851, 44554606, 42982521, 42094870, 41734336, 41579995, 41220846, 40137825, 38097816, 35673600, 33960899, 33502478, 33744206, 33820358, 33638006, 33850076, 34964095, 36962791, 39794123, 43708713, 48816156, 54561673, 59946196, 64213887, 67187900, 69061439, 70097440, 70544153, 70661948, 70714975, 70937515, 71490388, 72381908, 73411133, 74243766, 74602056, 74416973, 73861159, 73321958, 73328087, 74307039, 76188665, 78248600, 79576294, 79863479, 79661996, 79805214, 80746910, 82584418, 85412680, 89186751, 93267676, 96596823, 98531222, 99209880, 98965357, 97800974, 95792818, 93672797, 92509451]
39618I2509451L80443J882821L226283M462749N324009N574028N489918N433150
39610A24282852N179564M276070K952446K043576J932405K119292J989485J485532
39602A46261222P66221k87657j745442l085597l525233k890279j784160q50232
39594A32858843j94490L57563P40088O25082k11101j683490l447693m953587n559486
39585A18531729m915272l322497j511748J1062J188273J934602J829683O35189
39577A14381021j108927k468152l073322l303865l510419l523300l087448k334507
39569I1971081j521376o49647K90840R80319J116761R57246J059355J507504J799786
39560I7511869J555739J000631O57941Q11701J311845J661398J307428J96732
$$ y = [92509451, 92889894, 94772715, 97998998, 102461747, 107785756, 113359784, 118849702, 124282852, 129462416, 133738486, 136690932, 138734508, 140666913, 142786205, 144775690, 146261222, 147027443, 146739786, 144994344, 141908747, 138383514, 135493235, 133709075, 132858843, 132664353, 133021916, 133762004, 134387086, 134175985, 132492495, 129044802, 124091215, 118531729, 113616457, 110293960, 108782212, 108793274, 109981547, 111916149, 113745832, 114381021, 113272094, 110803942, 107730620, 104426755, 100916336, 97393036, 94305588, 91971081, 90449705, 89800058, 90090898, 91071217, 92187978, 93145224, 94204579, 95712083, 97511869, 99067608, 100068239, 100726180, 101537881, 102849726, 104511124, 105818552, 106015284]
39552A06015284q80272q67088M48581K169084L274557L562515L421971L079606
39544A20224238K484864J699135R09007J07411q20201j689145k096759j985404
39536A18833146j754248j675968j551510j162117p71459q70592j561431k439632
39528A07046189l013189l098085k968077l279668m578716o529082p827237p391139
39520F8360996n664452m290065m354715n336537n925394n421412m015991k147967
39512C1204463j89803J332225J779201Q84871r68434k976381m290822m368236
39504B2407084l339164k034576j277414j044920n93131N54757K058179L233746
39496A9964561L673364L240656J915168L8278j547043k066346j532612o63976
$$ y = [106015284, 105135012, 104267924, 104716505, 106885589, 110160146, 113722661, 117144632, 120224238, 122709102, 124408237, 125317244, 125424655, 124604454, 122915309, 120818550, 118833146, 117078898, 115402930, 113851420, 112689303, 111917844, 111047252, 109485821, 107046189, 104033000, 100934915, 97966838, 94687170, 90108454, 83579372, 75752135, 68360996, 62696544, 58406479, 54051764, 48715227, 42789833, 37368421, 33352430, 31204463, 31014660, 32346885, 34126086, 35010957, 34042523, 31066142, 26775320, 22407084, 19067920, 17033344, 15755930, 14711010, 14117879, 14672636, 16730815, 19964561, 23637925, 26878581, 28793749, 28832027, 27284984, 25218638, 23686026, 23022050]
39488B3022050j43840j59871n48665j083858j596378k019643k361135k537653
39480A2571007k318805j589002n79514L48897J075737J654343J943341J602270
39472A4708274N47635p52731j543796j340248l21963P30230J056435O75003L63788
39463A4122627O27177Q82878J36369j584634l022739l103796k104235j114746
39455D838901p08757n46979j00715O51599J246250J227867O72960L53061J161762
39446H795949L085001M875690N089493L429506Q69665j362039k555513k490499
39438A9737253j336275J87026J060190Q23367M0264k98340L52281J904274L881426
39429B6351466N464777N650235M002597J286151j100398k407206k949279l302651
$$ y = [23022050, 22878210, 22718339, 22169674, 21085816, 19489438, 17469795, 15108660, 12571007, 10252202, 8663200, 8083686, 8432583, 9508320, 11162663, 13106004, 14708274, 15255909, 14503178, 12959382, 11619134, 11297171, 12027401, 13083836, 13758839, 14122627, 14749804, 15632682, 15769051, 14184417, 11161678, 8057882, 5953647, 4838901, 4130144, 3583165, 3482450, 4134049, 5380299, 6608166, 7281126, 7634187, 8795949, 11880950, 16756640, 21846133, 25275639, 26145304, 24783265, 22227752, 19737253, 18400978, 18588004, 19648194, 20471561, 20511825, 20213485, 20565766, 22470040, 26351466, 31816243, 37466478, 41469075, 42755226, 41654828, 39247622, 36298343, 32995692]
39421C2995692l607012l827521m183456m875550n623746n880191n424585m470287
39413d896656l276649j949219n80441O90518J781106K638799L136007L179665
39405G23130K860057K241314J062159r85850l552526n485268n634816l760105
39397a2531905o19138K615851M910050N606961M545576K152932o04233k529813
39389C546281k784036j498128J66458Q78224K95035o89838r51443k88533N05701
39380h20279N94734m9786p35584q78451o66902q17560j630129k465237k418815
39371i888009j441232m29256j42725m00525n22809j98612L86235R67050J325976
39362a0343907J196152N28125j62373j43108P19842J762809K210290J848619J037903
$$ y = [32995692, 29388680, 25561159, 21377703, 16502153, 10878407, 4998216, -426369, -4896656, -8173305, -10122524, -10702965, -10012447, -8231341, -5592542, -2456535, 723130, 3583187, 5824501, 6886660, 5900810, 2348284, -3136984, -8771800, -12531905, -13151043, -10535192, -5625142, -18181, 4527395, 6680327, 6076094, 3546281, 762245, -735883, -569425, 308799, 603834, -86004, -1037447, -1325980, -820279, -225545, -275331, -1010915, -1889366, -2556268, -3373828, -5003957, -7469194, -9888009, -11329241, -11758497, -11901222, -12301747, -12824556, -13023168, -12636933, -11669883, -10343907, -9147755, -8619630, -8782003, -8925111, -8205269, -6442460, -4232170, -2383551, -1345648]
39353a345648L65135L26158R90090J792352J919106J118969j7922p40128r15414
39344C492698r47330j087671j128267p81732j39687L83571N24340M95470P57950
39335A569342J447030K145741K363552K130325J851154J588465Q67820n60220
39327A3403209j990063k142395l41336K761473N563650O560916N280687K533059
39319C1629200k18351j948056k653668k878484k846689k337473j340081m15065
39311A6991333j59801n00656p68767m33496M16935J303888J896690K270813K711712
39302B3728651L303192L690333L280755J747858o49593l232847n304813o386065
39294B0177471o283726n185325l629468k109072o49065J000586K714754L865373
$$ y = [-1345648, -980513, -654355, 335735, 2128087, 4047193, 5166162, 5148240, 4408112, 3492698, 2545368, 1457697, 329430, -452302, -591989, -208418, 315922, 811392, 1569342, 3016372, 5162113, 7525665, 9655990, 11507144, 13095609, 13963429, 13403209, 11413146, 9270751, 8929415, 11690888, 17254538, 23815454, 29096141, 31629200, 31410849, 29462793, 26809125, 23930641, 21083952, 18746479, 17406398, 16991333, 16831532, 16330876, 15562109, 15128613, 15545548, 16849436, 18746126, 21016939, 23728651, 27031843, 30722176, 34002931, 35750789, 35101196, 31868349, 26563536, 20177471, 13893745, 8708420, 5078952, 2969880, 2320815, 3321401, 6036155, 9901528]
39286I901528M056453L711192L565927L693127L415312K233391N19283q57528
39278C0238685j405735j411435j599147k425463l527924l861132k661744m15695
39270A2930410J383118J657414P77933j4703l5501K94849K53579j96494m29380
39261A6621225o5289L52647k33984k233410m742608o237741n927968m260151k156341
39252h883620j47645J576323K676299K705422J618146l7952j456251k008885j549772
39243e507935n31894L15644P03040J068584J888908K847797L056260K032504J00840
39234E973748k107906m087852n375006n603070m943746m143589l804077l801433
39226b7892931l580917k750456j178350J138382L853490O040526O643389N335426
$$ y = [9901528, 13957981, 17669173, 21235100, 24928227, 28343539, 30576930, 31096213, 30238685, 28832950, 27421515, 25822368, 23396905, 19868981, 16007849, 13346105, 12930410, 14313528, 15970942, 16748875, 16734172, 16698671, 16993520, 17247099, 17050605, 16621225, 16555936, 16908583, 16674599, 14441189, 9698581, 3460840, -2467128, -6727279, -8883620, -9031265, -7454942, -4778643, -2073221, -455075, -493027, -1949278, -3958163, -5507935, -6039829, -5724185, -5021145, -3952561, -2063653, 784144, 3840404, 5872908, 5973748, 3865842, -222010, -5597016, -11200086, -16143832, -20287421, -24091498, -27892931, -31473848, -34224304, -35402654, -34264272, -30410782, -24370256, -17726867, -12391441]
39218a2391441K828889L49231j098852j109695J03780J887631L458784M230814
39210a740859L994305K942752J591781N44384J49022L25133P20062R88178R37925
39201A0452683N83639J74957M6841K56395M15843P2316p25529j397979j442768
39192H436398r54643m23306r6639K48892Q42207J443071J607630J384286J393073
39183A3880969K023620K794361K786104J594140l85081k443936l973738m488828
39175A1787611l772530k220028p21726M7794R3157k14307o32001j050772j261623
39166B055575j016003k75814P16889J535669J721667J100433Q7296n76775n99155
39157D749782m26396n47986p70604n32103K16349Q35442P10729j33772j138241
$$ y = [-12391441, -9562552, -9213321, -10312173, -11421868, -11318088, -9430457, -5971673, -1740859, 2253446, 5196198, 6787979, 7332363, 7481385, 7806518, 8526580, 9514758, 10452683, 11036322, 11211279, 11258120, 11514515, 11930358, 12002674, 11277145, 9879166, 8436398, 7481755, 7058449, 6961810, 7210702, 8052909, 9495980, 11103610, 12487896, 13880969, 15904589, 18698950, 21485054, 23079194, 22694113, 20250177, 16276439, 11787611, 8015081, 5795053, 5073327, 5121121, 5214278, 4999971, 4367970, 3317198, 2055575, 1039572, 763758, 1480647, 3016316, 4737983, 5838416, 5925712, 5348937, 4749782, 4323386, 3775400, 3004796, 2472693, 2689042, 3524484, 4235213, 4101441, 2963200]
39148B963200j689556j502011p43960J55159R18209J588107K207042K549265K441706
39139H887161K174035K184433K362276K073650R84091m72535j571583j945991
39131A4675537j627488q01734J58544O23738P2755j395159l063846m124200m114578
39122D03569k952732p90833K033431M966710P271539Q208110P371162N009619
39114C1520575J991964p16271k668076m040158n136220n890356n960300n239515
39106C861643m081202k953184k040194j313175q06449n49378k94586L26758J262144
39097f587623J926148J820589J082102K47939l16612n31728l45640K81344J157440
39088a266041J913841K341081K506096K541963K508969K460910K432314K288094
$$ y = [2963200, 1273644, -228367, -972327, -817168, 101041, 1689148, 3896190, 6445455, 8887161, 11061196, 13245629, 15607905, 17681555, 18665646, 18193111, 16621528, 14675537, 13048049, 12246315, 12404859, 13028597, 13101352, 11706193, 8642347, 4518147, 403569, -2549163, -3339996, -1306565, 3660145, 10931684, 19139794, 26510956, 31520575, 33512539, 32796268, 30128192, 26088034, 20951814, 15061458, 9101158, 3861643, -219559, -3172743, -5212937, -6526112, -7332561, -7881939, -8176525, -7849767, -6587623, -4661475, -2840886, -1758784, -1510845, -1827457, -2359185, -2704825, -2423481, -1266041, 647800, 2988881, 5494977, 8036940, 10545909, 13006819, 15439133, 17727227]
39080A7727227J729661N29607j264932l271424m787166n021534l660248j287210
39072F93981R75941K366920K914679K998194K735612J953425N96770j025152k414171
39063A1796199l270581l710808m017435m087157l298813j216383J637326M062127
39055b105525N281950N406515M715362L007963J01575l322870n938193o869414
39047B77363o246059m715605k860292j199916k69598k41214o03136n99378k5820
39038a6483655O64676J093931J506402K386698L712066M877428N344720N100095
39030H202361M406662L393400K114023Q25163j35179p73592j494333k606912l895578
39021A0036015m750487m652958l538104j846647l08141M57418K99931m18997j097438
$$ y = [17727227, 19456888, 19986495, 18721563, 15450139, 10662973, 5641439, 1981191, 693981, 1669922, 4036842, 6951521, 9949715, 12685327, 14638752, 15235522, 14210370, 11796199, 8525618, 4814810, 797375, -3289782, -6588595, -7804978, -6167652, -2105525, 3176425, 8582940, 13298302, 16306265, 16407840, 13084970, 7146777, 277363, -5968696, -10684301, -13544593, -14744509, -15014107, -15255321, -15858457, -16457835, -16483655, -15818979, -14725048, -13218646, -10831948, -7119882, -2242454, 3102266, 8202361, 12609023, 16002423, 18116446, 18941609, 18806430, 18032838, 16538505, 13931593, 10036015, 5285528, 632570, -2905534, -4752181, -5060322, -4602904, -4302973, -4721970, -5819408]
39012e819408j194667m35309R95451K383852K854907K048601M42050j048945j736798
39003a510266j457516m45862Q57716J929385K311105J788817N15284r45881j745450
38994A297332j202354N95594K649708L679263L004905R20573j587395l379756
38986E977870l693427k565757q65931L04690M37855j21141o78768q31591o25678
38977b661878l05028n4887Q5887J92225L39258M83106M87934K98416L1709j30282
38967a233540p4495K37514P76973J362158J647641J342467M66371o24981j399318
38958B500790j330869j79533J632787L024126L020290J687222R8395p57037q62444
38949H833727q92396j346603k229542l348885m495557n337395n521409n018860
$$ y = [-5819408, -7014075, -7449384, -6453933, -4070081, -1215174, 833427, 1275477, 226532, -1510266, -2967782, -3413644, -2555928, -626543, 1684562, 3473379, 3988663, 3042782, 1297332, 94978, 690572, 3340280, 7019543, 10024448, 10945021, 9357626, 5977870, 2284443, -281314, -1147245, -842555, -404700, -525841, -1204609, -2036200, -2661878, -2966906, -3021793, -2935906, -2743681, -2404423, -1921317, -1433383, -1134967, -1103258, -1233540, -1308035, -1070521, -293548, 1068610, 2716251, 4058718, 4525089, 3900108, 2500790, 1169921, 990388, 2623175, 5647301, 8667591, 10354813, 10453208, 9696171, 8833727, 7941331, 6594728, 4365186, 1016301, -3479256, -8816651, -14338060, -19356920]
38941a9356920m131833l058376j685596M8628J792107K969681L263772K825130
38933a7333407K125409J671586J712343K102302K526172K866364L190621L399942
38925B261332L214870K647339K154696K048897K000581J471367M80484m21088
38917A5858478q50693q82442o40685k2310R84708J963430K306455J753814N70836
38908B1041591p97645k157212l571219m943176n772909n575344m505894l254029
38900i535837k250160j335385l62101L25463L64458k2415l21694l52080j68157
38891a3657908L11104R67193J048105j21644j998854l149398k856638j727818
38883b1185858n62313N84565J831988K697665K521040J300419l28777j608329
$$ y = [-19356920, -23488753, -26547129, -28232725, -28184097, -26391990, -23422309, -20158537, -17333407, -15207998, -13536412, -11824069, -9721767, -7195595, -4329231, -1138610, 2261332, 5476202, 8123541, 10278237, 12327134, 14327715, 15799082, 16279566, 15858478, 15007785, 14125343, 13484658, 13462348, 14447056, 16410486, 18716941, 20470755, 21041591, 20243946, 18086734, 14515515, 9572339, 3799430, -1775914, -6281808, -9535837, -11785997, -13121382, -13483483, -13158020, -12793562, -12815977, -13137671, -13489751, -13657908, -13346804, -12379611, -11331506, -11453150, -13452004, -16601402, -19458040, -21185858, -21748171, -21163606, -19331618, -16633953, -14112913, -12812494, -13141271, -14749600]
38875a4749600j846930o70583J321352K565349J930939J3481j466274j413855
38867a4316121q9210J617170K956990L441743K886955J589033J45713r65682j418622
38858d152031q78535O33173K244461K713080J635053j76883j623744k245520k150291
38849d001237j567494q10664k99752j58367R1611J070924K755846M356147N021195
38840F458209M571402L523956K487421J619389P19128k49435r82493j292378j482894
38831A5372305j975265k658873k909391k256021q35026P61537J861509K007897
38823I368672J179906k14516j694027k982897l826178l813253k783735j276633
38815f042661j42679K53163Q5403n02862j446723k273394k260432j286312L5316
$$ y = [-14749600, -16596530, -17267113, -15945761, -13380412, -11449473, -11435992, -12902266, -14316121, -14405331, -12788161, -9831171, -6389428, -3502473, -1913440, -1767727, -2733409, -4152031, -5030566, -4397393, -2152932, 560148, 2195201, 2018318, 394574, -1850946, -4001237, -5568731, -6379395, -6679147, -6837514, -6745903, -5674979, -2919133, 1437014, 6458209, 11029611, 14553567, 17040988, 18660377, 19379505, 19130070, 18147577, 16855199, 15372305, 13397040, 10738167, 7828776, 5572755, 4737729, 5499266, 7360775, 9368672, 10548578, 10334062, 8640035, 5657138, 1830960, -1982293, -4766028, -6042661, -6185340, -5932177, -5846774, -6349636, -7796359, -10069753, -12330185, -13616497, -13581181]
38806a3581181J273934K626213M132709N101591M875344L739443K492516J432668
38798A2093237L46918p54986j543489j902262j966104j658721p80404L57321R26968
38789E118478M60744n86210j316215j198644l51891O50792J129110P63751o2402
38780D607513n62734l37087K71347O76858O88597N01124K51091j57529p98337
38771E140843j457675j707737j258852k51698Q24699J526743J720413J475454
38763F012190R11209K88211J7269K45324N14924J96575o96590j426315j334181
38754D728616m65972O56248J551554J928752J659472Q87289k5658r02835j938712
38745H078754l235421m312109m399417l219549j276649N84326J737951K036597
$$ y = [-13581181, -12307247, -9681034, -5548325, -446734, 4428610, 8168053, 10660569, 12093237, 12440155, 11685169, 10141680, 8239418, 6273314, 4614593, 3834189, 4191510, 5118478, 5579222, 4993012, 3676797, 2478153, 2126262, 2777054, 3906164, 4669915, 4607513, 4044779, 3707692, 3979039, 4655897, 5344494, 5845618, 6096709, 5939180, 5140843, 3683168, 1975431, 716579, 464881, 1289580, 2816323, 4536736, 6012190, 6923399, 7211610, 7228879, 7474203, 7989127, 8185702, 7489112, 6062797, 4728616, 4262644, 4918892, 6470446, 8399198, 10058670, 10945959, 10920301, 10017466, 8078754, 4843333, 531224, -3868193, -7087742, -8364391, -7780065, -6042114, -4005517]
38737d005517J846042J848765K503978L549927M198466L924825K946722J879780
38729A8692988J096953N24959j00359r41425j915793k679471k815021k201872
38721I660959j191667k97409K66945O13753Q05452O90332K01079m07278q57475
38712I484691j300294k159094l417525m298068l907286k160031J23956J992257
38704e641394K973213K946375J895362K05743j041389p28181J092751K988892
38696D691372L443261K218371L03295j167042j607229r30491N18655J883619K227161
38687A1580972J424431L62049n6799Q8600O528p33980j755812k414545k426291
38678F075153j931864j247604o65919l04823n3372K15654L60752N7053q03839
$$ y = [-4005517, -2159475, -310710, 2193268, 5743195, 9941661, 13866486, 16813208, 18692988, 19789941, 20314900, 20214541, 19273116, 17357323, 14677852, 11862831, 9660959, 8469292, 8171883, 8438828, 9052581, 9858033, 10548365, 10749444, 10342166, 9484691, 8184397, 6025303, 2607778, -1690290, -5597576, -7757607, -7633651, -5641394, -2668181, 278194, 2173556, 2379299, 1337910, 609729, 1702480, 4691372, 8134633, 10353004, 10656299, 9489257, 7882028, 6951537, 7470192, 9353811, 11580972, 13005403, 13367452, 13310653, 13399253, 13405781, 12671801, 10915989, 8501444, 6075153, 4143289, 2895685, 2229766, 1924943, 1871571, 2087225, 2447977, 2505030, 1701191]
38669A701191j940491k898945l271988k769223j425237J28233R25649N28206m63837
38660i486442r83158n44771M16250J149240J282921R06834K25380o36604j498265
38651i168615k008065j896170j382969j129435j580074k444364l038453l053801
38643b5701946k694964k107178j114116K95238J610160K281427K360865K335345
38635b2735169K459968K575423K494566K225119J807016J234164O05264J22727
38627i210922j31777k45883k54903m7224M33802J015736J394964J366347R92069
38618d687791O29957P21202J392140K280708K874508K993121K864858K841513
38610A1910216L134788L623963L724009K721754O48896j356049k091760j699369
$$ y = [1701191, -239300, -3138245, -6410233, -9179456, -10604693, -10476460, -9550811, -9022605, -9486442, -10469600, -11014371, -10598121, -9448881, -8165960, -7259126, -7033746, -7670350, -9168615, -11176680, -13072850, -14455819, -15585254, -17165328, -19609692, -22648145, -25701946, -28396910, -30504088, -31618204, -31322966, -29712806, -27431379, -25070514, -22735169, -20275201, -17699778, -15205212, -12980093, -11173077, -9938913, -9333649, -9210922, -9342699, -9588582, -9843485, -9890709, -9456907, -8441171, -7046207, -5679860, -4687791, -4057834, -3336632, -1944492, 336216, 3210724, 6203845, 9068703, 11910216, 15045004, 18668967, 22392976, 25114730, 25763626, 24407577, 22315817, 20616448]
38602B0616448j482911k206304l135018l094299k026349j028979j069653k061703
38594D511232l090262l217292k145382l95483J147796J991422K259521K141602
38586C203154J464699J14032j386720k163547j829422p47079M47028J263646J422095
38577A787886R34963K10285k47804l36547l41498m30010m23844q8378O24688J635870
38567C325611K753336L623198L984011L983620L871579L348950J717070j125764
38559B5481611m277753o685063p969381q106624o870259m320031j581910k51709
38551a4581119p62929j866576k008626q56943P80931K151364L188053M080561
38543i875284M707000M714521L966411K665376J040607q73387k992463m843488
$$ y = [20616448, 19133537, 16927233, 13792215, 10697916, 8671567, 7642588, 6572935, 4511232, 1420970, -1796322, -3941704, -4337187, -3189391, -1197969, 1061552, 3203154, 4667853, 4781885, 3395165, 1231618, -597804, -1344883, -897855, 365791, 1787886, 2722849, 2933134, 2685330, 2348783, 2007285, 1577275, 1153431, 1065053, 1689741, 3325611, 6078947, 9702145, 13686156, 17669776, 21541355, 24890305, 26607375, 25481611, 21203858, 14518795, 6549414, -1557210, -8427469, -12747500, -14329410, -14581119, -15344048, -17210624, -19219250, -20076193, -19295262, -17143898, -13955845, -9875284, -5168284, -453763, 3512648, 6178024, 7218631, 6345244, 3352781, -1490707]
38535a490707n767049n554942m661819l627797k504106j080396N27487J882711
38527b2276618K739592L166715L161253K568411J528246O22664L05783M01352
38519g782602L75495p9535q94078j787182k327990k072185r92709L36786J301965
38510a3922035J902298K533507L207207L391213K686402J328167r5021j147645
38502a15907j657511j596576j068853l13381L87812P44057M73928m39305j486885
38493e072621j970265j754396j399664j371757j459728j283945j070850j429811
38485a6813037k434205l379037l537587k843638j736101o03146M95194J752493
38477b9099064L365283N189039O587167O832520N770946L938307J979346J90909
$$ y = [-1490707, -7257756, -12812698, -17474517, -21102314, -23606420, -24686816, -24159329, -22276618, -19537026, -16370311, -13209058, -10640647, -9112401, -8489737, -8183954, -7782602, -7407107, -7486642, -8380720, -10167902, -12495892, -14568077, -15560786, -15224000, -13922035, -12019737, -9486230, -6279023, -2887810, -201408, 1126759, 1031738, -115907, -1773418, -3369994, -4438847, -4752228, -4364416, -3620359, -3146431, -3585736, -5072621, -7042886, -8797282, -10196946, -11568703, -13028431, -14312376, -15383226, -16813037, -19247242, -22626279, -26163866, -29007504, -30743605, -31346751, -30851557, -29099064, -25733781, -20544742, -13957575, -7125055, -1354109, 2584198, 4563544, 4754453]
38469D754453j265133k043010j876246j060123l06481l410K00127R49464K382708
38460A732349L829448M296341L280661J176128j103040k907603m235165n343575
38452G25544o145994o178881n160322l393171j515460L5755J183342J929405K180747
38443a6339035J994782J842090K344192L659077N252154O336780O421150N404988
38435A6916178L436929R67845j203251k348935k410212j972944j576279j234425
38427A0574906o98405N5965P57486J095205R18507L34983k81597n53975m93062
38418A1710013m50118n86121o67745n67868o13498j065324j526890j374350o45956
38409D212143K7895L39562N50303P35206M77366k90267p07870Q4294J652441K520276
$$ y = [4754453, 3489320, 1446310, -429936, -1490059, -1796540, -1799950, -1599823, -650359, 1732349, 5561797, 9858138, 13138799, 14314927, 13211887, 10304284, 6069119, 725544, -5420450, -11599331, -16759653, -20152824, -21668284, -21632529, -20449187, -18519782, -16339035, -14344253, -12502163, -10157971, -6498894, -1246740, 5090040, 11511190, 16916178, 20353107, 21320952, 20117701, 17768766, 15358554, 13385610, 11809331, 10574906, 9876501, 9932466, 10689952, 11785157, 12703664, 13038647, 12757050, 12203075, 11710013, 11259895, 10673774, 10006029, 9438161, 8824663, 7759339, 6232449, 4858099, 4212143, 4240038, 4579600, 5129903, 5865109, 6342475, 6052208, 5344338, 5428632, 7081073, 9601349]
38399I601349J742911j96096k056005k925709k536419j058551R14218K370425
38391E856123K413489J026967q34139k064942k309891k031448j810570j745136
38383a499547j552896j076185m76331N2643N42533J109597J706598K184957K503398
38374C494767K646174K353474J222576p41728k811224l975652l723025k330836
38366c865474m89683J171414K205221K292955J378604q9449j231721j283403k19029
38357a30565J138253J734517J185492J54916k28256N59046J920711K714829K291404
38348A1340347R27694o24089j808969k517115k937905l317045l696566l736834
38340f370482k937334j249636O03526J667536J656467J161831R43078J164299
$$ y = [9601349, 11344260, 11148164, 9092159, 6166450, 3630031, 2571480, 3485698, 5856123, 8269612, 9296579, 8462440, 6397498, 4087607, 2056159, 245589, -1499547, -3052443, -4128628, -4604959, -4552316, -4009783, -2900186, -1193588, 991369, 3494767, 6140941, 8494415, 9716991, 8975263, 6164039, 2188387, -1534638, -3865474, -4355157, -3183743, -978522, 1314433, 2693037, 2603588, 1371867, 88464, -130565, 1007688, 2742205, 3927697, 4082613, 3854357, 4413403, 6334114, 9048943, 11340347, 12268041, 11643952, 9834983, 7317868, 4379963, 1062918, -2633648, -6370482, -9307816, -10557452, -9953926, -8286390, -6629923, -5468092, -4525014, -3360715]
38332c360715J369391J051025J50148r08115j574232j597940j145767n31498O8967
38323f478736N55513O98260K37089p98967k052165l124551l729773l601778k582478
38314b0877586r46300N95329J397544J280291M15362q54040j907152j941481o25582
38305b3463615J436367L233361M280477M728812M685855L939228K487221R08589
38297B236295j20644m89521n85035p12569q49619q95008q38480n73505K18693
38288b609393J712386L444988M432282M025186K630841J351351Q23944O23435
38280A6435020m2086j260468k326883k642632k396204k286172k744828l470358
38272g34611l619947k578895q00942K08111p97758l317707n248765m796703k104419
$$ y = [-3360715, -1991324, -940299, -790151, -1698266, -3272498, -4870438, -6016205, -6547703, -6478736, -5923223, -5224963, -4987874, -5786841, -7839006, -10963557, -14693330, -18295108, -20877586, -21823886, -21228557, -19831013, -18550722, -18135360, -18989400, -20896552, -22838033, -23463615, -22027248, -18793887, -14513410, -9784598, -5098743, -1159515, 1327706, 2236295, 2115651, 1626130, 1041095, 328526, -521093, -1416101, -2254581, -2828086, -2609393, -897007, 2547981, 6980263, 11005449, 13636290, 14987641, 15811585, 16435020, 16392934, 15132466, 12805583, 10162951, 7766747, 5480575, 2735747, -734611, -4354558, -6933453, -7734395, -7526284, -8324042, -11641749, -16890514, -21687217, -23791636]
38263b3791636J138700L382060M189016L846174K685135J045237m61125j098636
38255i065075n42498Q25853K207819K963473K907613K129261P41829r83764k359414
38246a174903k587701j580834k30725M60185L95697K18226K58744J59767l39986
38237d421530p54806l98825O55811J606000J853463J542502J142254Q71181O91974
38228B788024N49942L18973l04081j489159k856979l672512l570514k917624k363466
38219a3517396k193590k233118k208387j982388j491799o73376M80921J878745
38211b1940388L325910M470598M811743M009685K323945O05623l47527m61942
38203c202353l39298n34363r66554j100022o51661J171K01156k40622q08094q54160
$$ y = [-23791636, -22652936, -19270876, -15081860, -11235686, -8550551, -7505314, -7966439, -9065075, -9607573, -8781720, -6573901, -3610428, -702815, 1426446, 2168275, 1184511, -1174903, -3762604, -5343438, -5574163, -5113978, -4718281, -4500055, -4241311, -4081544, -4421530, -5176336, -5575161, -4919350, -3313350, -1459887, 82615, 1224869, 2096050, 2788024, 3337966, 3656939, 3352858, 1863699, -993280, -4665792, -8236306, -11153930, -13517396, -15710986, -17944104, -20152491, -22134879, -23626678, -24300054, -23819133, -21940388, -18614478, -14143880, -9332137, -5322452, -2998507, -2392884, -2740411, -3202353, -3541651, -4076014, -5042568, -6142590, -6794251, -6793080, -6591924, -6832546, -7640640, -8494800]
38193h494800k95017M22043R84775J590617K514295L481379L771290L013918J692796
38184H681296P04795N00029P82443R61430O72515j33612j297065k431587k992841
38175E447403k664225j682809o31491M1843J81217j97916q62344j308540j175790
38166b852652p11110l89725o2052R16307K477614L417656K705049P63889j146349
38157E118627k460513l489261m303390m332753l226265j420873L91123J833435
38149a1889870K696273K786370K240723J527994Q02902l44379k144129l984075
38141h308191m853619m248251k443248k15285J463391J888900J233014M53005
38133a5030284K54116L92267K91493n0040k34766j83899p8631J80455P87028J396614
$$ y = [-8494800, -8789817, -8367774, -7382999, -5792382, -3278087, 203292, 3974582, 6988500, 8681296, 9386091, 9886120, 10668563, 11629993, 12302508, 12168896, 10871831, 8440244, 5447403, 2783178, 1100369, 468878, 510721, 691938, 494022, -368322, -1676862, -2852652, -3563762, -3953487, -4015539, -3099232, -621618, 2796038, 5501087, 6264976, 5118627, 2658114, -831147, -5134537, -9467290, -12693555, -14114428, -13723305, -11889870, -9193597, -6407227, -4166504, -2638510, -1835608, -2179987, -4324116, -8308191, -13161810, -17410061, -19853309, -20068594, -18605203, -16716303, -15483289, -15030284, -14776168, -14383901, -14092408, -14142448, -14377214, -14561113, -14639744, -14459289, -13672261, -12275647]
38123a2275647J370391P23747K09377K76104M98221L14587j41751l55183k91066
38114i671220n30501j572758l215584m614263m865074l616193j254936J425663
38106b7914866L688715N031380N185863M233795K677000J168759J43485k27497
38098f013366J06764J033461K205708L245921L909379L875289K701600M65399
38090A1530155j731078k536105j775975o76378n26675j501905k906004m093171
38082d217136m820406m987193m435198l064835j099955P61371J663570J364878
38074a8834904N90198K43464L53095K75861j02260m7709Q93558K036616K267829
38065a2324252J292410j70665j169933j212956m64037M17866Q03927O63554M44691
$$ y = [-12275647, -10905256, -10181509, -9972132, -9696028, -9197807, -8883220, -9024971, -9380154, -9671220, -10201721, -11774479, -14990063, -19604326, -24469400, -28085593, -29340529, -27914866, -24226151, -19194771, -14008908, -9775113, -7098113, -5929354, -5785869, -6013366, -5906602, -4873141, -2667433, 578488, 4487867, 8363156, 11064756, 11530155, 9799077, 7262972, 5486997, 4810619, 4283944, 2782039, -123965, -4217136, -9037542, -14024735, -18459933, -21524768, -22624723, -21863352, -20199782, -18834904, -18244706, -18001242, -17648147, -17372286, -17474546, -17522255, -16628697, -14592081, -12324252, -11031842, -11202507, -12372440, -13585396, -14049433, -13631567, -12827640, -12164086, -11719395]
38056a1719395L67223K50282J48614N62087J636710K673441K928262K478350J757400
38047A082974O67939j089723l012347l923197l208001j376741O67265K406232
38039g785599L664151M298501M226387L572083K684872K077769K142731K627371
38031A7508266K605075J420097m39920j870571k443932k640323k861864k904524
38023H372304k563363k096924j727220j170425r8623J237769K230183K558897
38015F742598K345810J870178J397342J104265R20363N92852J17784p9590L56817
38006A5368419J177988J746167J705999J233614O90047K26661k83760j052448
37998B0812687k093176l078444l549450l315997k568128j619802p38430k23035
$$ y = [-11719395, -11352172, -11101890, -10953276, -10391189, -8754479, -6081038, -3152776, -674426, 1082974, 1750913, 661190, -2351157, -6274354, -9482355, -10859096, -10191831, -7785599, -4121448, 177053, 4403440, 7975523, 10660395, 12738164, 14880895, 17508266, 20113341, 21533438, 21093518, 19222947, 16779015, 14138692, 11276828, 8372304, 5808941, 3712017, 1984797, 814372, 715749, 1953518, 4183701, 6742598, 9088408, 10958586, 12355928, 13460193, 14380556, 14973408, 15091192, 15011602, 15368419, 16546407, 18292574, 19998573, 21232187, 21922234, 22148895, 21865135, 20812687, 18719511, 15641067, 12091617, 8775620, 6207492, 4587690, 3849260, 3626225]
37990C626225l23166q95984j369477j248014m91408P45139K472826M659740O798353
37981A3974234Q023392P725728N960585L357706P63119j220921k633766m036411
37973C1913666n721394p048801o850241m620398j194703J811542L180524K796549
37965A4266744J442531P6734p36959q96971n64362j00753n2255p66559j864493
37956A0803657k440044k094879j532658j749469k800912l825633m223855m261275
37948a2125068m350158m240378l312678j416899R51643L177778M893958N887595
37940a0534207N994308N207227L755005K027533M89616m46733p10803p43489j123509
37931C914948j892122k399061j953781n60397J053900K040837K021807J253668
$$ y = [3626225, 3303059, 2407075, 1037598, -210416, -701824, 43315, 2516141, 7175881, 13974234, 21997626, 29723354, 35683939, 39041645, 39804764, 38583843, 35950077, 31913666, 26192272, 19143471, 12293230, 7672832, 6478129, 8289671, 11470195, 14266744, 15709275, 15786009, 15049050, 14152079, 13587717, 13486964, 13434709, 12668150, 10803657, 8363613, 6268734, 4736076, 2986607, 185695, -3639938, -7863793, -12125068, -16475226, -20715604, -24028282, -25445181, -24493538, -21315760, -16421802, -10534207, -4539899, 667328, 4422333, 6449866, 6939482, 6492749, 5781946, 5038457, 3914948, 2022826, -376235, -2330016, -2890413, -1836513, 204324, 2226131, 3479799]
37923C479799L50385k50239o42051j172839j765338j776382p67206Q02798K010911
37914B69838K481298K533007K351511J574138l2897j892448l011589k895308j805772
37905d28222l19862J046683J923248K172899J921651J303862K65468j154206k483286
37896D248235l107336k893475k252455j600848j041737n50869j28822L22142R91877
37887f013288J892933K744093L162571K857602J754116K06528j005834j309734
37879D288987j007150r17137j257966j315214m29889J069016K225066K486661
37871E142374K089699J615446J470597J701122K057057K217140K016558J434163
37863A9744156M79196o56613j444474j477755j144939j328654k228858k990876
$$ y = [3479799, 3830184, 3579945, 2937894, 1765055, -283, -1776665, -2543871, -1741073, 269838, 2751136, 5284143, 7635654, 9209792, 9176895, 7284447, 4272858, 1377550, -428222, -748084, 298599, 2221847, 4394746, 6316397, 7620259, 7885727, 6731521, 4248235, 1140899, -1752576, -4005031, -5605879, -6647616, -7198485, -7327307, -7005165, -6013288, -4120355, -1376262, 1786309, 4643911, 6398027, 6604555, 5598721, 4288987, 3281837, 2364700, 1106734, -208480, -638369, 430647, 2655713, 5142374, 7232073, 8847519, 10318116, 12019238, 14076295, 16293435, 18309993, 19744156, 20223352, 19566739, 18122265, 16644510, 15499571, 14170917, 11942059, 8951183]
37855H951183k808538j898490r73300k46803M59565J000559R88228M32034k81359
37846E623079r10076j313702j080226J13125J789761K965083L185589K709725
37838A3082358J725008J76816j502259k379695k193990j861301k256507k997683
37830A792747l034165k058121p15625L09157P66156N33801m71959j955369l284571
37821h117949m066633m401619m486611m264376l581617k443468r67071P21801
37813c1607543K385107L609190M055428L784745L213227K679409K099737J153073
37805h627627j66354j327357j771245j582833j416725j725217k289813k573149
37797b1480320k258475j325457O0672J436353K083509J638237O39892J31744O50054
$$ y = [8951183, 6142645, 4244155, 3270855, 3024052, 3483617, 4484176, 5472404, 5904438, 5623079, 4713003, 3399301, 2319075, 2432200, 4221961, 7187044, 10372633, 13082358, 14807366, 14984182, 13481923, 11102228, 8908238, 7046937, 4790430, 1792747, -1241418, -3299539, -4015164, -3706007, -2939851, -2406050, -2878009, -4833378, -8117949, -12184582, -16586201, -21072812, -25337188, -28918805, -31362273, -32329344, -31607543, -29222436, -25613246, -21557818, -17773073, -14559846, -11880437, -9780700, -8627627, -8793981, -10121338, -11892583, -13475416, -14892141, -16617358, -18907171, -21480320, -23738795, -25064252, -25003580, -23567227, -21483718, -19845481, -19205589, -19073845, -18423791]
37788a8423791J813378K876661L398772L334508K814691K057711J338530Q51539
37780F1999O53082Q08969J458556K565907L663599M038907L287555J680597m5072
37771A8174099j282688j971960k444392k877484k959038k167919m31013J515576
37763E555181K520442J953014L70180q54429p88054J43496O64725Q4372j032997
37754H615930j705063j681501j440455j296115j031482m75263l150j93705j177385
37745c88189k543069l772490m567745m809683m409692l306749j599646L21722
37737b5075541J814593K301550J703546N67434l25917n44231k33235J59665L13990
37728a9318146K13499L0530l7817J83996Q38692J925301L148450L932944L705783
$$ y = [-18423791, -16610413, -13733752, -10334980, -7000472, -4185781, -2128070, -789540, 61999, 715081, 1524050, 2982606, 5548513, 9212112, 13251019, 16538574, 18219171, 18174099, 16891411, 14919451, 12475059, 9597575, 6638537, 4470618, 4039605, 5555181, 8075623, 10028637, 10398817, 9544388, 8756334, 8899830, 9564555, 9648927, 8615930, 6910867, 5229366, 3788911, 2492796, 1461314, 986051, 982901, 789196, -388189, -2931258, -6703748, -11271493, -16081176, -20490868, -23797617, -25397263, -25075541, -23260948, -20959398, -19255852, -18688418, -19014335, -19558566, -19791801, -19632136, -19318146, -19104647, -19074117, -19111934, -18927938, -18089246, -16163945, -13015495, -9082551, -5376768]
37719e376768K321919L38255j196729j496225p71207r4809l36146j319667k234184
37710a0165561k676201k848792k778170j958178r9589K197091L953870M750414
37702i625116M769094M201654L162911K056677J386321J076576M85996o85666
37694F828447j866947k210098j447219l495J422123K161910J760407K27874j883710
37685D989292l791503m868195m811600l711283k024384k51417J419299K896576
37677a0153215L680104L131575J510416K23071N20443K160036L756717M254946
37669I084093L677241K678400J894978J633568J668058J303629N1317j731537
37661B0259747l210644m000223m277935m081448l153584j641120l11513K93266
$$ y = [-5376768, -3054849, -2716594, -3913323, -5409548, -6180755, -6275564, -6611710, -7931377, -10165561, -12841762, -15690554, -18468724, -20426902, -20526491, -18329400, -14375530, -9625116, -4856022, -654368, 2508543, 4565220, 5951541, 7028117, 7514113, 6828447, 4961500, 2751402, 1304183, 1300688, 2722811, 4884721, 6645128, 6873002, 4989292, 1197789, -3670406, -8482006, -12193289, -14217673, -14469090, -13049791, -10153215, -6473111, -3341536, -1831120, -1608049, -1087606, 1072430, 4829147, 9084093, 12761334, 15439734, 17334712, 18968280, 20636338, 21939967, 21991284, 20259747, 17049103, 13048880, 8770945, 4689497, 1535913, -105207, -416720, -123454]
37653a23454M66336P29009J023693R65171N77961K37811P329m55242j287640k102983
37643C7991k363251j830177o28281Q86301K272144L233621L780468M053346M060720
37634A3502882L797659L546381L693209M117317M052057K821823O37087j516157
37626C4652258k730331k793689k053055r41591K04789J016518J103248L95308
37618B8853455o15471j189187r57358j55049P18856J278745J280802N87496o31927
37609B9170362j777999k166192j561509l18810R25353J617623J529076Q99078
37601B8316982L02174J18581Q9033m04998j533392k632442k736370j456532O74057
37592B0737093K638974L684863L718938L085441K083917Q38832m21232j273549
$$ y = [-123454, 342882, 1071891, 2095584, 3060755, 3638716, 3876527, 3883856, 3428614, 2140974, 37991, -2325260, -4155437, -4783718, -3897417, -1625273, 1608348, 5388816, 9442162, 13502882, 17300541, 20846922, 24540131, 28657448, 32709505, 35531328, 36168415, 34652258, 31921927, 29128238, 27075183, 26133592, 26338381, 27354899, 28458147, 28853455, 28237984, 27048797, 26091439, 25936390, 26655246, 27933991, 29214793, 29802289, 29170362, 27392363, 25226171, 23664662, 23345852, 24271205, 25888828, 27417904, 28316982, 28619156, 28737737, 28826770, 28421772, 26888380, 24255938, 21519568, 20063036, 20737093, 23376067, 27060930, 30779868, 33865309, 35949226, 36788058, 36366826, 35093277]
37584C5093277j493903j349052j250507j248606j133824r18777q84484j183785
37576B5630339j725091k443905l340408m192445m575190m293536l543947k597054
37568a081237j625265q77764n98244o02119l49240L16999Q87906R33728P32979
37559b262257P77014J025935J171309J352832J974266K879868L319033K828762
37551A3066762J715411O05572n8951n8709N24879J061343O69384q94986k901466
37542A3729239m420244n167018n362267n074322m094675k375295l10753J415192
37534a1660143K191985J871593R58073K48992J16403K67156K84352J05575k35627
37525e851641r60041k153485l183412l042498j395239J017763L061100L998577
$$ y = [35093277, 33599374, 32250322, 30999815, 29751209, 28617385, 27698608, 26814124, 25630339, 23905248, 21461343, 18120935, 13928490, 9353300, 5059764, 1515817, -1081237, -2706502, -3584266, -4182510, -4784629, -5133869, -4816870, -3928964, -2995236, -2262257, -1485243, -459308, 712001, 2064833, 4039099, 6918967, 10238000, 13066762, 14782173, 15387745, 15328794, 15270085, 15794964, 16856307, 17525691, 16630705, 13729239, 9308995, 4141977, -1220290, -6294612, -10389287, -12764582, -13075335, -11660143, -9468158, -7596565, -6638492, -6389500, -6273097, -6005941, -5721589, -5616014, -5851641, -6811682, -8965167, -12148579, -15191077, -16586316, -15568553, -12507453, -8508876]
37517h508876L631068K144083J41875j419493j735456o86474J173332L071292
37509b188649M413400M944197M771735M225766L524186K564527J170105m66367
37501B2958900j781868k410464k622328k977976l539166l661872k740492j018326
37493B206408N65351J268205J035427J58600j130041k519770l433701l395969
37485e245490k514774j308979j06609J126082K429438L639278M529673M880883
37477G429502M412789K992833R89454q96509k281490l331588m276477n009725
37469B8789n287417m972202l921176k049467K13405J962999K768598L257072M213087
37460c786312N340009N571038M544910L087407K117698J731055J628796J841833
$$ y = [-8508876, -4877808, -2733725, -2591850, -4011343, -5746799, -6433273, -5259941, -2188649, 2224751, 7168948, 11940683, 16166449, 19690635, 22255162, 23425267, 22958900, 21177032, 18766568, 16144240, 13166264, 9627098, 5965226, 3224734, 2206408, 2771759, 4039964, 5075391, 5233991, 4103950, 1584180, -1849521, -5245490, -7760264, -9069243, -9175852, -8049770, -5620332, -1981054, 2548619, 7429502, 11842291, 14835124, 15824578, 14928069, 12646579, 9314991, 5038514, 28789, -5258628, -10230830, -14152006, -16201473, -15988068, -14025069, -11256471, -7999399, -3786312, 1553697, 7124735, 11669645, 14757052, 16874750, 18605805, 20234601, 22076434]
37452B2076434K529722L409394L872939L544334K447998Q66382o60296j479293
37444C6607614j417105j074641j130756j517346j735252j783409k090406k504442
37436B3354257k140413o24140J092231J725068J165221M57791M51090R88259J390781
37427B7860145J232493N32875m03468j154312j468294j545807j811314k300684
37419B0941634k530537k100765j141831N830J221377K403826L130677K975269
37411B4905480K075444R79271k7360j000207j728707j586753k75758J628340L194701
37402B8164451L999387M209142M030445L438388K393091J035091l61690j512376
37394D5395929k302997k981552l949658n107915n651037m960723l619565l032345
$$ y = [22076434, 24606156, 28015550, 31888489, 35432823, 37880821, 38747203, 38086907, 36607614, 35190509, 34115868, 32985112, 31467766, 29732514, 27949105, 25858699, 23354257, 21213844, 20589704, 21681935, 23407003, 24572224, 25030015, 25481105, 26469364, 27860145, 29092638, 29625513, 29222045, 28067733, 26599439, 25053632, 23242318, 20941634, 18411097, 16310332, 15168501, 15174331, 16395708, 18799534, 21930211, 24905480, 26980924, 27960195, 27932835, 26932628, 25203921, 23617168, 23341410, 24969750, 28164451, 32163838, 36372980, 40403425, 43841813, 46234904, 47269995, 46908305, 45395929, 43092932, 40111380, 36161722, 31053807, 25402770, 20442047, 16822482, 13790137]
37386A3790137l910762n492393o393217n920550m424255k704215j312015k21522
37378a6588792J004284K575425L951071M226230L139930J400226p3724q26370
37370a191720o86899M05155J880784K389101J005270j487595l189363l006037
37362c881304j495202J18696J086096J212786O14941j16026l1587J262116K986817
37353A757333L961933L916402L634716L803183M096993L603348J992653O6670
37345B6833231r38691n86847L23773O59727J85994l16163j02745O97212J367435
$$ y = [13790137, 9879375, 4386982, -2006235, -7926785, -12351040, -15055255, -16367270, -16588792, -15584508, -13009083, -9058012, -4831782, -1691852, -291626, -365350, -1191720, -1878619, -1473464, 407320, 2796421, 3801691, 2314096, -875267, -3881304, -5376506, -5257810, -4171714, -2958928, -2343987, -2460013, -2491600, -1229484, 1757333, 5719266, 9635668, 13270384, 17073567, 21170560, 24773908, 26766561, 26833231, 25894540, 25307693, 25631466, 26291193, 26477187, 26161024, 26058279, 26755491, 28122926]
$$ [...]
##END NTUPLES=NMR SPECTRUM
##END=
