##TITLE=31Pdec_11P153'D2O
 aceton-d6, D2O 24 sc
 9.8.2023
##JCAMPDX= 6.0         $$ Bruker NMR JCAMP-DX V2.0
##DATA TYPE= NMR SPECTRUM
##DATA CLASS= NTUPLES
##ORIGIN= UXNMR, Bruker Analytische Messtechnik GmbH
##OWNER= root
$$ XWIN-NMR		Version 3.5
$$ Wed Aug  9 13:51:18 2023 Russian Standard Time (UT+4h)  she@DPX200
##.OBSERVE FREQUENCY= 81.013821
##.OBSERVE NUCLEUS= ^31P
##.ACQUISITION MODE= SIMULTANEOUS
##.ACQUISITION SCHEME= undefined
##.AVERAGES= 24
##.DIGITISER RES= 16
##SPECTROMETER/DATA SYSTEM= spect
##.PULSE SEQUENCE= zgpg30
##.SOLVENT NAME= CDCl3
##.SHIFT REFERENCE= (INTERNAL, CDCl3, 0, 248.564)
##AUDIT TRAIL= $$ (NUMBER, WHEN, WHO, WHERE, WHAT)
$$ ##TITLE= Audit trail, XWIN-NMR		Version 3.5
$$ ##JCAMPDX= 5.01
$$ ##ORIGIN= Bruker BioSpin GmbH
$$ ##OWNER= she
$$ F:/spectra/data/she/nmr/P31/1/pdata/1/auditp.txt
$$ ##AUDIT TRAIL=  $$ (NUMBER, WHEN, WHO, WHERE, WHAT)
(   1,<2023-08-09 13:49:55.00 +0400>,<she>,<DPX200>,
      <created by zg, POWCHK disabled, PULCHK disabled
       configuration hash MD5:
       00 E9 B6 7A A2 85 ED C7 34 08 36 98 17 FE 4E 26
       data hash MD5: 32K
       96 E8 44 2A 75 C4 05 13 BF E0 2D 67 26 C3 68 C1>)
(   2,<2023-08-09 13:49:58.26 +0400>,<she>,<DPX200>,
      <Start of raw data processing
       efp BC_mod = 2 LB = 5 FT_mod = 6 PKNL = 1 PHC0 = -10643.88 PHC1 = 40.28482 SI = 64K 
       data hash MD5: 64K
       C9 7F 1B 51 CB 4C C4 3E D2 E8 C5 C8 95 9E 3B E1>)
(   3,<2023-08-09 13:50:44.98 +0400>,<she>,<DPX200>,
      <pk PHC0 = -14.03236 PHC1 = 29.00001 
       data hash MD5: 64K
       49 CD 9D F2 50 64 D9 9C 61 64 6B D4 92 B3 92 93>)
(   4,<2023-08-09 13:50:50.68 +0400>,<she>,<DPX200>,
      <abs ABSG = 5 
       data hash MD5: 64K
       E6 BB 8D 6B EF 6A 66 B6 CA 49 A9 1E FC 2A 57 09>)
$$ ##END=
$$ 
$$ hash MD5
$$ AE 19 8D 0B CC E8 1C 8D 94 30 3F 93 E5 38 F9 C9
##$RELAX= 
##$RELAX= 
##$RELAX= 
##$RELAX= 
##$RELAX= 
##$RELAX= 
##$RELAX= 
##$RELAX= 
##$RELAX= 
$$ Bruker specific parameters
$$ --------------------------
##$DU= <F:/spectra>
##$EXPNO= 1
##$NAME= <P31>
##$PROCNO= 1
##$TYPE= <nmr>
##$USER= <she>
##$AMP= (0..31)
100 100 100 100 100 100 100 100 100 100 100 100 100 100 100 100 100 100 
100 100 100 100 100 100 100 100 100 100 100 100 100 100 
##$AQSEQ= 0
##$AQ_mod= 1
##$AUNM= <au_zg>
##$AUTOPOS= <>
##$BF1= 81.014009
##$BF2= 200.13
##$BF3= 200.13
##$BF4= 200.13
##$BF5= 200.13
##$BF6= 200.13
##$BF7= 200.13
##$BF8= 200.13
##$BYTORDA= 1
##$CFDGTYP= 0
##$CFRGTYP= 5
##$CHEMSTR= <none>
##$CNST= (0..31)
1 1 145 1 1 1 1 1 1 1 1 1 1 1 1 1 1 1 1 1 1 1 1 1 1 1 1 1 1 1 1 1 
##$CPDPRG= <waltz16>
##$CPDPRG1= <>
##$CPDPRG2= <waltz16>
##$CPDPRG3= <>
##$CPDPRG4= <mlev>
##$CPDPRG5= <mlev>
##$CPDPRG6= <mlev>
##$CPDPRG7= <mlev>
##$CPDPRG8= <mlev>
##$CPDPRGB= <>
##$CPDPRGT= <>
##$D= (0..31)
0 1 0 0 0 0 0 0 0 0 0 0.03 2e-05 3e-06 0 0 0 0 0 0 0 0 0 0 0 0 0 0 0 0 
0 0 
##$DATE= 1691574594
##$DBL= (0..7)
120 120 120 11 120 120 24 19 
##$DBP= (0..7)
150 150 150 150 150 150 150 150 
##$DBP07= 0
##$DBPNAM0= <>
$$ [...]
##$SUBNAM3= <"">
##$SUBNAM4= <"">
##$SUBNAM5= <"">
##$SUBNAM6= <"">
##$SUBNAM7= <"">
##$SUBNAM8= <"">
##$SUBNAM9= <"">
##$SW= 501.771253377433
##$SWIBOX= (0..15)
0 1 3 0 0 0 0 0 0 0 0 0 0 0 0 0 
##$SW_h= 40650.406504065
##$TD= 32768
##$TD0= 1
##$TE= 0
##$TE2= 300
##$TE3= 300
##$TEG= 300
##$TL= (0..7)
0 120 53 12 22 120 120 120 
##$TP= (0..7)
150 150 150 150 150 150 150 150 
##$TP07= 0
##$TPNAME0= <>
##$TPNAME1= <>
##$TPNAME2= <>
##$TPNAME3= <>
##$TPNAME4= <>
##$TPNAME5= <>
##$TPNAME6= <>
##$TPNAME7= <>
##$TPOAL= (0..7)
0.5 0.5 0.5 0.5 0.5 0.5 0.5 0.5 
##$TPOFFS= (0..7)
0 0 0 0 0 0 0 0 
##$TUNHIN= 0
##$TUNHOUT= 0
##$TUNXOUT= 0
##$USERA1= <user>
##$USERA2= <user>
##$USERA3= <user>
##$USERA4= <user>
##$USERA5= <user>
##$V9= 5
##$VALIST= <valist>
##$VCLIST= <CCCCCCCCCCCCCCC>
##$VD= 0
##$VDLIST= <DDDDDDDDDDDDDDD>
##$VPLIST= <PPPPPPPPPPPPPPP>
##$VTLIST= <TTTTTTTTTTTTTTT>
##$WBST= 1024
##$WBSW= 4
##$XGAIN= (0..3)
0 0 0 0 
##$XL= 0
##$YL= 0
##$YMAX_a= 3674
##$YMIN_a= -1109
##$ZGOPTNS= <>
##$ZL1= 120
##$ZL2= 120
##$ZL3= 120
##$ZL4= 120
##$ABSF1= 248.5645
##$ABSF2= -253.2056
##$ABSG= 5
##$ABSL= 3
##$ALPHA= 0
##$AQORDER= 0
##$ASSFAC= 0
##$ASSFACI= 0
##$ASSFACX= 0
##$ASSWID= 0
##$AUNMP= <proc_1d>
##$AZFE= 0.1
##$AZFW= 0.5
##$BCFW= 0
##$BC_mod= 2
##$BYTORDP= 0
##$COROFFS= 0
##$CY= -3
##$DATMOD= 1
##$DC= 0
##$DFILT= <>
##$DTYPP= 0
##$F1P= 0
##$F2P= 0
##$FCOR= 1
##$FTSIZE= 65536
##$FT_mod= 6
##$GAMMA= 0
##$GB= 0
##$INTBC= 1
##$INTSCL= 6.047779e-11
##$ISEN= 30
##$LB= 5
##$LEV0= 0
##$LPBIN= 0
##$MAXI= 10000
##$MC2= 0
##$MEAN= 0
##$ME_mod= 0
##$MI= 50
##$NCOEF= 0
##$NC_proc= -10
##$NLEV= 6
##$NOISF1= 182.463
##$NOISF2= 159.3651
##$NSP= 0
##$NTH_PI= 0
##$NZP= 0
##$OFFSET= 248.5645
##$PC= 4
##$PHC0= -10657.91
##$PHC1= 69.28483
##$PH_mod= 1
##$PKNL= yes
##$PPARMOD= 0
##$PSCAL= 0
##$PSIGN= 0
##$REVERSE= no
##$SF= 81.0140089999694
##$SI= 65536
##$SIGF1= 159.3651
##$SIGF2= -187.1042
##$SINO= 113.3802
##$SIOLD= 16384
##$SREGLST= <1H.CDCl3>
##$SSB= 0
##$STSI= 65536
##$STSR= 0
##$SW_p= 40650.406504065
##$SYMM= 0
##$S_DEV= 0
##$TDeff= 32768
##$TDoff= 0
##$TI= <>
##$TILT= no
##$TM1= 0
##$TM2= 0
##$TOPLEV= 0
##$USERP1= <user>
##$USERP2= <user>
##$USERP3= <user>
##$USERP4= <user>
##$USERP5= <user>
##$WDW= 1
##$XDIM= 65536
##$YMAX_p= 297560813
##$YMIN_p= -37637640
$$ End of Bruker specific parameters
$$ ---------------------------------
##NTUPLES= NMR SPECTRUM
##VAR_NAME=  FREQUENCY,     SPECTRUM/REAL,   SPECTRUM/IMAG
##SYMBOL=    X,             R,               I
##VAR_TYPE=  INDEPENDENT,   DEPENDENT,       DEPENDENT
##VAR_FORM=  AFFN,          ASDF,            ASDF
##VAR_DIM=   65536,         65536,           65536
##UNITS=     HZ,            ARBITRARY UNITS, ARBITRARY UNITS
##FACTOR=    0.620285442955139, 1,           1
##FIRST=     20137.2065510682, 0,            0
##LAST=      -20513.1999529968, 0,           0
##MIN=       -20513.1999529968, -37637640,   0
##MAX=       20137.2065510682, 297560813,    0
$$ Real data points
##PAGE= N=1
##DATA TABLE= (X++(R..R)), XYDATA
$$ [...]
13043D35511j761571k145860k050705j500267n60837N69355J445158J706406J555965
13034b306845J581411J982154K255868J836186Q11169k24788q49288j043087q54154
13025C188626k30938O90298J436488J604815J317963J046294R99568R03210M16710
13016A1373034m18428j249244j774554j904130j700652j371065j233722j436219
13008B85020j688174j513918q52983k09784j02801n44217j166741j637147j750411
12999i181156j333818l93727O90323J415150J636787J590712J426294R98284K31750
12990b919401n49029q72416o05571l0076N04941Q66504J122876J397451J753821
12981F69100K126966K350404K325833K166699K069553J996312J586705N16702
$$ y = [435511, -1326060, -3471920, -5522625, -7022892, -7583729, -7014374, -5569216, -3862810, -2306845, -725434, 1256720, 3512588, 5348774, 6159943, 5935155, 5085867, 4042780, 3188626, 2957688, 3647986, 5084474, 6689289, 8007252, 9053546, 10053114, 10956324, 11373034, 10954606, 9705362, 7930808, 6026678, 4326026, 2954961, 1721239, 285020, -1403154, -2917072, -3770055, -3979839, -4082640, -4626857, -5793598, -7430745, -9181156, -10514974, -10908701, -10218378, -8803228, -7166441, -5575729, -4149435, -3151151, -2919401, -3468430, -4340846, -4946417, -4976493, -4471552, -3605048, -2482172, -1084721, 669100, 2796066, 5146470, 7472303, 9639002, 11708555, 13704867, 15291572, 15808274]
12973A5808274j049102k454285l054705k715270j832113r65514m96003n12457
12965B728825q51562j212653j342863j178479q00710l10509J55443L45412L5542
12956b431554o75586j358924j631238j440715r46869l13798K45676M18351M3723
12947h090934o28851j137805j238356r59998l01228Q38816K316362L550130L901556
12938a750308L251355K102732J088010L99760k73748j255227k383048l112084
12930a932558l107856k584106j975658j459569r79887n93922m96491o92588q88640
12921a4711275p90050l66763K05955P27201J072119J265884J484322J848497K222660
12912g041450K367380K257336K034917J687414J088795M18148J60708M66362P92480
$$ y = [15808274, 14759172, 12304887, 9250182, 6534912, 4702799, 3737285, 3241282, 2728825, 1877263, 664610, -678253, -1856732, -2657442, -2967951, -2812508, -2467096, -2431554, -3107140, -4466064, -6097302, -7538017, -8484886, -8798684, -8553008, -8134657, -8090934, -8719785, -9857590, -11095946, -12055944, -12357172, -11518356, -9201994, -5651864, -1750308, 1501047, 3603779, 4691789, 5091549, 4817801, 3562574, 1179526, -1932558, -5040414, -7624520, -9600178, -11059747, -12039634, -12633556, -13130047, -13822635, -14711275, -15501325, -15868088, -15662133, -14934932, -13862813, -12596929, -11112607, -9264110, -7041450, -4674070, -2416734, -381817, 1305597, 2394392, 2812540, 2973248, 3439610, 4232090]
12903D232090M87798m36142j395932j957062k153278k168752k051152j788745
12895g231175j392136p88074J67668J430747K622853L256966L097193K311928
12887C475970J352602O61264L74887K92338K07689K32196O23373J285450J646258
12878A0152027J167081j16302j655287k890183l570473l685582l334257k764962
12870f697938k383728k488366k920207l083521k436125r93891O59009J822354
12862a8522413K121609J619453O76875k55563q47926j014321q39449m17290J54717
12853a7324308O78395R57224J048396J209835J485730J551546J157965N55054
12845h680163K25108L05762N52729P93695J061346J221189Q32626l55557j909554
$$ y = [4232090, 4719888, 4283746, 2887814, 930752, -1222526, -3391278, -5442430, -7231175, -8623311, -9411385, -9243717, -7812970, -5190117, -1933151, 1164042, 3475970, 4828572, 5489836, 5864723, 6157061, 6364750, 6596946, 7220319, 8505769, 10152027, 11319108, 11202806, 9547519, 6657336, 3086863, -598719, -3932976, -6697938, -9081666, -11570032, -14490239, -17573760, -20009885, -21003776, -20344767, -18522413, -16400804, -14781351, -14104476, -14360039, -15207965, -16222286, -17061735, -17479025, -17324308, -16645913, -15688689, -14640293, -13430458, -11944728, -10393182, -9235217, -8680163, -8455055, -8149293, -7596564, -6802869, -5741523, -4520334, -3687708, -4043265, -5952819]
12836e952819k938420k836831j756537m19055M51564N67360R7293o12320j249156
12827a4648921j531934j261032n64688P0331K99091L87480Q82826J832313K671786
12818a1862748K953516K816574K577326K228505J646459J016597O61773N62101
12810B600103L90899J718l93851n35580l96191j70707j43805m84290r80521j102936
12800a215161o02879L7023P0946o21086j440691j854408j869480j644720j082315
12791a0222771j15631Q77347J321815J057349N02174K66136P09350J729426K800947
12782a073858L338303L217891K893726K875214L179855L403493L167260K328105
12774B3329989R42159o83080j986620k534414k465236k357656k613417l114123
$$ y = [-5952819, -8891239, -11728070, -13484607, -13903662, -13452098, -12884738, -12787445, -13399765, -14648921, -16180855, -17441887, -18006575, -17936244, -17637153, -17249673, -16366847, -14534534, -11862748, -8909232, -6092658, -3515332, -1286827, 359632, 1376229, 2038002, 2600103, 2991002, 2992720, 2598869, 2063289, 1667098, 1496391, 1352586, 868296, -112225, -1215161, -1818040, -1781017, -1710071, -2331157, -3771848, -5626256, -7495736, -9140456, -10222771, -10338402, -9461055, -8139240, -7081891, -6579717, -6313581, -5604231, -3874805, -1073858, 2264445, 5482336, 8376062, 11251276, 14431131, 17834624, 21001884, 23329989, 24272148, 23589068, 21602448, 19068034, 16602798, 14245142, 11631725, 8517602]
12766H517602l446783l258606k414879j084497K47512J076972J319638J326417
12758B283376J410629J530199J495174J278100R94997P56013O69778Q19363J063073
12749A2300702J025550N23206r7837l11315r8311n5602p32416j981776l033460
12740G538741l142251k172678o85762M72445P52314K00859p38481j660724k398156
12731a833693k867999k901782k350739j343193l31153K26287K73988K21073N35608
12722a0371603J303602K245522L083935L705777L968266L627551K648399J410415
12714A1621864L76487l43861q83871j193596j050543m95778P0771L34682L35141
12705H771296J71614k51529r55194j620821j946147k142091k685488l539953l966040
$$ y = [8517602, 5070819, 1812213, -602666, -1687163, -1439651, -362679, 956959, 2283376, 3694005, 5224204, 6719378, 7997478, 8992475, 9748488, 10418266, 11237629, 12300702, 13326252, 13849458, 13751621, 13440306, 13341995, 13286393, 12553977, 10572201, 7538741, 4396490, 2223812, 1538050, 2010495, 2762809, 2963668, 2225187, 564463, -1833693, -4701692, -7603474, -9954213, -11297406, -11628559, -11402272, -11128284, -10907211, -10371603, -9068001, -6822479, -3738544, -32767, 3935499, 7563050, 10211449, 11621864, 11998351, 11654490, 10770619, 9577023, 8526480, 8030702, 8101473, 8436155, 8771296, 8942910, 8691381, 7736187, 6115366, 4169219, 2027128, -658360, -4198313, -8164353]
12696h164353l290847j691986n5437Q52968R75117Q49111J075920J835948K737062
12687d876497L078036K400477R47501m00571p78359p4625R62492J457530J273145
12678C989129J041673J312755J867856K037249J512249N44658n82427j878482
12670I844660l300692m420020m740385m233572l317672k376375j520011p74164
12662a4838231k47238k7203l5548l3525K71071J038413K060084K767963K709240
12653f334974K047258J394792J103404R26160M65312k75089r42227j241579j068864
12644c925807l88904O94747J728514K043667J281958k61651j869233k920716l205537
12635f822962k884461k278817j657622j102377n14450K23353J059197J758543
$$ y = [-8164353, -11455200, -13147186, -13202623, -12349655, -11374538, -10525427, -9449507, -7613559, -4876497, -1798461, 602016, 1549517, 1148946, 370587, 295962, 1258454, 2715984, 3989129, 5030802, 6343557, 8211413, 10248662, 11760911, 12305569, 11723142, 9844660, 6543968, 2123948, -2616437, -6850009, -10167681, -12544056, -14064067, -14838231, -15085469, -15112672, -15148220, -15181745, -14910674, -13872261, -11812177, -9044214, -6334974, -4287716, -2892924, -1789520, -863360, -398048, -673137, -1615364, -2856943, -3925807, -4314711, -3619964, -1891450, 152217, 1434175, 1172524, -696709, -3617425, -6822962, -9707423, -11986240, -13643862, -14746239, -15260689, -15037336, -13978139, -12219596]
12627a2219596K119254K191520K196232K179200J862925R98671j76251j031612
12619a879657j153817p25813k54210p2271j69038l07137j67739M45473J343626
12610b940583J997430K032945J607135J137378P88037M42477N8985k51923m78063
12601D393818p38982j036469j224016j261204j258095j243662j163990j146951
12593d679551j433261j924385k141306j840556j358455j063104p48197K9485J158248
12584a4001082J957570J989549J547344J228034J259012J380680J240466P60333
12576b638094J68510k41457l70171l39819k97194k85495l37430n50227r43104
12567e834481j321273j396951r97154j21916J024860J949706K060468J238587
$$ y = [-12219596, -10100342, -7908822, -5712590, -3533390, -1670465, -671794, -848045, -1879657, -3033474, -3759287, -4013497, -4085768, -4254806, -4561943, -4729682, -4284209, -2940583, -943153, 1089792, 2696927, 3834305, 4622342, 5064819, 5123804, 4871881, 4393818, 3654836, 2618367, 1394351, 133147, -1124948, -2368610, -3532600, -4679551, -6112812, -8037197, -10178503, -12019059, -13377514, -14440618, -15188815, -15159330, -14001082, -12043512, -10053963, -8506619, -7278585, -6019573, -4638893, -3398427, -2638094, -2469584, -2711041, -3081212, -3421031, -3718225, -4003720, -4341150, -4891377, -5834481, -7155754, -8552705, -9549859, -9671775, -8646915, -6697209, -4636741, -3398154]
12559c398154J18528m89420m11347j04179N5581J08784J43718K8820k76897m47643
12549d672209j05431P10610J568056K035079J933903J342779N02036l68701j266216
12540A679906k307495l352103l908023l615378k711484j791069j149988n80158
12532a7735792J85638J049972J681248J949285K091783K429145K963102L313563
12524b072056L093726K327614J432780P99202M71318K37395j08288o40997j289126
12515D251568j825612j981238j697779j212139q04929n61435m78679o52648j134725
12506f097616j671413j857771j607818j263159j123353j020381n14225N38285
12498a4617451J721416K369370K111633J173755K14162j57152K10853R91088J702193
$$ y = [-3398154, -3279626, -3769046, -4180393, -4284572, -4228991, -4120207, -3976489, -3947669, -4224566, -4672209, -4777640, -4067030, -2498974, -463895, 1470008, 2812787, 3314823, 2946122, 1679906, -627589, -3979692, -7887715, -11503093, -14214577, -16005646, -17155634, -17735792, -17550154, -16500182, -14818934, -12869649, -10777866, -8348721, -5385619, -2072056, 1021670, 3349284, 4782064, 5581266, 6052584, 6289979, 6181691, 5540694, 4251568, 2425956, 444718, -1253061, -2465200, -3270129, -3831564, -4310243, -4962891, -6097616, -7769029, -9626800, -11234618, -12497777, -13621130, -14641511, -15155736, -14617451, -12896035, -10526665, -8415032, -7241277, -7027115, -7184267, -6973414, -5982326, -4280133]
12489d280133K031969J921925J482695R03748L78538J684k96165o56646j078252
12480D09363j305430j019254k12850O60528J033986P71222K88046P8676K15751
12471I20038M20845N28033O63605R43582J212169J237284J050548Q96555Q55470
12462H728129O95784J77173o13632j331070j722295j826336j859457j985209k168562
12453a905475k168358j713315q30171j396J95693k81446q17086q05755l48730
12444h676039r0562m10024r96884j257855r26139j76532O73109J404055J932780
12435h524091K271558K460380K480590K272017J872858J466501J223252J151768
12427F674833J145572J083828Q35539K99419m34473j045769j227336r12714j95039
$$ y = [-4280133, -2248164, -326239, 1156456, 2060204, 2438742, 2440426, 2144261, 1487615, 409363, -896067, -1915321, -2128171, -1467643, -433657, 337565, 625611, 704287, 920038, 1340883, 1868916, 2532521, 3476103, 4688272, 5925556, 6976104, 7872659, 8728129, 9423913, 9601086, 8987454, 7656384, 5934089, 4107753, 2248296, 263087, -1905475, -4073833, -5787148, -6617319, -6618715, -6423022, -6704468, -7521554, -8327309, -8676039, -8766601, -9176625, -10173509, -11431364, -12357503, -12534035, -11860926, -10456871, -8524091, -6252533, -3792153, -1311563, 960454, 2833312, 4299813, 5523065, 6674833, 7820405, 8904233, 9739772, 10039191, 9604718, 8558949, 7331613, 6418899, 6223860]
12418F223860Q33715K004747K968462L407244L307688K821020J942568O38317
12410B4147621p21461j450372j260718o20023j65794J7360K58889O12159O86310
12401B1503971J92097o53512j395441j817307k014908k130438k172720k061105
12393I450637j739677j249004p32879l61129k19247k84831m91862p50293r06598
12384B715117p90317l53420K94192R97704J603982J890493J653910J020133N06975
12375I538769N30507Q88703R64657M46099l87332j122778j676278k148431k465736
12366D568180k428785k007050j340514n02014M96667J455957J992826J912650
12358D147917J451334J040792Q78889P71438L61804m79474j441808j985455j851378
$$ y = [6223860, 7057575, 9062322, 12030784, 15438028, 18745716, 21566736, 23509304, 24147621, 23426160, 21975788, 20715070, 20095047, 19929253, 19946613, 20205502, 20817661, 21503971, 21696068, 21042556, 19647115, 17829808, 15814900, 13684462, 11511742, 9450637, 7710960, 6461956, 5729077, 5367948, 5148701, 4863870, 4372008, 3621715, 2715117, 1924800, 1571380, 1865572, 2863276, 4467258, 6357751, 8011661, 9031794, 9538769, 10069276, 10957979, 11922636, 12368735, 11981403, 10858625, 9182347, 7033916, 4568180, 2139395, 132345, -1208169, -1710183, -1213516, 242441, 2235267, 4147917, 5599251, 6640043, 7518932, 8290370, 8652174, 8172700, 6730892, 4745437, 2894059]
12349B894059j329427r30095q51152q95121q27705o05925k87971L1112J78580
12340b623645P5553J6378M64486J393408K099514J922589R76033o6511p21306
12331C536499r53824q72337n63507k20161q2564j77234l60709o40177j140105
12322a474119j664202j633982p16085O69819J701050J911530J438718O60141j48192
12313G44678q14637j202609j277795j157426j000452q62123o70517l07380K95669
12304f252592J078874J819006K197693J988593J248930L27615l80198p38303r20347
12295C69271j151864j468448j775155k040766k271404k303234j814194o65905
12287a3121699Q39888K152701K902000L083189K880151K430437J796166J067950
$$ y = [2894059, 1564632, 634537, -216615, -1111736, -1939441, -2545366, -2833337, -2802225, -2623645, -2548092, -2531714, -2067228, -673820, 1425694, 3348283, 4324316, 4257805, 3536499, 2582675, 1710338, 1146831, 926670, 844106, 666872, 306163, -334014, -1474119, -3138321, -4772303, -5488388, -4818569, -3117519, -1205989, 232729, 892870, 744678, -69959, -1272568, -2550363, -3707789, -4708241, -5570364, -6240881, -6548261, -6252592, -5173718, -3354712, -1157019, 831574, 2080504, 2408119, 2027921, 1289618, 369271, -782593, -2251041, -4026196, -6066962, -8338366, -10641600, -12455794, -13121699, -12281811, -10129110, -7227110, -4143921, -1263770, 1166667, 2962833, 4030783]
12279D030783L85756j65231o23178j068627j503171j865831k150652k411804k617676
12270g989631k591542k180265j442419o12002P9521N06922O77937P54284R51269
12261a1845926J272573J416224J123436N75512K18623J78428R8386l39487r66837
12252h269068j389290j526250j639683j877320k027094j777221j065668j07987
12244a9679581Q07278J474320J803637J802728J524899J005454K74772n26622
12236a1513115j089925j110316n91216O7760L86139K35285q5196j83207J15054
12227a3768737P78048J673669K494963K741391K076648P39507o24293j603630
12219e492434k289965k821644k920821k140653m78956J485191L045928L780504
$$ y = [4030783, 4416539, 4251308, 3628130, 2559503, 1056332, -809499, -2960151, -5371955, -7989631, -10581173, -12761438, -14203857, -14815859, -14736338, -14229416, -13551479, -12797195, -11845926, -10573353, -9157129, -8033693, -7458181, -7239558, -7061130, -6962744, -7302231, -8269068, -9658358, -11184608, -12824291, -14701611, -16728705, -18505926, -19571594, -19679581, -18872303, -17397983, -15594346, -13791618, -12266719, -11261265, -10986493, -11513115, -12603040, -13713356, -14304572, -14236812, -13850673, -13615388, -13700584, -13883791, -13768737, -12990689, -11317020, -8822057, -6080666, -4004018, -3264511, -3888804, -5492434, -7782399, -10604043, -13524864, -15665517, -16144473, -14659282, -11613354, -7832850]
12211g832850L551325K400451O35147j100497k089817k024203j230269l77571
12203h068284P4779J54516J28153P5168j63734o16998r42004p15535Q0490J012819
12193h980630J656716J982136K223026K467117K518082K182457J575475J018751
12185F643130O38279J97794n56615j438330j859166j392546k38394R15587J455315
12176D365054J263614P03890K98132L92230R98561J829745K424903K313022J256269
12167A5845420m95536k239898l290190l462834l035345k308780j438221o75237
12159a100621m05795o96689j014367p07182K82714J407074K129097K289246J914577
12150D098054J042503j15268j106222j580499j595412j408110j073134m54835
$$ y = [-7832850, -4281525, -1881074, -1245927, -2346424, -4436241, -6460444, -7690713, -8068284, -7993505, -7838989, -7710836, -7635668, -7799402, -8416400, -9358404, -10073939, -9993449, -8980630, -7323914, -5341778, -3118752, -651635, 1866447, 4048904, 5624379, 6643130, 7281409, 7479203, 6922588, 5484258, 3625092, 2232546, 1994152, 2909739, 4365054, 5628668, 6332558, 6630690, 7022920, 8021481, 9851226, 12276129, 14589151, 15845420, 15349884, 13109986, 9819796, 6356962, 3321617, 1012837, -425384, -1100621, -1506416, -2203105, -3217472, -3924654, -3641940, -2234866, -105769, 2183477, 4098054, 5140557, 5025289, 3919067, 2338568, 743156, -664954, -1738088, -2192923]
12142b192923M04017J156834J469540J324959R41477N19588J89842J05559L65256
12133D284149P93152R67804O02388j82019j062018j865397k525006k788209k341481
12124d116637j358191o14876p59299j576490k238895k209068j624862q39891N7189
12115a5281020J134551K300915L315222L979813M153698L694254K601431J198170
12107G097034j0583p12997r66614j024785j076044j142254j137565j001280q12830
12098g87918p55673r03662j066029r38702m34017J95797N74939N04355Q3132l62795
12088c890573m73139j25193L94567O00664L31322O742K00013R40034J602312J562854
12078A149603Q38042l86l99979j76156N57514J502494K176192K087112J160781
$$ y = [-2192923, -1788906, -632072, 837468, 2162427, 3103904, 3623492, 3813334, 3918893, 4284149, 5077301, 6045105, 6647493, 6465474, 5403456, 3538059, 1013053, -1775156, -4116637, -5474828, -6089704, -6849003, -8425493, -10664388, -12873456, -14498318, -15338209, -15281020, -14146469, -11845554, -8530332, -4550519, -396821, 3297433, 5898864, 7097034, 7086451, 6373454, 5406840, 4382055, 3306011, 2163757, 1026192, 24912, -787918, -1543591, -2447253, -3513282, -4451984, -4886001, -4690204, -4115265, -3610910, -3527778, -3890573, -4363712, -4488905, -4094338, -3493674, -3162352, -3155610, -2955597, -2015563, -413251, 1149603, 1987645, 1987259, 1587280, 1411124, 1968638, 3471132, 5647324, 7734436, 8895217]
12069H895217m8776p47143n74506J10593N97947M60931j23097o33603p74032p40202
12059F423329q84871j218326j428636j373183j279799j342684j368439j054103
12051c526712m51355J12162M58592N98509M10248l14131j366467j984195j492634
12042g555983j0199J619027K525485K410541J649150R74734R38886J471368J973381
12033E996390J942019J460539J002353Q65231R56853J072001J174662J350919
12025A5820967J599735J749921J573371R82678J29490p21374j404247j853625
12017A7876916j922640j433059n36842K04191L85966K93543N26283J107385J344994
12008A7846737P05444n17020j627464k322038k700351k702621k056445q63344
$$ y = [8895217, 8846441, 8099298, 7524792, 7635385, 8233332, 8694263, 8571166, 7937563, 7163531, 6423329, 5538458, 4320132, 2891496, 1518313, 238514, -1104170, -2472609, -3526712, -3978067, -3865905, -3407313, -2808804, -2398556, -2712687, -4079154, -6063349, -7555983, -7566182, -5947155, -3421670, -1011129, 638021, 1612755, 2551641, 4023009, 5996390, 7938409, 9398948, 10401301, 11266532, 12223385, 13295386, 14470048, 15820967, 17420702, 19170623, 20743994, 21726672, 21856162, 21134788, 19730541, 17876916, 15954276, 14521217, 13984375, 14188566, 14574532, 14868075, 15394358, 16501743, 17846737, 18552181, 18035161, 16407697, 14085659, 11385308, 8682687, 6626242, 5762898]
12000E762898K03663N68271L70541J18343j15689p45812j873396k810834k693939
11991a215954j450553R3368J055444J223384R15177L97769l06182j134959j818969
11982b241475k116309k058923j815576j394169o50117M15044J520384K333748
11974f007393K737475K809869K640275K257076J676045R24680P7097o33370q41368
11965E640386m27011J20800M665j015187k203699k533354j741841n26341K57444
11956b424138L34794o2914o78152j377190j961400k129972j718176q65545J00434
11947a0782259Q94505J394208J626217J680918J594138J272766N71344m93489
11939b241652j583201k150308j832586q13407K80754R78158J442442K181036L223859
$$ y = [5762898, 5966561, 6534832, 6905373, 7023716, 6908027, 6162215, 4288819, 1477985, -1215954, -2666507, -2573139, -1517695, -294311, 620866, 1018635, 712453, -422506, -2241475, -4357784, -6416707, -8232283, -9626452, -10276569, -9861525, -8341141, -6007393, -3269918, -460049, 2180226, 4437302, 6113347, 7038027, 7115124, 6481754, 5640386, 5213375, 5334175, 5338840, 4323653, 2119954, -413400, -2155241, -2681582, -2424138, -2089344, -2152258, -2830410, -4207600, -6169000, -8298972, -10017148, -10882693, -10782259, -9887754, -8493546, -6867329, -5186411, -3592273, -2319507, -1748163, -2241652, -3824853, -5975161, -7807747, -8621154, -8340400, -7362242, -5919800, -3738764, -514905]
11930e14905L824911L221124J607902R7522l44216K59868J152342J689476J751027
11921A2745051J476461R30566J45559o82780j254980j467109j555205j846608
11913H490955k367724k788357k823547k624410k621123k938877l111676k527910
11905a3312669j147764L32381J066603P76433q6797p94565r26537n98493k11818
11896a4903226o173J39761M59005Q95428J060699O51570j50326p76645p54345
11887a3384252m3908J036292K078691K750963K844975K332602J401616L60356
11879f22665n45813j225723j662679j787423j476988p11055K70090J019305J183910
11870e559041P93171K08551k32425m66726n76820n31694k13371L16402P62201
$$ y = [-514905, 3310006, 6531130, 8139032, 8236554, 7892338, 8152206, 9304548, 10994024, 12745051, 14221512, 15152078, 15297637, 14614857, 13359877, 11892768, 10337563, 8490955, 6123231, 3334874, 511327, -2113083, -4734206, -7673083, -10784759, -13312669, -14460433, -14128052, -13061449, -12285016, -12371813, -13166378, -14092915, -14691408, -14903226, -14909399, -14769638, -14310633, -13415205, -12354506, -11702936, -11853262, -12629907, -13384252, -13428160, -12391868, -10313177, -7562214, -4717239, -2384637, -983021, -622665, -1168478, -2394201, -4056880, -5844303, -7321291, -8032346, -7762256, -6742951, -5559041, -4765870, -4557319, -4789744, -5256470, -5833290, -6364984, -6578355, -6261953, -5499752]
11861e499752R16445R31064J113934J466976J582193J093974J75235n28060m85476
11852G66533K37945J087860J521902J362998P77677R7871l13898k20826L05368
11843E623430R26296J380478J707487J986308J956713J187026l23385j958871
11835A2485482l050078l443838l367329k946165k160720j199590n03030l36048
11827d521316n21374p10247p56889p04240n58850k86714J0561J05003j10919m65340
11817h520325o41332m52592M869M38632O03530M97652L35708L50712O52713J227292
11807e503141J917417K350620K072093R83376l70207j164040j037063l65938K38237
11798h78646N47580P28218R06001R79814Q82367Q03273R92260J401362J661228
$$ y = [-5499752, -4583307, -3652243, -2538309, -1071333, 510860, 1604834, 1780069, 1252009, 766533, 1004478, 2092338, 3614240, 4977238, 5754915, 5852786, 5538888, 5318062, 5623430, 6549726, 7930204, 9637691, 11623999, 13580712, 14767738, 14444353, 12485482, 9435404, 5991566, 2624237, -321928, -2482648, -3682238, -4185268, -4521316, -5042690, -5752937, -6509826, -7214066, -7772916, -8059630, -8049069, -7944066, -8054985, -8520325, -9161657, -9614249, -9609380, -9170748, -8567218, -8069566, -7733858, -7383146, -6730433, -5503141, -3585724, -1235104, 836989, 1820365, 1450158, 286118, -750945, -1116883, -878646, -331066, 397152, 1303153, 2282967, 3165334, 3968607, 4960867, 6362229, 8023457]
11789H023457J450396Q29628J62303k78101n58046r05079j339204j615366j585466
11780D184522j484444j676772k128845k322346j796065o71268M68662J142716
11772d283840J295072J133143Q54668N88347M28862L70922K53492r5123o21665
11763g6122j014090r37198l10803N98294J314770J442945R50955K27661k07767
11754A988645j27170K72386O48567Q49278R18092Q68048O19229J80361k59287
11745E958149n13329n80439n39089l40143J40728Q49259J486242J726432J412727
11736I600537N50769p04255j965979k691046k544121j693444o47858J73303O30571
11727G08477P18944M44009r1470o07390p67438l78210N25778J708732K793701
$$ y = [8023457, 9473853, 10303481, 10465784, 10187683, 9629637, 8724558, 7385354, 5769988, 4184522, 2700078, 1023306, -1105539, -3427885, -5223950, -5895218, -5426556, -4283840, -2988768, -1855625, -1000957, -412610, 16252, 387174, 640666, 545543, -76122, -1090212, -2027410, -2338213, -1739919, -425149, 1017796, 1968751, 2196412, 1988645, 1861475, 2133861, 2782428, 3631706, 4549798, 5417846, 6037075, 6217436, 5958149, 5444820, 4864381, 4325292, 3985149, 4125877, 4975136, 6461378, 8187810, 9600537, 10151306, 9447051, 7481072, 4790026, 2245905, 552461, -95397, 77906, 708477, 1427421, 1871430, 1779960, 1172570, 405132, 26922, 552700, 2261432, 5055133]
11718E055133L373901L204850K386046J364833O68954M95698N27938K63318m18143
11709A6922528j136173j537790j756735k137138k648339k914354k819505k717377
11701g44883k892444l117358k986493k491482k001907j778195j728967j576862
11693a9318591j063456o8754J242013K416655L065002L203696L097898K838340
11685d587197K319238J595779R48371N09084R4162m47106r23359j005011n95709
11676b091748J25494Q82433J395211J476294J232624J043061J117787J181077
11668F362233Q45212K42813k9433L19689Q34945Q46335K98620j87998q3739M14417
11658I863094O14337J16840p47188j280952j141993o48337m17911p69470j435129
$$ y = [5055133, 8429034, 11633884, 14019930, 15384763, 16053717, 16549415, 17077353, 17340671, 16922528, 15786355, 14248565, 12491830, 10354692, 7706353, 4791999, 1972494, -744883, -3637327, -6754685, -9741178, -12232660, -14234567, -16012762, -17741729, -19318591, -20382047, -20450801, -19208788, -16792133, -13727131, -10523435, -7425537, -4587197, -2267959, -672180, 276191, 785275, 879437, 432331, -491028, -1496039, -2091748, -1966254, -1083821, 311390, 1787684, 3020308, 4063369, 5181156, 6362233, 7207445, 7450258, 7420825, 7740514, 8575459, 9421794, 9720414, 9532416, 9448677, 9863094, 10477431, 10594271, 9847083, 8566131, 7424138, 6775801, 6357890, 5588420, 4153291]
11649D153291j760218j213231J29189J517794K078844J576061O01765n9755j82592
11640F841148j29822k77802o40549j031365j310838j344582r22427M5497J291475
11631B520735K324095K829248K847614K564604K060615J340109N21281j27599
11623A6880702l78024k41497L3572J61666K9765k65564n71658q52797j178115
11614A3618050j524854j657212j311848n38595K39814O11091N84393N17388O47364
11605A1185591Q25199P59655M09765M6253m588L97438J125908J810840J981691
11596A8537752J350898L1463j543593k885237l602398l445543k447749j067110
11588D928483J5757L94119J80362k72580p52237j199563j510607j548895j334328
$$ y = [4153291, 2393073, 1179842, 1309031, 2826825, 4905669, 6481730, 7083495, 7023740, 6841148, 6711326, 6433524, 5792975, 4761610, 3450772, 2106190, 1183763, 1229260, 2520735, 4844830, 7674078, 10521692, 13086296, 15146911, 16487020, 17008301, 16880702, 16502678, 16261181, 16294753, 16456419, 16486184, 16220620, 15648962, 14796165, 13618050, 12093196, 10435984, 9124136, 8585541, 8825355, 9436446, 10020839, 10538227, 11185591, 12010790, 12770445, 13180210, 13226463, 13221875, 13619313, 14745221, 16556061, 18537752, 19888650, 19920113, 18376520, 15491283, 11888885, 8443342, 5995593, 4928483, 4944240, 5338359, 5518721, 5246141, 4493904, 3294341, 1783734, 234839, -1099489]
11579a099489j042232p81859m95940j02376L79870Q74545J298373J525858J442615
11570A999365J132434Q96711R41180J107203J081942Q54634P59394R90192J259526
11561A1022581J115918N11160j44980m75609m82427l72273k75205k87535n98040
11552A0013590j281548j997305k181870j660889q90929m57026m57385n32929l99629
11543A54080j53661p2193k93263p23919j120788j216841r08554m04496q8603j39016
11533d967254l45050l73473j27646K64427P22811J278740J857907K197367K093908
11524B601737J635376J076362N55403N8813l72707n48363k84849M02390J262539
11515F386701J878949J800403P99426q48086k403072l128872k763862j555286
$$ y = [-1099489, -2141721, -2923580, -3419520, -3521896, -3142026, -2267481, -969108, 556750, 1999365, 3131799, 4028510, 4969690, 6076893, 7158835, 8013469, 8772863, 9763055, 11022581, 12138499, 12649659, 12504679, 12029070, 11546643, 11174370, 10899165, 10611630, 10013590, 8732042, 6734737, 4552867, 2891978, 2001049, 1544023, 1086638, 553709, 154080, 419, -71774, -365037, -1088956, -2209744, -3426585, -4335139, -4739635, -4828238, -4967254, -5312304, -5685777, -5813423, -5548996, -4826185, -3547445, -1689538, 507829, 2601737, 4237113, 5313475, 5868878, 5927691, 5554984, 5006621, 4721772, 5124162, 6386701, 8265650, 10066053, 10865479, 10017393, 7614321, 4485449, 1721587, 166301]
11507A66301K4098J451811K198696J958637R92802L9613l46423l09129l88791
11498E787615p82154j125918j035221o32964m01957o11640j018578j104814n54519
11489a480150M36922J245675J283546N20853m32957q39208m28044N23959J589016
11480B419612K482106K996682K920161K205974J141493J73031m41656p32185q31073
11471A2334145q28639p89581p49718o47709l90179n9006N8048k39015p78905j116964
11461F792477r10789j82981P09302J305348J333744Q96224L33714j65571p58601
11452I352867j640921k625684l211649l078937k370278j471127o69941o3327L83392
11443e395605P69469J123434J278331J046123N92909M27134Q31053J446484J622879
$$ y = [166301, 190399, 1642210, 3840906, 5799543, 6792345, 6831958, 6485535, 6176406, 5787615, 5005461, 3879543, 2844322, 2211358, 1809401, 1197761, 179183, -925631, -1480150, -1043228, 202447, 1485993, 2006846, 1573889, 734681, 306637, 830596, 2419612, 4901718, 7898400, 10818561, 13024535, 14166028, 14339059, 13897403, 13165218, 12334145, 11505506, 10715925, 9966207, 9318498, 8928319, 8869313, 8927361, 8688346, 7909441, 6792477, 5881688, 5698707, 6408009, 7713357, 9047101, 9943325, 10277039, 10111468, 9352867, 7711946, 5086262, 1874613, -1204324, -3574602, -5045729, -5715670, -5778997, -5395605, -4626136, -3502702, -2224371, -1178248, -585339, -158205, 672848, 2119332, 3742211]
11434C742211J077397L6005j137032k183427k906528l197772l143413k875619
11426a0588178k326822j415750m88230j86228o91923j410515j657031j411165
11418b0175842j096628q31769l10983O24730J691497K506029K928625K982099
11410a1682242K715869K302889K043936K068987K141004J889321J143080k4526
11402B598318j366839k409902k567191j674823l94176K47535j54357j031646j563277
11393h316358j555949j472549j742843k252990k481512j985913p65996P09113
11385a9864997J801562K155406J949329J699840J791951K195100K589549K698836
11377b983424K498525K164163J844551J476903Q56849o2697r85703j480041j371494
$$ y = [3742211, 4819608, 4855613, 3718581, 1535154, -1371374, -4569146, -7712559, -10588178, -12915000, -14330750, -14818980, -15005208, -15697131, -17107646, -18764677, -20175842, -21272470, -22104239, -22415222, -21790492, -20098995, -17592966, -14664341, -11682242, -8966373, -6663484, -4619548, -2550561, -409557, 1479764, 2622844, 2598318, 1231479, -1178423, -3745614, -5420437, -5814613, -5567078, -5721435, -6753081, -8316358, -9872307, -11344856, -13087699, -15340689, -17822201, -19808114, -20574110, -19864997, -18063435, -15908029, -13958700, -12258860, -10466909, -8271809, -5682260, -2983424, -484899, 1679264, 3523815, 5000718, 5857567, 5794870, 4809167, 3329126, 1957632]
11368A957632q58093k56787K38538N38934N78512L85785J70477K19267O91312
11359C665577J517865K418660K984729K891619K188264J338647Q55612Q90844
11351A8751817J227121J574219J731209J516472P47086o10367k308265l854462
11343A8774830m687666m451154l264708j719676m75915J67806K85614M4629m18245
11334D255515r35313j371318j752795k127991k309282k021709j367205q63731
11326h493829q69355j165331j259455r31531l37248K52210O45039Q13026R48745
11317a0397729J307284J841959K148654J932143J356636P49562J64568m91862
11309a388785j079589j326376j237937j071995r35090p34135n15680m79825n79425
$$ y = [1957632, 1099539, 842752, 1081290, 1620224, 2198736, 2584521, 2754998, 2974265, 3665577, 5183442, 7602102, 10586831, 13478450, 15666714, 17005361, 17860973, 18751817, 19978938, 21553157, 23284366, 24800838, 25547924, 24937557, 22629292, 18774830, 14087164, 9636010, 6371302, 4651626, 4175711, 4343517, 4629131, 4673760, 4255515, 3320202, 1948884, 196089, -1931902, -4241184, -6262893, -7630098, -8493829, -9363184, -10528515, -11787970, -12719501, -13056749, -12804539, -12159500, -11346474, -10397729, -9090445, -7248486, -5099832, -3167689, -1811053, -1061491, -896923, -1388785, -2468374, -3794750, -5032687, -6104682, -7039772, -7773907, -8289587, -8769412, -9348837]
11300i348837m63707J0527M94306N76986L01524O3369J54320N76598J163713J686448
11290d784753J903258J661155R59248p8113j174829j870300j770496r70407m2536
11281f167773N42630Q17829J009079J072137Q25963M02669K06029M01565P31727
11272a58145R24705J067124J429891K045130K595227K703135K278744J586694
11264A4472505R69759M79112j78240j241387k461040l167340k815458j431322
11256D626589M56412K212173L380902L722832L189191J995977O67509j76046k19528
11247A9856011L54414J109659J723240K023978J799444Q58017o21899k028161
11239B5074703k811773k992176l040572l311616l692370l751910l131094j847296
$$ y = [-9348837, -9812544, -9802017, -9307711, -8730725, -8429201, -8365832, -8211512, -7634914, -6471201, -4784753, -2881495, -1220340, -261092, -339205, -1514034, -3384334, -5154830, -6125237, -6167773, -5625143, -4807314, -3798235, -2726098, -1900135, -1497466, -1291437, -889872, -158145, 766560, 1833684, 3263575, 5308705, 7903932, 10607067, 12885811, 14472505, 15442264, 15921376, 15743136, 14501749, 12040709, 8873369, 6057911, 4626589, 5083001, 7295174, 10676076, 14398908, 17588099, 19584076, 20251585, 20075539, 19856011, 20210425, 21320084, 23043324, 25067302, 26866746, 27724763, 27102864, 25074703, 22262930, 19270754, 16230182, 12918566, 9226196, 5474286, 2343192, 495896]
11231D95896l43070P90656J244909J152991Q12594L72441j12977m78073n17341
11222C418026k08222L42021J129780K173909L156768L432626K620427J100799
11214A7166134k47740q06726o55720l37481l24280p13285j305135j845359k157527
11205H772881k126953j703584j002804l32766l631j01681n09698j105422j814723
11196G1619k466175k753179k464062j720323r18811m36463l90564o23820q65349
11187a2567127r20579p44659l55750K71498J147353K097016K759454K863742K489496
11178b959556J960841J465913Q74522m279j070450j977502k511356k749968k784137
11169i755972k486511j765858r22922m47349m36020m86179k55897J32194L97790
$$ y = [495896, 152826, 943482, 2188391, 3341382, 4153976, 4526417, 4413440, 3935367, 3418026, 3209804, 3551825, 4681605, 6855514, 10012282, 13444908, 16065335, 17166134, 16918394, 16111668, 15455948, 15118467, 14794187, 14080902, 12775767, 10930408, 8772881, 6645928, 4942344, 3939540, 3606774, 3603143, 3501462, 2991764, 1886342, 71619, -2394556, -5147735, -7611797, -9332120, -10250931, -10687394, -11077958, -11701778, -12567127, -13487706, -14232365, -14588115, -14316617, -13169264, -11072248, -8312794, -5449052, -2959556, -998715, 467198, 1341720, 1337441, 266991, -1710511, -4221867, -6971835, -9755972, -12242483, -14008341, -14931263, -15378612, -15814632, -16300811, -16556708, -16424514, -16026724]
11160a6026724N51175P75601J044877J182270J230085J434958J833645K129371
11152e844742K073296J766111J489023J408997J542511J829569K081837J957405
11144H304007J169868k32809j824261l032860l469293l150084k457139j820871
11136f513442j400273j080021p25938l52853p4984m066j76653m60796n57872k48518
11126a1595416L56957R52530J403613J794541K108029K110651J677510J045629
11118a45956N97285N04977O83832R52164J123781J073733Q38149N50393K16144
11109F394502k66265p62071q37019k92335M10142N71342M3915o73452j085765
11100C502994j146828j035185p96293l58689K60182Q73325J149312P34513m04595
$$ y = [-16026724, -15475549, -14699948, -13655071, -12472801, -11242716, -9807758, -7974113, -5844742, -3771446, -2005335, -516312, 892685, 2435196, 4264765, 6346602, 8304007, 9473875, 9241066, 7416805, 4383945, 914652, -2235432, -4692571, -6513442, -7913715, -8993736, -9719674, -10072527, -10147511, -10151577, -10328230, -10789026, -11346898, -11595416, -11238459, -10285929, -8882316, -7087775, -4979746, -2869095, -1191585, -145956, 451329, 956306, 1640138, 2592302, 3716083, 4789816, 5627965, 6178358, 6394502, 6128237, 5366166, 4529147, 4236812, 4646954, 5218296, 5262211, 4588759, 3502994, 2356166, 1320981, 524688, 165999, 426181, 1299506, 2448818, 3183331, 2778736]
11091B778736j668483k114773j317284J28184J121157J056580K45117n30614p08573
11082a009953k74852L71397Q02542Q94766Q13052O61941K71516n12613j402525
11073F15271j802495j473049q66355o32538r16343j332133j532358j516746j359346
11064a0816092r62537l21275J59785l5973q82012j707497j881831j446498r38215
11055a8832145p27411p24991o67585m45752q9621L83428R67107J586381K123561
11046a6427028K487695K600425K395308J945994J537455J437586J559545J491949
11038i71071R61934J94255k80584j33759N06121J223342J622269J517306R96314
11029E636127L59576j08378l83579o73640j112839j556315j724252j482342r18837
$$ y = [2778736, 1110253, -1004520, -2321804, -2193620, -1072463, -15883, 229234, -301380, -1009953, -1284805, -913408, -110866, 783900, 1596952, 2258893, 2530409, 2017796, 615271, -1187224, -2660273, -3526628, -4159166, -5075509, -6407642, -7940000, -9456746, -10816092, -11778629, -12099904, -11940119, -11976092, -12858104, -14565601, -16447432, -17893930, -18832145, -19559556, -20284547, -20952132, -21397884, -21487505, -21104077, -20136970, -18550589, -16427028, -13939333, -11338908, -8943600, -6997606, -5460151, -4022565, -2463020, -971071, -9137, 185118, -95466, -229225, 276896, 1500238, 3122507, 4639813, 5636127, 5995703, 5887325, 5503746, 4830106, 3717267, 2160952, 436700, -1045642, -1964479]
11020a964479k04166N41756J259324J887771K307375K349916J904980J014693
11012I097170j72962j479082k593897k990445k281434q42625J79414j71079j698831
11003b953771l245771l771202l052769j482153L76601J905899K533169K117692
10995g572305J197007O08889Q06147J572747K310854K494372J953106R50675O5443
10986D386935j38954M90860J528731K211015J965551Q27079o23880j718639k068831
10977F859867j578770l91361R90969J787090J561724P83572M06544P88121J314434
10968A2522190J218879M61473m01609r23617j044889q85999o24204m83420n20643
10959I318161m58403l5148M75448M12548m93115j702281k346424j994634r06808
$$ y = [-1964479, -2168645, -1626889, -367565, 1520206, 3827581, 6177497, 8082477, 9097170, 8924208, 7445126, 4851229, 1860784, -420650, -1263275, -1083861, -1254940, -2953771, -6199542, -9970744, -13023513, -14505666, -14129065, -12223166, -9689997, -7572305, -6375298, -5766409, -4960262, -3387515, -1076661, 1417711, 3370817, 4321492, 4386935, 4247981, 4738841, 6267572, 8478587, 10444138, 11271217, 10647337, 8928698, 6859867, 5281097, 4889736, 5880705, 7667795, 9229519, 10013091, 10419635, 11207756, 12522190, 13741069, 14202542, 13800933, 12877316, 11832427, 10946428, 10322224, 9838804, 9318161, 8859758, 8824610, 9300058, 9712606, 9219491, 7517210, 5170786, 3176152, 2269344]
10950B269344K73402R54455Q95172K97837l57213o58385n23438j82974M6745J4435
10940C029380j63104k51885j90721j63121k96503l90063j40010L65206N84567
10931B383746O4741j079107k316474l221160l697936l767078l355336k429631
10923a7418235j232661j75413N78917J280654K192045L108779L513509L228340
10915d924065K677300K384771K411148K445353K275703J944046J555420J192105
10907A1961781R63965Q93591P51936K35450o51121j554387k125278k254993j992060
10898F228884j455350q62598m26009j45996J21316L56428L42450r71m61466p96932
10888B899756r56278r65507q38835p26967q92516j335858j658117j515133j012620
$$ y = [2269344, 2542746, 3497201, 4392373, 4690210, 4332997, 3674612, 3151174, 2968200, 3014945, 3029380, 2866276, 2614391, 2423670, 2260549, 1964046, 1573983, 1433973, 1799179, 2383746, 2448487, 1369380, -947094, -4168254, -7866190, -11633268, -14988604, -17418235, -18650896, -18826309, -18247392, -16966738, -14774693, -11665914, -8152405, -4924065, -2246765, 138006, 2549154, 4994507, 7270210, 9214256, 10769676, 11961781, 12925746, 13819337, 14571273, 14806723, 14155602, 12601215, 10475937, 8220944, 6228884, 4773534, 3910936, 3484927, 3338931, 3460247, 3816675, 4159125, 4158154, 3696688, 2899756, 1943478, 977971, 139136, -587831, -1480347, -2816205, -4474322, -5989455, -7002075]
10879g002075m26218K19871R38652J353377J017506K00014j47912N42485J738218
10870a566082K406756K113639J264305M61202o146p0697L15845J084004J901331
10861G904157K337377K194411J616869R03400K81488j58243m34427o77380j095307
10852A2872345j761557k353788k255220j146021M80102J586376J514619N64599
10844I501455m06183q15776o59569j63178N23990J230116J647184J553390J083970
10835A3495399O26743M51003N04795N43107L98290J55107P7927K98409N83901
10826A7134681N66658K33500m2446r4635l29032j198393k462430l341378l387379
10817G079146k869569k287922j883762j718820j817492j974285j744158r69424
$$ y = [-7002075, -7428293, -7208422, -6269770, -4916393, -3898887, -3698873, -3846785, -3304300, -1566082, 840674, 2954313, 4218618, 4679820, 4673674, 4602977, 4918822, 6002826, 7904157, 10241534, 12435945, 14052814, 14956214, 15237702, 15079459, 14645032, 13967652, 12872345, 11110788, 8757000, 6501780, 5355759, 5835861, 7422237, 8936856, 9501455, 9095272, 8279496, 7619927, 7456749, 7980739, 9210855, 10858039, 12411429, 13495399, 14122142, 14573145, 15077940, 15621047, 16019337, 16174444, 16252371, 16550780, 17134681, 17701339, 17934839, 17892393, 17797758, 17468726, 16270333, 13807903, 10466525, 7079146, 4209577, 1921655, 37893, -1680927, -3498419, -5472704, -7216862, -8186286]
10809h186286j35958J17073k54373o97882p03809j82914O80028J608096K264826
10800e491199K410919K126521J709633J324140Q95397L21898m01602j231060k004708
10791c40061k353100j981958j117727l98203j96342k77517k43739o7877K17j52260
10781g128567m19949o72719p86065n75511J8599O77888R01877N78467K08502M11514
10771f785964J243598K108704K361485J942419J383864J220189J458212J654525
10763F587032J452170R55624N76736N87106Q62924J034495Q35937K91380m13068
10754A2770336j153090j874619k424000k542100k117511j353541o10060j68349
10746E27066j92130p23966j535422k110180k019915j306975l50099N65788J352305
$$ y = [-8186286, -8322244, -8205171, -8459544, -9157426, -9861235, -10044149, -9364121, -7756025, -5491199, -3080280, -953759, 755874, 2080014, 2975411, 3297309, 2895707, 1664647, -340061, -2693161, -4675119, -5792846, -6191049, -6387391, -6664908, -6908647, -6976524, -6976307, -7128567, -7548516, -8221235, -9007300, -9582811, -9564212, -8886324, -7984447, -7405980, -7197478, -6785964, -5542366, -3433662, -1072177, 870242, 2254106, 3474295, 4932507, 6587032, 8039202, 8994826, 9571562, 10158668, 11021592, 12056087, 12892024, 13183404, 12770336, 11617246, 9742627, 7318627, 4776527, 2659016, 1305475, 695415, 527066, 334936, -389030, -1924452, -4034632, -6054547, -7361522, -7711621, -7145833, -5793528]
10737e793528J904525K115847K146664K377244K934222L432426L332628K490615
10729A4940643J313343M49613K85554N79060O09210j13628j274165k076243k119625
10720A2593762j702274j261742q79319m68688j04048J08285K66795N20327Q14623
10711I887721R98861J035041Q83574L32857p65244k115768l058935l070211k126155
10702B001741o85581N69152J120079R70754N84526L30817Q4728m62164j227263
10693C286789j749788j758685j465195j223825j106828r27973n52229l5367N18642
10684e014459J129958J896596K759292L380865L379894K713743J740390Q73233
10676A2859512K68927j36567m42482p01182q68275p43585j15869R09549J854644
$$ y = [-5793528, -3889003, -1773156, 373508, 2750752, 5684974, 9117400, 12450028, 14940643, 16253986, 16703599, 16989153, 17568213, 18177423, 18063795, 16789630, 14713387, 12593762, 10891488, 9629746, 8750427, 8281739, 8177691, 8285976, 8552771, 9073098, 9887721, 10886582, 11921623, 12805197, 13138054, 12372810, 10257042, 7198107, 4127896, 2001741, 1316160, 1885312, 3005391, 3976145, 4560671, 4891488, 4976216, 4514052, 3286789, 1537001, -221684, -1686879, -2910704, -4017532, -4945505, -5497734, -5533101, -5014459, -3884501, -1987905, 771387, 4152252, 7532146, 10245889, 11986279, 12859512, 13128439, 12991872, 12549390, 11848208, 10979933, 10236348, 10120479, 11030028, 12884672]
10667A2884672K262296K041764J364513M43547m08980p41345l23685M79787R58567
10658A8961136P16367m8575q75603j472019j816026j997882k035324j854623j523201
10649H054250j457727k114382l299526m054062l556911k034444m70012N02007
10641h430807J073368J671298K283871K507188K016147Q71900m55456j313539
10633B23970j345537q57941n41327p28662j086320j104858o78322n1691O03037
10624e567651J296852J959946K316271K141734J574665J051746Q76636Q84973
10616F535172O37069j8151o77747p85812k28141N95476J230434J532777J585794
10607A0406871J436180J011342K40245p88095j766819k309711k240092j755449
$$ y = [12884672, 15146968, 17188732, 18553245, 18996792, 18587812, 17846467, 17522782, 18002569, 18961136, 19677503, 19628928, 18753325, 17281306, 15465280, 13467398, 11432074, 9577451, 8054250, 6596523, 4482141, 1182615, -2871447, -6428358, -8462802, -8932814, -8430807, -7357439, -5686141, -3402270, -895082, 1121065, 1992965, 1537509, 223970, -1121567, -1979508, -2520835, -3249497, -4335817, -5440675, -6118997, -6170688, -5567651, -4270799, -2310853, 5418, 2147152, 3721817, 4773563, 5650199, 6535172, 7172241, 7154090, 6476343, 5690531, 5462390, 6057866, 7288300, 8821077, 10406871, 11843051, 12854393, 13094638, 12306543, 10539724, 8230013, 5989921, 4234472]
10599D234472j245460r36551p46499m68432n6097K68405J96571l32278j009060
10590i4929j464997j659701j790569j863254j661855j228495j005792j220529
10582a1990121j372503o99019R21757K780418L974161M048515L175410J996685
10574B835303J209408J014310R85770O63548J49313j05754P4131M94370R57021
10565H277420J324643J321458P35387j59056p92975r81151j045401j229522j408399
10556F042404j466098j511223j516146j149744k70798O96653J194536J168990
10548C188574J024924J068758J215121J166498P11272j02157r56695j456593j396285
10539D463417q36958L5726J018085J879004K395159K437722J981903J113519J18621
$$ y = [4234472, 2989012, 2052461, 1305962, 837530, 781433, 1049838, 1246409, 914131, -94929, -1559926, -3219627, -5010196, -6873450, -8535305, -9763800, -10769592, -11990121, -13362624, -14061643, -13139886, -10359468, -6385307, -2336792, 838618, 2835303, 4044711, 5059021, 6044791, 6708339, 6857652, 6751898, 6826029, 7320399, 8277420, 9602063, 10923521, 11658908, 11499852, 10706877, 9725726, 8680325, 7450803, 6042404, 4576306, 3065083, 1548937, 399193, 128395, 825048, 2019584, 3188574, 4213498, 5282256, 6497377, 7663875, 8375147, 8272990, 7316295, 5859702, 4463417, 3626459, 3662185, 4680270, 6559274, 8954433, 11392155, 13374058, 14487577, 14606198]
10530A4606198n86141q18549q39784j015926j374063j665969j705276j416372
10522E184118p43491J94113J016583J437693J534426J433481J052489M85626K18582
10513A1813620M38039N39935j0746p12330p23316k06994k9862l01610k29636O26875
10503A1203975J948946L442615M973790N983238N969736N590926O049465P414983
10495E2577674Q972195J1087139J4836767J9827632K4842947L0735371L8827511
10488B01707236M4686767L7941985J3224825k0286141m5117655n1640424m4665398
10481A35851195l4484499k6213521j9442065j3560349r211481o224757l642919
10474B3071604j558847p91819j074991j292084j179358j285581j584828j558863
$$ y = [14606198, 14020057, 13201508, 12361724, 11345798, 9971735, 8305766, 6600490, 5184118, 4440627, 4634740, 5651323, 7089016, 8623442, 10056923, 11109412, 11595038, 11813620, 12251659, 12791594, 12780848, 12068518, 11345202, 11138208, 11108346, 10806736, 10577100, 11203975, 13152921, 16595536, 21569326, 27552564, 33522300, 39113226, 45162691, 52577674, 61549869, 72637008, 87473775, 107301407, 132144354, 162879725, 201707236, 246394003, 284335988, 297560813, 277274672, 232157017, 180516593, 135851195, 101366696, 75153175, 55711110, 42150761, 32939280, 26714523, 23071604, 21512757, 20720938, 19645947, 18353863, 17174505, 15888924, 14304096, 12745233]
10466A2745233j379921j637845k064625j821336r65232m14531m55703m14316J27198
10457C718922Q21651J344463J695585J619437P52454m05399o32382M85786J908595
10448A1309112K408038J852308Q89519J383o51572r16194p07255k04344L02607
10439A4283602O38883P38520O52426O00011P22488P83708M57029j37616o42304
10430A8096747j182231k257341l729776m529340l781345j867333k3911Q09815
10422A535285M71509o77391j966003k552529j903080l06040J295563K103760K082091
10413H3165J829645J900059K193644K010615Q03444j118181k753883l284562k662897
10404i98951j429196k31251M42267L96944j52579p29680j024145j121165j262018
$$ y = [12745233, 11365312, 9727467, 7662842, 5841506, 4876274, 4461743, 4006040, 3591724, 3718922, 4540573, 5885036, 7580621, 9200058, 9952512, 9547113, 8914731, 9400517, 11309112, 13717150, 15569458, 16458977, 16460360, 15808788, 14892594, 14185339, 13980995, 14283602, 14922485, 15661005, 16313431, 16913442, 17635930, 18419638, 18876667, 18739051, 18096747, 16914516, 14657175, 10927399, 6398059, 2616714, 749381, 725470, 1535285, 2006794, 1329403, -636600, -3189129, -5092209, -5398249, -4102686, -1998926, 83165, 1912810, 3812869, 6006513, 8017128, 8820572, 7702391, 4948508, 1663946, -998951, -2428147, -2659398, -2217131, -1820187, -1972766, -2702446, -3726591, -4847756, -6109774]
10395f109774j511698j729606j728173j375943o67451K17332J004370J525802
10387a0375141J759401J692362J305324P29632K77588K40915P00719J481674K174198
10378a3328K286724J597936L76155q86020j891070k530642k636752k113303j292459
10369g102759p64189p48659r31600r62728p59231k60288O42801J702887K280563
10360f903203K075478J589815J485116J713563J689398J156761M61180K0191q5391
10351C202908J7736J93218L01273K74409K58484M67828Q47986J080489R83300
10342G627631P30746O05253O74083P76857P12172L78546j60461o84456r63786
10333I696585r52620p94281o26943m47446j82226J63875M52259M81650J32047
$$ y = [-6109774, -7621472, -9351078, -11079251, -12455194, -13122645, -12905313, -11900943, -10375141, -8615740, -6923378, -5618054, -4888422, -4610834, -4369919, -3669200, -2187526, -13328, 2273396, 3871332, 4247487, 3361467, 1470397, -1060245, -3696997, -5810300, -7102759, -7866948, -8615607, -9547207, -10509935, -11269166, -11529454, -10886653, -9183766, -6903203, -4827725, -3237910, -1752794, -39231, 1650167, 2806928, 3268108, 3288299, 3202908, 3220644, 3413862, 3715135, 3989544, 4248028, 4715856, 5563842, 6644331, 7627631, 8358377, 8963630, 9637713, 10414570, 11126742, 11505288, 11344827, 10660371, 9696585, 8743965, 7949684, 7322741, 6875295, 6693069, 6856944, 7309203, 7790853, 7922900]
10324G922900n20140j235860j781549k049734k036086j791034j428487j096010
10316d016000q85925q37439j016087j429121j807067j677623q45033K99334J109120
10307a1105841J278398J015323P45696P89980J207195J741062J960796J629191
10299g38200R07584R5513o95505j423642j849542j731831j249242q74941p78396
10290h338202o76496l71675r3508j00085k16672n1805M82843J123505J620212
10281f621883J907326J969462J784000J420132J025854O91157M40034L33224M20451
10272C369757N78617N53517K15940l34858r55449j608676k252470k708923k802180
10263e944725k602354k396503k371810k396186k150800j422111k20521J297814
$$ y = [7922900, 7402760, 6166900, 4385351, 2335617, 299531, -1491503, -2919990, -4016000, -4901925, -5739364, -6755451, -8184572, -9991639, -11669262, -12514295, -12214961, -11105841, -9827443, -8812120, -8066424, -7276444, -6069249, -4328187, -2367391, -738200, 169384, 264897, -430608, -1854250, -3703792, -5435623, -6684865, -7559806, -8338202, -9014698, -9386373, -9479881, -9579966, -9796638, -9848443, -9365600, -8242095, -6621883, -4714557, -2745095, -961095, 459037, 1484891, 2176048, 2616082, 2949306, 3369757, 3948374, 4501891, 4717831, 4382973, 3427524, 1818848, -433622, -3142545, -5944725, -8547079, -10943582, -13315392, -15711578, -17862378, -19284489, -19505010, -18207196]
10255a8207196K865208M028498M226544L180807J282246n15812j316423q69291
10247e325419L57559J584829K216986K111132J529923Q63690L50091K0571j53828
10238C555534j75930j00455p3756j94424l92633n39388o31458p77975j042549
10229c73034j386929j714298j845379j514146n94517O32865J631263K117194K263029
10220g83952K297201K115645J522223P10164J49572n7175l95306j311549k542756
10211A704067l304716l101455k168046j140759m78797k31103j64011K4055N14919
10202h345846J233438J878618K160290K019318J601327J071281N27071N4586k55007
10193A945076l82476l92597l07884k9021N26619J209174J647922J555926J040972
$$ y = [-18207196, -15341988, -11313490, -7086946, -3906139, -2623893, -3139705, -4456128, -5325419, -4967860, -3383031, -1166045, 945087, 2475010, 3338700, 3688791, 3709362, 3555534, 3379604, 3279149, 3205393, 3010969, 2618336, 2078948, 1447490, 669515, -373034, -1759963, -3474261, -5319640, -6833786, -7428303, -6795438, -5164175, -3046981, -783952, 1513249, 3628894, 5151117, 5861281, 6010853, 5953678, 5558372, 4246823, 1704067, -1600649, -4702104, -6870150, -8010909, -8489706, -8720809, -8884820, -8860765, -8345846, -7112408, -5233790, -3073500, -1054182, 547145, 1618426, 2145497, 2200083, 1945076, 1562600, 1170003, 862119, 833098, 1359717, 2568891, 4216813, 5772739, 6813711]
10184F813711N89079O86430J392146K260624K731222K640126K321422K172351
10176B1607111K194015K066455J615680J007434M36499j57428r07619j726298
10168B6135849k427781l038352l682672m177406m090741l338120k404460j728799
10160A247518j110524p1001J308583K292546K284515J431842L56212m59377q79055
10151F401259r50120p91405n92852n34846o58675q52473r28970o87513L633J060281
10141A468319K097898K547401J938845K32446j977027l671736m129952l584993
10133e078799k999663l029192l339448l114654k095132q54911q9199J14880K38561
10124b0247557P60515J727739K763798L378049L312395K686898J861114J188423
$$ y = [6813711, 7402790, 8089220, 9481366, 11741990, 14473212, 17113338, 19434760, 21607111, 23801126, 25867581, 27483261, 28490695, 28927194, 28769766, 27862147, 26135849, 23708068, 20669716, 16987044, 12809638, 8718897, 5380777, 2976317, 1247518, 136994, 65993, 1374576, 3667122, 5951637, 7383479, 7739691, 7280314, 6401259, 5451139, 4659734, 4066882, 3532036, 2873361, 2020888, 1091918, 404405, 408038, 1468319, 3566217, 6113618, 8052463, 8284909, 6307882, 2636146, -1493806, -5078799, -8078462, -11107654, -14447102, -17561756, -19656888, -20511799, -20600998, -20486118, -20247557, -19487042, -17759303, -14995505, -11617456, -8305061, -5618163, -3757049, -2568626]
10116b568626Q80065R44626J106599Q90728N7954r85366j444513r63251p0606
10107b152390L53940q937o74430r44149n60250K15591R64940J435139J608991
10098B38445J614095J586691J548072J376885R38020K72074l63015o84081o39146
10089E888040m68083m99840q77033j449221j906580k028748j837221j506546j115824
10080e801056n45907K82281J093304J359157Q40128o1295o34346n36641l4921
10071d039296L92054N22571M19484J59263k88553r10523j493309j709383j394751
10062h342443p39590j54673J06611J78825L83371Q15797J219982J287687R89526
10053d254907N49221J48812k66274q91014j780428k628881k843096j961056j07445
$$ y = [-2568626, -1688561, -743935, 362664, 1253392, 1311346, 325980, -1118533, -2081784, -2152390, -1798450, -1807387, -2481817, -3425966, -3986216, -3770625, -2805685, -1370546, 238445, 1852540, 3439231, 4987303, 6364188, 7302208, 7574282, 7211267, 6527186, 5888040, 5419957, 4920117, 4043084, 2593863, 687283, -1341465, -3178686, -4685232, -5801056, -6346963, -6064682, -4971378, -3612221, -2772093, -2833388, -3467734, -4004375, -4039296, -3647242, -3124671, -2705187, -2545924, -2834477, -3745000, -5238309, -6947692, -8342443, -9082033, -9236706, -9130095, -8951270, -8567899, -7752102, -6532120, -5244433, -4254907, -3705686, -3556874, -3823148, -4714162, -6494590, -9123471, -11966567, -13927623, -14035068]
10044a4035068J993300L524502M092173L760822K769455J416077J53619n10311
10036C164569m05125R9190M21238K78148j86549o70480r56340r56388p26659m84484
10026d22880m56260o31625p69246o75662l33322K79097J245425K405952L192965
10017C834444L081464K173061J089507L01776j95206n57743p64212p28939m99657
10008G734495j89509J10758K44299L2113m32747p36638n85724j27200L48221Q08217
9998G206285J321918J700746J659705J258547Q37762N45065K57374m3720j99285
9989A4544397k37406m20031p60078q37151l57590L31805N60264L2496r90281k058721
9979I807704k844620l184849l094226k769752k426232k097422j675276j105205
$$ y = [-14035068, -12041768, -8517266, -4425093, -664271, 2105184, 3521261, 3674880, 3164569, 2759444, 2858634, 3279872, 3558020, 3371471, 2700991, 1744651, 788263, 61604, -422880, -879140, -1510765, -2280011, -2955673, -3288995, -3009898, -1764473, 641479, 3834444, 6915908, 9088969, 10178476, 10480252, 10285046, 9727303, 8963091, 8234152, 7734495, 7544986, 7655744, 7900043, 7932156, 7499409, 6762771, 6177047, 6049847, 6398068, 7206285, 8528203, 10228949, 11888654, 13147201, 13984963, 14530028, 14787402, 14743682, 14544397, 14306991, 13886960, 13126882, 12289731, 11932141, 12263946, 12824210, 12856706, 11866425, 9807704, 6963084, 3778235, 684009, -2085743, -4511975, -6609397, -8284673, -9389878]
9971i389878m46719K07594P56246J068538J073493Q90364P84744R47382J317561
9962b790675J618407J591189J257731R41798R48479J230702J471264J461253J230158
9953H960306Q09535J12899q41116j782453k409918k618169k409878j785993q90365
9944b855152p5587L98939O16933P75459Q72164Q57537R22938J285955J747147
9935D546333J817150J323523N87907n5170n98570j104470j430310j460253j391690
9926B234450j479394j580050j269310m60982L66749P41879Q20051J158488J887553
9917B419434K416760K134971J176483K19882l23706n58897o02010k97040M04607
9908F990484J164853J623471J795142J916283K188657K858613M157326N889547
$$ y = [-9389878, -9836597, -9629003, -8872757, -7804219, -6730726, -5840362, -5055618, -4108236, -2790675, -1172268, 418921, 1676652, 2618450, 3566929, 4797631, 6268895, 7730148, 8960306, 9769841, 9882740, 9041624, 7259171, 4849253, 2231084, -178794, -1964787, -2855152, -2930739, -2531800, -1914867, -1139408, -267244, 590293, 1513231, 2799186, 4546333, 6363483, 7687006, 8274913, 8219743, 7621173, 6516703, 5086393, 3626140, 2234450, 755056, -824994, -2094304, -2555286, -2188537, -1446658, -626607, 531881, 2419434, 4836194, 6971165, 8147648, 8367530, 8043824, 7484927, 6882917, 6585877, 6990484, 8155337, 9778808, 11573950, 13490233, 15678890, 18537503, 22694829, 28584376]
9900B8584376P552021R219282J1578720J4183248J4243959Q754150j690736j2262187
9892H0162833j7885500j7412531j3505847r303881o136351l915282k326424j186327
9884H490690l38775K70280N73075N61448L01911k00723q51938j205070p51823
9875F849075M08254J510934J889082J548461Q91477J72077n84872j370781k153947
9866I159760k924198l571663l815792l452686k639865j791452j209455r15519
9858a1160870p86815p00297n18646o4799P67070J848868K810862L273407L141349
9849a389871K651919K097709J543222Q74191P6915o40821j010836r10414m28214
9840B863800J72590N75151O44123N88702P60152J207081J550311J423288R55779
$$ y = [28584376, 36136397, 45355679, 56934399, 71117647, 85361606, 94115756, 92425020, 80162833, 62277333, 44864802, 31358955, 22055074, 15918723, 12003441, 9677017, 8490690, 8151915, 8422195, 8995270, 9556718, 9858629, 9657906, 8805968, 7600898, 6849075, 7257329, 8768263, 10657345, 12205806, 13097283, 13269360, 12684488, 11313707, 9159760, 6235562, 2663899, -1151893, -4604579, -7244444, -9035896, -10245351, -11160870, -11947685, -12647982, -13166628, -13231427, -12464357, -10615489, -7804627, -4531220, -1389871, 1262048, 3359757, 4902979, 5777170, 5854085, 5213264, 4202428, 3292014, 2863800, 3036390, 3611541, 4255664, 4844366, 5604518, 6811599, 8361910, 9785198, 10740977]
9831A0740977O54445Q01382J115849J064669L89544p54981k050360l187194l810951
9822D963380l587826k553846j292232n06622l75075m80625l86761q0559K06433
9813d093733L72757M61628M54916K66216j13725o11811j148092j585597j711471
9804g708912j467509j139188j095682j349668j572206j530241j268873q22604
9796a7954883k5003J222287K666068L878824M622297M868135M554171L573479
9788G405375K063827N13188o01207j249320j781500k382801k723608k300240j083188
9779b139474L50366J361679J743837J597515R77300n2933j125034j684059j502173
9770d72976q79956k70823J06953K25275O2728l40930p84399j058801j148933j141404
$$ y = [10740977, 11395422, 12196804, 13312653, 14377322, 14766866, 14011885, 11961525, 8774331, 4963380, 1375554, -1178292, -2470524, -2977146, -3352221, -3832846, -4219607, -4300166, -4093733, -3720976, -3259348, -2804432, -2538216, -2651941, -3263752, -4411844, -5997441, -7708912, -9176421, -10315609, -11411291, -12760959, -14333165, -15863406, -17132279, -17954883, -17979886, -16757599, -14091531, -10212707, -5590410, -722275, 3831896, 7405375, 9469202, 9982390, 9381183, 8131863, 6350363, 3967562, 1243954, -1056286, -2139474, -1789108, -427429, 1316408, 2913923, 3891223, 3838290, 2713256, 1029197, -472976, -1352932, -1623755, -1516802, -1291527, -1228799, -1569729, -2354128, -3412929, -4561862, -5703266]
9760e703266j008299o63620k05308J12242K24334M17327R91377J809268K337906
9751a688039K202191J617179J179173J256171J674169J977939J844836J198352
9743A1261971J30753j059035j849429j841573j247569q35977j183111k015912
9735A360118k445278j872692n78239O13893J158518J176542J054352Q56886L38424
9726A662524n10990j212006j257709o89865m3640J90705r1796o56052j063921
9717c672750q76577o7555P44683Q19458J75068l42310m9603P63081J241327R73676
9707b91502K87258l45198q29633j305202j733367j832122j389333n49851K45131
9698g743819O21357N70192L51023J28795j63257n55058p86618m93416L61059J334383
$$ y = [-5703266, -6711565, -7375185, -7580493, -7468251, -7243917, -6826590, -5835213, -4025945, -1688039, 514152, 2131331, 3310504, 4566675, 6240844, 8218783, 10063619, 11261971, 11392724, 10333689, 8484260, 6642687, 5395118, 4559141, 3376030, 1360118, -1085160, -2957852, -3536091, -2922198, -1763680, -587138, 467214, 1324100, 1662524, 1151534, -60472, -1318181, -2008046, -2051686, -1860981, -1952777, -2608829, -3672750, -4549327, -4616882, -3872199, -3052741, -2877673, -3219983, -3269586, -2506505, -1265178, -291502, -4244, -349442, -1179075, -2484277, -4217644, -6049766, -7439099, -7988950, -7743819, -7122462, -6552270, -6201247, -6072452, -6235709, -6790767, -7577385, -8070801, -7709742, -6375359]
9688f375359J814973J488919N70647l72544q60133q14487m70362o9384K45287
9679d842443L35330J38648j19673o3842L18324N04178J3j037487j925742k101952
9669h794646j497638m43163N41784R74476P57516L43759L22530P86793J282703
9660e725886J398758J198423J015733J017325J069203R10861L83203m14680j138591
9651b85651j458260j339477r93297n71903o9482M65877Q23434Q44746O29601M22899
9641a531513L60372L78204K99735j4681n02327q58372p91888l62824Q0968L48250
9631b594076N84249Q84144R53393M41859m45217r74681o47630K10786P59182N05565
9621c22426k17022o49954m27284Q3523K87389J00650J1290M01920J040192J385663
$$ y = [-6375359, -4560386, -3071467, -2500820, -2873364, -3733497, -4547984, -5018346, -5087730, -4842443, -4507113, -4368465, -4488138, -4551980, -4233656, -3729478, -3729465, -4766952, -6692694, -8794646, -10292284, -10735447, -10193663, -9219187, -8461671, -8117912, -7795382, -7008589, -5725886, -4327128, -3128705, -2112972, -1095647, -26444, 884417, 1267620, 852940, -285651, -1743911, -3083388, -4076685, -4648588, -4718070, -4252193, -3428759, -2584013, -1954412, -1531513, -1171141, -792937, -493202, -507883, -1010210, -1868582, -2660470, -3023294, -2942326, -2594076, -2009827, -1125683, -172290, 269569, -175648, -1150329, -1797959, -1587173, -827991, -322426, -539448, -1189402, -1616686, -1533163, -1245774, -1145124, -1133834, -731914, 308278, 1693941]
9611A693941J221339P34956O7463q85015k123047l258821l799276l624107l015425
9602a2987992k265662j422337m22421O71569J636253K220377K286297J899059
9594h384857J323850Q71887O72976N97796M19615L5817m59621q62482j005399
9585f790418q93098p20980o79290p03664n36210j15332K39354K13383j8658N2473
9575i952440O08107J234226J428226J181413Q88117P99859P70210N15302k1915
9566b548895n75038p31385k32086P90586J856717K487649K535363K172102J639385
9557G394398J078814N26734o0095p65039j597995k419064l038059l353743l315486
9548e549535k815670j783910m10156Q54054J575045J565552Q68345l18659j612388
$$ y = [1693941, 2915280, 3650236, 3717699, 2832684, 709637, -2549184, -6348460, -9972567, -12987992, -15253654, -16675991, -17098412, -16426843, -14790590, -12570213, -10283916, -8384857, -7061007, -6189120, -5516144, -4918348, -4498733, -4462916, -4922537, -5785019, -6790418, -7683516, -8404496, -9083786, -9787450, -10323660, -10438992, -10199638, -9986255, -10004913, -9952440, -9344333, -8110107, -6681881, -5500468, -4612351, -3812492, -3042282, -2526980, -2548895, -3123933, -3855318, -4087404, -3296818, -1440101, 1047548, 3582911, 5755013, 7394398, 8473212, 8999946, 8939851, 8174812, 6576817, 4157753, 1119694, -2234049, -5549535, -8365205, -10149115, -10559271, -9705217, -8130172, -6564620, -5696275, -6014934, -7627322]
9539g627322k472599k479232j694851p14379k28690m16560p53731n15583M81925
9530a6421022J705829K490758K674582K573261K481455K393382K139000J560308
9522A597553N52982q10079k079581k550880j812669j87531J465995K411406K492233
9513A079429K010380J264431K80722j001295k375630l351013l534219k938600
9505h565795j884708p61024L1418J63574k64174n48215L6766J373328K497731
9496g921099K613180J909019J235109J156065J503954J710851J369466N38424
9488D114969l19433p15504n69577k49317j25139j76609j12230K62843R33841J775954
9478D819798K538742K820269K342362J290110J57831p94350j704154k628354l153346
$$ y = [-7627322, -10099921, -12579153, -14274004, -14988383, -15217073, -15633633, -16387364, -16902947, -16421022, -14715193, -12224435, -9549853, -6976592, -4495137, -2101755, 37245, 1597553, 2150535, 1340456, -739125, -3290005, -5102674, -5290205, -3824210, -1412804, 1079429, 3089809, 4354240, 4634962, 3633667, 1258037, -2092976, -5627195, -8565795, -10450503, -11211527, -11180109, -11016535, -11280709, -11828924, -11792158, -10418830, -7921099, -5307919, -3398900, -2163791, -1007726, 496228, 2207079, 3576545, 4114969, 3795536, 3080032, 2510455, 2261138, 2135999, 1959390, 1847160, 2110003, 3043844, 4819798, 7358540, 10178809, 12521171, 13811281, 13969112, 13174762, 11470608, 8842254, 5688908]
9469E688908k753187j465462K7803J011362J253139R17164K46730m74637q48285
9460C603535o03920J3772L39133p5876j003126j790063j961992j520522q23216
9451c822275l25276l14923p05530j121249j295317j286805j199813q98984k65639
9442a1235811M21177P11173N27472J29614m16857j280015k303812k906374k778691
9433a9132124k293089j933647j680453j296645q68826n78642j61300Q52332K378221
9424b4714173L730371M379595M374333L960041L208962K210720J292560P76375
9416g81216O57136O71015N47905J10399o76579j593732k241397k383771k145882
9407g836122j776264j316510o12439M20126J613482K555172K755895J987314N88040
$$ y = [5688908, 2935721, 1470259, 1498062, 2509424, 3762563, 4679727, 4926457, 4451820, 3603535, 2999615, 3013387, 3352520, 3276644, 2273518, 483455, -1478537, -2999059, -3822275, -4147551, -4462474, -5168004, -6289253, -7584570, -8871375, -10071188, -10970172, -11235811, -10814634, -10103461, -9575989, -9446375, -9863232, -11143247, -13447059, -16353433, -19132124, -21425213, -23358860, -25039313, -26335958, -27204784, -27783426, -27944726, -27092394, -24714173, -20983802, -16604207, -12229874, -8269833, -5060871, -2850151, -1557591, -781216, -124080, 546935, 1094840, 1205239, 528660, -1065072, -3306469, -5690240, -7836122, -9612386, -10928896, -11541335, -11121209, -9507727, -6952555, -4196660, -2209346, -1621306]
9398a621306o71757j172398q59651m6785J027446K265013L425806M027899L634711
9389A0008978K196665J22796j900860l198880l410746k687247j603651p82919
9381a255864n04371o23951q35791r55736r24935o43649j1726P85742J223042R04802
9371b842437P4365n53500n11898L2746O50224J155253J551874J645166J064305
9362B266098k14261j575008k218853j918532j199067p30086o41503n30449o5787
9353f827448N93331J022376J017408P34791M41577K82355K70319L71676N73272
9344a520343R35001J544932K323210K908276K882664K130640Q74010o07189k109759
9335I361442l358350l971586l752659k913016j865176q47317J43526J112621J904423
$$ y = [-1621306, -2293063, -3465461, -4325112, -4371897, -3344451, -1079438, 2346368, 6374267, 10008978, 12205643, 12328439, 10427579, 7228699, 3817953, 1130706, -472945, -1255864, -1760235, -2384186, -3219977, -4175713, -5100648, -5744297, -5756023, -4970281, -3747239, -2842437, -2768072, -3321572, -3833470, -3800724, -3150500, -1995247, -443373, 1201793, 2266098, 2051837, 476829, -1742024, -3660556, -4859623, -5589709, -6231212, -6761661, -6827448, -6234117, -5211741, -4194333, -3459542, -3017965, -2735610, -2465291, -2093615, -1520343, -585342, 959590, 3282800, 6191076, 9073740, 11204380, 12078390, 11471201, 9361442, 6003092, 2031506, -1721153, -4634169, -6499345, -7346662, -7203136, -6090515, -4186092]
9326d186092K293354K170238J639946R75697M48344J35536j07593m53578q61323
9317B054529j027483o01264M71132J746735K497370K273219J305315K87834k35532
9308H771855k13637Q1614L53475M05311K18795L7330J94773P00088J107658R47034
9298A2604296J90614q18361j756416k454834k781888k682878k351434k117252
9290b168153k069316j948419j514952r13546n54728o65355j035526j232731j058362
9281a3161088p65582p62687j082531j240451o98045N96527K193567L543956M278347
9272g097987M223382L437625K294516J314483P73054N43381L47369K3350m84825
9263E374348j183530j904183k264108j986765j256835n89908l19895l33785l28713
$$ y = [-4186092, -1892738, 277500, 1917446, 2893143, 3341487, 3477023, 3369430, 2915852, 2054529, 1027046, 425782, 896914, 2643649, 5141019, 7414238, 8719553, 9007387, 8771855, 8558218, 8639832, 8993307, 9398618, 9617413, 9654743, 9849516, 10549604, 11657262, 12604296, 12794910, 11976549, 10220133, 7765299, 4983411, 2300533, -50901, -2168153, -4237469, -6185888, -7700840, -8614386, -9169114, -9834469, -10869995, -12102726, -13161088, -13926670, -14689357, -15771888, -17012339, -17710384, -17113857, -14920290, -11376334, -7097987, -2874605, 563020, 2857536, 4172019, 4945073, 5488454, 5835823, 5859173, 5374348, 4190818, 2286635, 22527, -1964238, -3221073, -3810981, -4130876, -4464661, -4793374]
9254d793374j77211N9325L64099Q20040J384040J727326J439450M25812r39279
9245C10228k074511k592543k478238j978795j389846r04951n83634m19396m07439
9236a2519125n02797n48194l79652m6556K35281M69436J036603K201901L529436
9227f523667M112073L497565K191395J146190R20944J388934J984809K035249
9219A0753492J097456o59727k424691l348710l234615k521049j695312r54403
9211b987559l58272M7558L67449Q29451J445653J881764J827952J352170P40380
9202E146546J52968l62880o66975o19544l74954l46715p98166j577613k280441
9193a727774k571662k360759j807917j212488q07342o18509n49942n37115n08883
$$ y = [-4793374, -4970585, -4911260, -4547161, -3727121, -2343081, -615755, 823695, 1249507, 310228, -1764283, -4356826, -6835064, -8813859, -10203705, -11108656, -11692290, -12111686, -12519125, -13021922, -13570116, -13949768, -13996324, -13761043, -13291607, -12255004, -10053103, -6523667, -2411594, 1085971, 3277366, 4423556, 5344500, 6733434, 8718243, 10753492, 11850948, 11191221, 8766530, 5417820, 2183205, -337844, -2033156, -2987559, -3345831, -3298273, -2930824, -2101373, -655720, 1226044, 3053996, 4406166, 5146546, 5299514, 4936634, 4269659, 3650115, 3275161, 2928446, 2130280, 552667, -1727774, -4299436, -6660195, -8468112, -9680600, -10487942, -11106451, -11656393, -12193508, -12702391]
9184a2702391k88488K37623Q35190J047766P27001K64793J55094M59671Q63135
9175h400606J139242J359265J673445K063343K331064K235575J673426Q48342
9167D923096K20152J10591L40690M20466J40524k01392k70704k33028o07506j596696
9157C246193k746481l363389l176808k476134j641779p19126M50819J816748L047263
9148e562694L869470M249019M139653L297079J608903m79765k158060k919054
9140F044551k871867k409182j821634j293184r66313p88986m89574M6017M94122
9131d056050M55169L4076k20308L2926N99305J129131J541801J901607K090852
9122C508509J870560J202850L16774n03871j022151j006418l70356N66159J203003
$$ y = [-12702391, -12990879, -12753256, -11918066, -10870300, -10143299, -9878506, -9723412, -9263741, -8400606, -7261364, -5902099, -4228654, -2165311, 165753, 2401328, 4074754, 4923096, 5143248, 5253839, 5594529, 6014995, 6155519, 5954127, 5683423, 5450395, 4842889, 3246193, 499712, -2863677, -6040485, -8516619, -10158398, -10877524, -10426705, -8609957, -5562694, -1693224, 2555795, 6695448, 9992527, 11601430, 11121665, 8963605, 6044551, 3172684, 763502, -1058132, -2351316, -3317629, -4106615, -4596189, -4550172, -4056050, -3600881, -3566805, -3787113, -3754187, -3154882, -2025751, -483950, 1417657, 3508509, 5379069, 6581919, 6898693, 6394822, 5372671, 4366253, 3995897, 4562056, 5765059]
9113E765059J244097J035731J131511J590843J914485J656826Q72942j01597j072433
9104A4037464j984867k635244k676964k008469j015464k99378j66318m04454n31671
9095B314635k51193K76862N62150K09283p09415j658120k020212j540790m90225
9086c307025N45902J075892J005453O13797K59528J16672J59322L00601M71709
9077A241851O16288P07291P72721Q42500Q83794Q55832P97421P54874O38037K96566
9067H407175k06074n26126l64395J86051O90257P37925K29914o12150j433634
9058G108943j998360k346041k672816k995353l011653k430434j411240n10044
9050a0266998j23422r4166N3083N65947J252257J759552J927903J829873J572536
$$ y = [5765059, 7009156, 8044887, 9176398, 10767241, 12681726, 14338552, 15211494, 15109897, 14037464, 12052597, 9417353, 6740389, 4731920, 3716456, 3417078, 3250760, 2846306, 2314635, 2063442, 2340304, 2902454, 3111737, 2402322, 744202, -1276010, -2816800, -3307025, -2761123, -1685231, -679778, -65981, 193547, 310219, 469541, 770142, 1241851, 1858139, 2565430, 3338151, 4180651, 5064445, 5920277, 6717698, 7472572, 8110609, 8407175, 8201101, 7674975, 7310580, 7496631, 8186888, 8924813, 9154727, 8542577, 7108943, 5110583, 2764542, 91726, -2903627, -5915280, -8345714, -9756954, -10266998, -10390420, -10484586, -10431503, -9865556, -8613299, -6853747, -4925844, -3095971, -1523435]
9041a523435J183961P03252K89667J54781L67803P54877J022250J007162Q24723
9032D785041P49827R23498J196866J319164J250364J172879J182496J132614Q78783
9023A4591532N05370J27018l77466j126259j777710j692485o96160O01123J445286
9014A1600249J689834J713012J810012J957897K037318J945787J529453P29330
9006B5012892j62900o76430o75220m78896m01657m08436l39443k44514l18214
8997B1307182o54220j207978j850795k314462k260583j631634q33387l50123k37588
8988I966412j87256j2208J69873J89040k5422n65223j499076k561175l136283
8979B338682k800569j780576p07765k3577K01022N745n64863j269389j675920
$$ y = [-1523435, -339474, 363778, 653445, 808226, 1176029, 1930906, 2953156, 3960318, 4785041, 5534868, 6458366, 7655232, 8974396, 10224760, 11397639, 12580135, 13712749, 14591532, 15096902, 15223920, 14846454, 13720195, 11942485, 10250000, 9553840, 10154963, 11600249, 13290083, 15003095, 16813107, 18771004, 20808322, 22754109, 24283562, 25012892, 24849992, 24173562, 23498342, 23019446, 22617789, 22209353, 21869910, 21625396, 21307182, 20652962, 19444984, 17594189, 15279727, 13019144, 11387510, 10554123, 10204000, 9966412, 9779156, 9766948, 9936821, 10125861, 10100439, 9535216, 8036140, 5474965, 2338682, -461887, -2242463, -2950228, -2973805, -2772783, -2767038, -3331901, -4601290, -6277210]
8970f277210j555531j120985o95526k61069M33839J351972K021813K027377J474135
8961b601185Q27424M14027K49155K39570K87846J82229l32154j198933j927105
8952c859126k025900j511435q32532l48813n6079J88424L71578L42828J4544n40472
8942h256983j132998j546774j634085j373831q38652j42349N36746R69493J068858
8933a2350575J051649J234899J636974J931696J823658J294182M66401m84226
8925c395342j156978r98740J10528J506218K324144K383221K183620K094639J936781
8916F988091J428422O58627p6222o17487q93376p39114m5007R89728J931976K390909
8906A2016547K138431J133042l66310j797379k620840k683191k225662j659444
$$ y = [-6277210, -7832741, -8953726, -9649252, -9910321, -9476482, -8124510, -6102697, -4075320, -2601185, -1773761, -1359734, -1110579, -871009, -583163, -400934, -733088, -1932021, -3859126, -5885026, -7396461, -8228993, -8577806, -8633885, -8445461, -8073883, -7731055, -7716511, -8256983, -9389981, -10936755, -12570840, -13944671, -14783323, -14925672, -14388926, -13419433, -12350575, -11298926, -10064027, -8427053, -6495357, -4671699, -3377517, -2911116, -3395342, -4552320, -5551060, -5440532, -3934314, -1610170, 773051, 2956671, 5051310, 6988091, 8416513, 9075140, 8998918, 8381431, 7488055, 6748941, 6703934, 7693662, 9625638, 12016547, 14154978, 15288020, 14921710, 13124331, 10503491, 7820300, 5594638, 3935194]
8898C935194j409043j744728k488991k960347k480909j006277Q36174K272028
8890e046899K847812K571512J887817J457883J634208K059943J992149J096864
8882A0501289k21196j278965j705557j572793j203166r46529r22590q41913k47436
8873A561144R28199K175085K888106K908223K486367J892206J266246P66132O03668
8864A7475376Q44314J255224J434606J124979M12275m09374j178355j973389k809525
8855A6176131l391864l407561k984554k561516k297551j937398j336526p53481
8847b494320m22360j71092K18790N10795K56143n46352j353241j613556j163646
8838f778839j72946R80834J783519J868665J366434P80800M43033K67745J01119
$$ y = [3935194, 2526151, 781423, -1707568, -4667915, -7148824, -8155101, -7318927, -5046899, -2199087, 372425, 2260242, 3718125, 5352333, 7412276, 9404425, 10501289, 10280093, 9001128, 7295571, 5722778, 4519612, 3573083, 2650493, 1808580, 1561144, 2489343, 4664428, 7552534, 10460757, 12947124, 14839330, 16105576, 16871708, 17475376, 18319690, 19574914, 21009520, 22134499, 22546774, 22137400, 20959045, 18985656, 16176131, 12784267, 9376706, 6392152, 3830636, 1533085, -404313, -1740839, -2494320, -2916680, -3087772, -2868982, -2358187, -2102044, -2648396, -4001637, -5615193, -6778839, -6951785, -5970951, -4187432, -2318767, -952333, -171533, 271500, 539245, 640364]
8829F40364N7222L24821P96180J116098J073802P73787L92161q6089p74791j600232
8819B713323k271748k593243k666136k648703k431691j796476q73530j39063J64129
8810a2543138L42928Q06131J525161K180351K642313K970882L030220K489037
8802C443885J295429q0205r68359r54914p0134J235600K281383K572619K168198
8793A0923502J544593J077183P74549M88747J70627j33162l53006m00030k46086
8784A3846917l8302K7851k2746N3Q0497p4189n90115j113833j160852o97721k06642
8773A0050918j94186p27054j390325j595144r83730L08009J707528K555604K500550
8764A2232170J696294P12092J69039K92719P67044J070160R22366L71088l95908
$$ y = [640364, 697586, 1022407, 1818587, 2934685, 4008487, 4782274, 5174435, 5088346, 4313555, 2713323, 441575, -2151668, -4817804, -7466507, -9898198, -11694674, -12568204, -12707267, -12543138, -12200210, -11394079, -9868918, -7688567, -5046254, -2075372, 954848, 3443885, 4739314, 4659109, 3690750, 2735836, 2665702, 3901302, 6182685, 8755304, 10923502, 12468095, 13545278, 14319827, 14808574, 14979201, 14846039, 14493033, 14093003, 13846917, 13808615, 13836466, 13813720, 13813773, 13894270, 13820081, 13229966, 12116133, 10955281, 10257560, 10050918, 9856732, 9129678, 7739353, 6144209, 5160479, 5468488, 7176016, 9731620, 12232170, 13928464, 14640556, 14809595, 15102314, 15869358, 16939518, 17861884, 18232972, 17837064]
8755A7837064j112432j427340j168986o73336n83739j206712k231858l124527
8747F308134l563801l438728k725789j576394l16751Q51501J994242L095454L730118
8738D357986L361965J958669J62302j131188j313835l68699J151554K494793L222048
8729A3895595L369327L103237K401612J221113j72497j265680j665607j313409
8721A9573691m53743M58972R61516R18825O27556M41986L89434L14392K39315
8712B3471944K72473K10474l98635j651637k971741l575681l188008k208868j252849
8703H707472o15892j77950K46435N61393M92870J840o15821j142358j734150k580104
8693C143735l415357l687464l194378k294009j454810q37754l61520Q2360N96601
$$ y = [17837064, 16724632, 15297292, 14128306, 13454970, 12871231, 11664519, 9432661, 6308134, 2744333, -694395, -3420184, -4996578, -5313329, -4461828, -2467586, 627868, 4357986, 7719951, 9678620, 9840922, 8709734, 7395899, 7027200, 8178754, 10673547, 13895595, 17264922, 20368159, 22769771, 23990884, 23818387, 22552707, 20887100, 19573691, 19119948, 19578920, 20540436, 21459261, 22086817, 22528803, 22918237, 23232629, 23471944, 23744417, 23954891, 23556256, 21904619, 18932878, 15357197, 12169189, 9960321, 8707472, 8091580, 7913630, 8160065, 8721458, 9214328, 9216168, 8600347, 7457989, 5723839, 3143735, -271622, -3959086, -7153464, -9447473, -10902283, -11740037, -12101557, -12019197, -11422596]
8684a1422596J236838J828971J974224J431461M54261l75065o27502k87859L82105
8675e405162J106931J713745K083942K088713J637339Q04885j36265q62230j175997
8666A855901j073100p36897m85069n48064p83363p70827l78339q9366m93996j511587
8656e014707k414117k633828k250964j614803q07060L10350J721466L158843M278380
8647e266440M775102M448463L361582J914136O16933k20667n61620n25554l22518
8638H219417k17296m02446q83948j514649k063772k221325j706322n55470P51014
8629e94797J620953J826973J585354J228759R36642P52186O87328P39898Q77365
8620I660661J032191J074999Q40908L08620k37532l64828R2661Q22101J294705
$$ y = [-11422596, -10185758, -8356787, -6382563, -4951102, -4496841, -4871906, -5499408, -5787267, -5405162, -4298231, -2584486, -500544, 1588169, 3225508, 4030393, 3894128, 3031898, 1855901, 782801, 45904, -439165, -987229, -1770592, -2541419, -2919758, -3009124, -3503120, -5014707, -7428824, -10062652, -12313616, -13928419, -14735479, -14425129, -12703663, -9544820, -5266440, -491338, 3957125, 7318707, 9232843, 9849776, 9629109, 9067489, 8541935, 8219417, 8002121, 7599675, 6715727, 5201078, 3137306, 915981, -790341, -1345811, -594797, 1026156, 2853129, 4438483, 5667242, 6603884, 7356070, 8043398, 8783296, 9660661, 10692852, 11767851, 12608759, 12917379, 12679847, 12315019, 12407680, 13229781, 14524486]
8611A4524486J218166P14133J27003k55092l22431j20358K05573M69015N27273
8602A7087768L34368j12460q52050j883076k963347l603163l426038k558897j559771
8593D63334r15868o75815n90394n09723n43626q37620j250049j324886o96473
8584f881120M13535J220401J091157K30002n37160o83052m50556l16166k81064
8575f194023L390N57280R15101P22846K03847j36256q4626J95958N55171J087281
8565b174031J923566K931951L725840L946019L495136K539763J364850K40422
8557A7993516o49605j242043j583688j761105j837848j869531j931430k056665
8549E061601k165718k150909k031199j909150j758273j421329r19692n92497p12921
$$ y = [14524486, 15742652, 16456785, 16583788, 16328696, 16006265, 15885907, 16091480, 16560495, 17087768, 17422136, 17309676, 16457626, 14574550, 11611203, 8008040, 4582002, 2023105, 463334, -452534, -1128349, -1718743, -2228466, -2772092, -3609712, -4859761, -6184647, -6881120, -6467585, -5247184, -4156027, -3926025, -4463185, -5146237, -5596793, -5912959, -6194023, -6190633, -5633353, -4718252, -3995406, -3791559, -3927815, -4012441, -3816483, -3261312, -2174031, -250465, 2681486, 6407326, 10353345, 13848481, 16388244, 17753094, 17993516, 17343911, 16101868, 14518180, 12757075, 10919227, 9049696, 7118266, 5061601, 2895883, 744974, -1286225, -3195375, -4953648, -6374977, -7294669, -7887166, -8600087]
8540h600087j040542j008084l93476L97932Q00708O62794K51477j21934k83927
8531i335139j26618L65523R61471J239478R11413M4993j032848j935535k322493
8522a1229755k029453j259331n15311j31531Q9454N63065J243724J505296Q30860
8513a0932982n44508j850232k532854k603560k306627j711063p40958N40182J834197
8504b0848405K789349L224460L208659K981315K791939K775461K926658L108938
8496B958374L037148K353647R13922r37821k486634l134239k766628j697195m23524
8487b182950N08402O45622o7458j111716j724899j522576p52730M7232N29051
8478e632022O61682N56540L20546O1765o7851R7940O28368J371205J958347K036907
$$ y = [-8600087, -9640629, -10648713, -11042189, -10644257, -9843549, -9180755, -8929278, -9051212, -9335139, -9461757, -9096234, -8134763, -6895285, -5983872, -5938879, -6971727, -8907262, -11229755, -13259208, -14518539, -15033850, -15165381, -15075927, -14512862, -13269138, -11763842, -10932982, -11477490, -13327722, -15860576, -18464136, -20770763, -22481826, -23222784, -22682602, -20848405, -18059056, -14834596, -11625937, -8644622, -5852683, -3077222, -150564, 2958374, 5995522, 8349169, 9263091, 8325270, 5838636, 2704397, -62231, -1759426, -2182950, -1674548, -1028926, -1096384, -2208100, -3932999, -5455575, -6208305, -6161073, -5632022, -4970340, -4413800, -4093254, -4031489, -4099340, -4001400, -3373032, -2001827, -43480, 1993427]
8468A993427J564457Q42901K22621j87344m91523p76231r93830j032761q03444
8459C38273k79416M25167J003363J120378P36847K08902m2486M0813J36196l7908
8449C650129l59891m21467K2073P71743J349603J389413Q57817r013q61841j352116
8439E036450j274454p29969p2426M33671Q40293J267223J530304J298534O46986
8430H976612J26706Q8814J82585j96518j106234j998590k369626k152446j509115
8421D2188o10429K87994Q90175J168059J383551J612430J462650N20209j022272
8412E734555k381105k791990k042385n59314Q92215J747351K046126K201194K295246
8403G141893J881348P00113o93417j418221j254595p55509m57782m22356n58857
$$ y = [1993427, 3557884, 4400785, 4623406, 4436062, 3944539, 3168308, 2174478, 1141717, 338273, 58857, 484024, 1487387, 2607765, 3344612, 3553514, 3511028, 3551841, 3688037, 3650129, 3290238, 2868771, 2890844, 3662587, 5012190, 6401603, 7259420, 7250407, 6388566, 5036450, 3761996, 3032027, 2959601, 3393272, 4233565, 5500788, 7031092, 8329626, 8976612, 9103318, 9192132, 9374717, 9178199, 8071965, 6073375, 3703749, 1551303, 42188, -568241, -280247, 609928, 1777987, 3161538, 4773968, 6236618, 6756827, 5734555, 3353450, 561460, -1480925, -2040239, -1148024, 599327, 2645453, 4846647, 7141893, 9023241, 9723354, 9029937, 7611716, 6357121, 5601612, 5143830, 4721474, 4162617]
8394D162617r04388j384902j691815j669851j555249j560628j451086q43500K03366
8385f695436J194324J739876J842627J672170J322720Q77152N23686M48352O33812
8376C559283Q47044Q59868O73806N00686N17271O95979R06912J076937J131929
8367A0769715Q88914K17180p18282j583793k237876k727556k928522k533582j550672
8358b404474n12549N7163J94367K91926N44044Q55467J130194J317190J251454
8349B724782P97431J70663j80165q9455J48245J80929l0754l21077n76473p27920
8339B096206o23534j00502Q07655J809272K513956K666199K280602J579845P95808
8330A3825507N5341n40058q36628p40114l46836J45485O04111R30204R56963N83471
$$ y = [4162617, 3258229, 1873327, 181512, -1488339, -3043588, -4604216, -6055302, -6898802, -6695436, -5501112, -3761236, -1918609, -246439, 1076281, 1953433, 2477119, 2925471, 3559283, 4406327, 5266195, 5940001, 6440687, 6957958, 7653937, 8560849, 9637786, 10769715, 11658629, 11875809, 11157527, 9573734, 7335858, 4608302, 1679780, -853802, -2404474, -2917023, -2859860, -2665493, -2373567, -1829523, -974056, 156138, 1473328, 2724782, 3522213, 3692876, 3512711, 3423256, 3571501, 3752430, 3721676, 3400599, 2824126, 2096206, 1472672, 1372170, 2179825, 3989097, 6503053, 9169252, 11449854, 13029699, 13825507, 13880848, 13340790, 12504162, 11764048, 11417212, 11562697, 12166808, 13097012, 14053975, 14637446]
8320A4637446l909m59523o96475j019855j751857k821743l797076m254887m094579
8311d262458l566201l013208k515986j811914o93108N35343J190523Q90394l0893
8302a3277508q56070j103694p49567j6135Q66491J747235K559566L251050L657488
8293c921144L530667K811737J829804J084827Q03541P72624N95744M7189p85270
8284F769719j579412j980501j843122j349387q41969m92900j74579L06415R00874
8275b84862J315549J307357R05541L29649k15314n71485n33119N5226R68118J508989
8265D785649J040634k88476j528308j825912j276166p02484o38252p87500n87696
8256a808511l9372L07975R5251m44701q65869r81922q00462k58299O57928J617518
$$ y = [14637446, 14633537, 14174014, 13477539, 12457684, 10705827, 7884084, 4087008, -167879, -4262458, -7828659, -10841867, -13357853, -15169767, -15862875, -15327532, -14137009, -13246615, -13277508, -14133578, -15237272, -15986839, -16002974, -15136483, -13389248, -10829682, -7578632, -3921144, -390477, 2421260, 4251064, 5335891, 6139432, 6912056, 7507800, 7554989, 6769719, 5190307, 3209806, 1366684, 17297, -824672, -1317572, -1492151, -1185736, -284862, 1030687, 2338044, 3243585, 3573234, 3357920, 2786435, 2253316, 2308542, 3276660, 4785649, 5826283, 5537807, 4009499, 2183587, 907421, 204937, -433315, -1220815, -1808511, -1847883, -1539908, -1444657, -1889358, -2755227, -3737149, -4537611, -4795910, -4137982, -2520464]
8246b520464K087439J825498J055777J63138n66623r04380o91748o2180N70680
8237I57137R49900J263457J808082K476356K779402K323754J108860n62011k255685
8228A0849252l527437m099515m010232l498699k740769j803127q30404r7175K26841
8219i531265L09451N76542J337926K415879L160632K995892K037961J039788O20817
8210D963623P09164Q57202Q43807O77157K33221o22866j558058j887252j354322
8201B861676m80378N5227J17527J6012j7508L3153J65510L60025M28247J39821
8191C679312m41039r12809r04562m29264J36212L81299J96805j71246m00379l93462
8181G40867k44065J1935M02290P65514P49237K02428o06828j304352j770024k030606
$$ y = [-2520464, -433025, 1392473, 2448250, 2611388, 2044765, 1140385, 448637, 386457, 957137, 1907037, 3170494, 4978576, 7454932, 10234334, 12558088, 13666948, 13104937, 10849252, 7321815, 3222300, -787932, -4286631, -7027400, -8830527, -9660931, -9758106, -9531265, -9221814, -8645272, -7307346, -4891467, -1730835, 1265057, 3303018, 4342806, 4963623, 5672787, 6529989, 7373796, 8050953, 8284174, 7661308, 6103250, 4215998, 2861676, 2381298, 2436525, 2554052, 2570064, 2552556, 2585709, 2751219, 3111244, 3539491, 3679312, 3238273, 2325464, 1420902, 991638, 1127850, 1509149, 1705954, 1534708, 1134329, 740867, 496802, 508737, 911027, 1676541, 2425778, 2628206, 2021378, 717026, -1052998, -3083604]
8171c083604j987600j504839o75701K26125J013961J623062J957408J923348J580874
8162A073034J064546M02407l76825j028593j281990j255890j374309j768322k044743
8153f590685j812953j203672o48943l25207o5708K85841P17996J234874J918110
8144f490347K685352L154249K921399J965993P08426l05754p30442n05261J92785
8135C596400R67531J282140P76451l48346j369076j649525j221075o40516k93977
8126A100007l8983L86878Q13113P40300j7745j000499j519466j346946r08300
8117a791641p96462j137858j457523j171689k03978R00785J461539J227337M93034
8108b476456k33734o21082o76725o77743r38016j521848k135936k364045k036238
$$ y = [-3083604, -5071204, -6576043, -7251744, -7025619, -6011658, -4388596, -2431188, -507840, 1073034, 2137580, 2539987, 2163162, 1134569, -147421, -1403311, -2777620, -4545942, -6590685, -8403638, -9607310, -10256253, -10581460, -10647168, -10361327, -9643331, -8408457, -6490347, -3804995, -650746, 2270653, 4236646, 4945072, 4639318, 3908876, 3403615, 3596400, 4563931, 5846071, 6622522, 6274176, 4905100, 3255575, 2034500, 1393984, 1100007, 1061024, 1447902, 2261015, 3001315, 2983570, 1983071, 463605, -883341, -1791641, -2588103, -3725961, -5183484, -6355173, -6559151, -5658366, -4196827, -2969490, -2476456, -2710190, -3331272, -4007997, -4685740, -5623756, -7145604, -9281540, -11645585, -13681823]
8099a3681823j332033n54508R9639N83764J002278J618092K655645L948187M935062
8090g25697N206449M945796M610570M258034L484135K059153L43368j040492j736746
8081B1404570j762902j339089q08939n46371o90014j026907j294593j504465j799651
8072A0631639k097637k091081j571644n92106O28439J774336K467454K460148
8064A1609548J827114Q48439k35372j201273j714507j538517q95711l56733k96531
8055H046457o27162j050749j343883j411215j359430j550228k236176l035872
8047d568258l125588k158071o99114M67415J164388J656428J955651J764690J060159
8038b482300L22683P0207L75866R17430J344071J527505J544372J469387J219457
$$ y = [-13681823, -15013856, -15568364, -15468725, -14884961, -13882683, -12264591, -9608946, -5660759, -725697, 4480752, 9426548, 14037118, 18295152, 21779287, 23838440, 24181808, 23141316, 21404570, 19641668, 18302579, 17493640, 16947269, 16257255, 15230348, 13935755, 12431290, 10631639, 8534002, 6442921, 4871277, 4279171, 4907610, 6681946, 9149400, 11609548, 13436662, 14285101, 14049729, 12848456, 11133949, 9595432, 8699721, 8342988, 8046457, 7419295, 6368546, 5024663, 3613448, 2254018, 703790, -1532386, -4568258, -7693846, -9851917, -10551031, -10083616, -8919228, -7262800, -5307149, -3542459, -2482300, -2159617, -2089410, -1713544, -796114, 547957, 2075462, 3619834, 5089221, 6308678]
8029F308678P10001J75269J07808P12459J582681K123391K177512K025588J868732
8020A7792119J556698Q12952m25013j840642k815894k843481k053998j171568
8012I011173p31728n48081k33468L3147k21822q46220j043202m28191L93935N59997
8002E945540j15840j177026k127942k674007k641881k069297j296172o85479k89028
7993g131132N9532M63420R63642J627138K318962K484509J546964l53359k230368
7984b50692l018973k436868j089645J56863Q50451J102212J236589J439121J767046
7975b43896K292898K958712L327582K842548J510153P4663p18853q62951q83881
7966A0296975j111720j464795j812264k147184k379834k297657j822995j066766
$$ y = [6308678, 7018679, 7193948, 7301756, 8014215, 9596896, 11720287, 13897799, 15923387, 17792119, 19348817, 20161769, 19736756, 17896114, 15080220, 12236739, 10182741, 9011173, 8279445, 7731364, 7497896, 7531043, 7309221, 6463001, 5419799, 4991608, 5385543, 5945540, 5829700, 4652674, 2524732, -149275, -2791156, -4860453, -6156625, -6842104, -7131132, -7071600, -6608180, -5644538, -4017400, -1698438, 786071, 2333035, 1979676, -250692, -3269665, -5706533, -6796178, -6639315, -5788864, -4686652, -3450063, -2010942, -243896, 2049002, 5007714, 8335296, 11177844, 12687997, 12762660, 12043807, 11180856, 10296975, 9185255, 7720460, 5908196, 3761012, 1381178, -916479, -2739474, -3806240]
7958c806240q2506J145452K382255L132796L156257K752359K309548J780558Q93958
7949A3664437k66223j246502j765882j946926j955847j727179j202806o01832
7941B951240k26958j30287j62967k43717l64825m24166l25794k40046m73733r92684
7931f33937j330000j122834n30934N5411N09050R11272J185683J148915Q70205
7922A062831O02129L14764l10704j273359k010254k045245j603553j228773r86587
7913g478751m98017K70250P28248L77207m96354j089981q94915m5946R76204J715820
7903f436235J862987J315006K79183p99968j545349j850488j746926j203462k31220
7894a0356472Q49620J487273J392862Q54137L93826J58402j76481q75050j702879
$$ y = [-3806240, -3888746, -2743294, -361039, 2771757, 5928014, 8680373, 10989921, 12770479, 13664437, 13398214, 12151712, 10385830, 8438904, 6483057, 4755878, 3553072, 2951240, 2724282, 2593995, 2431028, 2187311, 1822486, 1398320, 1072526, 832480, 358747, -633937, -1963937, -3086771, -3617705, -3562294, -3053244, -2141972, -956289, 192626, 1062831, 1664960, 1979724, 1669020, 395661, -1614593, -3659838, -5263391, -6492164, -7478751, -7976768, -7706518, -6978270, -6601063, -7097417, -8187398, -9082313, -9128259, -8152055, -6436235, -4573248, -3258242, -2979059, -3779027, -5324376, -7174864, -8921790, -10125252, -10356472, -9506852, -8019579, -6626717, -5772580, -5378754, -5220352, -5396833, -6271883, -7974762]
7885g974762k131853j882220j160730m51651j94014n81114j470776k422054k921937
7876b1191111k678347j737881l91925R59300J916493K236114J973184J420489
7868a7493684Q51747L48600j12672m79369n88099k85101M47204J435820K347623
$$ y = [-7974762, -10106615, -11988835, -13149565, -13601216, -13795230, -14376344, -15847120, -18269174, -21191111, -23869458, -25607339, -25999264, -25039964, -23123471, -20887357, -18914173, -17493684, -16641937, -16293337, -16406009, -16885378, -17473477, -17758578, -17311374, -15875554, -13527931]
$$ [...]
##END NTUPLES=NMR SPECTRUM
##END=
