##TITLE=31Pdec_11P153'
 CDCl3 64 sc
 11.8.2023
##JCAMPDX= 6.0         $$ Bruker NMR JCAMP-DX V2.0
##DATA TYPE= NMR SPECTRUM
##DATA CLASS= NTUPLES
##ORIGIN= UXNMR, Bruker Analytische Messtechnik GmbH
##OWNER= root
$$ XWIN-NMR		Version 3.5
$$ Fri Aug 11 13:45:28 2023 Russian Standard Time (UT+4h)  she@DPX200
##.OBSERVE FREQUENCY= 81.013821
##.OBSERVE NUCLEUS= ^31P
##.ACQUISITION MODE= SIMULTANEOUS
##.ACQUISITION SCHEME= undefined
##.AVERAGES= 64
##.DIGITISER RES= 16
##SPECTROMETER/DATA SYSTEM= spect
##.PULSE SEQUENCE= zgpg30
##.SOLVENT NAME= CDCl3
##.SHIFT REFERENCE= (INTERNAL, CDCl3, 0, 248.564)
##AUDIT TRAIL= $$ (NUMBER, WHEN, WHO, WHERE, WHAT)
$$ ##TITLE= Audit trail, XWIN-NMR		Version 3.5
$$ ##JCAMPDX= 5.01
$$ ##ORIGIN= Bruker BioSpin GmbH
$$ ##OWNER= she
$$ F:/spectra/data/she/nmr/P31/1/pdata/1/auditp.txt
$$ ##AUDIT TRAIL=  $$ (NUMBER, WHEN, WHO, WHERE, WHAT)
(   1,<2023-08-11 13:43:53.79 +0400>,<she>,<DPX200>,
      <created by zg, POWCHK disabled, PULCHK disabled
       configuration hash MD5:
       00 E9 B6 7A A2 85 ED C7 34 08 36 98 17 FE 4E 26
       data hash MD5: 32K
       C7 0E 04 D4 70 51 2F A1 98 6B EF 2B 58 0F 37 50>)
(   2,<2023-08-11 13:43:56.26 +0400>,<she>,<DPX200>,
      <Start of raw data processing
       efp BC_mod = 2 LB = 5 FT_mod = 6 PKNL = 1 PHC0 = -10633.21 PHC1 = 11.08485 SI = 64K 
       data hash MD5: 64K
       09 46 FF 59 50 B2 E6 97 9E 97 1A B8 CC 90 E5 4C>)
(   3,<2023-08-11 13:44:15.03 +0400>,<she>,<DPX200>,
      <pk PHC0 = 10.65166 PHC1 = 0 
       data hash MD5: 64K
       A6 5A 75 1B 8F D2 7C 11 FB 04 FD 8F 40 00 82 6A>)
(   4,<2023-08-11 13:44:20.51 +0400>,<she>,<DPX200>,
      <abs ABSG = 5 
       data hash MD5: 64K
       3B AA CB 35 15 D2 53 CE FD F1 D0 EB 8D BC 68 6A>)
$$ ##END=
$$ 
$$ hash MD5
$$ 76 81 9E 21 32 9E 37 3C 9A B4 AE 58 94 96 F9 5D
##$RELAX= 
##$RELAX= 
##$RELAX= 
##$RELAX= 
##$RELAX= 
##$RELAX= 
##$RELAX= 
##$RELAX= 
##$RELAX= 
$$ Bruker specific parameters
$$ --------------------------
##$DU= <F:/spectra>
##$EXPNO= 1
##$NAME= <P31>
##$PROCNO= 1
##$TYPE= <nmr>
##$USER= <she>
##$AMP= (0..31)
100 100 100 100 100 100 100 100 100 100 100 100 100 100 100 100 100 100 
100 100 100 100 100 100 100 100 100 100 100 100 100 100 
##$AQSEQ= 0
##$AQ_mod= 1
##$AUNM= <au_zg>
##$AUTOPOS= <>
##$BF1= 81.014009
##$BF2= 200.13
##$BF3= 200.13
##$BF4= 200.13
##$BF5= 200.13
##$BF6= 200.13
##$BF7= 200.13
##$BF8= 200.13
##$BYTORDA= 1
##$CFDGTYP= 0
##$CFRGTYP= 5
##$CHEMSTR= <none>
##$CNST= (0..31)
1 1 145 1 1 1 1 1 1 1 1 1 1 1 1 1 1 1 1 1 1 1 1 1 1 1 1 1 1 1 1 1 
##$CPDPRG= <waltz16>
##$CPDPRG1= <>
##$CPDPRG2= <waltz16>
##$CPDPRG3= <>
##$CPDPRG4= <mlev>
##$CPDPRG5= <mlev>
##$CPDPRG6= <mlev>
##$CPDPRG7= <mlev>
##$CPDPRG8= <mlev>
##$CPDPRGB= <>
##$CPDPRGT= <>
##$D= (0..31)
0 1 0 0 0 0 0 0 0 0 0 0.03 2e-05 3e-06 0 0 0 0 0 0 0 0 0 0 0 0 0 0 0 0 
0 0 
##$DATE= 1691747033
##$DBL= (0..7)
120 120 120 11 120 120 24 19 
##$DBP= (0..7)
150 150 150 150 150 150 150 150 
##$DBP07= 0
##$DBPNAM0= <>
##$DBPNAM1= <>
$$ [...]
##$SUBNAM3= <"">
##$SUBNAM4= <"">
##$SUBNAM5= <"">
##$SUBNAM6= <"">
##$SUBNAM7= <"">
##$SUBNAM8= <"">
##$SUBNAM9= <"">
##$SW= 501.771253377433
##$SWIBOX= (0..15)
0 1 3 0 0 0 0 0 0 0 0 0 0 0 0 0 
##$SW_h= 40650.406504065
##$TD= 32768
##$TD0= 1
##$TE= 0
##$TE2= 300
##$TE3= 300
##$TEG= 300
##$TL= (0..7)
0 120 53 12 22 120 120 120 
##$TP= (0..7)
150 150 150 150 150 150 150 150 
##$TP07= 0
##$TPNAME0= <>
##$TPNAME1= <>
##$TPNAME2= <>
##$TPNAME3= <>
##$TPNAME4= <>
##$TPNAME5= <>
##$TPNAME6= <>
##$TPNAME7= <>
##$TPOAL= (0..7)
0.5 0.5 0.5 0.5 0.5 0.5 0.5 0.5 
##$TPOFFS= (0..7)
0 0 0 0 0 0 0 0 
##$TUNHIN= 0
##$TUNHOUT= 0
##$TUNXOUT= 0
##$USERA1= <user>
##$USERA2= <user>
##$USERA3= <user>
##$USERA4= <user>
##$USERA5= <user>
##$V9= 5
##$VALIST= <valist>
##$VCLIST= <CCCCCCCCCCCCCCC>
##$VD= 0
##$VDLIST= <DDDDDDDDDDDDDDD>
##$VPLIST= <PPPPPPPPPPPPPPP>
##$VTLIST= <TTTTTTTTTTTTTTT>
##$WBST= 1024
##$WBSW= 4
##$XGAIN= (0..3)
0 0 0 0 
##$XL= 0
##$YL= 0
##$YMAX_a= 3631
##$YMIN_a= -4227
##$ZGOPTNS= <>
##$ZL1= 120
##$ZL2= 120
##$ZL3= 120
##$ZL4= 120
##$ABSF1= 248.5645
##$ABSF2= -253.2056
##$ABSG= 5
##$ABSL= 3
##$ALPHA= 0
##$AQORDER= 0
##$ASSFAC= 0
##$ASSFACI= 0
##$ASSFACX= 0
##$ASSWID= 0
##$AUNMP= <proc_1d>
##$AZFE= 0.1
##$AZFW= 0.5
##$BCFW= 0
##$BC_mod= 2
##$BYTORDP= 0
##$COROFFS= 0
##$CY= -3
##$DATMOD= 1
##$DC= 0
##$DFILT= <>
##$DTYPP= 0
##$F1P= 0
##$F2P= 0
##$FCOR= 1
##$FTSIZE= 65536
##$FT_mod= 6
##$GAMMA= 0
##$GB= 0
##$INTBC= 1
##$INTSCL= 6.047779e-11
##$ISEN= 30
##$LB= 5
##$LEV0= 0
##$LPBIN= 0
##$MAXI= 10000
##$MC2= 0
##$MEAN= 0
##$ME_mod= 0
##$MI= 50
##$NCOEF= 0
##$NC_proc= -10
##$NLEV= 6
##$NOISF1= 182.463
##$NOISF2= 159.3651
##$NSP= 0
##$NTH_PI= 0
##$NZP= 0
##$OFFSET= 248.5645
##$PC= 4
##$PHC0= -10622.56
##$PHC1= 11.08485
##$PH_mod= 1
##$PKNL= yes
##$PPARMOD= 0
##$PSCAL= 0
##$PSIGN= 0
##$REVERSE= no
##$SF= 81.0140089999694
##$SI= 65536
##$SIGF1= 159.3651
##$SIGF2= -187.1042
##$SINO= 113.3802
##$SIOLD= 16384
##$SREGLST= <1H.CDCl3>
##$SSB= 0
##$STSI= 65536
##$STSR= 0
##$SW_p= 40650.406504065
##$SYMM= 0
##$S_DEV= 0
##$TDeff= 32768
##$TDoff= 0
##$TI= <>
##$TILT= no
##$TM1= 0
##$TM2= 0
##$TOPLEV= 0
##$USERP1= <user>
##$USERP2= <user>
##$USERP3= <user>
##$USERP4= <user>
##$USERP5= <user>
##$WDW= 1
##$XDIM= 65536
##$YMAX_p= 348079112
##$YMIN_p= -106961193
$$ End of Bruker specific parameters
$$ ---------------------------------
##NTUPLES= NMR SPECTRUM
##VAR_NAME=  FREQUENCY,     SPECTRUM/REAL,   SPECTRUM/IMAG
##SYMBOL=    X,             R,               I
##VAR_TYPE=  INDEPENDENT,   DEPENDENT,       DEPENDENT
##VAR_FORM=  AFFN,          ASDF,            ASDF
##VAR_DIM=   65536,         65536,           65536
##UNITS=     HZ,            ARBITRARY UNITS, ARBITRARY UNITS
##FACTOR=    0.620285442955139, 1,           1
##FIRST=     20137.2065510682, 0,            0
##LAST=      -20513.1999529968, 0,           0
##MIN=       -20513.1999529968, -106961193,  0
##MAX=       20137.2065510682, 348079112,    0
$$ Real data points
##PAGE= N=1
##DATA TABLE= (X++(R..R)), XYDATA
$$ [...]
42300a7007895K762521M656574M938314M098222K842263J295581n62829k199533
$$ -17007895 -14245374 -9588800 -4650486 -552264 2289999 3585580 3022751 823218
42292H23218k861648k444144j528417o09339K90259J237796K058666K543117K714761
$$ 823218 -2038430 -4482574 -6010991 -6620330 -6330071 -5092275 -3033609 -490492 2224269
42283B224269K727275K625167K281450J489753J74082j318909k227351k000623
$$ 2224269 4951544 7576711 9858161 11347914 11521996 10203087 7975736 5975113
42275E975113r87800k18406l55968j074819j590922j569597j313913j267754j625314
$$ 5975113 4987313 4768907 4412939 3338120 1747198 177601 -1136312 -2404066 -4029380
42266d029380k346643l256648m066168m478289m356934l720430k603968j094294
$$ -4029380 -6376023 -9632671 -13698839 -18177128 -22534062 -26254492 -28858460 -29952754
42258b9952754M85968J646542K137914K201839K291450K613494L063397L505513
$$ -29952754 -29466786 -27820244 -25682330 -23480491 -21189041 -18575547 -15512150 -12006637
42250a2006637L889293M088666L880694L219431K364613J567390P36525l84393
$$ -12006637 -8117344 -4028678 -147984 3071447 5436060 7003450 7739975 7355582
42242G355582j739251k838650l150155k521973j254196J20951J151172J710619
$$ 7355582 5616331 2777681 -372474 -2894447 -4148643 -4027692 -2876520 -1165901
42234a165901J973696K081370J904315J276308L71547l92994q22286j063479j247440
$$ -1165901 807795 2889165 4793480 6069788 6441335 6048341 5226055 4162576 2915136
42225B915136j307463j253644j317658j596779j755894j338801k88520J021006
$$ 2915136 1607673 354029 -963629 -2560408 -4316302 -5655103 -5943623 -4922617
42217d922617K187410L055898L656162L985022L824079K804805Q76444j240502
$$ -4922617 -2735207 320691 3976853 7961875 11785954 14590759 15467203 14226701
42209A4226701k394990k048937q04790K70919N83671O4717j277327l271070n165740
$$ 14226701 11831711 9782774 8977984 9248903 9832574 9897291 8619964 5348894 183154
42200A83154n922650n148432l456084j798844o86769p3268L43682Q79389J682957
$$ 183154 -5739496 -10887928 -14344012 -16142856 -16829625 -16902893 -16559211 -15679822 -13996865
42191a3996865K604877L312399L563427L286257K521376J546141R51615J188145
$$ -13996865 -11391988 -8079589 -4516162 -1229905 1291471 2837612 3789227 4977372
42183D977372J972945K503694K354761J829050J356495R94914P38089Q52372J474403
$$ 4977372 6950317 9454011 11808772 13637822 14994317 15989231 16727320 17579692 19054095
42174A9054095K119584K017741Q79591q89442k546988l325033k680856p69780
$$ 19054095 21173679 23191420 24071011 23181569 20634581 17309548 14628692 13858912
42166A3858912J346568K440073K241727J564276J186979Q90852j69801k255563
$$ 13858912 15205480 17645553 19887280 21451556 22638535 23529387 23359586 21104023
42158B1104023m435810n293877m255522k206865p20578o20504j378007j932435
$$ 21104023 16668213 11374336 7118814 4911949 4191371 3570867 2192860 260425
42150B60425j879110j634529j588762j473122o93962Q94493K699965L846858L905339
$$ 260425 -1618685 -3253214 -4841976 -6315098 -7009060 -6114567 -3414602 432256 4337595
42141D337595L209639K421226J753422P91624p59360k347556k982708k414080
$$ 4337595 7547234 9968460 11721882 12513506 11754146 9406590 6423882 4009802
42133D009802j538055j427385k193726l056921l357415l158368k869223k630691
$$ 4009802 2471747 1044362 -1149364 -4206285 -7563700 -10722068 -13591291 -16221982
42125a6221982k272900j711183j128978p40317n15479k25686K81826Q97595J322176
$$ -16221982 -18494882 -20206065 -21335043 -22075360 -22590839 -22816525 -22534699 -21637104 -20314928
42116b0314928J333383J047318R00696J221453J740775J722714Q11646l39177
$$ -20314928 -18981545 -17934227 -17033531 -15812078 -14071303 -12348589 -11536943 -11876120
42108a1876120n79348N59980K427491L987655M652332M288839K876222N99292
$$ -11876120 -12455468 -11895488 -9467997 -5480342 -828010 3460829 6337051 6936343
42100F936343j898460l803968m727230m815844m403207l814777l353093l024183
$$ 6936343 5037883 1233915 -3493315 -8309159 -12712366 -16527143 -19880236 -22904419
42092b2904419k280802m90753K199227M802632O410103O842513O322496M987718
$$ -22904419 -25185221 -25675974 -23476747 -18674115 -12264012 -5421499 900997 5888715
42084E888715L043699J025972n20805j472971j970053k076316j933477j961018
$$ 5888715 8932414 9958386 9437581 7964610 5994557 3918241 1984764 23746
42076B3746k371935k587918j700265L74891K616035L896398L913955L035858J678644
$$ 23746 -2348189 -4936107 -6636372 -6261481 -3645446 250952 4164907 7200765 8879409
42067H879409J57486j153633j926516k121647j935748j565813j144060p80621
$$ 8879409 9036895 7883262 5956746 3835099 1899351 333538 -810522 -1591143
42059a591143n11786k94841j68566k91001o88879j113694j298883j218457r45599
$$ -1591143 -2102929 -2397770 -2566336 -2857337 -3546216 -4659910 -5958793 -7177250 -8122849
42050h122849m64409J31678M48918J61904m95159r49315r70723p68326l97739
$$ -8122849 -8587258 -8455580 -8006662 -7844758 -8339917 -9289232 -10259955 -11028281 -11426020
42041a1426020M66318J955585L559202M545009M614703L897355K556599Q08541
$$ -11426020 -10959702 -9004117 -5444915 -899906 3714797 7612152 10168751 10977292
42033A0977292p73311j428678q53476N16071J918495K781546K824915K000962
$$ 10977292 10203981 8775303 7921827 8437898 10356393 13137939 15962854 17963816
42025A7963816O10195o61130j132790o64828K80676J108686J513245J457638R73834
$$ 17963816 18574011 17912881 16780091 16115263 16395939 17504625 19017870 20475508 21449342
42016B1449342J73696o54606j246858j730256k551554l848100n043052n331443
$$ 21449342 21623038 20968432 19721574 17991318 15439764 11591664 6548612 1217169
42008A217169m548380l337102k464088k208089k439191k959172l548802l896694
$$ 1217169 -3331211 -6668313 -9132401 -11340490 -13779681 -16738853 -20287655 -24184349
42000b4184349l752773l089974j977573m53511J270658K646494L162567K873464
$$ -24184349 -27937122 -31027096 -33004669 -33458180 -32187522 -29541028 -26378461 -23504997
41992b3504997K306770J859507J539687J269902J075811Q53822L07035n96555
$$ -23504997 -21198227 -19338720 -17799033 -16529131 -15453320 -14599498 -14292463 -14889018
41984a4889018j288621j044655K39459J906165L176581L791457M021047M205119
$$ -14889018 -16177639 -17222294 -16982835 -15076670 -11900089 -8108632 -4087585 117534
41976A17534M372946M250108L555448K299670Q62494j86947m21149J39052R85560
$$ 117534 4490480 8740588 12296036 14595706 15458200 15271253 14850104 14989156 15974716
41967A5974716J504649J507110J311945J237339J177319Q73627M38670K51767
$$ 15974716 17479365 18986475 20298420 21535759 22713078 23586705 24025375 24277142
41959B4277142L44419K70529k66808r66240j318941j219120r50810p54735o94161
$$ 24277142 24621561 24892090 24625282 23659042 22340101 21120981 20170171 19415436 18721275
41950A8721275q60223j421282k415585l612593m567818m775529l941728k301375
$$ 18721275 17861052 16439770 14024185 10411592 5843774 1068245 -2873483 -5174858
41942e174858n76723N62346R47755P44838P1790r29143j814243k067445j666842
$$ -5174858 -5751581 -5189235 -4241480 -3496642 -3424852 -4353995 -6168238 -8235683 -9902525
41933i902525j110159p99109o77242n56870m82239n68297p12791p13039n52671
$$ -9902525 -11012684 -11811793 -12489035 -13045905 -13528144 -14096441 -14809232 -15522271 -16074942
41924a6074942l83605l00031k61270j44511K38650J043295K144260L091449L488419
$$ -16074942 -16458547 -16758578 -17019848 -17164359 -16925709 -15882414 -13738154 -10646705 -7158286
41915g158286L342470K884208K171317J157334J31560k60312L54366J569844K512990
$$ -7158286 -3815816 -931608 1239709 2397043 2528603 2268291 2622657 4192501 6705491
41906F705491K610217J932247Q80277k30277j219203j896603k100469j873579
$$ 6705491 9315708 11247955 12128232 11897955 10678752 8782149 6681680 4808101
41898D808101j446871j001687n55376j10698K39141M60302O77989R25530Q82273
$$ 4808101 3361230 2359543 1804167 1693469 1932610 2392912 3070901 3996431 4878704
41889D878704J33028j266549k703918l576309l760621l443442k753531j818678
$$ 4878704 5011732 3745183 1041265 -2535044 -6295665 -9739107 -12492638 -14311316
41881a4311316j024929q45749j315447j877189j884903j179134j19529Q36601
$$ -14311316 -15336245 -16181994 -17497441 -19374630 -21259533 -22438667 -22558196 -21721595
41873b1721595J486413J877104K076814K007704J522626O74551j00372j67913
$$ -21721595 -20235182 -18358078 -16281264 -14273560 -12750934 -12076383 -12176755 -12344668
41865a2344668P95920K401189L690071L827350K777810J317405L21039M2782J35234
$$ -12344668 -11548748 -9147559 -5457488 -1630138 1147672 2465077 2786116 2828898 2964132
41856B964132K71944N08145R47395J299438J060022J13573j069513j908757k243625
$$ 2964132 3236076 3744221 4691616 5991054 7051076 7164649 6095136 4186379 1942754
41847A942754k308457k302100k141390j664871r79735m59590k91526r5725P40229
$$ 1942754 -365703 -2667803 -4809193 -6474064 -7453799 -7913389 -8204915 -8300640 -7560411
41838g560411K167075L087909K219401n49390l823499n801512n601628l574038
$$ -7560411 -5393336 -2305427 -86026 -635416 -4458915 -10260427 -15862055 -19436093
41830a9436093p18168J908213L467449L601959K674043J569692J045063J231606
$$ -19436093 -20154261 -18246048 -14778599 -11176640 -8502597 -6932905 -5887842 -4656236
41822d656236J756771K197279K321260K037818J364470N25408o6012j07408K62537
$$ -4656236 -2899465 -702186 1619074 3656892 5021362 5546770 5480758 5373350 5635887
41813E635887N13740J83520p13222j753988k542934l001067l254162l377708l343685
$$ 5635887 6149627 6333147 5619925 3865937 1323003 -1678064 -4932226 -8309934 -11653619
41804a1653619l143120k832814k440155j882811j014998K28493J669161K833720
$$ -11653619 -14796739 -17629553 -20069708 -21952519 -22967517 -22739024 -21069863 -18236143
41796a8236143L180604K547048J398669N24031M10906R34972J615884K053416
$$ -18236143 -15055539 -12508491 -11109822 -10585791 -10174885 -9239913 -7624029 -5570613
41788e570613K097325J776464J254051Q33555Q35884J357031K157803K825568
$$ -5570613 -3473288 -1696824 -442773 390782 1226666 2583697 4741500 7567068
41780G567068L039801K698618J887476Q45621k7977k83059K87240J409586K468022
$$ 7567068 10606869 13305487 15192963 16038584 16010607 15727548 16014788 17424374 19892396
41771A9892396K937850K662568J733598K68584j548453l299487m440924m694501
$$ 19892396 22830246 25492814 27226412 27494996 25946543 22647056 18206132 13511631
41763A3511631m277705l704099l387988l421978l616302l663866l294649k348154
$$ 13511631 9233926 5529827 2141839 -1280139 -4896441 -8560307 -11854956 -14203110
41755a4203110p85112J241003L243130M466300M369590L157825J701407Q10109
$$ -14203110 -14988222 -13747219 -10504089 -6037789 -1668199 1489626 3191033 4001142
41747D001142O46307Q88620J287184J841877K478182K794497K301804R24729p72042
$$ 4001142 4647449 5536069 6823253 8665130 11143312 13937809 16239613 17164342 16392300
41738A6392300j899869j881423q71017M25286J348797J696390J580209J038958
$$ 16392300 14492431 12611008 11739991 12165277 13514074 15210464 16790673 17829631
41730A7829631n8417j699682l397117m279592l677777j772404L57209J510994
$$ 17829631 17771214 16071532 12674415 8394823 4717046 2944642 3301851 4812845
41722D812845J302446K82921q06582j686585k403361k874168k880553k406770
$$ 4812845 6115291 6398212 5591630 3905045 1501684 -1372484 -4253037 -6659807
41714f659807j697514r84960l68871N8032K14716K04940K56223L76313K37821
$$ -6659807 -8357321 -9342281 -9711152 -9653120 -9438404 -9233464 -8977241 -8600928 -8363107
41705h363107m48007j515049k421225k757010k641334k569327k800115k925702
$$ -8363107 -8811114 -10326163 -12747388 -15504398 -18145732 -20715059 -23515174 -26440876
41697b6440876k251910p18663P93659J350714J014433O71819Q97166J406417J686995
$$ -26440876 -28692786 -29411449 -28617790 -27267076 -26252643 -25580824 -24683658 -23277241 -21590246
41688b1590246J704844J749051J925465K117084K218223K112128J606919P11133
$$ -21590246 -19885402 -18136351 -16210886 -14093802 -11875579 -9763451 -8156532 -7445399
41680g445399j69594o53239r22407j491281k427171l145591l079967k288247j269833
$$ -7445399 -7614993 -8268232 -9190639 -10681920 -13109091 -16254682 -19334649 -21622896 -22892729
41671b2892729m16976J80558N88843R55552J516823K398697L306263L580248K764131
$$ -22892729 -23309705 -23129147 -22540304 -21584752 -20067929 -17669232 -14362969 -10782721 -8018590
41662h018590J130269m69908j310255j257278n58667N57361J831011K712815K626195
$$ -8018590 -6888321 -7358229 -8668484 -9925762 -10484429 -9927068 -8096057 -5383242 -2757047
41653b757047J635556N31831K3426O6100K26397M49598J048065J992870K665320
$$ -2757047 -1121491 -589660 -566234 -500134 -273737 175861 1223926 3216796 5882116
41644E882116K484434J529574L74867n07161r96811j138849r90553p21599o84687
$$ 5882116 8366550 9896124 10270991 9763830 8767019 7628170 6637617 5916018 5231331
41635E231331j186462k131306k982441l197276k718175j967072j380956j087435
$$ 5231331 4044869 1913563 -1068878 -4266154 -6984329 -8951401 -10332357 -11419792
41627a1419792j036663j212010j532641j696386j368126n28515M98857J329830
$$ -11419792 -12456455 -13668465 -15201106 -16897492 -18265618 -18794133 -18295276 -16965446
41619a6965446J700597J463335O60226l47810j038987j164366r48420p56374n98720
$$ -16965446 -15264849 -13801514 -13141288 -13489098 -14528085 -15692451 -16640871 -17397245 -17995965
41610a7995965o7547J174086K846360M087719M162717L146612J800928P83328
$$ -17995965 -18063512 -16889426 -14043066 -9955347 -5792630 -2646018 -845090 -61762
41602f1762J56929l17191p15447r75424j140468j299133j415657j465545j587655
$$ -61762 95167 -222024 -937471 -1912895 -3053363 -4352496 -5768153 -7233698 -8821353
41593h821353j813516j794104j169760j52600O37081R07586Q93005Q01168N04372
$$ -8821353 -10634869 -12428973 -13598733 -13751333 -13114252 -12206666 -11313661 -10512493 -10008121
41584a0008121p1032o23929p67672l77119M98492J732849K883383L158832K034479
$$ -10008121 -10079153 -10703082 -11470754 -11847873 -11349381 -9616532 -6733149 -3574317 -1539838
41575a539838j05284k115330k869197j923621K89491K723908M368571M901058
$$ -1539838 -1645122 -3760452 -6629649 -8553270 -8263779 -5539871 -1171300 3729758
41567C729758M694933M188726L475607K548741J552121N32123p27927k260882
$$ 3729758 8424691 12613417 16089024 18637765 20189886 20722009 19994082 17733200
41559A7733200l521695l823837l068660j772469n57447P8981k15205j289519k234254
$$ 17733200 14211505 10387668 7319008 5546539 4989092 5068073 4852868 3563349 1329095
41550A329095k078726q90292K42705M28522k43301j209048k147269k865071k978280
$$ 1329095 -749631 -1639923 -1397218 -968696 -1211997 -2421045 -4568314 -7433385 -10411665
41541a0411665k283697j257433o44325n50860l74437K89194J051877J246682P85896
$$ -10411665 -12695362 -13952795 -14597120 -15147980 -15522417 -15233223 -14181346 -12934664 -12148768
41532a2148768K56123K57966Q55840J641515K137783K099884J624258J150689
$$ -12148768 -11892645 -11634679 -10778839 -9137324 -6999541 -4899657 -3275399 -2124710
41524b124710J280911K325875L883392M993797M921706L802631K409874J324127
$$ -2124710 -843799 1482076 5365468 10359265 15280971 19083602 21493476 22817603
41516B2817603N22553k10383p84547r79107r40369j098748j505787j609106r59886
$$ 22817603 23340156 23129773 22345226 21366119 20425750 19327002 17821215 16212109 15252223
41507A5252223P9668P18232P53779P59904J130233J380307P49630p84835k505516
$$ 15252223 15331891 16050123 16803902 17563806 18694039 20074346 20823976 20039141 17533625
41498A7533625l760387m285688l869890k398276m37818Q31021P31389j64732p83766
$$ 17533625 13773238 9487550 5617660 3219384 2781566 3612587 4343976 4179244 3395478
41489C395478p85384o82777r82657j659768k355994k672142k341762j530349r10506
$$ 3395478 2610094 1927317 944660 -715108 -3071102 -5743244 -8085006 -9615355 -10525861
41480a0525861j015946j529041j620655r84762p0105P33001J539936K375187K692281
$$ -10525861 -11541807 -13070848 -14691503 -15676265 -15746370 -15013369 -13473433 -11098246 -8405965
41471h405965J983374O22999l21915p9367J206588K665563L326753K797904J623787
$$ -8405965 -6422591 -5799592 -6121507 -6200874 -4994286 -2328723 998030 3795934 5419721
41462E419721Q58322J047945J713360J946393J314342L9700j376286k380555k494652
$$ 5419721 6278043 7325988 9039348 10985741 12300083 12339783 10963497 8582942 6088290
41453F088290j665474l96650Q12616K003584L321703M223757L756755J749840
$$ 6088290 4422816 4026166 4838782 6842366 10164069 14387826 18144581 19894421
41445A9894421p89734k697095l672560m092066m262745m262834m209416m186384
$$ 19894421 19104687 16407592 12735032 8642966 4380221 117387 -4092029 -8278413
41437h278413l955198l095387j474111O02986K634738M112044M589450L922287
$$ -8278413 -12233611 -15328998 -16803109 -16200123 -13565385 -9453341 -4863891 -941604
41429i41604K503419J046240P4522k35247J83971J280685K511205K901841J941846
$$ -941604 1561815 2608055 2682577 2447330 2631301 3911986 6423191 9325032 11266878
41420A1266878L33625n65094j86730O12717N52075o04999j800222j823602m68869
$$ 11266878 11600503 11035409 10848679 11461396 12013471 11408472 9608250 7784648 7315779
41411G315779J431193K808399L044834K150426O51127p10878j504157j972754
$$ 7315779 8746972 11555371 14600205 16750631 17401758 16690880 15186723 13213969
41403A3213969k662860l573964l945969l138096j531553k30136N7849m94401j394048
$$ 13213969 10551109 6977145 3031176 -106920 -1638473 -1868609 -1810760 -2305161 -3699209
41394c699209k374512l200568l427078k849005j990215j619220j762138j642785
$$ -3699209 -6073721 -9274289 -12701367 -15550372 -17540587 -19159807 -20921945 -22564730
41386b2564730p09516P04832J955307K889376L673845M114019L737447K593495
$$ -22564730 -23274246 -22569414 -20614107 -17724731 -14050886 -9936867 -6199420 -3605925
41378c605925J478977J128376J445436J737165J494761P52261r3897n27102j43595
$$ -3605925 -2126948 -998572 446864 2184029 3678790 4431051 4337154 3810052 3666457
41369C666457R32957J819121J440658l87124k573327l664901l139937j715498
$$ 3666457 4599414 6418535 7859193 7472069 4898742 1233841 -1906096 -3621594
41361c621594n04240r2274m05735j125277j941650k505989k466234j725226n65833
$$ -3621594 -4125834 -4218108 -4623843 -5749120 -7690770 -10196759 -12662993 -14388219 -14954052
41352a4954052N76002J384139J662416J268210L04783o78051r95333m77742L80436
$$ -14954052 -14378050 -12993911 -11331495 -10063285 -9758502 -10436553 -11431886 -11909628 -11529192
41343a1529192J062193J619693K401875L348608L913052L726335L030399K308951
$$ -11529192 -10466999 -8847306 -6445431 -3096823 816229 4542564 7572963 9881914
41335I881914J761491J400901J456103K209410L323364L724483K566640K92995
$$ 9881914 11643405 13044306 14500409 16709819 20033183 23757666 26324306 26617301
41327B6617301j556727j740946m34644J051631J481789N54124j148486k692039
$$ 26617301 25060574 23319628 22884984 23936615 25418404 25972528 24824042 22132003
41319B2132003l308174k786073j611691n86142j08963J16549N74803J269414J741609
$$ 22132003 18823829 16037756 14426065 13839923 13730960 13847509 14422312 15691726 17433335
41310A7433335J664230J180193O39299K07602j86136o61638j232566j755122j994954
$$ 17433335 19097565 20277758 20917057 21124659 20938523 20276885 19044319 17289197 15294243
41301A5294243j855532j579676j591645k054983k680947l039827k946620k449430
$$ 15294243 13438711 11859035 10267390 8212407 5531460 2491633 -454987 -2904417
41293b904417j573544k78405J310106K733831L354070K768995J232339l16700
$$ -2904417 -4477961 -4756366 -3446260 -712429 2641641 5410636 6642975 6326275
41285F326275q37776P176J641917L178160M077125M184190L479340K192919J024651
$$ 6326275 5488499 5495675 7137592 10315752 14392877 18577067 22056407 24249326 25273977
41276B5273977P31867J320123J935622J743737P20994n34068j507964k076274
$$ 25273977 26005844 27325967 29261589 31005326 31726320 31192252 29684288 27608014
41268B7608014k327827k397224k407005k342966k025301j387584p13210l69496
$$ 27608014 25280187 22882963 20475958 18132992 16107691 14720107 14006897 13637401
41260A3637401l34947k15983K51618R07485J374223J362340P76134k19901j158468
$$ 13637401 13302454 13086471 13338089 14245574 15619797 16982137 17758271 17538370 16379902
41251A6379902j549144j385593j234571j657402k614034l515786l740373l024803
$$ 16379902 14830758 13445165 12210594 10553192 7939158 4423372 682999 -2341804
41243b341804j571382J6239J042544J259344J130619J397418K352473L618947
$$ -2341804 -3913186 -3896947 -2854403 -1595059 -464440 932978 3285451 6904398
41235F904398M541012M603885L566247J528993r73870l147918m399597m614641
$$ 6904398 11445410 16049295 19615542 21144535 20170665 17022747 12623150 8008509
41227H008509l983355k727020j101679M98314J659633K163113J977048J118645
$$ 8008509 4025154 1298134 196455 694769 2354402 4517515 6494563 7613208
41219G613208l02411j921688l205971l812504l801769l460009k990047k396747
$$ 7613208 7310797 5389109 2183138 -1629366 -5431135 -8891144 -11881191 -14277938
41211a4277938j549634k74062J502635L536052N224555N939312N450771L988679
$$ -14277938 -15827572 -16101634 -14598999 -11062947 -5838392 100920 5551691 9540370
41203I540370J952439k56415k113443k979391k515836j074368N09076J537777
$$ 9540370 11492809 11236394 9122951 6143560 3627724 2553356 3062432 4600209
41195D600209J797710J395596N46773l79353q55802n32691L90830J253280J452321
$$ 4600209 6397919 7793515 8340288 7960935 7105133 6572442 6963272 8216552 9668873
41186I668873R10962J25686j94569L17463J283038J720271P93676j409814l842695
$$ 9668873 10579835 10705521 10510952 10828415 12111453 13831724 14625400 13215586 9372891
41177I372891n285287n209843l944494k152668l07276J344788K538945K977652
$$ 9372891 4087604 -1122239 -5066733 -7219401 -7526677 -6181889 -3642944 -665292
41169f65292K577879J518780n5269k138596m421962n943677n648583l411371k04026
$$ -665292 1912587 3431367 3376098 1237502 -3184460 -9128137 -14776720 -18188091 -18392117
41160a8392117K843849N209914O702570O976757N856826L888995J978700M82296
$$ -18392117 -15548268 -10338354 -3635784 3340973 9197799 13086794 15065494 15547790
41152A5547790q68773k132874k793609k426643j292753j1257R79660J362979Q03493
$$ 15547790 14679017 12546143 9752534 7325891 6033138 6021881 7001541 8364520 9168013
41143I168013n63495j701191j392755M17482K390868L126949K496240J469512
$$ 9168013 8604518 6903327 5510572 5928054 8318922 11445871 13942111 15411623
41135A5411623Q81900P13220N24538J78517j67856o26711j705396l629289n716053
$$ 15411623 16293523 17006743 17531281 17709798 17541942 16915231 15209835 11580546 5864493
41126E864493o765551o167842m459745k718071j574559r34129m64379q1347Q3536
$$ 5864493 -901058 -7068900 -11528645 -14246716 -15821275 -16755404 -17219783 -17301130 -17217594
41117a7217594J2308p0343O3874L48176M94855M19571M37231Q71322J598505K232356
$$ -17217594 -17205286 -17275629 -17211755 -16863579 -16368724 -15949153 -15511922 -14640600 -13042095 -10809739
41107a0809739K653270K979897L019860K230028M29232j846364l951047n671512
$$ -10809739 -8156469 -5176572 -2156712 73316 502548 -1343816 -5294863 -10966375
41099a0966375o795073o610425m564262j336737J393093K435527J996063J103310
$$ -10966375 -17761448 -24371873 -28936135 -30272872 -28879779 -26444252 -24448189 -23344879
41091b3344879O06682Q23571J644109K647999L375503L713133L842959L764075
$$ -23344879 -22738197 -21914626 -20270517 -17622518 -14247015 -10533882 -6690923 -2926848
41083b926848L200725K098137Q13825l82879j573800k629940k803151j427183
$$ -2926848 273877 2372014 3185839 2802960 1229160 -1400780 -4203931 -5631114
41075e631114J096030L437468M430665L760927J807022o74255k708677l498817
$$ -5631114 -4535084 -1097616 3333049 7093976 8900998 8226743 5518066 2019249
41067B019249k988651j908704j150851j161621j820790k579821k677185j595778
$$ 2019249 -969402 -2878106 -4028957 -5190578 -7011368 -9591189 -12268374 -13864152
41059a3864152L95906K254536K940220K282221J106368N21275R86324J961136
$$ -13864152 -13468246 -11213710 -8273490 -5991269 -4884901 -4363626 -3377302 -1416166
41051a416166K482105K107527J175762J28070j052690k409906l326615k880929
$$ -1416166 1065939 3173466 4349228 4477298 3424608 1014702 -2311913 -5192842
41043e192842r77487J305783K674762K673366J774787Q26486N26894J031742J806317
$$ -5192842 -6170329 -4864546 -2189784 483582 2258369 3084855 3611749 4643491 6449808
41034F449808K121568J868544J599203J655831J719150J470609J159388J002604
$$ 6449808 8571376 10439920 12039123 13694954 15414104 16884713 18044101 19046705
41026A9046705M69848j085908l222688m560605m238461k696021r61168K57785
$$ 19046705 19516553 18430645 15207957 10647352 6408891 3712870 2751702 3009487
41018C009487O48843J60403p60680j234328p80733P3427L92498r3870q18157j131420
$$ 3009487 3658330 3818733 3058053 1823725 1042992 1116419 1508917 1415047 596890 -534530
41008e34530q98210m21576j08163k01577n66740p03421j94824Q07137J682872
$$ -534530 -1432740 -1854316 -1962479 -2164056 -2730796 -3434217 -3629041 -2821904 -1139032
40999a139032J911029J399701L71165p95408j621718j759977j289012n67312K70371
$$ -1139032 771997 2171698 2542863 1747455 125737 -1634240 -2923252 -3490564 -3220193
40990c220193J369206K563914L118891K489793J194143M29768P34242J411752
$$ -3220193 -1850987 712927 3831818 6321611 7515754 7945522 8679764 10091516
40982A0091516J473845P93835O80n10986r67966j618063k207787k282555j742453
$$ 10091516 11565361 12359196 12359876 11848890 10880924 9262861 7055074 4772519 3030066
40973C030066q85891j05652K48244p5007r77252j895600k230696j888203j207786
$$ 3030066 2144175 2038523 2286767 2211760 1234508 -661092 -2891788 -4779991 -5987777
40964e987777m77418J79552N57113M78331K11682K92764P19196P57814j10135
$$ -5987777 -6465195 -6285643 -5728530 -5250199 -5038517 -4745753 -4026557 -3268743 -3378878
40955c378878j397230k181943k238553k139867k364222k781066l012009k835113
$$ -3378878 -4776108 -6958051 -9196604 -11336471 -13700693 -16481759 -19493768 -22328881
40947b2328881k128516q38826P59476K053094K598496K521200K269273K111499
$$ -22328881 -24457397 -25296223 -24536747 -22483653 -19885157 -17363957 -15094684 -12983185
40939a2983185K007303J819422J474493R75069L87816j80624o24087q24589o58345
$$ -12983185 -10975882 -9156460 -7681967 -6706898 -6319082 -6499706 -7123793 -7948382 -8606727
40930h606727j41066N00606J118722J952443L306237M851331N648938N129207
$$ -8606727 -8747793 -8247187 -7128465 -5176022 -1869785 2981546 8630484 13759691
40922A3759691L748828K363971J224936K8516j203797j863693j466070k00533
$$ 13759691 17508519 19872490 21097426 21125942 19922145 18058452 16592382 16391849
40914A6391849J363399K736239L485589L177297J766421j18386j651524k509131
$$ 16391849 17755248 20491487 23977076 27154373 28920794 28802408 27150884 24641753
40906B4641753k817256k564844j559835m4630J132206J285809N87201k95822j010258
$$ 24641753 21824497 19259653 17699818 17655188 18787394 20073203 20660404 20364582 19354324
40897A9354324j598792j955561j764057j115796p42526j287931k515314l478207
$$ 19354324 17755532 15799971 14035914 12920118 12177592 10889661 8374347 4896140
40889D896140l368223k055456l4310J839115K689650K160513P97865k90736l30381
$$ 4896140 1527917 -527539 -561849 1277266 3966916 6127429 6925294 6634558 6304177
40880F304177N65474J654683K210320J942772J063097J06720m01444k76907K30233
$$ 6304177 6869651 8524334 10734654 12677426 13740523 13847243 13445799 13168892 13399125
40871A3399125N88159K30111j117762l074786m622904m794963l465843j342544
$$ 13399125 13987284 14217395 13099633 10024847 5401943 606980 -2858863 -4201407
40863d201407P72814K456179L477510L649192L124293K501795K243886K116693
$$ -4201407 -3428593 -972414 2505096 6154288 9278581 11780376 14024262 16140955
40855A6140955J522348L13872r95581j796767j906402j535336r75106l83104K47273
$$ 16140955 17663303 17977175 16981594 15184827 13278425 11743089 10767983 10384879 10632152
40846A0632152R36679J506713J633949J236269O48900K08267j81940p57994j284509
$$ 10632152 11568831 13075544 14709493 15945762 16594662 16802929 16620989 15862995 14578486
40837A4578486j195742m58989J15207k79422j506215k678392l155983l052943
$$ 14578486 13382744 12923755 13038962 12759540 11253325 8574933 5418950 2366007
40829B366007k793443k497466j983907j229729n69745l24521l00286J63076J502259
$$ 2366007 -427436 -2924902 -4908809 -6138538 -6708283 -7032804 -7333090 -7170014 -5667755
40820e667755L305149M511934M326096K899988J111360k40888r46986j208587
$$ -5667755 -2362606 2149328 6475424 9375412 10486772 10245884 9298898 8090311
40812H090311j190321q99867m45514j88865m71129j218710j952203k194200j762668
$$ 8090311 6899990 6000123 5554609 5365744 4894615 3675905 1723702 -470498 -2233166
40803b233166p12761P42122K125717K782563K400228J418840O71293N95980R88969
$$ -2233166 -2945927 -2203805 -78088 2704475 5104703 6523543 7194836 7790816 8779785
40794H779785J484555J956001K330463K322845J664153N17790n68131j132344
$$ 8779785 10264340 12220341 14550804 16873649 18537802 19055592 18487461 17355117
40786A7355117j072937m57794P35589K540489M690578O516670P282915O714076
$$ 17355117 16282180 15824386 16559975 19100464 23791042 30307712 37590627 44304703
40778D4304703N199676L432495J843089M36408q62050j901143k508594k912046
$$ 44304703 49504379 52936874 54779963 55216371 54354321 52453178 49944584 47032538
40770D7032538l683913n095359o609861p215541o331820m314215k052806k30079
$$ 47032538 43348625 38253266 31643405 24427864 18096044 13781829 11729023 11498944
40762A1498944R15348J287033P56016n94551k258235l525521l882889l184366
$$ 11498944 12414292 13701325 14457341 13862790 11604555 8079034 4196145 1011779
40754A011779j624366L18191K066916L278887L912888L851736K694582K98033
$$ 1011779 -612587 -294396 1772520 5051407 8964295 12816031 15510613 15808646
40746A5808646k531998m342790m274513k829896j287170n48639p03931j420895
$$ 15808646 13276648 8933858 4659345 1829449 542279 -6360 -710291 -2131186
40738b131186k315016k900591k600411j201170O86261J890628J646931L42739
$$ -2131186 -4446202 -7346793 -9947204 -11148374 -10462113 -8571485 -6924554 -6581815
40730f581815p82357p20137N42593K264923L753787M822721N590835O026322N751192
$$ -6581815 -7364172 -8084309 -7541716 -5276793 -1523006 3299715 8890550 14916872 20668064
40721B0668064M317435J783327r50059k569525k328764o00749J569047L293574
$$ 20668064 24985499 26768826 25818767 23249242 20920478 20319729 21888776 25182350
40713B5182350M151653M005479K945243J400212k4024r14071j138022o99781J96819
$$ 25182350 29334003 33339482 36284725 37684937 37660913 36746842 35608820 34909039 35105858
40704C5105858J016773J227613Q49328L75134J00459j35235m85881q03608r91055
$$ 35105858 36122631 37350244 38199572 38574706 38675165 38539930 38054049 37250441 36259386
40695C6259386j242642j621948j704147j024312K63401J495071K184955K348539
$$ 36259386 35016744 33394796 31690649 30666337 30929738 32424809 34609764 36958303
40687C6958303K199039J752983P68056r70093l199938n035988n566708m756087
$$ 36958303 39157342 40910325 41678381 40708288 37508350 32472362 26905654 22149567
40679B2149567l493244k589278k044920j518104j057857q82736p49171k09248
$$ 22149567 18656323 16067045 14022125 12504021 11446164 10563428 9814257 9605009
40671I605009N33032O29730l75646j926587l027847l129119k337936j124468m4401
$$ 9605009 10138041 10767771 10392125 8465538 5437691 2308572 -29364 -1153832 -1198233
40662a198233M95440M69098J84838p4808k82565n28421q01591r40140o89179J25152
$$ -1198233 -702793 -233695 -48857 -123665 -406230 -934651 -1736242 -2676382 -3365561 -3240409
40652c240409J279230K073712J867523P46866n41143j312257j376090q35145J30809
$$ -3240409 -1961179 112533 1980056 2726922 2185779 873522 -502568 -1337713 -1206904
40643a206904J197570K005606K516726K956630L253131K899582J652426P9713
$$ -1206904 -9334 1996272 4512998 7469628 10722759 13622341 15274767 15354480
40635A5354480r07731r07605j83342P92273J640651K123593K284567K501646L069054
$$ 15354480 14446749 13539144 13355802 14148075 15788726 17912319 20196886 22698532 25767586
40626B5767586L708271L767769K972428J788001R85207R49658J401208J655228
$$ 25767586 29475857 33243626 36216054 38004055 38989262 39938920 41340128 42995356
40618D2995356J167475m9840j513257k759284l627238m013962l621500k257922
$$ 42995356 44162831 44112991 42599734 39840450 36213212 32199250 28577750 26319828
40610B6319828l17677J337459K050897J792516R44681j15611j161044k009574
$$ 26319828 26002151 27339610 29390507 31183023 32127704 32012093 30851049 28841475
40602B8841475k439017k282829j660210j033451q04445p88684l64598O76541J723452
$$ 28841475 26402458 24119629 22459419 21425968 20621523 19832839 19468241 20144782 21868234
40593B1868234K096366J949436J988049K458609K969861L283436L619516L933081
$$ 21868234 23964600 25914036 27902085 30360694 33330555 36613991 40233507 44166588
40585D4166588L480436J647728j014423l049792l383981k143607l47394R00381
$$ 44166588 47647024 49294752 48280329 45230537 41846556 39702949 39355555 40255936
40577D0255936R86781l1614j594865l033261l883714l922567l120769j752653
$$ 40255936 41242717 41211103 39616238 36582977 32699263 28776696 25655927 23903274
40569B3903274m49890R0172m40683j752584l087701l565011k687101p84638J104771
$$ 23903274 23453384 23543556 23102873 21350289 18262588 14697577 12010476 11225838 12330609
40560A2330609K013282J739434P89794j28667l95122M08068K153945L947345M692049
$$ 12330609 14343891 16083325 16873119 16744452 16349330 16757398 18911343 22858688 27550737
40551B7550737M077133K773491J575530O51292k20236j037217j562903j745507
$$ 27550737 31627870 34401361 35976891 36628183 36407947 35370730 33807827 32062320
40543C2062320j734428j447741m81873J305773L236567M084653L074131O52787
$$ 32062320 30327892 28880151 28398278 29704051 32940618 37025271 40099402 40752189
40535D0752189j758082k873617k514993j586398j196528j804116l024150m014120
$$ 40752189 38994107 36120490 33605497 32019099 30822571 29018455 25994305 21980185
40527B1980185m047751k987303j407383j95622J22150k78006p98501r46974o18103
$$ 21980185 17932434 14945131 13537748 13342126 13464276 13186270 12387769 11440795 10822692
40518A0822692n2623L83749N19996N94690J044251J976522K974033L524347L502751
$$ 10822692 10770069 11153818 11673814 12268504 13312755 15289277 18263310 21787657 25290408
40509B5290408L114627K585016K160436K217029K913589L668756L364138J348528
$$ 25290408 28405035 30990051 33150487 35367516 38281105 41949861 45313999 46662527
40501D6662527j817359m687068n935467n147232k949822n29616J206899K228403
$$ 46662527 44845168 40158100 34222633 29075401 26125579 25595963 26802862 29031265
40493B9031265L095783M042717M567793M132972L041316K240837K246686K559500
$$ 29031265 32127048 36169765 40737558 44870530 47911846 50152683 52399369 54958869
40485E4958869K258896R73258q38925k374382l085793k948571k385025j949927
$$ 54958869 57217765 58191023 57352098 54977716 51891923 48943352 46558327 44608400
40477D4608400j912276k023243j721418o31010J104472K929268M257012M776189
$$ 44608400 42696124 40672881 38951463 38320453 39424925 42354193 46611205 51387394
40469E1387394M511145L713120K727678J918051J614314J989249K858499L635640
$$ 51387394 55898539 59611659 62339337 64257388 65871702 67860951 70719450 74355090
40461G4355090L678993K819346J472612J39660j077075k298494l387813m012808
$$ 74355090 78034083 80853429 82326041 82465701 81388626 79090132 75702319 71689511
40453G1689511m178581m256388m306078l821688k550227j218601q53555j478924
$$ 71689511 67510930 63254542 58948464 55126776 52576549 51357948 50504393 49025469
40445D9025469k088367j967504j437250j075380q19222l00507L93533R15538J378042
$$ 49025469 46937102 44969598 43532348 42456968 41637746 41337239 41730772 42646310 44024352
40436D4024352K216102L334273L978157L612636K481224J123991k14867j413346
$$ 44024352 46240454 49574727 53552884 57165520 59646744 60770735 60555868 59142522
40428E9142522k092262j873953r34037K7267L75557k7435q37845j442176j279047
$$ 59142522 57050260 55176307 54242270 54269537 54645094 54617659 53779814 52337638 51058591
40419E1058591k83305R21411J459560R03224n05062k182833l545810m147288l871157
$$ 51058591 50775286 51696697 53156257 54059481 53554419 51371586 47825776 43678488 39807331
40410C9807331l088847k359386j884296j532847j485391k406279m571264p033855
$$ 39807331 36718484 34359098 32474802 30941955 29456564 27050285 22479021 15445166
40402A5445166q143364o989183m138968j010116J226124K214347K367459K479658
$$ 15445166 7301802 312619 -3826349 -4836465 -3610341 -1395994 971465 3451123
40394C451123L146056M319095N457528O116592O263556O085274N786812N595574
$$ 3451123 6597179 10916274 16373802 22490394 28753950 34839224 40626036 46221610
40386D6221610N575298N294527M103785K053560J89334m91601j67781J27222k41708
$$ 46221610 51796908 57091435 61195220 63248780 63438114 62946513 62778732 62905954 62664246
40377F2664246j057817j913687k708895l374734l630516l297987k562829j726391
$$ 62664246 61606429 59692742 56983847 53609113 49978597 46680610 44117781 42391390
40369D2391390r38508k84901J78374O35217J419831K484147L233923L140442K263448
$$ 42391390 41452882 41167981 41346355 41981572 43401403 45885550 49119473 52259915 54523363
40360E4523363R38205p23634k628278m238792m848274m339180l286701k217882
$$ 54523363 55461568 54737934 52109656 47870864 43022590 38683410 35396709 33178827
40352C3178827j064452N10043K428878L997993M349288L112275P89352j481332
$$ 33178827 32114375 32624418 35053296 39051289 43400577 46512852 47302204 45820872
40344D5820872k632468k276878p87640J043347K449680L084913L185013L242442
$$ 45820872 43188404 40911526 40123886 41167233 43616913 46701826 49886839 53129281
40336E3129281L415832L406335K997890K456325K166912K088900J866303J357383
$$ 53129281 56545113 59951448 62949338 65405663 67572575 69661475 71527778 72885161
40328G2885161P79275M21086M56851R13263J539901J842895J581905J127298R46354
$$ 72885161 73664436 74085522 74542373 75455636 76995537 78838432 80420337 81547635 82493989
40319H2493989Q24811Q7000j341751k556690k572126j306466M74262J900722K539914
$$ 82493989 83318800 83405800 82064049 79507359 76935233 75628767 76103029 78003751 80543665
40310H0543665K511287K308355K306863K277442J599771J22536j451057k281872
$$ 80543665 83054952 85363307 87670170 89947612 91547383 91669919 90218862 87936990
40302H7936990k288126k037706j915528j755501j285311o18946j74492k29660
$$ 87936990 85648864 83611158 81695630 79940129 78654818 78035872 77861380 77631720
40294G7631720o33668r08174o46635R7048Q19634J057766Q79437P97502J147624
$$ 77631720 76998052 76089878 75443243 75540291 76359925 77417691 78297128 79094630 80242254
40285H0242254J639704J660173J017407J85914l59785q67753j943179l386705
$$ 80242254 81881958 83542131 84559538 84745452 84385667 83517914 81574735 78188030
40277G8188030l887816k307164R42699M211493O183445O724659O307904N252600
$$ 78188030 74300214 71993050 72935749 77147242 83330687 90055346 96363250 101615850
40269A01615850L779464K351672J526696J534558K134226K765693K825321K044707
$$ 101615850 105395314 107746986 109273682 110808240 112942466 115708159 118533480 120578187
40261A20578187O94228p75321k260981l841129n099551n165199l713388j540337
$$ 120578187 121272415 120497094 118236113 114394984 109295433 104130234 100416846 98876509
40253I8876509J89448R86843J071361P48630K13929k37760l10953o1184J11535
$$ 98876509 99065957 100052800 101124161 101872791 102086720 101848960 101538007 101476823 101588358
40244A01588358j69988r91821k080269k879260k956945k523053k252924k398963
$$ 101588358 101418370 100426549 98346280 95467020 92510075 89987022 87734098 85335135
40236H5335135k474047k114469j739318j782732j704297n82290J449048L170843
$$ 85335135 82861088 80746619 79007301 77224569 75520272 74937982 76387030 79557873
40228G9557873L748912L503050L067740K528748J743078R17261L90033J90609
$$ 79557873 83306785 86809835 89877575 92406323 94149401 95066662 95456695 95647304
40220I5647304J85280L74862P32879J014992J006206P00242K1250j247724k899029
$$ 95647304 95832584 96207446 96940325 97955317 98961523 99661765 99683015 98435291 95536262
40211I5536262m005960l686082k016661J85089K296128M136319N418320N549637
$$ 95536262 91530302 87844220 85827559 86012648 88308776 92445095 97863415 103413052
40203A03413052M181541J652564j226807l607342m848880m760357l813880k866871
$$ 103413052 107594593 109247157 108020350 104413008 99564128 94803771 90989891 88123020
40195H8123020k424239k265684j897957j193055m20255J88136O70547J191208
$$ 88123020 85698781 83433097 81535140 80342085 79921830 80109966 80780513 81971721
40187H1971721J853890K657196L487661M127985M350399M001240K968454J212862
$$ 81971721 83825611 86482807 89970468 94098453 98448852 102450092 105418546 106631408
40179A06631408r58372k710278l100032j874280K68169K314069L680845M216937
$$ 106631408 105673036 102962758 99862726 97988446 98256615 100570684 104251529 108468466
40171A08468466L762120K153817l10908k808756m592551n483681n666442n254888
$$ 108468466 112230586 114384403 114073495 111264739 106672188 101188507 95522065 90267177
40163I0267177m297856l047444j928427j219103q76812o29771j67651O07770J362149
$$ 90267177 85969321 82921877 80993450 79774347 78897535 78267764 78100113 78707883 80070032
40154H0070032J501722P84423l32711j164826j522231j732383k045712k328116
$$ 80070032 81571754 82356177 82023466 80858640 79336409 77604026 75558314 73230198
40146G3230198k317666j873061r44634L70620J636800K239563J944022J148286
$$ 73230198 70912532 69039471 68094837 68465457 70102257 72341820 74285842 75434128
40138G5434128M56765J19301n2416l80864j004432j689150j889334j178590K95317
$$ 75434128 75890893 76010194 75957778 75576914 74572482 72883332 70993998 69815408 70110725
40129G0110725J927807L218948L960498L867227K487692j85333l250727n388738
$$ 70110725 72038532 75257480 79217978 83085205 85572897 85387564 82136837 76748099
40121G6748099n764928m336658j574885J716414M455995N731307N495418M674401
$$ 76748099 70983171 66646513 65071628 66788042 71244037 76975344 82470762 87145163
40113H7145163M366146M862518N429137N027197L316243J008523p87847j544981
$$ 87145163 91511309 96373827 101802964 106830161 110146404 111154927 110367080 108822099
40105A08822099j527155j123963l29772R59147K446942L542356L801899L049261
$$ 108822099 107294944 106170981 105841209 106800356 109247298 112789654 116591553 119640814
40097A19640814J303497j048205l177081m355253m562022m232077l522311k295426
$$ 119640814 120944311 119896106 116719025 112363772 107801750 103569673 100047362 97751936
40089I7751936p81081L65328Q76467J232208J881758K531189K616604K162671
$$ 97751936 96970855 97336183 98212650 99444858 101326616 103857805 106474409 108637080
40081A08637080J695222J510161J534856J792063K400415L008357K795006J429430
$$ 108637080 110332302 111842463 113377319 115169382 117569797 120578154 123373160 124802590
40073A24802590k20708p18680N98311L032544N163841N898033N032661L183149
$$ 124802590 124581882 123863202 124461513 127494057 132657898 138555931 143588592 146771741
40065A46771741J367792M88058Q36128J859017K459633J803258N0736j711055
$$ 146771741 148139533 148627591 149463719 151322736 153782369 155585627 155636363 153925308
40057A53925308k402017j891508j037043q46957j622354k778697l356305k810499
$$ 153925308 151523291 149631783 148594740 147747783 146125429 143346732 139990427 137179928
40049A37179928j558838p68516j338251k955217m333659m510690l740598k997242
$$ 137179928 135621090 134852574 133514323 130559106 126225447 121714757 117974159 114976917
40041A14976917k842821l035242l026946k442400j124622Q18544K839250M155731
$$ 114976917 112134096 109098854 106071908 103629508 102504886 103323430 106162680 110318411
40033A10318411M404947L944256L333213K676622J666900J33270j655089l116099
$$ 110318411 114723358 118667614 122000827 124677449 126344349 126477619 124822530 121706431
40025A21706431l600357k704247p04421J341164K299708J934930R90074K34766
$$ 121706431 118106074 115401827 114697406 116038570 118338278 120273208 121263282 121498048
40017A21498048l16748j078792k037496k563563k113597r48795q7787n45088k489967
$$ 121498048 121181300 120102508 118065012 115501449 113387852 112439057 112351270 111806182 109316215
40008A09316215n008514o765210p104851o544879o062388n918315n397696l762053
$$ 109316215 104307701 97542491 90437640 83892761 77830373 71912058 66514362 62752309
40000F2752309j188496J430750L373503M419100M473059L474068J889628P53688
$$ 62752309 61563813 62994563 66368066 70787166 75260225 78734293 80623921 81377609
39992H1377609O44297Q43880J32608j572167k975565l010288k107186j416203
$$ 81377609 82021906 82865786 82998394 81426227 78450662 75440374 73333188 71916985
39984G1916985j189294o20322P79019K302767K809648J993057O10525l63986n77024
$$ 71916985 70727691 70107369 70886388 73189155 75998803 77991860 78602385 78238399 77661375
39975G7661375l89402l67282p22024j156547j189482n86419N25943J857866L141223
$$ 77661375 77271973 76904691 76182667 75026120 73836638 73250219 73776162 75634028 78775251
39966G8775251M149163M655588M422000L273194J355601o20300j687844j503083
$$ 78775251 82924414 87580002 92002002 95275196 96630797 96010497 94322653 92819570
39958I2819570q11000p03384j441846k331687k717163k663566k551047k464891
$$ 92819570 92008570 91305186 89863340 87531653 84814490 82150924 79599877 77134986
39950G7134986k321192k297596k706117l466439l987164l644444k318846n25202
$$ 77134986 74813794 72516198 69810081 66343642 62356478 58712034 56393188 55867986
39942E5867986R22435J501856J383652J210126J422733J861895K009876J497538
$$ 55867986 56790421 58292277 59675929 60886055 62308788 64170683 66180559 67678097
39934F7678097M26144n70945o17591O76429K639964M024959M256484L915543L838623
$$ 67678097 68104241 67533296 66915705 67592134 70232098 74257057 78513541 82429084 86267707
39925H6267707M162485M550360M884612N183728N139352M418212L375453K848352
$$ 86267707 90430192 94980552 99865164 105048892 110188244 114606456 117981909 120830261
39917A20830261L124598L587210L507689K780456J777015R51225Q08836J818004
$$ 120830261 123954859 127542069 131049758 133830214 135607229 136558454 137367290 139185294
39909A39185294L946290O465332Q481637R545704R649383Q965982P902291P146280
$$ 139185294 143131584 149596916 158078553 167624257 177273640 186239622 194141913 201288193
39901B01288193P199049P845366Q402471Q548224Q633293R034543R393766Q764469
$$ 201288193 208487242 216332608 224735079 233283303 241916596 250951139 260344905 269109374
39893B69109374O584763L379537L47435j741668l080676m242209n366297o204098
$$ 269109374 275694137 279073674 279421109 277679441 274598765 270356556 264990259 258786161
39885B58786161o742621p283477p851623q019252p588782p092803p230232p988685
$$ 258786161 252043540 244760063 236908440 228889188 221300406 214207603 206977371 198988686
39877A98988686q702094q893685q678846q299312p634329o419598m810035l478454
$$ 198988686 190286592 181392907 172714061 164414749 156780420 150360822 145550787 142072333
39869A42072333l063513l535094m129392l932818k545137k12262K530643N154326
$$ 142072333 139008820 135473726 131344334 127411516 124866379 124654117 127184760 132339086
39861A32339086P139610Q037789P782454O861378O015935N777544O285656P328832
$$ 132339086 139478696 147516485 155298939 162160317 168176252 173953796 180239452 187568284
39853A87568284Q397182Q895767Q607491P938092P542193P758898Q526328R655520
$$ 187568284 195965466 204861233 213468724 221406816 228949009 236707907 245234235 254889755
39845B54889755J0904670J1912543J2428328J2586779J2585370J2069717J0294121
$$ 254889755 265794425 277706968 290135296 302722075 315307445 327377162 337671283
39838C37671283P093180L314649j5042k683612n140268p611919r810172j1419619
$$ 337671283 344764463 348079112 348064070 345380458 340240190 332628271 322818099 311398480
39830C11398480j2433283j2965908j3128678j3206022j3578040j4202441j4409676
$$ 311398480 298965197 285999289 272870611 259664589 246086549 231884108 217474432
39823B17474432j3528416j1659495r633502q261008p778931p889681q009473p452642
$$ 217474432 203946016 192286521 182653019 174392011 166613080 158723399 150713926 143261284
39815A43261284n764547l214987q63844K24669J9100l59986K32750J715102K842460
$$ 143261284 137496737 134281750 133417906 133642575 133661675 133301689 133534439 135249541 138092001
39806A38092001K633694J563059J068868J900030L282677L898558L381622K447288
$$ 138092001 140725695 142288754 143357622 145257652 148540329 152438887 155820509 158267797
39798A58267797J670608P06916j025112l301038n218738o277518o882049p649048
$$ 158267797 159938405 160645321 159620209 156319171 151100433 144822915 137940866 130291818
39790A30291818q527348q835226q034675o292473m351462k973386k417361k307795
$$ 130291818 121764470 112929244 104894569 98602096 94250634 91277248 88859887 86552092
39782H6552092k046836j470901j053678j357416k379497l609674m620166n294318
$$ 86552092 84505256 83034355 81980677 80623261 78243764 74634090 70013924 64719606
39774F4719606n480413m844961l355171j672784p07662q04730j587430k496015
$$ 64719606 59239193 54394232 51039061 49366277 48658615 47853885 46266455 43770440
39766D3770440l150498l215636k364798o44567J347865K903603L723085L881790
$$ 43770440 40619942 37404306 35039508 34394941 35742806 38646409 42369494 46251284
39758D6251284L505941K756616J998615J637016J736669J994725K070206J740127
$$ 46251284 49757225 52513841 54512456 56149472 57886141 59880866 61951072 63691199
39750F3691199Q11403p54967k525957l721918l901194l378508k798296k423933
$$ 63691199 64502602 63747635 61221678 57499760 53598566 50220058 47421762 44997829
39742D4997829j993422j122349L41293K217863L976489M855217M307486K500136
$$ 44997829 43004407 41882058 42223351 44441214 48417703 53272920 57580406 60080542
39734F0080542K92996j385288k199766k530584k981910l707104m194553l844991
$$ 60080542 60373538 58988250 56788484 54257900 51275990 47568886 43374333 39529342
39726C9529342k794399j899700j669915j443534r8845K377645M495661M731185
$$ 39529342 36734943 34835243 33165328 31721794 31622949 34000594 38496255 43227440
39718D3227440L151910J269626M28236P06127J376995J970404K549718L177882
$$ 43227440 46379350 47648976 48077212 48783339 50160334 52130738 54680456 57858338
39710E7858338L585975L507454L048778K475519J781073P86559l37945j008520
$$ 57858338 61444313 64951767 68000545 70476064 72257137 73043696 72705751 71697231
39702G1697231q79308l17785M7896J02339K16569N09856N94508K38110j12654
$$ 71697231 70817923 70500138 70548034 70650373 70866942 71376798 71971306 72209416 72096762
39693G2096762J40445Q85252J405190J314188R08112M31762n01338k269342m247005
$$ 72096762 72237207 73122459 74527649 75841837 76749949 77181711 76680373 74411031 70164026
39684G0164026n062310l995396j713918N82337K358042L751917M754092M998331
$$ 70164026 65101716 61106320 59392402 59974739 62332781 66084698 70838790 75837121
39676G5837121M402167L485654K797455K331383J764378J037377M00888J1137
$$ 75837121 80239288 83724942 86522397 88853780 90618158 91655535 92056423 92067560
39668I2067560k15990l63739l84167k86964k95963o74896j377610j904877j606298
$$ 92067560 91851570 91487831 91103664 90816700 90520737 89845841 88468231 86563354 84957056
39659H4957056k76902J507465K771195K911252K004388M16060j550097l437627
$$ 84957056 84680154 86187619 88958814 91870066 93874454 94290514 92740417 89302790
39651H9302790m425694l821858j816735N20864K077382K413832J776941P27655
$$ 89302790 84877096 81055238 79238503 79759367 81836749 84250581 86027522 86755177
39643H6755177j62446n29022l83352p1896k1137n08707j555445k840581l733084
$$ 86755177 86592731 86063709 85680357 85608461 85587324 85078617 83523172 80682591 76949507
39634G6949507l646074k511448q39626P59507K077148L326097M742615O204871
$$ 76949507 73303433 70791985 69952359 70711866 72789014 76115111 80857726 87062597
39626H7062597P230018P378171O685651N636470M685230L933968L316788K868049
$$ 87062597 94292615 101670786 108356437 113992907 118678137 122612105 125928893 128796942
39618A28796942K626103K474882K330018K300337K364758K099036J202439K35603
$$ 128796942 131423045 133897927 136227945 138528282 140893040 142992076 144194515 144430118
39610A44430118K71257J623206L328472M116823L592425K298069R94170J57940
$$ 144430118 144701375 146324581 149653053 153769876 157362301 159660370 160654540 160812480
39602A60812480j33258k13248n64576j234284j652291j327755n88784k82315p80243
$$ 160812480 160679222 160465974 159901398 158667114 157014823 155687068 155098284 154815969 154035726
39593A54035726j594250j988756j709923j073084n84888n92672j138628k003234
$$ 154035726 152441476 150452720 148742797 147669713 147084825 146492153 145353525 143350291
39585A43350291k896923l640251m167694m417007m267829l566943k244724n31171
$$ 143350291 140453368 136813117 132645423 128228416 123960587 120393644 118148920 117617749
39577A17617749R69545J673055J597804J334528J291705J230360P80962J46023
$$ 117617749 118587294 120260349 121858153 123192681 124484386 125714746 126495708 126641731
39569A26641731j07028J96790P45409J374728K284581L417355M032191L328152
$$ 126641731 126534703 126731493 127476902 128851630 131136211 134553566 138585757 141913909
39561A41913909J456060l45433p32182O04067K692041M123191M183681L218065
$$ 141913909 143369969 143024536 142292354 142896421 145588462 149711653 153895334 157113399
39553A57113399J987950R04112K422o27875q37402q24531j120873j984830l073654
$$ 157113399 159101349 160005461 160007883 159380008 158542606 157718075 156597202 154612372 151538718
39544A51538718l876264m223021m207302l908823l490348l323474l598333l883864
$$ 151538718 147662454 143439433 139232131 135323308 131832960 128509486 124911153 121027289
39536A21027289l499783k402074j344154r84082j099565r28650j17959R56287
$$ 121027289 117527506 115125432 113781278 112797196 111697631 110768981 110651022 111607309
39528A11607309J767610K238493K617606K924145K763699J763436L1421j992819
$$ 111607309 113374919 115613412 118231018 121155163 123918862 125682298 125713719 123720900
39520A23720900m065897o197963q035985q543786o825969l321060K71236K478817
$$ 123720900 119655003 113457040 105421055 96877269 90051300 86730240 87001476 89480293
39512H9480293L163587K957223K099974M43722j621929l053125l216070k573769
$$ 89480293 92643880 95601103 97701077 98144799 96522870 93469745 90253675 87679906
39504H7679906k048600k114725k767484l856071m917298n059916l753133j713121
$$ 87679906 85631306 83516581 80749097 76893026 71975728 66915812 63162679 61449558
39496F1449558l86396l97652r68874j047260n75492l61676r98320k239318l302871
$$ 61449558 61063162 60665510 59696636 58649376 58073884 57712208 56713888 54474570 51171699
39487E1171699l533876k844620j717554q02639m48015n94665r88726j290793j069324
$$ 51171699 47637823 44793203 43075649 42273010 41824995 41230330 40241604 38950811 37881487
39478C7881487o8126J379275K471983K659030K078208J225098M67520J4626J8443
$$ 37881487 37813361 39192636 41664619 44323649 46401857 47626955 48094475 48109101 48127544
39469D8127544L90115O95933N23066j40448j055380k066753l052730l726658l804704
$$ 48127544 48517659 49213592 49736658 49596210 48540830 46474077 43421347 39694689 35889985
39460C5889985l281211k272766p13507J429042L634367M895009M508005K703563
$$ 35889985 32608774 30336008 29622501 31051543 34685910 39580919 44088924 46792487
39452D6792487M28396j405148k456651k911985l054071k956342k612791k201740
$$ 46792487 47220883 45815735 43359084 40447099 37393028 34436686 31823895 29622155
39444B9622155j928801j585452o29477J044902K647392L113487K131114M02208
$$ 29622155 27693354 26107902 25478425 26523327 29170719 32284206 34415320 34817528
39436C4817528r65874j189826k22334J208374K088943J971618J316596Q49129
$$ 34817528 33851654 32661828 32439494 33647868 35736811 37708429 39025025 39874154
39428C9874154P85898R15070J108164J306517J239833P33551K19029L47382J030762
$$ 39874154 40660052 41575122 42683286 43989803 45229636 45963187 46182216 46529598 47560360
39419D7560360J398589Q47170l14575j374051j886449j706717r32451j53299k81889
$$ 47560360 48958949 49806119 49491544 48117493 46231044 44524327 43591876 43438577 43156688
39410D3156688j671517l650454n257425o140532o380126n800959m078116j459019
$$ 43156688 41485171 37834717 32577292 26436760 20056634 14255675 10177559 8718540
39402H718540J146738K906324L602214L469633K890069K312913K084866K119961
$$ 8718540 9865278 12771602 16373816 19843449 22733518 25046431 27131297 29251258
39394B9251258J937008J192704J6602j301894k713472m221487n444871n772934
$$ 29251258 31188266 32380970 32397572 31095678 28382206 24160719 18715848 12942914
39386A2942914n070158l934240l016673k254463j072798O95944K419806L295054
$$ 12942914 7872756 3938516 921843 -1332620 -2405418 -1709474 710332 4005386
39378D005386L129128K368856J565275R84368N67009O9310o31447j221234j144560
$$ 4005386 7134514 9503370 11068645 12053013 12620022 12689332 12057885 10836651 9692091
39369I692091l32888M97256N97661M7235n18967q39389j153331j474191j380882
$$ 9692091 9359203 9856459 10454120 10501355 9982388 9142999 7989668 6515477 5134595
39360E134595p18787K3382L37995L11620L25375M92536P17289J013345J396485
$$ 5134595 4415808 4439190 4777185 5088805 5414180 5906716 6624005 7637350 9033835
39351I033835J661926J601319J272656P54179j55112j571807k965823l423218
$$ 9033835 10695761 12297080 13569736 14323915 14168803 12596996 9631173 6207955
39343F207955k577402r94031M57686J374340J862705K056438J815575Q77864q03095
$$ 6207955 3630553 2636522 3094208 4468548 6331253 8387691 10203266 11081130 10278035
39334A0278035k867535m639210n442618m990260l606308k035714q46325K7468
$$ 10278035 7410500 2771290 -2671328 -7661588 -11267896 -13303610 -14149935 -14122467
39326a4122467R54099J785053J764934N79138q66490j279786m45648P58023J731659
$$ -14122467 -13168368 -11383315 -9618381 -9039243 -9905733 -11185519 -11631167 -10873144 -9141485
39317i141485K753919M036564N027459N182748M797750M419731L922878K922737
$$ -9141485 -6387566 -2351002 2676457 7859205 12656955 17076686 20999564 23922301
39309B3922301J769634J237146J263289Q40003o27382k476937l578626l477571
$$ 23922301 25691935 26929081 28192370 29032373 28404991 25928054 22349428 18871857
39301A8871857k473942j028536M64187J537705J759857J093410K2562p42270p39753
$$ 18871857 16397915 15369379 15833566 17371271 19131128 20224538 20247100 19504830 18765077
39292A8765077o3071P64966J273308J374986J193769P53384O8628n81105q14485
$$ 18765077 18702006 19466972 20740280 22115266 23309035 24062419 24131047 23549942 22735457
39283B2735457o31288m67836o77890j144146j465849j346428p25789K76381J386721
$$ 22735457 22104169 21636333 20958443 19814297 18348448 17002020 16276231 16552612 17939333
39274A7939333K197859K275116J354750l94619k236970l205711k830315j497244
$$ 17939333 20137192 22412308 23767058 23372439 21135469 17929758 15099443 13602199
39266A3602199K6592J265280K040549K081041J115857o06204k277480l169091
$$ 13602199 13628791 14894071 16934620 19015661 20131518 19525314 17247834 14078743
39258A4078743l126516k431358j450863m83249L31024J091130J983642K993301
$$ 14078743 10952227 8520869 7070006 6586757 6917781 8008911 9992553 12985854
39250A2985854L892840M482054M646345M252812L270115J964378O84810n09685
$$ 12985854 16878694 21360748 26007093 30259905 33530020 35494398 36179208 35669523
39242C5669523j680021k532618k604287k006297j482871j504333j727088j613598
$$ 35669523 33989502 31456884 28852597 26846300 25363429 23859096 22132008 20518410
39234B0518410j163959o70205j09186P43262J773203K522210K638333K045790
$$ 20518410 19354451 18684246 18575060 19318322 21091525 23613735 26252068 28297858
39226B8297858Q42265n99010j563178j501112o61990J20054L34475J84889K288
$$ 28297858 29140123 28541113 26977935 25476823 24814833 24934887 25269362 25454251 25456539
39217B5456539l65347j291325k655759l717591l798481k942844j734573n18114
$$ 25456539 25091192 23799867 21144108 17426517 13628036 10685192 8950619 8432505
39209H432505Q97012K556888L673990L163624R80801j544355l019836l339745
$$ 8432505 9329517 11886405 15560395 18724019 19704820 18160465 15140629 11800884
39201A1800884l400148l772559m151568m012039l298138k353136j526918r91540
$$ 11800884 8400736 4628177 476609 -3535430 -6833568 -9186704 -10713622 -11705162
39193a1705162o74585k35264O81674K028137L324150M116563M317377M043797
$$ -11705162 -12379747 -12615011 -11933337 -9905200 -6581050 -2464487 1852890 5896687
39185E896687L327821K116205M59334j355936k774104l149750k266525p73653
$$ 5896687 9224508 11340713 11800047 10444111 7670007 4520257 2253732 1480079
39177A480079K06108J49948l68629m83815j22074Q3558j58250l70520j38184O3847
$$ 1480079 1686187 1836135 1467506 983691 861617 945175 786925 416405 278221 342068
39167C42068o37538k267706l713985l883274k888365j814962j452506j593434
$$ 342068 -295470 -2563176 -6277161 -10160435 -13048800 -14863762 -16316268 -17909702
39159a7909702j601313j282877q95362m65130M60876K177840M117218N071172
$$ -17909702 -19511015 -20793892 -21689254 -22154384 -21693508 -19515668 -15398450 -10327278
39151a0327278M250722K070357k01331j573118k062732k322949k701631k846284
$$ -10327278 -6076556 -4006199 -4207530 -5780648 -7843380 -10166329 -12867960 -15714244
39143a5714244k218172p96158Q45117K044326K506060K327499J780812J139651
$$ -15714244 -17932416 -18728574 -17883457 -15839131 -13333071 -11005572 -9224760 -8085109
39135h085109O06777K86169J94324L07891N92674R80666J337665J486914J301311
$$ -8085109 -7478332 -7192163 -6997839 -6689948 -6097274 -5116608 -3778943 -2292029 -990718
39126i90718P94430J08024o05649j254005j715564j740829j079574K35969J807521
$$ -990718 -196288 -88264 -693913 -1947918 -3663482 -5404311 -6483885 -6247916 -4440395
39117d440395L126446L873048L959026L415756K394504J250898M54634K78851
$$ -4440395 -1313949 2559099 6518125 9933881 12328385 13579283 14033917 14312768
39109A4312768N67282Q65597Q33839N38549L10030L06206K85756j17070r38399
$$ 14312768 14880050 15745647 16579486 17118035 17428065 17734271 18020027 17902957 16964558
39100A6964558j824113k446518k875372l444660m271767m975600m919164l773968
$$ 16964558 15140445 12693927 9818555 6373895 2102128 -2873472 -7792636 -11566604
39092a1566604j868291N3837J447991K320072K986790L630126M167511M404163
$$ -11566604 -13434895 -13381058 -11933067 -9612995 -6626205 -2996079 1171432 5575595
39084E575595M144207L286051K048867J004203N61249M38506O988p83066j233207
$$ 5575595 9719802 13005853 15054720 16058923 16620172 17058678 17065666 16282600 15049393
39075A5049393q65049j82024r9942q33976j730192k093478j817012j217749o02307
$$ 15049393 14184344 14002320 13902378 13068402 11338210 9244732 7427720 6209971 5607664
39066E607664r4252L31778P49046J111982J201644Q70514L10211o8856J2514N77819
$$ 5607664 5513412 5845190 6594236 7706218 8907862 9778376 10088587 10019731 10032245 10610064
39056A0610064J455826K221057K242347J228866k31056j086526r49576m85336
$$ 10610064 12065890 14286947 16529294 17758160 17527104 16440578 15491002 15005666
39048A5005666m87201q86807r97152n16919J00693K43646j98577p89965r36954
$$ 15005666 14518465 13631658 12634506 12117587 12218280 12461926 12263349 11473384 10536430
39039A0536430l34665O90292J200954L14911j863537m042407m729127l536126
$$ 10536430 10201765 10892057 12093011 12407922 10544385 6501978 1772851 -1763275
39031a763275j460587J31603O96929O73513O46889O14868J36591r76574k294542
$$ -1763275 -3223862 -3092259 -2395330 -1721817 -1074928 -460060 -323469 -1300043 -3594585
39022c594585l052509k697481j240980P15669K273382K779845K298873J537772
$$ -3594585 -6647094 -9344575 -10585555 -9869886 -7596504 -4816659 -2517786 -980014
39014i80014J217566J500934K028849K385664K397535K068235J483973R05210
$$ -980014 237552 1738486 3767335 6152999 8550534 10618769 12102742 13007952
39006A3007952P89216J470283K744039L884040M184488L499956K252100R81507
$$ 13007952 13797168 15267451 18011490 21895530 26080018 29579974 31832074 32813581
38998C2813581l8785q10116j377485j666974j536168r79754k96449R235l97228
$$ 32813581 32774796 31964680 30587195 28920221 27384053 26404299 26107850 26117085 25719857
38989B5719857j368119k377233k928925k833967k181233j225786l33904J31377
$$ 25719857 24351738 21974505 19045580 16211613 14030380 12804594 12470690 12602067
38981A2602067j2308p24503j823829k954228l511342k915613j149978J107784
$$ 12602067 12589759 11865256 10041427 7087199 3575857 660244 -489734 618050
38973F18050K988697L912902L573095J902917n50518k510528k817253j508848
$$ 618050 3606747 7519649 11092744 12995661 12445143 9934615 7117362 5608514
38965E608514K21366J165937R77762O0648r20139j354689j021619l78053j91416
$$ 5608514 5829880 6995817 7973579 8034227 7114088 5759399 4737780 4359727 4168311
38956D168311o40177j097229j075641j016493j652983k784714l261950k281025
$$ 4168311 3528134 2430905 1355264 338771 -1314212 -4098926 -7360876 -9641901
38948i641901k82360J594034K614027K809020K537095K060296J513400R92906
$$ -9641901 -9924261 -8330227 -5716200 -2907180 -370085 1690211 3203611 4196517
38940D196517N65052L00055L33533P44343J282736J387060P13998l53012r65456
$$ 4196517 4761569 5061624 5395157 6139500 7422236 8809296 9523294 9170282 8204826
38931H204826o92997K8471M63354L92561J41490J258L4872M16219J437916K915573
$$ 8204826 7511829 7540300 8003654 8396215 8537705 8538963 8573835 8990054 10427970 13343543
38921A3343543L932520L567829J784441o34950k869549m471450n142768m606051
$$ 13343543 17276063 20843892 22628333 21993383 19123834 14652384 9509616 4903565
38913D903565k931519p74523R83969J890999K199886K519589L167726L814284
$$ 4903565 1972046 1197523 2181492 4072491 6272377 8791966 11959692 15773976
38905A5773976L779989K734644J074511m17848j223732j396019j393053j715860
$$ 15773976 19553965 22288609 23363120 22945272 21721540 20325521 18932468 17216608
38897A7216608k534957l479506l914027l632161l159505l114797l381541l258185
$$ 17216608 14681651 11202145 7288118 3655957 496452 -2618345 -5999886 -9258071
38889i258071k401522j220706k37110N55486J458659K490201L339126L748297
$$ -9258071 -11659593 -12880299 -13117409 -12561923 -11103264 -8613063 -5273937 -1525640
38881a525640L685046L223257K479490J632476Q68682L53117K80293P28984J328498
$$ -1525640 2159406 5382663 7862153 9494629 10363311 10716428 10996721 11725705 13054203
38872A3054203J362363N27497n93427j183838j184384j195154j450730j462995
$$ 13054203 14416566 14944063 14350636 13166798 11982414 10787260 9336530 7873535
38864G873535q79096j96330k14924j038310k006785k475522k284287j551068m61094
$$ 7873535 6994439 6798109 6583185 5544875 3538090 1062568 -1221719 -2772787 -3233881
38855c233881O06149J100169P69224K8837l78185j50958K54953J62141n57797
$$ -3233881 -2627732 -1527563 -758339 -729502 -1107687 -1258645 -1003692 -841551 -1399348
38846a399348j406646j960487k384840k999479l517868l212037j939807n13247
$$ -1399348 -2805994 -4766481 -7151321 -10150800 -13668668 -16880705 -18820512 -19333759
38838a9333759L02512P54644J518504K381275K246862O01034j632110l041187
$$ -19333759 -19031247 -18276603 -16758099 -14376824 -12129962 -11528928 -13161038 -16202225
38830a6202225l141104k502862j841070j439354j270760j149323p22965K87881
$$ -16202225 -19343329 -21846191 -23687261 -25126615 -26397375 -27546698 -28269663 -27981782
38822b7981782J717767L059852M010307M693255N292945N716513N778393N562607
$$ -27981782 -26264015 -23204163 -19193856 -14500601 -9207656 -3491143 2287250 7849857
38814G849857N404083N492198N551583M979129L425287J328471k54174n44694
$$ 7849857 13253940 18746138 24297721 29276850 32702137 34030608 33776434 33231740
38806C3231740K32506J111371J249827M07732j168666k903036l982542l802220
$$ 33231740 33464246 34575617 35825444 36233176 35064510 32161474 28178932 24376712
38798B4376712k540217j032629L4738N40561N26494j01220j194100k155033k583497
$$ 24376712 21836495 20803866 20838604 21379165 21905659 21804439 20610339 18455306 15871809
38789A5871809k853248l577762m703226n618557n992059n916614n293344l765257
$$ 15871809 13018561 9440799 4737573 -880984 -6873043 -12789657 -18083001 -21848258
38781b1848258j465993P31616K043609K458013K313874J644515M04609r29232
$$ -21848258 -23314251 -22582635 -20539026 -18081013 -15767139 -14122624 -13718015 -14647247
38773a4647247j544042j099114k0147J021435J666296J914113J868772J524888
$$ -14647247 -16191289 -17290403 -17310550 -16289115 -14622819 -12708706 -10839934 -9315046
38765i315046P57393l85184j325304j194325K53560K154826L381108L798165M232599
$$ -9315046 -8557653 -8942837 -10268141 -11462466 -11208906 -9054080 -5672972 -1874807 2357792
38756B357792N163138N953647N610138L906789J471520r18129k741003l651803
$$ 2357792 7520930 13474577 19084715 22991504 24463024 23544895 20803892 17152089
38748A7152089l485343k440299j025899K63095J156489J591933J664606J538083
$$ 17152089 13666746 11226447 10200548 10463643 11620132 13212065 14876671 16414754
38740A6414754J223496M89879p99518k258035l096400k781053j503087K3516J140724
$$ 16414754 17638250 18128129 17328611 15070576 11974176 9193123 7690036 7713552 8854276
38731H854276J629963J668240J527821J349634J190843J174958J382972J537161
$$ 8854276 10484239 12152479 13680300 15029934 16220777 17395735 18778707 20315868
38723B0315868J020238n73788k976023n438540p244589p904596p156479n196812
$$ 20315868 21336106 20762318 17786295 12347755 5103166 -2801430 -9957909 -15154721
38715a5154721k835317r90596O8654P35417J349070J814213J946006J781818J415024
$$ -15154721 -17990038 -18980634 -18911980 -18176563 -16827493 -15013280 -13067274 -11285456 -9870432
38706i870432Q73714L01442j19021n88275j591069l070707m115963l908311k693911
$$ -9870432 -8996718 -8695276 -8814297 -9402572 -10993641 -14064348 -18180311 -22088622 -24782533
38697b4782533j359597k81522Q74311K319024L659181M315024M043306L026286
$$ -24782533 -26142130 -26423652 -25549341 -23230317 -19571136 -15256112 -11212806 -8186520
38689h186520J792751J030934J071044J499280J633839J381135J204089J246396
$$ -8186520 -6393769 -5362835 -4291791 -2792511 -1158672 222463 1426552 2672948
38681B672948J062435M17757j91328k05492J98750M09141K07902j42113m65629
$$ 2672948 3735383 4153140 3961812 3756320 3955070 4364211 4572113 4430000 3964371
38672C964371q51026j266775j403425j016239j93158Q06264J810256K750992L528335
$$ 3964371 3113345 1846570 443145 -573094 -766252 40012 1850268 4601260 8129595
38663H129595L940979L766728K963413J821246Q28865L10541K29327L34408L70844
$$ 8129595 12070574 15837302 18800715 20621961 21450826 21761367 21990694 22325102 22695946
38654B2695946J41581m19152j131397j711583k130387k617930l186272l415357
$$ 22695946 22837527 22418375 21286978 19575395 17445008 14827078 11640806 8225449
38646H225449k961377k075956j339234j036427j099625j511826k345586l361669
$$ 8225449 5264072 3188116 1848882 812455 -287170 -1798996 -4144582 -7506251
38638g506251l904695l352464j568888J040346L728029N723206O635381O625551
$$ -7506251 -11410946 -14763410 -16332298 -15291952 -11563923 -5840717 794664 7420215
38630G420215O061173N072348L633639J950780M30831p10803j494839j852064
$$ 7420215 13481388 18553736 22187375 24138155 24568986 23858183 22363344 20511280
38622B0511280j641411j051558n63152l33007J6837P66719J591476J969492J806068
$$ 20511280 18869869 17818311 17255159 16922152 16938989 17705708 19297184 21266676 23072744
38613B3072744J308493M86207p95870k368530l767494m690807n124682n015840
$$ 23072744 24381237 24867444 24071574 21703044 17935550 13244743 8120061 3104221
38605C104221m158935k497028k86398K084700M184169N431786N320135L997762
$$ 3104221 -1054714 -3551742 -3838140 -1753440 2430729 7862515 13182650 17180412
38597A7180412K371221J313104Q86775N94086K12892r714K0009j13768q09710
$$ 17180412 19551633 20864737 21751512 22345598 22558490 22548776 22568785 22455017 21645307
38588B1645307j811316k399056k138287j198335M190J180669K143825K711247
$$ 21645307 19833991 17434935 15296648 14098313 14102503 15283172 17426997 20138244
38580B0138244K842531K701173K351489J512559p2958j989447l185756k923005
$$ 20138244 22980775 25681948 28033437 29545996 29473038 27483591 24297835 21374830
38572B1374830j605775m47888k77193q12569j159297q36776j52161L23867L56985
$$ 21374830 19769055 19321167 19043974 18231405 17072108 16235332 16083171 16407038 16764023
38563A6764023M7516m97433j223464j961463k484595k746476k819844k566091
$$ 16764023 16811539 16314106 15090642 13129179 10644584 7898108 5078264 2512173
38555B512173j666380j45524J382533K250273K404614K339558K468386K754153
$$ 2512173 845793 700269 2082802 4333075 6737689 9077247 11545633 14299786
38547A4299786K847560K378854J238618j68407j058120r76704l28240J16053J40647
$$ 14299786 17147346 19526200 20764818 20596411 19538291 18561587 18233347 18349400 18490047
38538A8490047O9069j36911j072008k815568m216474l926302k015420J7628R01385
$$ 18490047 18559116 18422205 17350197 14534629 10318155 6391853 4376433 4394061 5295446
38529E295446P86476O45134R23161J160723P71523j89459j097287j358932q11641
$$ 5295446 6081922 6727056 7650217 8810940 9582463 9393004 8295717 6936785 6125144
38520F125144L35373J738828L068790M078411M654029M760940M308079L214589
$$ 6125144 6460517 8199345 11268135 15346546 20000575 24761515 29069594 32284183
38512C2284183J747246O09268L48625O51308N41172n73777k282481l718829m445242
$$ 32284183 34031429 34640697 34989322 35640630 36181802 35608025 33325544 29606715 25161473
38503B5161473m555874m167415l235925j882288n69236J91382K04609l43185j058238
$$ 25161473 20605599 16438184 13202259 11319971 10750735 10942117 11146726 10803541 9745303
38494I745303j576000j754908j678891j451467j072808n69309n7218M92121J342507
$$ 9745303 8169303 6414395 4735504 3284037 2211229 1641920 1584702 2076823 3419330
38485C419330K523483L383903L059285J502727k88858j276463j378529j289916
$$ 3419330 5942813 9326716 12386001 13888728 13599870 12323407 10944878 9654962
38477I654962j534915j976299k146914j767171r09437J22901R73795J414397J469973
$$ 9654962 8120047 6143748 3996834 2229663 1320226 1443127 2416922 3831319 5301292
38468E301292J354834J217737R50387L11055p16748j749543k318474k372960k291473
$$ 5301292 6656126 7873863 8824250 9135305 8418557 6669014 4350540 1977580 -313893
38459c13893k269028j887613n98226J390877L019829L303808K173400L14794j555261
$$ -313893 -2582921 -4470534 -5068760 -3677883 -658054 2645754 4819154 5133948 3578687
38450C578687l014558l736703l398792j963483R9862K052441L381956M066712
$$ 3578687 564129 -3172574 -6571366 -8534849 -8434987 -6382546 -3000590 1066122
38442A066122M398605M584855M507249L838796K403587M84309j176872j771889
$$ 1066122 5464727 10049582 14556831 18395627 20799214 21283523 20106651 18334762
38434A8334762j043544L62618J292174J028594j41265j375489k169676k620632
$$ 18334762 17291218 17653836 18946010 19974604 19833339 18457850 16288174 13667542
38426A3667542k930372l015147k718267k152277j648803j483759j715902k118110
$$ 13667542 10737170 7722023 5003756 2851479 1202676 -281083 -1996985 -4115095
38418d115095k207977j613252n80318J20974N2324k99006n5178J021703K284207
$$ -4115095 -6323072 -7936324 -8516642 -8395668 -8343344 -8642350 -8697528 -7675825 -5391618
38409e391618K895318K506905J332074j06622j242150j771340j864265j950873
$$ -5391618 -2496300 10605 1342679 1236057 -6093 -1777433 -3641698 -5592571
38401e592571k234851k504182k391077j677880m21447R84658J909611J968491
$$ -5592571 -7827422 -10331604 -12722681 -14400561 -14822008 -13837350 -11927739 -9959248
38393i959248J480355J151970J207873J177398P50477M76323J168418K737475
$$ -9959248 -8478893 -7326923 -6119050 -4941652 -4191175 -3714852 -2546434 191041
38385A91041M058869M095736K898029J421583N94154O53983J166830J470725J191360
$$ 191041 4249910 8345646 11243675 12665258 13259412 13913395 15080225 16550950 17742310
38376A7742310N31362R4097L17427J023721J566345J458864Q40622K74592P8589
$$ 17742310 18273672 18367769 18685196 19708917 21275262 22734126 23574748 23849340 23927929
38367B3927929o7339p43505k013812l149873l245420k084160l31491J070780J565376
$$ 23927929 23860590 23117085 21103273 17953400 14707980 12623820 12292329 13363109 14928485
38358A4928485J094421j34969j735786l073655l458915k666709j258756k39783
$$ 14928485 16022906 15887937 14152151 11078496 7619581 4952872 3694116 3454333
38350C454333k81838j222708k271571k712783k497736k190764k261867k429826
$$ 3454333 3172495 1949787 -321784 -3034567 -5532303 -7723067 -9984934 -12414760
38342a2414760j906447m30749J173634J801789J310421N40007J19418j94532p76912
$$ -12414760 -14321207 -14751956 -13578322 -11776533 -10466112 -9926105 -9806687 -10001219 -10778131
38333a0778131j319240j265311o89221j30268K39615O32111R19906O35479j90322
$$ -10778131 -12097371 -13362682 -14051903 -14182171 -13942556 -13310445 -12390539 -11755060 -11945382
38324a1945382q99828j201791j624163k507803l111786k389141l77735J797293
$$ -11945382 -12845210 -14047001 -15671164 -18178967 -21290753 -23679894 -24057629 -22260336
38316b2260336L176630L687743L712620L501568L078628K297765R38274q66085
$$ -22260336 -19083706 -15395963 -11683343 -8181775 -5103147 -2805382 -1867108 -2733193
38308b733193k269955k263233p74362J084712K033147J632886K60463j459828
$$ -2733193 -5003148 -7266381 -8040743 -6956031 -4922884 -3289998 -3029535 -4489363
38300d489363k884073l340316k391646k04805K495764M874515O372650O789880
$$ -4489363 -7373436 -10713752 -13105398 -13310203 -10814439 -5939924 432726 7222606
38292G222606O164855M655915K559504L84803j306309k296002k798931k963483
$$ 7222606 13387461 18043376 20602880 20987683 19681374 17385372 14586441 11622958
38284A1622958k499169j165777N02808J461222J202643J40506j105523k328144
$$ 11622958 9123789 7958012 8460820 9922042 11124685 11265191 10159668 7831524
38276G831524l510128m511310n249778n719685n500687l782259m64134L078050
$$ 7831524 4321396 -189914 -5439692 -11159377 -16660064 -20442323 -20906457 -17828407
38268a7828407M979963M612834K918596J208719J82321K3863O98448J795364K535017
$$ -17828407 -12848444 -8235610 -5317014 -4108295 -3925974 -3902111 -3203663 -1408299 1126718
38259A126718K393303J608260Q04338K08224m85625j426196k041717j498096J67085
$$ 1126718 3520021 5128281 5932619 6140843 5655218 4229022 2187305 689209 856294
38250H56294J658834J593733M0986j541823k011666j663849j396978j368669j097117
$$ 856294 2515128 4108861 4149847 2608024 596358 -1067491 -2464469 -3833138 -4930255
38241d930255m98905m2049J3484k03314p32971j767440k942486l393349k825693
$$ -4930255 -5429160 -5471209 -5457725 -5661039 -6394010 -8161450 -11103936 -14497285 -17322978
38232a7322978j905905j227067m99227P21410K010563K467115J910558J101459
$$ -17322978 -19228883 -20455950 -20955177 -20233767 -18223204 -15756089 -13845531 -12744072
38224a2744072Q42132J314545K236646L204568L830353L904003L520531K848692
$$ -12744072 -11901940 -10587395 -8350749 -5146181 -1315828 2588175 6108706 8957398
38216H957398J818846L16015j349214k522995k904958k933748l281924m032953
$$ 8957398 10776244 11092259 9743045 7220050 4315092 1381344 -1900580 -5933533
38208e933533m498203l904572k255192m28080O86790J089008J511208K397648
$$ -5933533 -10431736 -14336308 -16591500 -17019580 -16332790 -15243782 -13732574 -11334926
38200a1334926L373136L835780L686287L164164K281094Q90294p91927k196595
$$ -11334926 -7961790 -4126010 -439723 2724441 5005535 5895829 5103902 2907307
38192B907307k986339l290002l279097k805726j614254K14920K079320L048125
$$ 2907307 -79032 -3369034 -6648131 -9453857 -11068111 -10853191 -8773871 -5725746
38184e725746K420744M28725j625713k289560j195410P46395K368211L185712
$$ -5725746 -3305002 -2876277 -4501990 -6791550 -7986960 -7240565 -4872354 -1686642
38176a686642L301791K798649J575069l29766k520975m379417n332280n109352
$$ -1686642 1615149 4413798 5988867 5659101 3138126 -1241291 -6573571 -11682923
38168a1682923l926070k419274j248921o46364l19242K03754J100195K060300
$$ -11682923 -15608993 -18028267 -19277188 -19923552 -20242794 -20039040 -18938845 -16878545
38160a6878545K548222K294559J557170R20705Q82421J584563K760276L832911
$$ -16878545 -14330323 -12035764 -10478594 -9557889 -8675468 -7090905 -4330629 -497718
38152d97718M223310L744320K628544J074440j003314l469469n395767n543296
$$ -497718 3725592 7469912 10098456 11172896 10169582 6700113 1304346 -4238950
38144d238950l636247q48196J226048J909707J612634R82740L28481j48837k8565
$$ -4238950 -7875197 -8723393 -7497345 -5587638 -3975004 -2992264 -2663783 -2812620 -2841185
38135b841185J042835K775522M228027M580372L897358K977719K407540J929018
$$ -2841185 -1798350 977172 5205199 9785571 13682929 16660648 19068188 20997206
38127B0997206R00296p28208k146464k451914j525779o3590J130911J722394J753668
$$ 20997206 21897502 21169294 19022830 16570916 15045137 14981547 16112458 17834852 19588520
38118A9588520J217791l929j703166l124158l578407l291431l217993l802650
$$ 19588520 20806311 20802382 19099216 15975058 12396651 9105220 5887227 2084577
38110B084577m304423l742453k241788r15354m91813o02919n13867n8582L83072
$$ 2084577 -2219846 -5962299 -8204087 -9119441 -9611254 -10214173 -10728040 -10786622 -10403550
38101a0403550M70500J89000k15179l74450p7210M18181N43492M6373p50823j438724
$$ -10403550 -9933050 -9744050 -9959229 -10333679 -10410889 -9992708 -9449216 -9402843 -10153666 -11592390
38091a1592390j977264k462411k745835k616934k160880j578928p64771N88204
$$ -11592390 -13569654 -16032065 -18777900 -21394834 -23555714 -25134642 -25899413 -25311209
38083b5311209K463152M353621N611007N787154M761246K848070P91385o37519
$$ -25311209 -22848057 -18494436 -12883429 -7096275 -2335029 513041 1304426 666907
38075F66907j169849j098635q58415o92669o54834o72446n47688p7075P28431
$$ 666907 -502942 -1601577 -2459992 -3152661 -3807495 -4479941 -5027629 -5104704 -4376273
38066d376273J600559K187763K216054J582178M80561n72352j030875p23004Q0601
$$ -4376273 -2775714 -587951 1628103 3210281 3690842 3118490 2087615 1364611 1445212
38057A445212R57480J599479J862675J737151J312585O98350k0867p25882j278397
$$ 1445212 2402692 4002171 5864846 7601997 8914582 9612932 9592065 8866183 7587786
38048G587786j708240k259272l062608l832054m062980l488814k213915n41771
$$ 7587786 5879546 3620274 557666 -3274388 -7337368 -10826182 -13040097 -13581868
38040a3581868J091434K153268K353522J963331J501678J110543N94214R7747
$$ -13581868 -12490434 -10337166 -7983644 -6020313 -4518635 -3408092 -2813878 -2716131
38032b716131K42963J299075K587239L138026K787733K234339K059883K079477
$$ -2716131 -2473168 -1174093 1413146 4551172 7338905 9573244 11633127 13712604
38024A3712604J747493R14573j3847n52260o17154n62687q02314j368891j819465
$$ 13712604 15460097 16374670 16360823 15808563 15191409 14628722 13826408 12457517 10638052
38015A0638052j621368o79493N41191J454944J899529K192438K638982L062279
$$ 10638052 9016684 8337191 8878382 10333326 12232855 14425293 17064275 20126554
38007B0126554K921086J895141K44437j468478k894287l987537m645453m509862
$$ 20126554 23047640 24942781 25187218 23718740 20824453 16836916 12191463 7681601
37999G681601l312454j382772L40171R36442K31248j067060j964261j944047j191412
$$ 7681601 4369147 2986375 3326546 4262988 4494236 3427176 1462915 -481132 -1672544
37990a672544k17230N32270P23612J59298r48957j892570k026324j455877q90202
$$ -1672544 -1889774 -1357504 -633892 -474594 -1423551 -3316121 -5342445 -6798322 -7688524
37981g688524p47178o82394j27001R83394K232520L249062L895938M040662L507477
$$ -7688524 -8435702 -9118096 -9245097 -8261703 -6029183 -2780121 1115817 5156479 8663956
37972H663956K370833J079016J25847l26801m25161l18939M327O14365J470394
$$ 8663956 11034789 12113805 12239652 11912851 11487690 11168751 11173078 11787443 13257837
37963A3257837K369301K992207K995165K165788O18599j153953k534507l195869
$$ 13257837 15627138 18619345 21614510 23780298 24398897 23244944 20710437 17514568
37955A7514568l298514l271770l399795l590784l483430k775422j550562l49853
$$ 17514568 14216054 10944284 7544489 3953705 470275 -2305147 -3855709 -4205562
37947d205562J71481k06449j044505j627763j581170j114035p52641r00301j556526
$$ -4205562 -4034081 -4240530 -5285035 -6912798 -8493968 -9608003 -10360644 -11260945 -12817471
37938a2817471k322591k700660k481161j816891r02979K26244J419544K160835
$$ -12817471 -15140062 -17840722 -20321883 -22138774 -23041753 -22815509 -21395965 -19235130
37930a9235130K013696J322632J055258J744412K871615L534959L476647L114688
$$ -19235130 -17221434 -15898802 -14843544 -13099132 -10227517 -6692558 -3215911 -101223
37922a01223K716888K008539P28507p42602j576221j244031P2634J732730L094704
$$ -101223 2615665 4624204 5352711 4610109 3033888 1789857 1862491 3595221 6689925
37913F689925L741954L531364K660518J625568Q61309L21643m48244j727801l224384
$$ 6689925 10431879 13963243 16623761 18249329 19110638 19432281 18984037 17256236 14031852
37904A4031852m357568m807852m637244l993760k932643j524553K9027J401203
$$ 14031852 9674284 4866432 229188 -3764572 -6697215 -8221768 -8192741 -6791538
37896f791538K187850K098118J321047N84377N03789Q42520P12461m22662k199449
$$ -6791538 -4603688 -2505570 -1184523 -600146 -96357 746163 1458624 1035962 -1163487
37887a163487l825033m743524m744560l847594k403699j056161k52140J18359
$$ -1163487 -4988520 -9732044 -14476604 -18324198 -20727897 -21784058 -22036198 -21917839
37879b1917839M15333P64923J090808J399076J719176J908953J835500J648894
$$ -21917839 -21502506 -20737583 -19646775 -18247699 -16528523 -14619570 -12784070 -11135176
37871a1135176J573405J518705J219029O91535K17403r9069l96066o72903p27620
$$ -11135176 -9561771 -8043066 -6824037 -6132502 -5915099 -6014168 -6410234 -7083137 -7810757
37862g810757n73723n70001r61460j552390k002379k214217k244122k029018j437890
$$ -7810757 -8384480 -8954481 -9915941 -11468331 -13470710 -15684927 -17929049 -19958067 -21395957
37853b1395957n21912M30667J055347J113684O80480J73291L7271L64011R90942
$$ -21395957 -21917869 -21487202 -20431855 -19318171 -18637691 -18464400 -18427129 -18063118 -17072176
37844a7072176J921971L258942M592861M932495L667339J393720o12607j623085
$$ -17072176 -15150205 -11891263 -7298402 -2365907 1301432 2695152 2082545 459460
37836D59460j800764j494786p50831L78987J525406K281265K517209K208834J252039
$$ 459460 -1341304 -2836090 -3586921 -3207934 -1682528 598737 3115946 5324780 6576819
37827F576819k20991j551985k029034j697625j388268j799008k730124l351230
$$ 6576819 6355828 4803843 2774809 1077184 -311084 -2110092 -4840216 -8191446
37819h191446l083083k057013p90750L54943J291084J912402J960459J338466
$$ -8191446 -11274529 -13331542 -14122292 -13767349 -12476265 -10563863 -8603404 -7264938
37811g264938M65159N0974L95523J046144J294283Q95229J29693p02628j534900
$$ -7264938 -6799779 -6748805 -6353282 -5307138 -4012855 -3117626 -2987933 -3690561 -5225461
37802e225461k300095k825476l116288l417846l714234l410769j917904N03614
$$ -5225461 -7525556 -10351032 -13467320 -16885166 -20599400 -24010169 -25928073 -25424459
37794b5424459K834756M264934M776784M756477M408921L747609K859137J883346
$$ -25424459 -22589703 -18324769 -13547985 -8791508 -4382587 -634978 2224159 4107505
37786D107505Q75154p4553o98114p77308m45403m2631K69737N12281N60097J57259
$$ 4107505 4982659 4908106 4209992 3432684 2987281 2944650 3214387 3726668 4286765 4444024
37776D444024o10728j122429p59369M09162J640491K213156K018370J498201J131706
$$ 4444024 3833296 2710867 1951498 2360660 4001151 6214307 8232677 9730878 10862584
37767A0862584J023852R01223M08071n72281j767367k617226k625638j790124
$$ 10862584 11886436 12787659 13195730 12623449 10856082 8238856 5613218 3823094
37759C823094p33548k73836p17830j573284k019671j675078q91481l38597l48451
$$ 3823094 3089546 2815710 2097880 524596 -1495075 -3170153 -4061634 -4400231 -4748682
37750d748682o66390q16839o73998n89051q98781j414419j570422j048282l9568
$$ -4748682 -5415072 -6231911 -6905909 -7494960 -8393741 -9808160 -11378582 -12426864 -12466432
37741a2466432J128230K342348L520068M324250M378817L731348K882973K338023
$$ -12466432 -11338202 -8995854 -5475786 -1151536 3227281 6958629 9841602 12179625
37733A2179625K220262K256809J999494J142183k06153j591760k654567l374007
$$ 12179625 14399887 16656696 18656190 19798373 19592220 18000460 15345893 11971886
37725A1971886l753639l511237k434084r13296L28252J090666J864657K988456
$$ 11971886 8218247 4707010 2272926 1359630 1687882 2778548 4643205 7631661
37717G631661M002866M112316L054618J258151o82612k406901l754805m598118
$$ 7631661 11634527 15746843 18801461 20059612 19377000 16970099 13215294 8617176
37709H617176m743093l941336k122551K46770K187323K856534K220641R87766
$$ 8617176 3874083 -67253 -2189804 -1943034 244289 3100823 5321464 6309230
37701F309230q8124p54086j225327j788083k403516k572021j659006M43795K967174
$$ 6309230 6221106 5467020 4241693 2453610 50094 -2521927 -4180933 -3737138 -769964
37692g69964M741107N093551M236988K868333J619031R02010R38459J575219K115483
$$ -769964 3971143 9064694 13301682 16170015 17789046 18691056 19629515 21204734 23320217
37683B3320217J697694J31651j678884k384324j421381M09436J634478J349025
$$ 23320217 25017911 25149562 23470678 21086354 19664973 20074409 21708887 23057912
37675B3057912j77390j895155k783298k438836j245750q5582L30882l17n66683
$$ 23057912 22880522 20985367 18202069 15763233 14517483 14431901 14762783 14762466 14195783
37666A4195783j027234j467057j930098k068134j529324m59548P05944J779808
$$ 14195783 13168549 11701492 9771394 7703260 6173936 5714388 6420332 8200140
37658H200140K776002L441055L335590K515242J720456J597434J931053J900667
$$ 8200140 10976142 14417197 17752787 20268029 21988485 23585919 25516972 27417639
37650B7417639R93259n08495j834683k367033k102199j667871j757776k325761
$$ 27417639 28410898 27902403 26067720 23700687 21598488 19930617 18172841 15847080
37642A5847080k450313j304129P67892K478667K969237K572742K019915J318231
$$ 15847080 13396767 12092638 12860530 15339197 18308434 20881176 22901091 24219322
37634B4219322n3626j998200l507455l761117l077660k400794k114189j811478
$$ 24219322 24165696 22167496 18660041 14898924 11821264 9420470 7306281 5494803
37626E494803j129133l13699J48935Q4145l99780j193051k131583k809931k778705
$$ 5494803 4365670 4051971 4200906 4285051 3885271 2692220 560637 -2249294 -5027999
37617e027999j983531q53238P7578N52014O42897N48653L28149k36460j416344
$$ -5027999 -7011530 -7864768 -7787190 -7235176 -6592279 -6043626 -5715477 -5951937 -7368281
37608g368281k992910m000515l337853q59125K227229M227814M300291K981835
$$ -7368281 -10361191 -14361706 -17699559 -18558684 -16331455 -12103641 -7803350 -4821515
37600d821515J551922R68547J267528J727873J561674O24421m26564p66880k89961
$$ -4821515 -3269593 -2301046 -1033518 694355 2256029 2880450 2453886 1687006 1397045
37591A397045K50518J10995n53138q91544l81807O61988J648893K416516L137079
$$ 1397045 1647563 1758558 1205420 313876 -67931 594057 2242950 4659466 7796545
37582G796545L788649M096269L935054L473409K889275K170931J213105p3844
$$ 7796545 11585194 15681463 19616517 23089926 25979201 28150132 29363237 29289393
37574B9289393j695804l366931m437243m399180l533443k700976k362394k130594
$$ 29289393 27593589 24226658 19789415 15390235 11856792 9155816 6793422 4662828
37566D662828j451630l64255O79572J414459J817570J824205J445002J072492
$$ 4662828 3211198 2846943 3526515 4940974 6758544 8582749 10027751 11100243
37558A1100243J232987J968905K734715K925040K314046J086772k45383j041885
$$ 11100243 12333230 14302135 17036850 19961890 22275936 23362708 23117325 22075440
37550B2075440j065921q63596j186126j876788j736922J75203L311267N958254
$$ 22075440 21009519 20145923 18959797 17083009 15346087 15521290 18832557 24790811
37542B4790811O665825N191456K319011q06734l176818m240035m131168l566445
$$ 24790811 31456636 36648092 38967103 38160369 34983551 30743516 26612348 23045903
37534B3045903l280467l417348l481449k928989j775386n55591K53956N90889
$$ 23045903 19765436 16348088 12866639 9937650 8162264 7606673 7860629 8451518
37526H451518N59810J14492p37341j544391j614157p39904M73626J138356Q27436
$$ 8451518 9011328 9125820 8388479 6844088 5229931 4490027 4963653 6102009 6929445
37517F929445k38213j525006k527705k894516k463176j298918L06611J930257
$$ 6929445 6691232 5166226 2638521 -255995 -2719171 -4018089 -3711478 -1781221
37509a781221L214681M040838M436590M259283L149151J026767j472276l377086
$$ -1781221 1433460 5474298 9910888 14170171 17319322 18346089 16873813 13496727
37501A3496727m207034m142314l412498j988290q3485J484329J901360J207446
$$ 13496727 9289693 5147379 1734881 -253409 -336894 1147435 3048795 4256241
37493D256241K26985k44298P2308J062710K378406L458266L819732L542939L262907
$$ 4256241 4483226 4238928 4311236 5373946 7752352 11210618 15030350 18573289 21836196
37484B1836196L510239M142952M485198L932408K432640N40913r76863j765499
$$ 21836196 25346435 29489387 33974585 37906993 40339633 40880546 39903683 38138184
37476C8138184k158012k709204l495482m119626m398800m666153n195148n649722
$$ 38138184 35980172 33270968 29775486 25655860 21257060 16590907 11395759 5746037
37468E746037n443814m466079l089977j567925J62599K009135L450835L973704
$$ 5746037 302223 -4163856 -7253833 -8821758 -8659159 -6650024 -3199189 774515
37460G74515L593635K763278J911961J270753J014882J275814J929508K525475
$$ 774515 4368150 7131428 9043389 10314142 11329024 12604838 14534346 17059821
37452A7059821K561747J879344Q31795N8746m8809K22475J12512q00487k035517
$$ 17059821 19621568 21500912 22332707 22391453 22342644 22565119 22677631 21877144 19841627
37443A9841627k667691k377869j820190j820554k387782k724866k149160p89951
$$ 19841627 17173936 14796067 12975877 11155323 8767541 6042675 3893515 3103564
37435C103564O48759J630619K163624K520484K774702K731471K265291J552056
$$ 3103564 3752323 5382942 7546566 10067050 12841752 15573223 17838514 19390570
37427A9390570Q63889K42059m55201j218842j812275k074225k103564k039213
$$ 19390570 20254459 20496518 20041317 18822475 17010200 14935975 12832411 10793198
37419A0793198j823295j325043n71292K94499J163300J904073K274614K112605
$$ 10793198 8969903 7644860 7073568 7368067 8531367 10435440 12710054 14822659
37411A4822659J573022R82368M89954M2234l62097o34691p92497r19012r13247
$$ 14822659 16395681 17378049 17868003 17910237 17548140 16913449 16120952 15201940 14288693
37402A4288693n97435j90208l32025j340493k612159l088742k309890q03112N22867
$$ 14288693 13691258 13501050 13169025 11828532 9216373 6127631 3817741 3014629 3537496
37393C537496J124913R78131L44399l44258n43856O1692J126348J775488J447575
$$ 3537496 4662409 5640540 5984939 5640681 5096825 5158517 6284865 8060353 9507928
37384I507928N74859J95288Q37961J989494K732149K671489K077531J369003P78226
$$ 9507928 10082787 10278075 11116036 13105530 15837679 18509168 20586699 21955702 22733928
37375B2733928L89424J18038l74173j397180k726664l609759l429068k255600
$$ 22733928 23123352 23241390 22867217 21470037 18743373 15133614 11704546 9448946
37367I448946p31179M01817O61183O5617p82724j089056n97838J48891M39501
$$ 9448946 8717767 9119584 9780767 9846384 9063660 7974604 7376766 7525657 7965158
$$ [...]
##END NTUPLES=NMR SPECTRUM
##END=
