##TITLE=31Pdec_10P164_1
 CDCl3, 24 sc
 10.1.2020
##JCAMPDX= 6.0         $$ Bruker NMR JCAMP-DX V2.0
##DATA TYPE= NMR SPECTRUM
##DATA CLASS= NTUPLES
##ORIGIN= UXNMR, Bruker Analytische Messtechnik GmbH
##OWNER= root
$$ XWIN-NMR		Version 3.5
$$ Fri Jan 10 14:51:19 2020 Russian Standard Time (UT+4h)  she@DPX200
##.OBSERVE FREQUENCY= 81.013821
##.OBSERVE NUCLEUS= ^31P
##.ACQUISITION MODE= SIMULTANEOUS
##.ACQUISITION SCHEME= undefined
##.AVERAGES= 24
##.DIGITISER RES= 17
##SPECTROMETER/DATA SYSTEM= spect
##.PULSE SEQUENCE= zgpg30
##.SOLVENT NAME= D2O
##.SHIFT REFERENCE= (INTERNAL, D2O, 0, 182.463)
##AUDIT TRAIL= $$ (NUMBER, WHEN, WHO, WHERE, WHAT)
$$ ##TITLE= Audit trail, XWIN-NMR		Version 3.5
$$ ##JCAMPDX= 5.01
$$ ##ORIGIN= Bruker BioSpin GmbH
$$ ##OWNER= she
$$ F:/spectra/data/she/nmr/P31/1/pdata/1/auditp.txt
$$ ##AUDIT TRAIL=  $$ (NUMBER, WHEN, WHO, WHERE, WHAT)
(   1,<2020-01-10 14:50:18.89 +0400>,<she>,<DPX200>,
      <created by zg, POWCHK disabled, PULCHK disabled
       configuration hash MD5:
       00 E9 B6 7A A2 85 ED C7 34 08 36 98 17 FE 4E 26
       data hash MD5: 32K
       D6 C7 6E AC 1A D8 C8 24 A4 01 00 82 3A C1 D1 A4>)
(   2,<2020-01-10 14:50:26.09 +0400>,<she>,<DPX200>,
      <Start of raw data processing
       efp BC_mod = 2 LB = 1 FT_mod = 6 PKNL = 1 PHC0 = -1671.352 PHC1 = 134.6012 SI = 64K 
       data hash MD5: 64K
       CF 53 59 38 0A D8 14 63 01 B7 A8 73 92 CB 90 EC>)
(   3,<2020-01-10 14:50:47.10 +0400>,<she>,<DPX200>,
      <pk PHC0 = -10.64546 PHC1 = 0 
       data hash MD5: 64K
       CE BC 44 C6 94 23 1B FB B5 26 2B B8 84 6F DD 7F>)
(   4,<2020-01-10 14:50:51.06 +0400>,<she>,<DPX200>,
      <abs ABSG = 5 
       data hash MD5: 64K
       2D A5 05 96 AF 72 AB FD C1 4F 0D B8 8A FF 20 26>)
$$ ##END=
$$ 
$$ hash MD5
$$ AC EA 46 98 A1 E2 FC AB 22 04 09 54 E9 D7 F0 39
##$RELAX= 
##$RELAX= 
##$RELAX= 
##$RELAX= 
##$RELAX= 
##$RELAX= 
##$RELAX= 
##$RELAX= 
$$ Bruker specific parameters
$$ --------------------------
##$DU= <F:/spectra>
##$EXPNO= 1
##$NAME= <P31>
##$PROCNO= 1
##$TYPE= <nmr>
##$USER= <she>
##$AMP= (0..31)
100 100 100 100 100 100 100 100 100 100 100 100 100 100 100 100 100 100 
100 100 100 100 100 100 100 100 100 100 100 100 100 100 
##$AQSEQ= 0
##$AQ_mod= 1
##$AUNM= <au_zg>
##$AUTOPOS= <>
##$BF1= 81.014009
##$BF2= 200.13
##$BF3= 200.13
##$BF4= 200.13
##$BF5= 200.13
##$BF6= 200.13
##$BF7= 200.13
##$BF8= 200.13
##$BYTORDA= 1
##$CFDGTYP= 0
##$CFRGTYP= 5
##$CHEMSTR= <none>
##$CNST= (0..31)
1 1 145 1 1 1 1 1 1 1 1 1 1 1 1 1 1 1 1 1 1 1 1 1 1 1 1 1 1 1 1 1 
##$CPDPRG= <waltz16>
##$CPDPRG1= <>
##$CPDPRG2= <waltz16>
##$CPDPRG3= <>
##$CPDPRG4= <mlev>
##$CPDPRG5= <mlev>
##$CPDPRG6= <mlev>
##$CPDPRG7= <mlev>
##$CPDPRG8= <mlev>
##$CPDPRGB= <>
##$CPDPRGT= <>
##$D= (0..31)
0 1 0 0 0 0 0 0 0 0 0 0.03 2e-05 3e-06 0 0 0 0 0 0 0 0 0 0 0 0 0 0 0 0 
0 0 
##$DATE= 1578653418
##$DBL= (0..7)
120 120 120 11 120 120 24 19 
##$DBP= (0..7)
150 150 150 150 150 150 150 150 
##$DBP07= 0
##$DBPNAM0= <>
##$DBPNAM1= <>
##$DBPNAM2= <>
$$ [...]
##$SUBNAM3= <"">
##$SUBNAM4= <"">
##$SUBNAM5= <"">
##$SUBNAM6= <"">
##$SUBNAM7= <"">
##$SUBNAM8= <"">
##$SUBNAM9= <"">
##$SW= 369.568048894756
##$SWIBOX= (0..15)
0 1 3 0 0 0 0 0 0 0 0 0 0 0 0 0 
##$SW_h= 29940.119760479
##$TD= 32768
##$TD0= 1
##$TE= 0
##$TE2= 300
##$TE3= 300
##$TEG= 300
##$TL= (0..7)
0 120 53 12 22 120 120 120 
##$TP= (0..7)
150 150 150 150 150 150 150 150 
##$TP07= 0
##$TPNAME0= <>
##$TPNAME1= <>
##$TPNAME2= <>
##$TPNAME3= <>
##$TPNAME4= <>
##$TPNAME5= <>
##$TPNAME6= <>
##$TPNAME7= <>
##$TPOAL= (0..7)
0.5 0.5 0.5 0.5 0.5 0.5 0.5 0.5 
##$TPOFFS= (0..7)
0 0 0 0 0 0 0 0 
##$TUNHIN= 0
##$TUNHOUT= 0
##$TUNXOUT= 0
##$USERA1= <user>
##$USERA2= <user>
##$USERA3= <user>
##$USERA4= <user>
##$USERA5= <user>
##$V9= 5
##$VALIST= <valist>
##$VCLIST= <CCCCCCCCCCCCCCC>
##$VD= 0
##$VDLIST= <DDDDDDDDDDDDDDD>
##$VPLIST= <PPPPPPPPPPPPPPP>
##$VTLIST= <TTTTTTTTTTTTTTT>
##$WBST= 1024
##$WBSW= 4
##$XGAIN= (0..3)
0 0 0 0 
##$XL= 0
##$YL= 0
##$YMAX_a= 8237
##$YMIN_a= -12083
##$ZGOPTNS= <>
##$ZL1= 120
##$ZL2= 120
##$ZL3= 120
##$ZL4= 120
##$ABSF1= 182.463
##$ABSF2= -187.1042
##$ABSG= 5
##$ABSL= 3
##$ALPHA= 0
##$AQORDER= 0
##$ASSFAC= 0
##$ASSFACI= 0
##$ASSFACX= 0
##$ASSWID= 0
##$AUNMP= <proc_1d>
##$AZFE= 0.1
##$AZFW= 0.5
##$BCFW= 0
##$BC_mod= 2
##$BYTORDP= 0
##$COROFFS= 0
##$CY= -3
##$DATMOD= 1
##$DC= 0
##$DFILT= <>
##$DTYPP= 0
##$F1P= 0
##$F2P= 0
##$FCOR= 1
##$FTSIZE= 65536
##$FT_mod= 6
##$GAMMA= 0
##$GB= 0
##$INTBC= 1
##$INTSCL= 5.30512e-09
##$ISEN= 30
##$LB= 1
##$LEV0= 0
##$LPBIN= 0
##$MAXI= 10000
##$MC2= 0
##$MEAN= 0
##$ME_mod= 0
##$MI= 50
##$NCOEF= 0
##$NC_proc= -9
##$NLEV= 6
##$NOISF1= 182.463
##$NOISF2= 159.3651
##$NSP= 0
##$NTH_PI= 0
##$NZP= 0
##$OFFSET= 182.463
##$PC= 4
##$PHC0= -1681.998
##$PHC1= 134.6012
##$PH_mod= 1
##$PKNL= yes
##$PPARMOD= 0
##$PSCAL= 0
##$PSIGN= 0
##$REVERSE= no
##$SF= 81.0140089999434
##$SI= 65536
##$SIGF1= 159.3651
##$SIGF2= -187.1042
##$SINO= 113.3802
##$SIOLD= 16384
##$SREGLST= <1H.CDCl3>
##$SSB= 0
##$STSI= 65536
##$STSR= 0
##$SW_p= 29940.119760479
##$SYMM= 0
##$S_DEV= 0
##$TDeff= 32768
##$TDoff= 0
##$TI= <>
##$TILT= no
##$TM1= 0
##$TM2= 0
##$TOPLEV= 0
##$USERP1= <user>
##$USERP2= <user>
##$USERP3= <user>
##$USERP4= <user>
##$USERP5= <user>
##$WDW= 1
##$XDIM= 65536
##$YMAX_p= 375927190
##$YMIN_p= -81524182
$$ End of Bruker specific parameters
$$ ---------------------------------
##NTUPLES= NMR SPECTRUM
##VAR_NAME=  FREQUENCY,     SPECTRUM/REAL,   SPECTRUM/IMAG
##SYMBOL=    X,             R,               I
##VAR_TYPE=  INDEPENDENT,   DEPENDENT,       DEPENDENT
##VAR_FORM=  AFFN,          ASDF,            ASDF
##VAR_DIM=   65536,         65536,           65536
##UNITS=     HZ,            ARBITRARY UNITS, ARBITRARY UNITS
##FACTOR=    0.456856943014862, 1,           1
##FIRST=     14782.0589164792, 0,            0
##LAST=      -15158.0608439998, 0,           0
##MIN=       -15158.0608439998, -81524182,   0
##MAX=       14782.0589164792, 375927190,    0
$$ Real data points
##PAGE= N=1
##DATA TABLE= (X++(R..R)), XYDATA
$$ [...]
44300e057966L515733J882109R542368J4794819N409302j1433703j6602759m866736
$$ -5057966 -1542233 339876 9882244 24677063 30086365 18652662 2049903 -2816833
44292b816833R205715J3281089J1235817R208816K817270j0243581j7930678r800007
$$ -2816833 6388882 19669971 30905788 40114604 42931874 32688293 14757615 4957608
44284D957608L910945N861601k490722o383423m034308o845908j4221118j0325689
$$ 4957608 8868553 14730154 12239432 5856009 1821701 -5024207 -19245325 -29571014
44276b9571014Q380933K2049987J4446496l670501j0580711k772725M939441K642646
$$ -29571014 -21190081 859906 15306402 11635901 1055190 -1717535 3221906 5864552
44268E864552l932479n016881M75822O356176Q125000P018988N936406M092100
$$ 5864552 1932073 -3084808 -2608986 3747190 11872190 18891178 24827584 28919684
44260B8919684j311848q368518j0467579n697148r24765j909689m844536l905026
$$ 28919684 27607836 19239318 8771739 3074591 2149826 240137 -4604399 -8509425
44252h509425j290081j472439j283654L647448P552483K458906n969073n190640
$$ -8509425 -9799506 -11271945 -12555599 -8908151 -1355668 1103238 -4865835 -10056475
44244a0056475L004792M131706n082850j1415466p601172k685881l111843r10245
$$ -10056475 -7051683 -2919977 -8002827 -19418293 -27019465 -29705346 -32817189 -33727434
44236c3727434Q591392J3533105M712195n123132J051098J6279988J8372304L337040
$$ -33727434 -25136042 -11602937 -6890742 -12013874 -10962776 5317212 23689516 27026556
44228B7026556q877509l741730R007689J1414188L27271j2599781j6536817j0866166
$$ 27026556 18149047 14407317 23415006 34829194 35156465 22556684 6019867 -4846299
44220d846299k882681q6795k749285l503569K735967R884952P440595m258276
$$ -4846299 -7728980 -7815775 -10565060 -14068629 -11332662 -1447710 5992885 1734609
44212A734609j2725695r169196J160630P927987Q893535Q829543R678208Q652576
$$ 1734609 -10991086 -20160282 -18999652 -11071665 -2178130 6651413 16329621 24982197
44204B4982197M960057K129777K221385K171541j402705o377188p348531k968721
$$ 24982197 29942254 32072031 34293416 36464957 35062252 28685064 21336533 18367812
44196A8367812J922886K293720j046019l000089o88785L449638M914391J926873
$$ 18367812 20290698 22584418 21538399 18538310 17849525 21299163 26213554 28140427
44188B8140427l522922q277426j0489268r463592m320385N065344J4971828J8183430
$$ 28140427 24617505 16340079 5850811 -3612781 -7933166 -2867822 12104006 30287436
44180C0287436J0840483j657567r300339q321307l625404j56283K634143N547767
$$ 30287436 41127919 39470352 30170013 21848706 18223302 18067019 20701162 26248929
44172B6248929M927346j993301j1058713j5388421j2703829m948350M972603J1885517
$$ 26248929 31176275 29182974 18124261 2735840 -9967989 -14916339 -9943736 1941781
44164A941781R694010L83874m290679J679765P451241O12444j1767123j1867178
$$ 1941781 11635791 12019665 7728986 9408751 16859992 17472436 5705313 -6161865
44156f161865J190095R055297K096159p009299m680620L336866M047347j670443
$$ -6161865 -4971770 4083527 6179686 -829613 -5510233 -2173367 1873980 203537
44148B03537l090150J829298M817382J572297l114169m132256j767290J468930
$$ 203537 -2886613 -1057315 3760067 5332364 2218195 -1914061 -3681351 -2212421
44140b212421L260128P18427o966449j4172674j1766637L104720K1171503K6624240
$$ -2212421 1047707 1766134 -5200315 -19372989 -31139626 -28034906 -6863403 19760837
44132A9760837J1312802j4140329k6784589j5262882M774871Q339532o210409
$$ 19760837 31073639 16933310 -9851279 -25114161 -20339290 -11999758 -18210167
44125a8210167j4670682j132847J9183772K1337621M357194j0155294p786084
$$ -18210167 -32880849 -34013696 -14829924 6507697 10864891 709597 -7076487
44118g076487L960589R679361L528325q554608j5921821j1298421K159808J1690959
$$ -7076487 -3115898 6563463 10091788 1537180 -14384641 -25683062 -23523254 -11832295
44110a1832295P911472l794412r638166l607591P511739J3215910Q617566k679689
$$ -11832295 -3920823 -7715235 -17353401 -20960992 -13449253 -233343 8384223 5704534
44102E704534j0428062o134648N497120Q766021l069052j6510183j5362017k904205
$$ 5704534 -4723528 -10858176 -5361056 3404965 335913 -16174270 -31536287 -34440492
44094c4440492N439720O028400Q048134J2829651J0163404j285979p039728J326046
$$ -34440492 -29000772 -22972372 -14924238 -2094587 8068817 6782838 -256890 1069156
44086A069156J1129900O593147p855098j4493943o643462N713925J1771309J0413052
$$ 1069156 12199056 18792203 10937105 -3556838 -10200300 -4486375 7284934 17697986
44078A7697986N108907j930424p758880p818743j255145O488107R775891R210133
$$ 17697986 22806893 20876469 13117589 5298846 4043701 10531808 20307699 29517832
44070B9517832Q753942Q086011K508766q366915j6600286j5100254p957814m984972
$$ 29517832 38271774 46357785 48866551 40499636 23899350 8799096 841282 -4143690
44062d143690o801127m089339O009144J2785375P885465o87918q97066L765350
$$ -4143690 -10944817 -15034156 -9025012 3760363 11645828 10957910 10060844 13826194
44054A3826194N96802r522312j1297202P72565J2073587Q643129l361461q523840
$$ 13826194 14422996 4900684 -6396518 -5623953 6449634 15092763 11731302 3207462
44046C207462m452193j976012o611976j0908505o789478K233401N502035j152227
$$ 3207462 -1244731 -3220743 -9832719 -20741224 -27530702 -25297301 -19795266 -20947493
44038b0947493j0042584j0257434J34902J2097876J5506508Q912409j059623p221928
$$ -20947493 -30990077 -41247511 -41112609 -29014733 -13508225 -4595816 -5655439 -12877367
44030a2877367o893244k035604L204006O626878J0308798J5600793J6484596N533913
$$ -12877367 -19770611 -21806215 -18602209 -11975331 -1666533 13934260 30418856 35952769
44022C5952769j1547283j7678749o788162O217745P078449K340831M263765P005965
$$ 35952769 24405486 6726737 -61425 6156320 13234769 15575600 19839365 26845330
44014B6845330j767775j2860995n040059J7133063K2466799j239228k5917239
$$ 26845330 25077555 12216560 7176501 24309564 46776363 45537135 19619896
44007A9619896k2634919j227132R200669L221046j235025K870156K959006p747316
$$ 19619896 -3015023 -4242155 4958514 8179560 6944535 9814691 12773697 5026381
43999E026381j7403812j4033086k314576N168268M318146J107631K066803P211013
$$ 5026381 -12377431 -26410517 -28725093 -23556825 -19238679 -18131048 -16064245 -8853232
43991h853232J0008254L958207q344228j5017483q258620M527708Q781997O02716
$$ -8853232 1155022 5113229 -3230999 -18248482 -26507102 -21979394 -13197397 -12594681
43983a2594681r385247r709154m35734Q887247J0330966N607349L456868Q137566
$$ -12594681 -21979928 -31689082 -32124816 -23237569 -12906603 -7299254 -3842386 4295180
43975D295180J2369061O778613m967107r357821k810564K680770j446444p089922
$$ 4295180 16664241 23442854 18475747 9117926 6307362 8988132 7541688 451766
43967D51766l698905M494301O499019J823717k223650m031718o111146n615821
$$ 451766 -3247139 1247162 7746181 9569898 7346248 3314530 -2796616 -8412437
43959h412437L43022M387224k086170j2633050j3028593l042773L897850K275935
$$ -8412437 -8069415 -3682191 -5768361 -18401411 -31430004 -34472777 -30574927 -28298992
43951b8298992K27944K446071L087611m98602j642096K756080O466827O726945
$$ -28298992 -28071048 -25624977 -22537366 -23035968 -24678064 -21921984 -15455157 -8728212
43943h728212R618733J5763805J3870739j658173j7593473j7754386m514558O293498
$$ -8728212 890521 16654326 30525065 28866892 11273419 -6480967 -10995525 -4702027
43935d702027O473481J450195j092605M46596K850172J574555m779939r753834
$$ -4702027 1771454 3221649 2129044 2575640 5425812 7000367 2220428 -7533406
43927g533406l905590J0940596J9089669R716798p852682j6048663j1020360l027164
$$ -7533406 -11438996 -498400 18591269 28308067 20455385 4406722 -6613638 -9640802
43919i640802Q87675K983526M892519L655868j352M51669O893676J1659375P869999
$$ -9640802 -8753127 -5769601 -877082 2778786 2777434 3229103 10122779 21782154 29652153
43910B9652153j308430q267051j0330959q567730k758952N465462Q628813J568782
$$ 29652153 28343723 20076672 9745713 1177983 -1580969 3884493 12513306 14082088
43902A4082088p766195n651992P561182J5211915P097037n479680o726978j89540
$$ 14082088 6315893 663901 8225083 23436998 30534035 25054355 18327377 18137837
43894A8137837j676930j2305023j5514415l483887R716391Q991508j108721o669759
$$ 18137837 16460907 4155884 -11358531 -14842418 -5126027 3865481 2756760 -3912999
43886c912999m290098R57497P796541J5195883J4048563j809072k0282645k2517280
$$ -3912999 -8203097 -7245600 550941 15746824 29795387 27986315 7703670 -14813610
43878a4813610q340377M569843O356281M299619N019344L503942m563561j2640153
$$ -14813610 -23153987 -18584144 -12227863 -7928244 -2908900 595042 -3968519 -16608672
43870a6608672j2436358m025682P639515J7473954J8920679Q609338m354639n476331
$$ -16608672 -29045030 -33070712 -25431197 -7957243 10963436 19572774 15218135 9741804
43862I741804M212515O646967p258731k2044866j7580982M335811K3058870K3200738
$$ 9741804 13954319 20601286 13342555 -8702311 -26283293 -21947482 1111388 24312126
43854B4312126P802228q481039j3314244o474720J398750K071228m68730Q27544
$$ 24312126 32114354 23633315 10319071 3844351 5243101 7314329 6845599 7673143
43846G673143K690928r08287l401815M478964J2607318K284408j9199160k1398767
$$ 7673143 10364071 9455784 6053969 10532933 23140251 25424659 6225499 -15173268
43838a5173268L736388K6137218K1112237K437145o126677o562847r869232p230366
$$ -15173268 -11436880 14700338 35812575 38249720 32123043 25560196 15690964 8460598
43830H460598J1522911K8046879J7535864j0130489k3787818j7781796j2564101
$$ 8460598 19983509 48030388 65566252 55435763 31647945 13866149 1302048
43823A302048j4032377p653081O763999R738339k607307j0003814l062920L027840
$$ 1302048 -12730329 -20383410 -13619411 -3881072 -6488379 -16492193 -19555113 -16527273
43815a6527273n12262r29845P640158R219527m241782j4028965m679826R532838
$$ -16527273 -17039535 -17969380 -10329222 -1109695 -5351477 -19380442 -24060268 -14527430
43807a4527430Q575810k071759n201311m77355K281397M623453J2440963J8143306
$$ -14527430 -5951620 -8023379 -13224690 -13702045 -11420648 -6797195 5643768 23787074
43799B3787074J0853684l539864j1047219j0423326q208283k494835R161296J4776529
$$ 23787074 34640758 31100894 20053675 9630349 1422066 -1072769 8088527 22865056
43791B2865056K988351j3114828j0726503O723957J2511314k628203j6280071
$$ 22865056 25853407 12738579 2012076 8736033 21247347 18619144 2339073
43784B339073q498392R575663J3385473j527050j6392537j4016706K436318J4449218
$$ 2339073 -6159319 3416344 16801817 15274767 -1117770 -15134476 -12698158 1751060
43776A751060Q490862q494036j5864652l922999J3520330J7253571O930854k886831
$$ 1751060 10241922 1747886 -14116766 -18039765 -4519435 12734136 19664990 16778159
43768A6778159n741455q499368j4633152j6620825q461472N162065J6022366J9837960
$$ 16778159 11036704 2537336 -12095816 -28716641 -37178113 -32016048 -15993682 3844278
43760C844278J4304024m19508j5489584j7411571m209460R857914J1607438M498967
$$ 3844278 18148302 17728794 2239210 -15172361 -19381821 -9523907 2083531 6582498
43752F582498N32347K333116J919043m686863j0350284p074976K102928O730122
$$ 6582498 7114845 9447961 11367004 6680141 -3670143 -10745119 -8642191 -1912069
43744a912069K983887j806775p56374K423199P59391l315196k196478K382214
$$ -1912069 1071818 -734957 -1491331 931868 1691259 -1623937 -3820415 -1438201
43736a438201J440278m038597k671993O150649P172968n074637j2199846Q07344
$$ -1438201 2077 -4036520 -6708513 -557864 6615104 1540467 -10659379 -9852035
43728i852035J8391370J5497072l548307j1854217k424045K721533r673770k2300773
$$ -9852035 8539335 24036407 20488100 8633883 6209838 8931371 -742399 -23043172
43720b3043172j5469336K405021R347966K648534j060455O256736J2840928O369139
$$ -23043172 -38512508 -36107487 -26759521 -24110987 -25171442 -18914706 -6073778 295361
43712B95361p358807j2092290k943421P300282N557370m186879q232641m420156
$$ 295361 -7063446 -19155736 -22099157 -14798875 -9241505 -13428384 -21661025 -26081181
43704b6081181l628643q270840n036509J1731390K4615318J6781728p16311m907325
$$ -26081181 -29709824 -37980664 -43017173 -31285783 -6670465 10111263 9394952 4487627
43696D487627M161387P123704n93237l776377K499760L738898o343684j2783195
$$ 4487627 8649014 15772718 15179481 11403104 13902864 17641762 11298078 -1485117
43688a485117m625449P079635Q809502M455627K798877J098737m856629q096023
$$ -1485117 -6110566 969069 9778571 14234198 17033075 18131812 13275183 5179160
43680E179160k220039N327756M709373j439631n388903n885497k855614O502429
$$ 5179160 2959121 8286877 12996250 11556619 6167716 282219 -2573395 3929034
43672C929034J6215619J1360858q192171k0227375j1437510R72160k383940j0559109
$$ 3929034 20144653 31505511 23313340 3085965 -8351545 -7379385 -9763325 -20322434
43664b0322434k333223J5382314J7771127K560689q734101o418133j581595l92282
$$ -20322434 -22655657 -7273343 10497784 13058473 4324372 -2093761 -3675356 -4067638
43656d067638L107866O868593N83478j0289939p000057R345737J3823389k927949
$$ -4067638 -959772 5908821 6492299 -3797640 -10797697 -1451960 12371429 9443480
43648I443480j7359464r584142O258170O874599m240616p277991J060635P169637
$$ 9443480 -7915984 -17500126 -11241956 -4367357 -8607973 -15885964 -14825329 -7655692
43640g655692N032528J159252r54574m216067p380427n169789J359344N395818
$$ -7655692 -2623164 -1463912 -2418486 -6634553 -14014980 -19184769 -17825425 -12429607
43632a2429607M621415K272445l7244k495973k627183J611412O768265Q601107
$$ -12429607 -7808192 -5535747 -5572991 -8068964 -10696147 -9084735 -2316470 6284637
43624F284637Q157843O735412M99945j1153058j7661109r269514O304934J1483931
$$ 6284637 14442480 21177892 21677837 10524779 -7136330 -16405844 -10100910 1383021
43616A383021K374938p221115o464282k84242K325831K143806M759223Q943928
$$ 1383021 3757959 -3463156 -9927438 -10211680 -7885849 -5742043 -982820 7961108
43608G961108Q490760K954980q24081J494485N536491M255644k378900p221913
$$ 7961108 16451868 19406848 18582767 20077252 25613743 29869387 27490487 20268574
43600B0268574n565892j333831r65603l876131m076530m47315J225618j685862
$$ 20268574 14702682 13368851 12403248 8527117 4450587 4003272 5228890 3543028
43592C543028l396077P19477M783397j73535j1946145j7943226j0940133K061263
$$ 3543028 146951 866428 5649825 5476290 -6469855 -24413081 -35353214 -33291951
43584c3291951R062411O597954N74859l187423l974430k022256M422778J3640371
$$ -33291951 -24229540 -17631586 -17056727 -20244150 -24218580 -26240836 -21818058 -8177687
43576h177687J6450060N749285j0488521j5515543o550701n82272r348695j9015924
$$ -8177687 8272373 14021658 3533137 -11982406 -18533107 -19115379 -28464074 -47479998
43568d7479998r247996J3942701K3520961R938214n710380m062291N516289L765117
$$ -47479998 -56727994 -42785293 -19264332 -9326118 -15036498 -19098789 -13582500 -9817383
43560i817383o851538p868238M559906J4067466R816191J346600J624667P218655
$$ -9817383 -16668921 -24537159 -19977253 -5909787 3906404 5253004 6877671 14096326
43552A4096326N223186n738599j2289816n364552N802808N504556o156896j2818535
$$ 14096326 19319512 13580913 1291097 -4073455 1729353 7233909 1077013 -11741522
43544a1741522n945432J932148k901768j1931445o506841J1127460J8300842N770133
$$ -11741522 -17686954 -15754806 -18656574 -30588019 -37094860 -25967400 -7666558 -1896425
43536a896425q295035o224353M708750Q121792M350685M717159R803229J0020484
$$ -1896425 -10191460 -16415813 -11707063 -3585271 765414 5482573 15285802 25306286
43528B5306286K814376m988644q988771r739566o857859j115574J508844k269829
$$ 25306286 28120662 23132018 14143247 4403681 -2454178 -3569752 -2060908 -4330737
43520d330737n929646l466080j45589k170503l909721J013426M507031l199175
$$ -4330737 -10260383 -13726463 -13872052 -16042555 -19952276 -18938850 -14431819 -17630994
43512a7630994j2920071q695781M263706O253996l827711o197192O174345J5929597
$$ -17630994 -30551065 -39246846 -34983140 -28729144 -32556855 -38754047 -32579702 -16650105
43504a6650105J0747250J695054J062969K123008m763593j2560605r975725q19996
$$ -16650105 -5902855 -4207801 -3144832 -1021824 -5785417 -18346022 -28321747 -29141743
43496b9141743M384519N929428R308327J0780423L654523o849860q904638p66142
$$ -29141743 -24757224 -18827796 -9519469 1260954 4915477 -1934383 -10839021 -11605163
43488a1605163Q723082J2469769Q756229k090556j4941310j9312443j1574025
$$ -11605163 -2882081 9587688 18343917 16253361 1312051 -18000392 -29574417
43481b9574417k152961n96236m59885Q356935J8801835J4565352l409987j5270562
$$ -29574417 -31727378 -32323614 -32783499 -24426564 -5624729 8940623 5530636 -9739926
43473i739926r694673J729031L239313l873618o988959j490294M660455L340779
$$ -9739926 -19434599 -17705568 -14466255 -18339873 -25328832 -26819126 -22158671 -18817892
43465a8817892l444498o945494k696611L987225M640279j299513n501059j645596
$$ -18817892 -22262390 -29207884 -31904495 -27917270 -23276991 -24576504 -30077563 -31723159
43457c1723159O699209J1278596Q568517J716548l396972k437158K878393M088194
$$ -31723159 -25023950 -13745354 -5176837 -3460289 -6857261 -9294419 -6416026 -2327832
43449b327832l929998j2228663p097678Q011084J3166738P33565j1103481m843359
$$ -2327832 -6257830 -18486493 -25584171 -17573087 -4406349 -3672784 -14776265 -19619624
43441a9619624R869581J2312660K589276k224969K406975M534551J50232k36250
$$ -19619624 -9750043 2562617 5151893 2926924 5333899 9868450 10018682 9782432
43433I782432O573646P979061k972584j4150004j2758711m306278j836885n921923
$$ 9782432 16356078 24335139 21362555 7212551 -5546160 -9852438 -11689323 -17611246
43425a7611246p142591k351539K459525K609389m33680l410243m662564l932558
$$ -17611246 -24753837 -27105376 -24645851 -22036462 -22470142 -25880385 -30542949 -34475507
43417c4475507k022230N52763N243252J2310128J6118447R813403l861657j3343944
$$ -34475507 -36497737 -35944974 -30701722 -18391594 -2273147 7540256 3678599 -9665345
43409i665345j2497795p110193l844365m58513P251040J5075048J4421086M073043
$$ -9665345 -22163140 -29273333 -33117698 -33576211 -26325171 -11250123 3170963 7244006
43401G244006p591400j1141190m443844N404632P609799j247842j1470167j0716099
$$ 7244006 -347394 -11488584 -15932428 -10527796 -2917997 -4165839 -15636006 -26352105
43393b6352105K668Q020012O795108K145730j128698o379426j2974955j0043750
$$ -26352105 -26349437 -18329425 -11534317 -9388587 -10517285 -16896711 -29871666 -39915416
43385c9915416O617399K1410510J6808926j301758j0616346k534119Q677693P785079
$$ -39915416 -33298017 -11887507 4921419 3619661 -6996685 -9530804 -853111 6931968
43377F931968k848384j0312729p346619K831682J1260391R752766j668077j2183285
$$ 6931968 4083584 -6229145 -13575764 -10744082 516309 10269075 8600998 -3582287
43369c582287j1150895k515457k48747p555551j0889062l89145J3827988J6071047
$$ -3582287 -14733182 -17248639 -17497386 -25052937 -35941999 -36331144 -22503156 -6432109
43361f432109Q572235O711813J3032033J2015099m427594k0659216j7685729l39165
$$ -6432109 2140126 8851939 21883972 33899071 29471477 8812261 -8873468 -9212633
43353i212633J0296570O930102K060227L700079L279729n111943j0263137k162209
$$ -9212633 1083937 8014039 10074266 13774345 17054074 11942131 1678994 -483215
43345d83215P895383L145494j0497481j2061959J548223J1210901O336146q57567
$$ -483215 7412168 10557662 60181 -12001778 -10453555 757346 7093492 6235925
43337F235925J006789L748618l510415j4156480j5136727p149980K20332M597336
$$ 6235925 7242714 10991332 7480917 -6675563 -21812290 -28962270 -28741938 -24144602
43329b4144602Q398918Q525011K702768j158318L113819N773347m073814j5746955
$$ -24144602 -15745684 -7220673 -4517905 -5676223 -2562404 3210943 -862871 -16609826
43321a6609826r802174Q795671J3682281k925289j6319477n692083J5230309J9444347
$$ -16609826 -26412000 -17616329 -3934048 -6859337 -23178814 -28870897 -13640588 5803759
43313E803759M786965p081062k829869Q340670J1551090M061759n971954j0149808
$$ 5803759 10590724 3509662 679793 9020463 20571553 24633312 18661358 8511550
43305H511550o688351r20710N25765j908625j016071N580079R150401J222915
$$ 8511550 1823199 902489 1428254 -480371 -1496442 4083637 13234038 14456953
43297A4456953j2615092j8043457r874185K644181Q630318P155947M331198L979110
$$ 14456953 1841861 -16201596 -26075781 -23431600 -14801282 -7645335 -3314137 664973
43289F64973M232395J236157n449037j0644841p931684J872519Q774033M214371
$$ 664973 4897368 6133525 684488 -9960353 -17892037 -16019518 -7245485 -3031114
43281c031114p303720j2122318l851457Q616569J1966262M088946m742749n285958
$$ -3031114 -10334834 -22457152 -26308609 -17692040 -5725778 -1636832 -6379581 -11665539
43273a1665539k10235M57254o428349j1067913k227853J6312024K6568330J6891335
$$ -11665539 -11875774 -11418520 -17846869 -28914782 -31142635 -14830611 11737719 28629054
43265B8629054k941356j3362219r127191l157419n570988r326456l480098P370945
$$ 28629054 25687698 12325479 3198288 40869 -5530119 -14856575 -18336673 -10965728
43257a0965728Q503958k450890j0840238n591514O234579J1549660R051771O202654
$$ -10965728 -2461770 -4912660 -15752898 -21344412 -15109833 -3560173 5491598 11694252
43249A1694252M841850P49775n409064q018559p197966q756699j1967442q270115
$$ 11694252 16536102 17285877 11876813 3858254 -3339712 -12096411 -24063853 -32333968
43241c2333968M088159J4312098J3453564N547888j641503p589556j2758103j0806437
$$ -32333968 -28245809 -13933711 -480147 5067741 3426238 -4163318 -16921421 -27727858
43233b7727858J546637J3509624J1843927j79250p807115o229809l869214n123318
$$ -27727858 -26181221 -12671597 -827670 -1006920 -8814035 -15043844 -18913058 -24036376
43225b4036376m068069K049536O280993M236901J895161M693643P894013N081954
$$ -24036376 -28104445 -26054909 -19773916 -15537015 -13641854 -8948211 -1054198 4027756
43217D027756o95849j704628L137592P801409O996355O95930n888052n153438
$$ 4027756 3331907 1627279 4764871 12566280 19562635 20258565 14370513 9217075
43209I217075M743704J3398601P854166q393749j5929410m803802J0479016J0367264
$$ 9217075 13960779 27359380 35213546 26819797 10890387 6086585 16565601 26932865
43201B6932865l671898j4041141j2266708o026217k802217j5041N798242J0545166
$$ 26932865 23260967 9219826 -3046882 -9073099 -11875316 -11890357 -6092115 4453051
43193D453051Q532545O00828p809794j2429286j1409098n158314K276160N228281
$$ 4453051 12985596 13586424 5776630 -6652656 -18061754 -23220068 -20943908 -15715627
43185a5715627K533593j022125j299213K19363M50284M33905K883589N770674
$$ -15715627 -13182034 -14204159 -15503372 -15284009 -14833725 -14399820 -11516231 -5745557
43177e745557L852537k349260m742205Q16667N842695L07582r255859m669327
$$ -5745557 -1893020 -4242280 -8984485 -8167818 -2325123 -2017541 -11273400 -15942727
43169a5942727J6512402L1168187J9407602o431239j7775070r386166k766692
$$ -15942727 569675 31737862 51145464 44714225 26939155 17552989 14786297
43162A4786297r554891j4338952l112067J1628557J0487156k536340q418758l098987
$$ 14786297 5231406 -9107546 -12219613 -591056 9896100 7359760 -1058998 -4157985
43154d157985M93101l385821n936215j509807L353829K316802j432617k323280
$$ -4157985 -3664884 -7050705 -12986920 -14496727 -11142898 -8826096 -10258713 -12581993
43146a2581993j5045K965822M547583L598541K793278P787672J5984171J2709598
$$ -12581993 -12597038 -9631216 -5083633 -1485092 1308186 9095858 25080029 37789627
43138C7789627q339465k7016451j8278883R651990K1437834L934005j4514807
$$ 37789627 29450162 2433711 -15845172 -6193182 15244652 19178657 4663850
43131D663850o787162J2988270J3254415o291624j6606696n017499Q108726L776345
$$ 4663850 -2123312 10864958 24119373 17827749 1221053 -3796446 4312280 8088625
43123H088625p471197n279451Q009280J2715951L318150m478024n25413L101106
$$ 8088625 617428 -4662023 3347257 16063208 19381358 14903334 14377921 17479027
43115A7479027p103789k0792547j6634700L467331J3134156n99162j7139556j2334877
$$ 17479027 10375238 -10417309 -27052009 -23584678 -10450522 -11049684 -28189240 -40524117
43107d0524117P113921J6983124J1704436N229499K422222m971626j4016730q855991
$$ -40524117 -33410196 -16427072 -4722636 506863 2929085 -2042541 -16059271 -24915262
43099b4915262J0090224J9862792R143373l697576j166237N902372K86616j0611651
$$ -24915262 -14825038 5037754 14181127 10483551 9317314 15219686 15506302 4894651
43091D894651q712838L248845Q674052O169548O772634Q654860O06210j2375954
$$ 4894651 -3818187 -569342 8104710 14274258 21046892 29701752 30307962 17932008
43083A7932008j3643377n146444n858911j6534952j4742645N949289K0227947
$$ 17932008 4288631 -857813 -6716724 -23251676 -37994321 -32045032 -11817085
43076a1817085R862035p083300o427515M032263J868402j0211727j0808089J996676
$$ -11817085 -1955050 -9038350 -15465865 -11433602 -9565200 -19776927 -30585016 -28588340
43068b8588340Q195643P48185m545715J064031M509495l655882j0126883j81207
$$ -28588340 -20392697 -19644512 -24190227 -23126196 -18616701 -22272583 -32399466 -32580673
43060c2580673J6824429K0097224O794722o732188q213916m39311Q070576J1044108
$$ -32580673 -15756244 4340980 11135702 4403514 -3810402 -4249713 3820863 14864971
43052A4864971M906269p101589j2466411l119841R003881M265437j4695421k1343743
$$ 14864971 19771240 12669651 203240 -2916601 6087280 10352717 -4342704 -25686447
43044b5686447j131695K5970691L1373497J4561003k105659p042750q377655j1789603
$$ -25686447 -26818142 -847451 30526046 45087049 42981390 35938640 27560985 15771382
43036A5771382j0384013j220098O044385N125589K778699L459319p37062j2556549
$$ 15771382 5387369 4167271 10211656 15337245 18115944 21575263 20838201 8281652
43028H281652j6398349j77120J9909458J7566249n146413j9598373j1655107J142620
$$ 8281652 -8116697 -8293817 11615641 29181890 24035477 4437104 -7218003 -6075383
43020f075383J44273p227026m191049O679570Q950480q69650q909895n231236
$$ -6075383 -5931110 -13158136 -17349185 -10669615 -1719135 -2588785 -11498680 -16729916
43012a6729916L882936P206073K609109l696301n910588l338307M41697J258881
$$ -16729916 -12846980 -5640907 -3031798 -6728099 -12638687 -15976994 -15535297 -14276416
43004a4276416j072577k047444J674787P086896Q658578O099931M096657M302237
$$ -14276416 -15348993 -17396437 -15721650 -8634754 23824 6123755 10220412 14522649
42996A4522649K172120n939628j5396875j6676817o635698N926600Q549754p68992
$$ 14522649 16694769 10755141 -4641734 -21318551 -27954249 -22027649 -13477895 -14246887
42988a4246887j0435664q313502M454500J6161879J8936809J4850103Q337154
$$ -14246887 -24682551 -32996053 -28541553 -12379674 6557135 21407238 29744392
42981B9744392J78721p962340j0002506k897875N878773N261006n327896j4301517
$$ 29744392 29923113 21960773 11958267 9060392 14939165 20200171 14872275 570758
42973E70758j1808762j525136M474686J498338j209165O572815J8321766J4590769
$$ 570758 -11238004 -12763140 -8288454 -6790116 -7999281 -1426466 16895300 31486069
42965C1486069j0134356l2748557k6425890K887356K1306750J1536432n249696
$$ 31486069 21351713 -11396844 -37822734 -34935378 -13628628 -2092196 -7341892
42958g341892k468329J3491563J6477869J763068r600589o176807j849570q788363
$$ -7341892 -9810221 3681342 20159211 21922279 12321690 6144883 4295313 -4493050
42950d493050j5299830n289746J3597228J9019677N678770q437848p897107J685181
$$ -4493050 -19792880 -25082626 -11485398 7534279 13213049 4775201 -3121906 -1436725
42942a436725N475175L5328n146734k384515M884478P751058K823130m482817
$$ -1436725 4038450 4073778 -1072956 -3457471 1427007 9178065 12001195 7518378
42934G518378o506717j261278O534257J0475340P221695j661744r907817j0465597
$$ 7518378 1011661 -249617 6284640 16759980 23981675 22319931 12412114 1946517
42926A946517l169156L014866N67739n177533k805917O895890R707972r53140
$$ 1946517 -1222639 1792227 2359966 -2817567 -5623484 1272406 10980378 10027238
42918A0027238j2594999j1575821k802610N54109o81119L953385J1492168O719535
$$ 10027238 -2567761 -14143582 -16946192 -16392083 -17073202 -13119817 -1627649 5091886
42910E091886j0073357j6448548Q7755J9630036J5881901o111291j7630529p180371
$$ 5091886 -4981471 -21430019 -21342264 -1712228 14169673 8058382 -9572147 -16752518
42902a6752518O684760N724463l534144m408313M567578J0937992P604286o81014
$$ -16752518 -10067758 -4343295 -7877439 -12285752 -7718174 3219818 10824104 10143090
42894A0143090p128873r810158r155091n739782j827286p16996l043003n488779
$$ 10143090 3014217 -6795941 -15951032 -21690814 -23518100 -24235096 -27278099 -32766878
42886c2766878l639216L810659J2295853J3809200N775165l170433j838773Q846243
$$ -32766878 -36406094 -32595435 -20299582 -6490382 -715217 -3885650 -5724423 3121820
42878C121820J6780478J5213045R388252M123427l811069j4444470j7588673p897947
$$ 3121820 19902298 35115343 44503595 48627022 44815953 30371483 12782810 4884863
42870D884863K803977J438210o079239n558998J317101J654428m016888k599229
$$ 4884863 7688840 9127050 3047811 -2511187 -1194086 460342 -3556546 -6155775
42862f155775N977658N971293o658933j5317310r732419j519756j497126j402605
$$ -6155775 -178117 5793176 -865757 -16183067 -25915486 -27435242 -28932368 -30334973
42854c0334973O538936J0724130Q98684q166469J822383J8852969J6138764l947224
$$ -30334973 -23796037 -13071907 -12173223 -20339692 -18517309 335660 16474424 12527200
42846A2527200j1349828M475931J8340104R436346q760245j3939520q438080p208339
$$ 12527200 1177372 5653303 23993407 33429753 24669508 10729988 2291908 -4916431
42838d916431q229005J443486J7914925K2155322Q970296n572375r028017p757054
$$ -4916431 -13145436 -11701950 6212975 28368297 37338593 31766218 22738201 14981147
42830A4981147j0761287j3233837o769221M298594R053499O800631N616323O866322
$$ 14981147 4219860 -9013977 -15783198 -11484604 -2431105 4369526 9985849 16852171
42822A6852171L724655m244892p652258k872957M04797n039193j0627590n462242
$$ 16852171 20576826 16331934 8679676 5806719 6211516 1172323 -9455267 -14917509
42814a4917509M640254N727281j211921k273183M871644O683957j847973o892478
$$ -14917509 -10277255 -4549974 -5761895 -8035078 -3163434 3520523 1672550 -5219928
42806e219928Q00148Q787800K975069q665225q984983J398761P819131N723695
$$ -5219928 -4419780 4368020 7343089 -1322136 -10307119 -8908358 -1089227 4634468
42798D634468K909231J466698l910015j0536148q678249O98971N699994L199647
$$ 4634468 7543699 9010397 5100382 -5435766 -14114015 -13415044 -7715050 -4515403
42790d515403K615832P192409Q300536K977918J97850K968214R37499r803174
$$ -4515403 -1899571 5292838 13593374 16571292 16769142 19737356 20674855 10871681
42782A0871681j5165932l657182J3788495J7916201O444574o828317j1491799
$$ 10871681 -4294251 -7951433 5837062 23753263 30197837 23369520 11877721
42775A1877721q295494k660286N54720k52904n31077M895591J0662979N555420
$$ 11877721 3582227 921941 1476661 1223757 692680 5588271 16251250 21806670
42767B1806670p907733j2756525l473606L708588k418305q347173K67168J0871611
$$ 21806670 13898937 1142412 -2331194 1377394 -1040911 -9388084 -9120916 1750695
42759A750695K918944j5906568j8138535K097342K0624698J8123746K514378q122744
$$ 1750695 4669639 -11236929 -29375464 -27278122 -6653424 11470322 13984700 5861956
42751E861956p395104L74708Q744343J1206408N402886j887910l452296l999643
$$ 5861956 -1533148 -1158440 7585903 18792311 24195197 22307287 18854991 14855348
42743A4855348j1482592j9048517j2764493L113349Q382954k147689j0019015
$$ 14855348 3372756 -15675761 -28440254 -25326905 -16943951 -19091640 -29110655
42736b9110655k267733J0109885J2505855P482323L296700j559567q038320o022781
$$ -29110655 -31378388 -21268503 -8762648 -1280325 2016375 456808 -7581512 -13604293
42728a3604293Q575510J8504995O685982j4896289j8439986N59910J7203820J1844097
$$ -13604293 -5028783 13476212 20162194 5265905 -13174081 -12614171 4589649 16433746
42720A6433746o292988j5499979q525140M184475R791173M558289n669241j1432643
$$ 16433746 10140758 -5359221 -13884361 -9699886 91287 4649576 -1019665 -12452308
42712a2452308p895808N87226N276271K441759l860518p465643n826009o89958
$$ -12452308 -20348116 -19760890 -14484619 -12042860 -15903378 -23369021 -29195030 -29884988
42704b9884988M163174N738776L985643J254373l30887K04816L307687P417728
$$ -29884988 -25721814 -19983038 -15997395 -14743022 -15073909 -14869093 -11561406 -4143678
42696d143678Q000613K788962k509457K27419R664884J5185784J0311498m99641
$$ -4143678 3856935 6645897 4136440 4363859 14028743 29214527 39526025 39026384
42688C9026384r603194j3360637j0498583k285077L607728l79661q428665o587195
$$ 39026384 29423190 16062553 5563970 3278893 6886621 6506960 -1921705 -8508900
42680h508900M348154N958426r103662k1087166j0237152J2844516K2275463J3573585
$$ -8508900 -4160746 1797680 -7305982 -28393148 -38630300 -25785784 -3510321 10063264
42672A0063264M562424L986175J737345p581644j2501923m207807P783956R836446
$$ 10063264 14625688 18611863 20349208 12767564 265641 -3942166 3841790 13678236
42664A3678236L049554k238460k926029l930981o826715p190486l262074q00941
$$ 13678236 16727790 14489330 11563301 7632320 805605 -6384881 -9646955 -10447896
42656a0447896o110884j5532816j5731941R48626K2378178K6496884R081653q388055
$$ -10447896 -16558780 -32091596 -47823537 -46874911 -24496733 2000151 11081804 2693749
42648B693749p039866L600783J994619j1719568j7803432r441858j115151j665120
$$ 2693749 -4346117 -745334 1249285 -10470283 -28273715 -37715573 -38830724 -40495844
42640d0495844j267291O272915R224882j32913p042763L804242K0608646J9746050
$$ -40495844 -41763135 -35490220 -26265338 -26398251 -33441014 -29636772 -9028126 10717924
42632A0717924J619526j0361428m971622L423626J81906r150856j1598125o035636
$$ 10717924 12337450 1976022 -2995600 428026 609932 -8540924 -20139049 -26174685
42624b6174685J50548L837437N535122L193462k991473m590984N135891J7642325
$$ -26174685 -26024137 -22186700 -16651578 -13458116 -16449589 -21040573 -15904682 1737643
42616A737643J6985246K273013r005609m399838O904842Q575143J3660o246410
$$ 1737643 18722889 20995902 11990293 7590455 14495297 23070440 23084100 16837690
42608A6837690n160694l773577n607055m532592J589366M140604j592944o006401
$$ 16837690 11676996 7903419 2296364 -2236228 -646862 3493742 1900798 -4105603
42600d105603K41686J0100957J0760842L646272Q4155J534246p09364p594623
$$ -4105603 -3863917 6237040 16997882 20644154 20728309 22262555 21553191 13958568
42592A3958568r539053l143929L466618N011417N516753O788358L819733l256002
$$ 13958568 4419515 1275586 4742204 9753621 15270374 22058732 25878465 22622463
42584B2622463n840742j856268j082520p931431j2026446n573061K661381K582237
$$ 22622463 16781721 14925453 13842933 5911502 -6114944 -11688005 -9026624 -6444387
42576f444387K1147M354613R247348L104079q222326q130767M051637J1603710
$$ -6444387 -6423240 -2068627 7178721 10282800 2060474 -6070293 -2018656 9585054
42568I585054O228273j989032l465388j674030j390217O29137N376676N087175
$$ 9585054 15813327 13824295 10358907 8684877 7294660 7923797 13300473 18387648
42560A8387648l164262q302952j360480P831076L835983r511689j2941608p11028
$$ 18387648 15223386 6920434 5559954 13391030 17227013 7715324 -5226284 -5937312
42552e937312R539001K230645j2903145j4307459J024472J4124166J0841312r52033
$$ -5937312 3601689 5832334 -7070811 -21378270 -20353798 -6229632 4611680 3659647
42544C659647o235866l909757k889859m264850p04645P881198J1384006N018934
$$ 3659647 -2576219 -6485976 -9375835 -13640685 -14345330 -6464132 4919874 9938808
42536I938808l353297o060684n897720p598833q106443l193628L280896N200222
$$ 9938808 6585511 524827 -5372893 -12971726 -21078169 -24271797 -20990901 -15790679
42528a5790679M114671N415005Q739019R399186N723656r84824r177118j4239988
$$ -15790679 -11676008 -6261003 2478016 11877202 17600858 16616034 7438916 -6801072
42520f801072r571940K578693R011420L176150l334350J760431J0708186P424324
$$ -6801072 -16373012 -13794319 -4782899 -1606749 -4941099 -3180668 7527518 14951842
42512A4951842n985274j1859971l878565O424743J0340107J1236194J0339099
$$ 14951842 8966568 -2893403 -6771968 -347225 9992882 21229076 31568175
42505C1568175J508777j3226539j9302578r938306K494066M674633j96801k898726
$$ 31568175 33076952 19850413 547835 -9390471 -6896405 -2221772 -2418573 -5317299
42497e317299m425380r666665j3986726r324741J661057R131796J0039499Q556822
$$ -5317299 -9742679 -19409344 -33396070 -42720811 -41059754 -31927958 -21888459 -13331637
42489a3331637N978785K95643n794107n625603K134094J1021607J3958040R336928
$$ -13331637 -7352852 -7057209 -12851316 -18476919 -16342825 -5321218 8636822 17973750
42481A7973750J200567m053740l422003j105060k561148m600573Q96483J1595235
$$ 17973750 19174317 15120577 11698574 10593514 8032366 3431793 4328276 15923511
42473A5923511J3538461R95927j2751091j2986385l278181K297401n84829n016681
$$ 15923511 29461972 30457899 17706808 4720423 1442242 3739643 3154814 -1861867
42465a861867o205329n092421k312050J128541K35000p278852j3849396j0899780
$$ -1861867 -8067196 -13159617 -15471667 -14343126 -14108126 -21386978 -35236374 -46136154
42457d6136154j278034O228041R944494J2440120J0406356Q36044p128763k186297
$$ -46136154 -47414188 -41186147 -31241653 -18801533 -8395177 -7559133 -14687896 -16874193
42449a6874193R235457R610965k808558j0764557m417530N990611R094725P367135
$$ -16874193 -7638736 1972229 -836329 -11600886 -16018416 -10027805 -933080 6434055
42441F434055N405599o20195j0747395j2488077J465893J6745246J3702609n294909
$$ 6434055 11839654 11219459 472064 -12016013 -10550120 6195126 19897735 14602826
42433A4602826j8867635j3998769J818289J4295541J6778915J0409156k12906
$$ 14602826 -4264809 -18263578 -16445289 -2149748 14629167 25038323 24825417
42426B4825417q597839r821180n032564M07726L138689L430027K423439J302508
$$ 24825417 16227578 6406398 1373834 1781560 4920249 8350276 10773715 12076223
42418A2076223J439839K174709P93995k410834k741560J581544N080717K874340
$$ 12076223 13516062 15690771 16484766 14073932 11332372 12913916 17994633 20868973
42410B0868973j579895k599564j932736m885221r712771q994744p22404Q811410
$$ 20868973 19289078 16689514 14756778 9871557 158786 -8835958 -9558362 -746952
42402g46952J2667299Q346576k677992j4121334j6195427n804993O253531O970809
$$ -746952 11920347 20266923 17588931 3467597 -12727830 -18532823 -12279292 -5308483
42394e308483j229508m353952K092262P728128N363784J922884M984898R094174
$$ -5308483 -6537991 -10891943 -8799681 -1071553 4292231 6215115 11200013 20294187
42386B0294187M754715o040041j2991537j2003968p550604k961670L119214J0532900
$$ 20294187 25048902 19008861 6017324 -5986644 -13537248 -16498918 -13379704 -2846804
42378b846804J4380284R779595k525293j4885365j6656723l720723J3644110J8202259
$$ -2846804 11533480 21313075 18787782 3902417 -12754306 -16475029 -2830919 15371340
42370A5371340N384423j0363621j3978011p388227j373292J931681O528945Q823716
$$ 15371340 20755763 10392142 -3585869 -10974096 -12347388 -10415707 -3886762 4936954
42362D936954J908179q431084q341172K036296P401675K023530j359981N322669
$$ 4936954 6845133 -1585951 -9927123 -7890827 -489152 1534378 174397 5497066
42354E497066J0467454K741215q795339r566196k535581N20439R47036P178220
$$ 5497066 15964520 18705735 9910396 344200 -2191381 -1670942 -723906 6454314
42346F454314J3909574Q836384l146231n156323K129761J06192j4077583j8344230
$$ 6454314 20363888 29200272 26054041 20897718 23027479 23133671 9056088 -9288142
42338i288142r93522J7605193J4814627j346244q291064l190528L94314l43320
$$ -9288142 -10281664 7323529 22138156 20791912 12500848 9310320 9704634 9361314
42330I361314K804209P569261L083287p322932p498464M192414R702163Q1666
$$ 9361314 12165523 19734784 22818071 15495139 7996675 12189089 21891252 21972918
42322B1972918r432314l363642J0419783J3889442M591281n379767r245497j0909367
$$ 21972918 12540604 9176962 19596745 33486187 38077468 32697701 23452204 12542837
42314A2542837j2828419j0234868K37150J2727131J6441991O904839p726648j3341608
$$ 12542837 -285582 -10520450 -10283300 2443831 18885822 25790661 18064013 4722405
42306D722405n581840L509735J78158j1798474j5444129m498420P746332P670267
$$ 4722405 -859435 2650300 2828458 -8970016 -24414145 -28912565 -21166233 -13495966
42298a3495966m86407k863429M495208J2294278J0648516p41120j2800813j4463108
$$ -13495966 -13982373 -16845802 -12350594 -56316 10592200 9851080 -2949733 -17412841
42290a7412841l234873J0149073J2772160N769963J775682N367646P238727J547166
$$ -17412841 -20647714 -10498641 2273519 8043482 9819164 15186810 22425537 23972703
42282B3972703l803246j783948J189255k130188n625827j282577M154247r21428
$$ 23972703 20169457 18385509 19574764 17444576 11818749 10536172 14690419 13768991
42274A3768991j2293018j4583284l763021Q818044J2973973P843013l679281j5528964
$$ 13768991 1475973 -13107311 -16870332 -8052288 4921685 12764698 9085417 -6443547
42266f443547j6378714j612604J4127368J1594779o225686j7533007j2291973
$$ -6443547 -22822261 -24434865 -10307497 1287282 -4938404 -22471411 -34763384
42259c4763384k459936O37791J288874O249348J2977984J7872553K1510260J9555129
$$ -34763384 -37223320 -36585529 -35296655 -29047307 -16069323 1803230 23313490 42868619
42251D2868619M480740j6460091k2717418r854049Q89708m507228r731100L377590
$$ 42868619 47349359 30889268 8171850 -1682199 -792491 -5299719 -15030819 -11653229
42243a1653229K0934025J7164926k767276r043395O779978K0252330J2390037
$$ -11653229 9280796 26445722 23678446 14635051 21415029 41667359 54057396
42236E4057396n601623j4836577j4777097j4011135j1173059m41092J3068134
$$ 54057396 48455773 33619196 18842099 4830964 -6342095 -6783187 6284947
42229F284947J7214442Q428085n551359j5336455j6096130q162148K595307Q001833
$$ 6284947 23499389 31927474 26376115 11039660 -5056470 -13218618 -10623311 -2621478
42221b621478N559725N20196j947238j894366l23088L334280O457925L496843
$$ -2621478 2938247 3458443 1511205 -383161 -706249 2628031 9085956 12582799
42213A2582799m674455r137270n734450j545674k359910k572977L404050Q181309
$$ 12582799 7908344 -1228926 -6963376 -8509050 -10868960 -13441937 -10037887 -1856578
42205a856578K494229o508097l356524J0746731J6874857N600564r093473j0215905
$$ -1856578 637651 -5870446 -9226970 1519761 18394618 23995182 14901709 4685804
42197D685804l96412N678192L124762l46538P24256L327068M081595L796993K275318
$$ 4685804 4289392 9967584 13092346 12745808 13470064 16797132 20878727 24675720 26951038
42188B6951038l342012j1851479j5964866j1155478k158842L285127L732467L231784
$$ 26951038 23609026 11757547 -4207319 -15362797 -17521639 -14236512 -10504045 -7272261
42180g272261M257779N854077O888602O910678N084910K159971J826539N370448
$$ -7272261 -3014482 2839595 9728197 16638875 21723785 23883756 25710295 31080743
42172C1080743O502294j940138j5610788k0133615q434457Q867766J5271526P252914
$$ 31080743 37583037 35642899 20032111 -101504 -8535961 331805 15603331 22856245
42164B2856245l539457n053836K790198J0140268Q312547j555908r681014q011115
$$ 22856245 19316788 14262952 17053150 27193418 35505965 33950057 24269043 16257928
42156A6257928N05069N415724J642387n283442p921041n382816n44910M855244
$$ 16257928 16762997 22178721 23821108 18537666 10616625 5233809 4688899 9544143
42148I544143P884810L838114n435893q969239j086722P296728K821636r064357
$$ 9544143 17428953 21267067 15831174 6861935 5775213 13071941 15893577 6829220
42140F829220j0519622K227415J3538995J1712516L173629j700367l065271m198711
$$ 6829220 -3690402 -1462987 12076008 23788524 26962153 25261786 22196515 17997804
42132A7997804k323080K924901K664220p515401j5681298q754802O900412J4240651
$$ 17997804 15674724 18599625 21263845 13748444 -1932854 -10687656 -3787244 10453407
42124A0453407J0309065P028712R437644R476693L166218j588460M93662K895754
$$ 10453407 20762472 27791184 37228828 46705521 49871739 48283279 48776941 51672695
42116E1672695n82909n649723p074854q421740j3116487j4416610n474738O491416
$$ 51672695 51089786 45440063 38365209 29943469 16826982 2410372 -3064366 3427050
42108C427050Q506847J674040j17784P702486J2149796K349754j2261101j3285150
$$ 3427050 11933897 13607937 13490153 21192639 33342435 35692189 23431088 10145938
42100A0145938J168264J3094619Q287928n491144j0174108j802845N996529K660781
$$ 10145938 11314202 24408821 32696749 27205605 17031497 15228652 21225181 23885962
42092B3885962n167100n407743J198663L975432J01664j560041L889355P951971
$$ 23885962 18718862 13311119 14509782 18485214 18586878 17026837 20916192 28868163
42084B8868163R21940j2890694j9505044j2104143K776355J4508760J7697549
$$ 28868163 29790103 16899409 -2605635 -14709778 -11933423 2575337 20272886
42077B0272886J2242098P21523j0829794j3961844n535942N875427O930640m001857
$$ 20272886 32514984 33236507 22406713 8444869 2908927 8784354 15714994 11713137
42069A1713137j1499448n38639K1857223L0867085J3457581j3632153k2795159
$$ 11713137 213689 -324950 21532273 52399358 65856939 52224786 29429627
42062B9429627p822027J1676003J5974747N272195p153318j2122965j0036889
$$ 29429627 21607600 33283603 49258350 54530545 47377227 35254262 25217373
42055B5217373n238496k67728N967170J5351798K3920067K1297797L622521j5888093
$$ 25217373 19978877 19711149 25678319 41030117 64950184 86247981 89870502 73982409
42047G3982409j9952585j0113960l663712o534784n708361N597257J3682731P749767
$$ 73982409 54029824 43915864 40252152 33717368 28009007 33606264 47288995 55038762
42039E5038762N23532P170728J6938485Q851287j2130284k0171045q078147L753793
$$ 55038762 55562294 62733022 79671507 88522794 76392510 56221465 48143318 51897111
42031E1897111J308789m760140k750359J174206k23457P5850O793071Q291365
$$ 51897111 53205900 48445760 45695401 46869607 46646150 46722000 53515071 61806436
42023F1806436l306282j3333490o186222O851951M440115r012437j0085097M623296
$$ 61806436 58500154 45166664 38980442 45832393 50272508 41260071 31174974 35798270
42015C5798270J3089504M215185o145933l732685K769328J714035j76384O528187
$$ 35798270 48887774 53102959 46957026 43224341 45993669 47707704 47531320 54059507
42007E4059507J2432489L556793j2409763j4899031j611724Q662249M705694l432388
$$ 54059507 66491996 70048789 57639026 42739995 41128271 49790520 54496214 51063826
41999E1063826l338661K593406N855309N649179N644816N610228M428686M708991
$$ 51063826 47725165 50318571 56173880 61823059 67467875 73078103 77506789 82215780
41991H2215780O675280L723884p154629j5611718r060301Q575981J9734673J5409551
$$ 82215780 88891060 92614944 85460315 69848597 60788296 69364277 89098950 104508501
41983A04508501M809519K16060J231759j91367n316626o758058O15907J2317766
$$ 104508501 109318020 109534080 110765839 110574472 105257846 98499788 99115695 111433461
41975A11433461J8294761J2322870j951704j3319406j3055512l501100N391322
$$ 111433461 129728222 142051092 140099388 126779982 113724470 110223370 115614692
41968A15614692P640859N313366J672477k408323l359406M515736J7893214K3099663
$$ 115614692 123255551 128568917 130241394 127833071 124473665 128989401 146882615 169982278
41960A69982278J4541839N500993Q465226J3312968K754414j5673532j6198808
$$ 169982278 184524117 190025110 198490336 211803304 214557718 198884186 182685378
41953A82685378M544778J8843364J0398150Q20269J4062442L4873531L1068229
$$ 182685378 187230156 206073520 216471670 217291939 231354381 266227912 297296141
41946B97296141N649472o374869P586826J9857414Q754099p452003k383763J5270902
$$ 297296141 302945613 296570744 304157570 324014984 332769083 325317080 322933317 338204219
41938C38204219J6585728j831625j4365340o235069P859808R702567K387472j52101
$$ 338204219 354789947 352958322 338592982 332357913 340217721 349920288 352307760 352155659
41930C52155659N202641J0187130Q311324P0436r656033j3451941o361838N401066
$$ 352155659 357358300 367545430 375856754 375927190 366271157 352819216 346457378 351858444
41922C51858444P255244n406195j8022210j4678709J83797Q532343L820321l481881
$$ 351858444 359113688 353707493 335685283 321006574 321190371 329722714 333543035 330061154
41914C30061154n496936p980184j6374581k3159106j9064702q950044m985870
$$ 330061154 324564218 316584034 300209453 277050347 257985645 249035601 244049731
41907B44049731q090441p822180O5622P056292M909625l984867j2594959j7578253
$$ 244049731 235959290 228137110 228202732 235259024 240168649 236183782 223588823 206010570
41899B06010570j7628217j1084489p77228M749454Q57526o988472j1770127j4043599
$$ 206010570 188382353 177297864 176520636 181270090 182127616 175139144 163369017 149325418
41891A49325418j6296028j4664958n761828K798369L50629r522317j1367221P36697
$$ 149325418 133029390 118364432 112602604 115400973 115751602 106229285 94862064 95598761
41883I5598761J4601183J6113141M965918r616802k0137334k2705238j5612806
$$ 95598761 110199944 126313085 131279003 121662201 101524867 78819629 63206823
41876F3206823k731854O911873Q323409M853263L66037n614109j0935946q686252
$$ 63206823 60474969 67386842 75710251 80563514 80929551 75315442 64379496 55693244
41868E5693244N31521L787047o079630j5939327r517552P111198J3233468L763429
$$ 55693244 56224765 60011812 53932182 37992855 28475303 35586501 48819969 52583398
41860E2583398n798443n405728l049696o202618q497850m411169j504835n187734
$$ 52583398 46784955 41379227 38329531 32126913 23629063 19217894 17713059 12525325
41852A2525325m741276R095563K2779786J6055674n289446j4043624n44191J3391282
$$ 12525325 7784049 16879612 39659398 55715072 50425626 36382002 35837811 49229093
41844D9229093P158484r543945j3410031j182172R580388P917922J421452L7895
$$ 49229093 56387577 46843632 33433601 32251429 41831817 49749739 51171191 51209086
41836E1209086J655863n87994n637765o548344j166218N159141O140922K04692
$$ 51209086 52864949 52276955 46639190 40090846 38924628 44083769 50224691 50429383
41828E0429383r026725j4963382j2382739k783491N648514O417247J864174j309261
$$ 50429383 41402658 26439276 14056537 11273046 16921560 23338807 25202981 23893720
41820B3893720j758537l325872n910616m163325K226359N089221P03306j253168
$$ 23893720 22135183 18809311 12898695 8735370 10961729 16050950 16754256 15501088
41812A5501088Q153613J8809093J1622850j2087044k6469561j4034621R712281
$$ 15501088 23654701 42463794 54086644 41999600 15530039 1495418 11207699
41805A1207699J6661205K862401j0006681o580950M773887Q780177L382625l370037
$$ 11207699 27868904 30731305 20724624 14143674 18917561 27697738 31080363 27710326
41797B7710326o181750m494676J072955O853429O408698m71822m485214L65378
$$ 27710326 21528576 17033900 18106855 24960284 31368982 30897160 26411946 26777324
41789B6777324O260158K614750p015864r804360l320007J171601l802154j1652636
$$ 26777324 33037482 35652232 28636368 18832008 15512001 16683602 12881448 1228812
41781A228812j2573456o227810J090061N520952O946190N970745M102362L626042
$$ 1228812 -11344644 -17572454 -16482393 -10961441 -4015251 1955494 6057856 9683898
41773I683898M242367L233829R12453J070296L572284K544237l820206p692837
$$ 9683898 13926265 17160094 18072547 19142843 22715127 25259364 21439158 13746321
41765A3746321k242345O742719P747941n5814n384842m33006Q912584J1143890
$$ 13746321 11503976 18246695 25994636 25938822 20553980 20120974 29033558 40177448
41757D0177448L191655o721141q645465j240161P429716Q834069K817328l702411
$$ 40177448 43369103 36647962 28002497 26762336 34192052 43026121 45843449 42141038
41749D2141038n690508m274142k263876m00092K33013k537345o828323n895096
$$ 42141038 36450530 32176388 29912512 29512420 29745433 27208088 20379765 14484669
41741A4484669K556313J0332201P850087l459729j3351377j4931186r201076j90791
$$ 14484669 17040982 27373183 35223270 31763541 18412164 3480978 -5720098 -5910889
41733e910889P830640R997558M925631q66554Q89739Q701119J1575991K648772
$$ -5910889 1919751 11917309 16842940 15976386 16866125 25567244 37143235 39792007
41725C9792007j1399728j6626324o305574J0826715J7089977M181628j4569704
$$ 39792007 28392279 11765955 5460381 16287096 33377073 37558701 22988997
41718B2988997j7027321j9403J4962552J0106294n292317j0815529m512541m86441
$$ 22988997 5961676 5942273 20904825 31011119 25718802 14903273 10390732 9904291
41710I904291l374162m571219k215333m609644j0927189q244151N618475J4373269
$$ 9904291 6530129 1958910 -256423 -4866067 -15793256 -24037407 -18418932 -4045663
41702d045663P613493l105551l361640L276227N771095M317922M563657L297401
$$ -4045663 3567830 462279 -2899361 376866 6147961 10465883 15029540 18326941
41694A8326941n056692j4245892j2546809J64528J2466653J5255583P647520n652397
$$ 18326941 13270249 -975643 -13522452 -13357924 -891271 14364312 22011832 16359435
41686A6359435j5373891j2789999j468450L713826l346847j0628567p034838J202123
$$ 16359435 985544 -11804455 -13272905 -9559079 -12905926 -23534493 -30569331 -29367208
41678b9367208M040229M412034P558271O874239k460553q278475J60188J0155733
$$ -29367208 -25326979 -20914945 -13356674 -6482435 -8942988 -17221463 -17061275 -6905542
41670f905542M916626n673341o73573J3513339J1835527n214182j0520369K801880
$$ -6905542 -1988916 -7662257 -8335830 5177509 17013036 11798854 1278485 4080365
41662D080365Q728529o328154j8944160p858457J0835116J1088743k551811p349825
$$ 4080365 12808894 6480740 -12463420 -20321877 -9486761 1601982 -949829 -8299654
41654h299654L29380N744960M015305L697932O825760N692260j799408q958913
$$ -8299654 -7970274 -2225314 1789991 5487923 12313683 18005943 16206535 7247622
41646G247622j1351895r776413n269291m31392o40775n460187n802069K256912
$$ 7247622 -4104273 -13880686 -19149977 -19581369 -20222144 -25682331 -31484400 -29227488
41638b9227488J0196246J2077830J4253374J8920229J3388866p450049k2689544
$$ -29227488 -19031242 -6953412 7299962 26220191 39609057 32159008 9469464
41631I469464j1870660J0965577J5391876K61588o874383M998188J5043015O761476
$$ 9469464 -2401196 8564381 23956257 24217845 17343462 22341650 37384665 44146141
41623D4146141p269778r040332j832839J849642K443866O746759J0753175N831761
$$ 44146141 36876363 27836031 26003192 27852834 30296700 37043459 47796634 53628395
41615E3628395m549161r185746o799359o188015r769219r128381L81697J0044031
$$ 53628395 49079234 39893488 33094129 26906114 17136895 8008514 8390211 18434242
41607A8434242Q685613j531615p117321j040933P840031P592735R83422J636104
$$ 18434242 27119855 25588240 18470919 17429986 25270017 32862752 33846174 35482278
41599C5482278J2514679J9100064R484872p987485j5881358r834849J26370N446302
$$ 35482278 47996957 67097021 76581893 68594408 52713050 42878201 43004571 48450873
41591D8450873N775700L144966k08341j49338L776322L491328o834244j7612125
$$ 48450873 54226573 57371539 57163198 57013860 60790182 64281510 57447266 39835141
41583C9835141j3272205N371283J9929382J7543475N051590k714519k07703O599638
$$ 39835141 26562936 31934219 51863601 69407076 74458666 71744147 71536444 78136082
41575G8136082Q912874L150941o143004j1070111j0027194q959029j0278897q034162
$$ 78136082 87048956 90199897 84056893 72986782 62959588 54000559 43721662 35687500
41567C5687500J91356O019066L861204J602679O032244Q563637O14743p832059
$$ 35687500 35878856 41897922 45759126 47361805 53394049 61957686 62572429 54740370
41559E4740370m069988L105488k007980j1681311o421642Q049120O803383j0911600
$$ 54740370 50670382 53775870 51767890 40086579 33664937 41714057 48517440 37605840
41551C7605840j7498961k603734J0088095L462747o943094l880428L374138J810835
$$ 37605840 20106879 17503145 27591240 31053987 24110893 20230465 23604603 25415438
41543B5415438K17464R187154J7139905R825235m320585j0585103j2239489j6353190
$$ 25415438 25632902 34820056 51959961 61785196 57464611 46879508 34640019 18286829
41535A8286829j3990226O29964R243348l950272k0566660j3651492P896464J3862916
$$ 18286829 4296603 4926567 14169915 10219643 -10347017 -23998509 -16102045 -2239129
41527b239129K316884j149713J0264537J5579461N495372l546279j374444R72932
$$ -2239129 77755 -1071958 9192579 24772040 30267412 26721133 25346689 26319621
41519B6319621k712138j620356P130906Q047377m861973j3714917n279334P367334
$$ 26319621 23607483 21987127 29118033 37165410 32303437 18588520 13309186 20676520
41511B0676520P895852K608603N337720J1794313Q282210m009538j1222418p716049
$$ 20676520 28572372 31180975 36518695 48313008 56595218 52585680 41363262 33647213
41503C3647213n22935L451308L633115J550404j962062o993810j4685585k2715328
$$ 33647213 33124278 36575586 40208701 41759105 39797043 32803233 18117648 -4597680
41495d597680k1333153l907234J7698911K1601908M112541j3641331j3232448
$$ -4597680 -25930833 -29838067 -12139156 9462752 13575293 -66038 -13298486
41488a3298486j44091R526600J0383606O709392J959911p36162K479353P778296
$$ -13298486 -13442577 -3915977 6467629 13177021 15136932 14400770 16880123 24658419
41480B4658419M188464q945658j6330560q458103K728069K092736n453857m464668
$$ 24658419 28846883 19901225 3570665 -4887438 -2159369 -66633 -5520490 -9985158
41472i985158O183313J3130581Q896127q37052p487235o329886L567747J6130710
$$ -9985158 -3801845 9328736 18224863 17387811 9900576 3570690 7138437 23269147
41464B3269147J8892530O677777r289950j5180868j2227755j0440897j0884420
$$ 23269147 42161677 48839454 39549504 24368636 12140881 1699984 -9184436
41457i184436p370087j632940j943576p177040o271055M315068J4529551J5477565
$$ -9184436 -16554523 -18187463 -20131039 -27308079 -33579134 -29264066 -14734515 743050
41449G43050J0253675O047010L967719J819452O65377K683666N392745L173163
$$ 743050 10996725 17043735 21011454 22830906 23496283 26179949 31572694 34745857
41441C4745857m870802j1109108o464950P258257J5598711P500001q812602j4443975
$$ 34745857 29875055 18765947 12300997 19559254 35157965 42657966 33845364 19401389
41433A9401389m604930N698867L912678l733327m936867L07427L605125K075628
$$ 19401389 14796459 20495326 24408004 20674677 15737810 16045237 19650362 21725990
41425B1725990j793808p353367j2771310j1101101L10342J2141452J4846428J1985621
$$ 21725990 19932182 12578815 -192495 -11293596 -10983254 1158198 16004626 27990247
41417B7990247J1335649R918516J188609q663850p103523M338669J0611512L882495
$$ 27990247 39325896 49244412 50433021 41769171 34665648 39004317 49615829 53498324
41409E3498324q708570j7409416j8066835r251440N993921J5883074J0261943
$$ 53498324 44789754 27380338 9313503 62063 6055984 21939058 32201001
41402C2201001m033467j0065204l286398M795756N216452P87320l706704o972766
$$ 32201001 28167534 18102330 14815932 19611688 24828140 25615460 21908756 14935990
41394A4935990n662207K833295J0435449N800106n985884o938798O407394J5631276
$$ 14935990 9273783 12107078 22542527 28342633 22356749 15417951 21825345 37456621
41386C7456621P399477p954332j4112867j0835737p271676n345316k170141J49591
$$ 37456621 44856098 36901766 22788899 11953162 4681486 -663830 -2833971 -2684380
41378b684380r02282p69858M607056R762069P539885L12673m816881o038553m594707
$$ -2684380 -3586662 -4356520 250536 10012605 17552490 17865163 13048282 7009729 2415022
41369B415022M74321P363345Q642043K043249l123058O89233P112290O759927
$$ 2415022 2889343 10252688 18894731 20937980 17814922 18504155 25616445 32376372
41361C2376372K074000j17244k590453j0234539j5437394p527126P006708J1265537
$$ 32376372 34450372 34333128 31742675 21508136 6070742 -1456384 5550324 16815861
41353A6815861L991786Q26363P458153J0306274R20849p782363j990157R220398
$$ 16815861 20807647 21634010 29092163 39398437 40319286 32536923 30546766 39767164
41345C9767164O244498j1485574k4214512j9403235o544033n73809j669590K22248
$$ 39767164 46011662 34526088 10311576 -9091659 -15635692 -16209501 -17879091 -17656843
41337a7656843O984072R152266J569092o992478n468582L626586Q049754L838502
$$ -17656843 -10672771 -1520505 48587 -6943891 -12412473 -8785887 -736133 3102369
41329C102369K9600L021865N906571P25847n899634r61886J3136914J7802902
$$ 3102369 3131969 6153834 12060405 12786252 6886618 5924732 19061646 36864548
41321C6864548L410300j5205462j7023445k422975Q433065L452372o829684o777578
$$ 36864548 40274848 25069386 8045941 5622966 14056031 17508403 10678719 3901141
41313C901141K233848O622977J978992k445470m15129K172973q62231n310698
$$ 3901141 6134989 12757966 14736958 12291488 11876359 14049332 13187101 7876403
41305G876403m821066j630690o36451K47676M020944N100723k233246j0438189
$$ 7876403 3055337 1424647 788196 1035872 5056816 10157539 7924293 -2513896
41297b513896p431452L487760P223847O01534l160218L065194Q980060M725953
$$ -2513896 -9945348 -6457588 766259 1367793 -1792425 1272769 10252829 14978782
41289A4978782l633492n290095k89949M892287P743862P264252N25966r753518
$$ 14978782 11345290 6055195 5765246 10657533 18401395 25665647 26191613 16438095
41281A6438095j3530425q007858l831514p142482p029896O011533J9918068J6383113
$$ 16438095 2907670 -5100188 -8931702 -16074184 -23104080 -17092547 2825521 19208634
41273A9208634o94943j0418912n161154K575696K987675M88025m62511l888465
$$ 19208634 18513691 8094779 2933625 5509321 8496996 8985021 8522510 4634045
41265D634045r955226q341341O226759K1064698J8529745j697655k0681879k0134540
$$ 4634045 -5321181 -13662522 -7435763 13628935 32158680 30461025 9779146 -10355394
41257a0355394j193116J6539306J4869580l312067j7111238j2499175J456795
$$ -10355394 -11548510 4990796 19860376 16548309 -562929 -13062104 -11605309
41250a1605309O594493l91504p201884n016489K572008Q445224R631164O008930
$$ -11605309 -5010816 -5402320 -12604204 -17620693 -15048685 -6603461 3027703 9036633
41242I036633R1002k110664K008132N428719R91835n584661l391781M814276M915653
$$ 9036633 9127635 7016971 9025103 14453822 15445657 9860996 6469215 11283491 16199144
41233A6199144o504523j6032764j2780236j695084O726022Q889462N750692j283864
$$ 16199144 9694621 -6338143 -19118379 -20813463 -14087441 -5197979 552713 -731151
41225g31151o976260m523644L882598P978523M846364K950764O387532P213995
$$ -731151 -7707411 -12231055 -8348457 -369934 4476430 7427194 13814726 21028721
41217B1028721M17437n398045j935483M142274J715817o883706j0003519m224909
$$ 21028721 21446158 16048113 14112630 18254904 19970721 13087015 3083496 -1141413
41209a141413K776848M557146K186664p01028k048059p54157L161655P591015
$$ -1141413 1635435 6192581 8379245 7678217 5630158 4876001 8037656 15628671
41201A5628671R582365O766289j661130j1708529j4267889m932602P157052R174406
$$ 15628671 25211036 31977325 30316195 18607666 4339777 -592825 6564227 15738633
41193A5738633K204082k328103k825872q351958j6942289j2362300Q587150K3790163
$$ 15738633 17942715 15614612 12788740 4436782 -12505507 -24867807 -16280657 7509506
41185G509506J4858704o269925j5694765r984303k545699J655948O972688R235228
$$ 7509506 22368210 16098285 403520 -9580783 -12126482 -10470534 -3497846 5737382
41177E737382p90875j6986316k0775715p039201R094596J4318959J1399804P821679
$$ 5737382 4946507 -12039809 -32815524 -39854725 -30760129 -16441170 -5041366 2780313
41169B780313L883517k329342q401433j1068865r128849j275298J1089998J8873858
$$ 2780313 6663830 4334488 -4066945 -15135810 -24264659 -25539957 -14449959 4423899
41161D423899J2996497j776479j0449603o760712Q93930L745533K774018K300853
$$ 4423899 17420396 15643917 5194314 -1566398 -672468 3073065 5847083 8147936
41153H147936L131100N113439Q249123R007002L470607m622861p506616n636774
$$ 8147936 11279036 16392475 24641598 33648600 37119207 32496346 24989730 19352956
41145A9352956o648053j1370952j1932794n696478L23585J697454J644918R23683
$$ 19352956 12704903 1333951 -10598843 -16295321 -15971736 -14274282 -12629364 -11705681
41137a1705681m433073j0894575p128463O883244J4476569O158682m201714j42259
$$ -11705681 -16138754 -27033329 -34161792 -27278548 -12801979 -6643297 -10845011 -10987270
41129a0987270J1423777J1264432k053910j0955054o052622K501001L876832K052572
$$ -10987270 436507 11700939 9647029 -1308025 -7360647 -4859646 -982814 1069758
41121A069758N279886J0744035R625635K220519k055430O01840K366453l627403
$$ 1069758 6349644 17093679 26719314 28939833 26884403 27486243 29852696 26225293
41113B6225293j0948596p899253L998931R296932k02622j2626937j2052819l24877
$$ 26225293 15276697 7377444 11376375 20673307 20470685 7843748 -4209071 -4533948
41105d533948P869310P321308O469691R740961R635045N25501j0942165j5055362
$$ -4533948 3335362 10656670 17126361 26867322 36502367 37027868 26085703 11030341
41097A1030341j0318464j010292Q257395J1285234K741773j2330509j9672265
$$ 11030341 711877 -298415 7958980 19244214 21985987 9655478 -10016787
41090a0016787j2605724k77023O189323O987750O609993L466329l702786p262731
$$ -10016787 -22622511 -22899534 -16710211 -9722461 -3112468 353861 -3348925 -10611656
41082a0611656n44880Q758726P324652l853439r922468l242420O138149M762747
$$ -10611656 -11156536 -2397810 4926842 1073403 -8849065 -12091485 -5953336 -1190589
41074a190589o039964j1600530k355240J2992183J6467726L609159q964523n047450
$$ -1190589 -7230553 -18831083 -21186323 -8194140 8273586 11882745 2918222 -2129228
41066b129228Q255511J1203409J362032m381240N88848J167032j2373530k4605955
$$ -2129228 6126283 17329692 18691724 14310484 14899332 16066364 3692834 -20913121
41058b0913121j7174571L326386J6366065J5713180R901307L615528l474908o072306
$$ -20913121 -38087692 -34761306 -18395241 -2682061 7219246 10834774 7359866 1287560
41050A287560M93250P996483O054364J46224J683851N863282l10739j1855338
$$ 1287560 1780810 9777293 15831657 15977881 17661732 23525014 23214275 11358937
41042A1358937j0567199M256884J3318214Q755924M609412Q889900Q107614q073326
$$ 11358937 791738 5048622 18366836 27122760 31732172 40622072 48729686 40656360
41034D0656360k5345420k3094706k267433J7844782K2041296R396503j0040086
$$ 40656360 15310940 -7783766 -10051199 7793583 29834879 39231382 29191296
41027B9191296k1058613j4669392K08752N668989r61221m549010K164423P017600
$$ 29191296 8132683 -6536709 -6327957 -658968 -1620189 -6169199 -4004776 3012824
41019C012824O92735o965853n348114j917822p128712j3754986q730560M354270
$$ 3012824 3705559 -3260294 -8608408 -10526230 -17654942 -31409928 -40140488 -35786218
41011c5786218J2124939J2900478J3817488J3099398L961431p356695o433582
$$ -35786218 -23661279 -10760801 3056687 16156085 20117516 12760821 6327239
41004F327239O018229J2392229K919925j1180812j3595294k244658J1157440J4434667
$$ 6327239 12345468 24737697 27657622 16476810 2881516 636858 11794298 26228965
40996B6228965N570994o133416r713660n034975j431435k626919k214697K032621
$$ 26228965 31799959 25666543 15952883 10917908 9486473 6859554 4644857 6677478
40988F677478K069003m382212n862022L075010Q917299J426921o398269o66986
$$ 6677478 8746481 4364269 -1497753 1577257 10494556 11921477 5523208 4856222
40980D856222N917152m963690k0569053j3450371J1114466J9368934K481562j0258614
$$ 4856222 10773374 5809684 -14759369 -28209740 -17095274 2273660 4755222 -5503392
40972e503392m28210J2118228O498503n728250n447184J491354N06206l566577
$$ -5503392 -5931602 6186626 12685129 6956879 1509695 3001049 3507255 -59322
40964e9322P79418P224026M294708r14366M129816J1776187O005134q927632j5522071
$$ -59322 720096 7944122 12238830 11324464 15454280 27230467 33235601 24307969 8785898
40955H785898j1601677q356923o224959K474254J1136137N288437r249912j0334698
$$ 8785898 -2815779 -11172702 -17397661 -14923407 -3787270 1501167 -7748745 -18083443
40947a8083443N745648J7597778J1682447m63450m428684j647375J601644M915148
$$ -18083443 -12337795 5259983 16942430 16478980 12050296 10402921 12004565 16919713
40939A6919713N753426j407615j0720841q120324L942236N240524r264352j7220989
$$ 16919713 22673139 21265524 10544683 2424359 6366595 11607119 2342767 -14878222
40931a4878222l772011J2564624Q052962r784879j6190018o822884K078663K839215
$$ -14878222 -18650233 -6085609 1967353 -7817526 -24007544 -30830428 -28751765 -25912550
40923b5912550K311340K920834k95992m539020n97406R590195J3369817O486012
$$ -25912550 -23601210 -20680376 -20976368 -25515388 -26112794 -16522599 -3152782 3333230
40915C333230k861096q724308j1321974p709936M356613J3644056N771741j1443772
$$ 3333230 472134 -8252174 -19574148 -27284084 -22927471 -9283415 -3511674 -14955446
40907a4955446j3391364N035479J9321888J1063670o094682j0061639k295318
$$ -14955446 -28346810 -23311331 -3989443 7074227 979545 -9082094 -11377412
40900a1377412J575462l62644J642909P026564N720449j917559m822595j042403
$$ -11377412 -9801950 -10164594 -8521685 -1495121 4225328 2307769 -2514826 -3557229
40892c557229q46166p770406j2168362p931305j528991J450360N656125J3904758
$$ -3557229 -4403395 -12173801 -24342163 -32273468 -33802459 -32352099 -26695974 -12791216
40884a2791216J7446309R051525k671391m230254K472657L329055o121240j4150379
$$ -12791216 4655093 13706618 11035227 6804973 9277630 12606685 6485445 -7664934
40876g664934j0108133J916006J0855626J2190330Q486416K713465k578886l589832
$$ -7664934 -17773067 -15857061 -5001435 7188895 15675311 18388776 15809890 12220058
40868A2220058N43110M226102K073848l030498m935391n008163r300574j5411813
$$ 12220058 12763168 16989270 19063118 16032620 11097229 6089066 -3211508 -18623321
40860a8623321j2867359P6898J0560813Q783722K231231K611588O328634J223382
$$ -18623321 -31490680 -31413782 -20852969 -12069247 -9838016 -7226428 -897794 325588
40852C25588j1062738j4743647l529074R317735J0221282L509407K375420R303885
$$ 325588 -10737150 -25480797 -29009871 -19692136 -9470854 -5961447 -3586027 5717858
40844E717858J4437770R781798k146688j2361070j3740895o919076j20654m28906
$$ 5717858 20155628 29937426 27790738 15429668 1688773 -5230303 -5350957 -5779863
40836e779863m514226l163157M404596Q834079N677071J904661J819804k079875
$$ -5779863 -10294089 -13457246 -9052650 -218571 5458500 7363161 9182965 7103090
40828G103090j3850889j9931090n703010J8779792K6830976R805316j1573408
$$ 7103090 -6747799 -26678889 -32381899 -13602107 13228869 23034185 11460777
40821A1460777j5097311l360817N263676K306623l778200k157089O821833J2847753
$$ 11460777 -3636534 -6997351 -1733675 572948 -3205252 -5362341 1459492 14307245
40813A4307245P390684n882583j3281485o482376O025737Q562383j342454r689979
$$ 14307245 21697929 15815346 2533861 -3948515 2077222 10639605 9297151 -392828
40805c92828m894004P560628J3346881O521048o025343j3466636j0561586j187732
$$ -392828 -5286832 2273796 15620677 22141725 16116382 2649746 -7911840 -9099572
40797i099572M948597J866124n208767n966014N60802L957895k360196j0739769
$$ -9099572 -4150975 -2284851 -7493618 -13459632 -12898830 -8940935 -11301131 -22040900
40789b2040900r664885N09884Q983976Q788347K900307k657172n189157m095019
$$ -22040900 -31705785 -31195901 -22211925 -13423578 -10523271 -13180443 -18369600 -22464619
40781b2464619Q46409P007907Q468761K274624n746571n616545M533203J3888786
$$ -22464619 -21618210 -14610303 -6141542 -3866918 -9613489 -15230034 -10696831 3191955
40773C191955J0457008m206837j6511199j6760977p725927L117554J1582453J3903503
$$ 3191955 13648963 9442126 -7069073 -23830050 -31555977 -28438423 -16855970 -2952467
40765b952467N840191p975319j2690976j458008J2192896J1754984P90078n037347
$$ -2952467 2887724 -5087595 -17778571 -19236579 -7043683 4711301 5501379 464032
40757D64032k583236r37876j028464M156833R759342J834926j6255653k2578579
$$ 464032 -2119204 -3057080 -4085544 71289 9830631 11665557 -4590096 -27168675
40749b7168675r277414M992432N309384J602140O099947J0882567N862928N07673
$$ -27168675 -36446089 -31453657 -26144273 -24542133 -18442186 -7559619 -1696691 -1189018
40741a189018O420850J3614691P199877m732927m491198L642781J350788j0362093
$$ -1189018 5231832 18846523 26046400 21313473 16822275 20465056 21815844 11453751
40733A1453751j2855774l027476J828004n281657r828055p21562J4044569K2336534
$$ 11453751 -1402023 -4429499 -2601495 -7883152 -17711207 -18432769 -4388200 17948334
40725A7948334K0626943Q115546j3251080k8956697k1802679K331439J7099400
$$ 17948334 38575277 46690823 33439743 4483046 -17319633 -14988194 2111206
40718B111206J0400437j880126l425989R63115P97694k053127k739683m608724
$$ 2111206 12511643 10631517 7205528 8168643 8966337 6913210 4173527 -435197
40710d35197q771409p119356K336806P263878L01240p114838k984738O185642
$$ -435197 -9206606 -16325962 -13989156 -6725278 -6424038 -13538876 -16523614 -10337972
40702a0337972P955930L606540J451348J299211p81487j918866N72752J219851
$$ -10337972 -2382042 1224498 2675846 3975057 3193570 1274704 1847456 3067307
40694C067307k809099l521041L393793P616450P25570q482996q963955m848341
$$ 3067307 258208 -3262833 130960 7747410 8472980 -10016 -8973971 -13822312
40686a3822312l189553J258390J1573058J4160710J37960j2627540l661062J5312200
$$ -13822312 -17011865 -15753475 -4180417 9980293 10118253 -2509287 -6170349 9141851
40678I141851J6867397L94128j0997445r912065r770924j3103151p504577M905489
$$ 9141851 26009248 26403376 15405931 5493866 -4277058 -17380209 -24884786 -19979297
40670a9979297O580823j755763J011431J6836815K0341110K693095j0068511p33454
$$ -19979297 -13398474 -15154237 -14142806 2694009 23035119 25728214 15659703 14926249
40662A4926249R530183m54667j3666025n941732Q955685K021047j8968195j9621997
$$ 14926249 24456432 24001765 10335740 4394008 13349693 15370740 -3597455 -23219452
40654b3219452M692838K1041692J0486256p055997r174472k336845j512038k307468
$$ -23219452 -18526614 2515078 13001334 5945337 -3229135 -5565980 -7078018 -9385486
40646i385486O313688J6873220J2507528n218538j6326838r883139L089178P259583
$$ -9385486 -3071798 13801422 26308950 21090412 4763574 -5119565 -2030387 5229196
40638E229196K422834j107529M08665P14270l762993o686984j977884M633855
$$ 5229196 7652030 6544501 6953166 7667436 3904443 -2782541 -4760425 -126570
40630a26570K255831q803899j6066094j1420303m30244P470790R859863Q481206
$$ -126570 2129261 -6674638 -22740732 -34161035 -34591279 -27120489 -17260626 -8779420
40622h779420L983276o88188N78170P454945R734850J315582r183829j0661951
$$ -8779420 -4796144 -5484332 -4906162 2548783 12283633 13599215 4415386 -6246565
40614f246565n620347l414515l796731l68641M128203J574217l970819L32019
$$ -6246565 -11866912 -15281427 -19078158 -19446799 -15318596 -13744379 -17715198 -17383179
40606a7383179J2539245J3531329l895654j9538023j2488889Q355649J6967397
$$ -17383179 -4843934 8687395 4791741 -14746282 -27235171 -18879522 -1912125
40599a912125O951896k900899J09155M639016l163227j5071007j2697309L031608
$$ -1912125 5039771 2138872 2248027 6887043 3723816 -11347191 -24044500 -21012892
40591b1012892J1497956K464560r303191o898367L961638N821723k354122m033727
$$ -21012892 -9514936 -7050376 -16353567 -23251934 -19290296 -13468573 -15822695 -19856422
40583a9856422Q305478K0877250J8371136M399610n911214n831147q85989K073550
$$ -19856422 -11550944 9326306 27697442 32097052 26185838 20354691 19468702 21542252
40575B1542252J245064k185544n771903o800901n851873o751508r328917o795018
$$ 21542252 22787316 20601772 14829869 8028968 2177095 -4574413 -13903330 -20698348
40567b0698348M202456J5470407J6434242Q351515J699703J207678J572002j938668
$$ -20698348 -16495892 -1025485 15408757 23760272 25459975 26667653 28239655 26300987
40559B6300987o334905o526826k598446J229218J748058q21525l507281k920547
$$ 26300987 19966082 13439256 10840810 12070028 13818086 12996561 9489280 6568733
40551F568733J588491O873595Q720049N132687k536219r567363j0046365l184713
$$ 6568733 8157224 15030819 23750868 28883555 26347336 16779973 6733608 3548895
40543C548895L347212K074139l182882k852994K184083J431003n891371o453936
$$ 3548895 6896107 8970246 5787364 2934370 5118453 6549456 658085 -5795851
40535e795851N300505J5088904R868147j443277k507565N379881Q823572M811649
$$ -5795851 -495346 14593558 24461705 23018428 20510863 25890744 34714316 39525965
40527C9525965M25045l534354j0241218j3023080l585467Q768539O745706p131842
$$ 39525965 39951010 36416656 26175438 13152358 9566891 18335430 25081136 17949294
40519A7949294j3609558p667859l175314m502233M08410J2057608J2023982m151613
$$ 17949294 4339736 -3328123 -6503437 -11005670 -10597260 1460348 13484330 9332717
40511I332717j3350149j492773J1020477K638845j2867367j0593936K972957L800290
$$ 9332717 -4017432 -5510205 5510272 8149117 -4718250 -15312186 -12339229 -8538939
40503h538939n320056o9460J9476761K4888408O577806q991746j950226J0456074
$$ -8538939 -13858995 -13928455 5548306 30436714 37014520 28022774 26072548 36528622
40495C6528622M465847j2386624j6737833o931577j148640o063015r415938k007900
$$ 36528622 40994469 28607845 11870012 4938435 3789795 -2273220 -11689158 -13697058
40487a3697058J0399471J7760745J5245180K523094j4366238k1547451j0746077
$$ -13697058 -3297587 14463158 29708338 32231432 17865194 -3682257 -14428334
40480a4428334N797354P588715n522425j2235092j701773J0123171O114711n216990
$$ -14428334 -8630980 -1042265 -6564690 -18799782 -20501555 -10378384 -4263673 -9480663
40472i480663m687788O063992Q213409k511345q862741m54469J0105716Q547797
$$ -9480663 -14168451 -8104459 108950 -2402395 -11265136 -11719605 -1613889 6933908
40464F933908N49402r58603J852101k070193j1092958j2426854l290222M930482
$$ 6933908 7483310 6524707 8376808 6306615 -4786343 -17213197 -20503419 -15572937
40456a5572937N118421L443089O251334R557275P135582L28540n788439r375524
$$ -15572937 -10454516 -7011427 -760093 8797182 15932764 16261304 10472865 1097341
40448A097341j0331671p594690j948034L325913P215386J1324589J4130602J1526013
$$ 1097341 -9234330 -16829020 -18777054 -15451141 -8235755 3088834 17219436 28745449
40440B8745449M681084k35896k172146o318674j2282596j1240254l55337R367424
$$ 28745449 33426533 33190637 31018491 24699817 12417221 1176967 821630 10189054
40432A0189054P037073l629874j0987548j0269825m883310J068606M753318M385107
$$ 10189054 17226127 13596253 2608705 -7661120 -12544430 -11475824 -6722506 -2337399
40424b337399K689697M841125Q561930M561602p550294j3885327n217780Q291839
$$ -2337399 352298 5193423 13755353 18316955 10766661 -3118666 -8336446 -44607
40416d4607J1438721M305371k734155n804058o868835l978067M147563R923997
$$ -44607 11394114 15699485 12965330 7161272 292437 -3685630 461933 10385930
40408A0385930O715346Q56705O44844Q16914o583844j3898837r207182P04009
$$ 10385930 17101276 17957981 18602825 19419739 12835895 -1062942 -10270124 -9566115
40400i566115L03757o523442k690744R673008J0236234l591881j0252878q47603
$$ -9566115 -9262358 -15785800 -18476544 -8803536 1432698 -2159183 -12412061 -13259664
40392a3259664O464540R30978q40626J2262915J9981341K979610k0276058j8854021
$$ -13259664 -6795124 -5864146 -6704772 5558143 25539484 28519094 8243036 -10610985
40384a0610985K397347J1325552j820382j4143813r140042K632778P119737O664676
$$ -10610985 -8213638 3111914 1291532 -12852281 -21992323 -19359545 -12239808 -5575132
40376e575132P635478P406334L368078K40750K33686j373736m462136j382246
$$ -5575132 2060346 9466680 12834758 13075508 13309194 11935458 7473322 6091076
40368F091076O974621O708574p657037k0164126j4258546L281308J2761154Q769362
$$ 6091076 13065697 19774271 12117234 -8046892 -22305438 -19024130 -6262976 2506386
40360B506386K729744K390709L400465J261427j361541k295233m603275r410007
$$ 2506386 5236130 7626839 11027304 12288731 10927190 8631957 4028682 -5381325
40352e381325j1727141p876259r93437M744700R280778J1725574P169587m485975
$$ -5381325 -17108466 -24984725 -25978162 -21233462 -11952684 -227110 6942477 2456502
40344B456502j2354088p143019L273269K788779q331764j1452318K791045J8345202
$$ 2456502 -9897586 -17040605 -13767336 -10978557 -19310321 -30762639 -27971594 -9626392
40336i626392J5831204K00387q240017l775194R91422p78515j266872L327006
$$ -9626392 6204812 6405199 -1834818 -5610012 -4618590 -5397105 -6663977 -3336971
40328c336971L475121n570849j1642838l653146R839132J3178472N972939l89283
$$ -3336971 138150 -5432699 -17075537 -20728683 -10889551 2288921 8261860 7872577
40320G872577j408178p09589J732662P705812J0627456K620840r566414j0651979
$$ 7872577 6464399 5754810 7487472 15193284 25820740 28441580 18875166 8223187
40312H223187Q10008J0478417R805962M951323J784136k553940q225106p877375
$$ 8223187 9033195 19511612 29317574 34268897 36053033 33499093 25273987 17396612
40304A7396612m79104L725500L66235n93251O135392P589147p159655k4060554
$$ 17396612 16917508 20643008 21009243 20415992 26551384 34140531 26980876 2920322
40296B920322k0191677J986404J5462354M875341j4428508j8734050m997538R935319
$$ 2920322 -17271355 -15284951 177403 5052744 -9375764 -28109814 -33107352 -23172033
40288b3172033J1572865J728082o843390m780383M809757J0647410O775974o94989
$$ -23172033 -11599168 -9871086 -16714476 -21494859 -16685102 -6037692 738282 43293
40280D3293k716141O43281K364408l68673l855642n164809n023545m124631k630636
$$ 43293 -2672848 -2029567 334841 -33832 -3889474 -9054283 -14077828 -18202459 -20833095
40271b0833095k359920l610706k108765L846778O830639R52923m335191M732468
$$ -20833095 -23193015 -26803721 -28912486 -25065708 -18235069 -17282146 -21617337 -16884869
40263a6884869K1776798K3986406M999403j3359365j1653634J154818N860464
$$ -16884869 4891929 28878335 33877738 20518373 8864739 10019557 15880021
40256A5880021K542993L552498P578875K727768q889521j1689220k399927M702625
$$ 15880021 18423014 21975512 29554387 32282155 23392634 11703414 9303487 14006112
40248A4006112J484536l814930m612347n535576p358494j589181J0121811J0311808
$$ 14006112 15490648 11675718 7063371 1527795 -5830699 -7419880 2701931 13013739
40240A3013739o795263j9930881j0592536P383941R487131r89649j917379P908170
$$ 13013739 6218476 -13712405 -24304941 -16921000 -7433869 -8423518 -10340897 -2432727
40232b432727P304402q733683j7907773n950912J1602910J5023814P382902J961181
$$ -2432727 4871675 -3862008 -21769781 -27720693 -16117783 -1093969 6288933 8250114
40224H250114r791l076203l008545M263989R491433K883586p799572q499042j588174
$$ 8250114 8240323 5164120 2155575 6419564 15910997 18794583 10995011 2495969 907795
40215I07795n7727l992080j816130O579606P558692k564005r506388l167905P175360
$$ 907795 850068 -3142012 -4958142 1621464 9180156 6616151 -2890237 -6058142 1117218
40206A117218Q311445J892165j559364J385297O113575Q382329N730268l604660
$$ 1117218 9428663 11320828 9761464 11146761 17260336 25642665 31372933 27768273
40198B7768273j5472386j9003097r240171L943703Q064813N063476O101922J1900842
$$ 27768273 12295887 -6707210 -15947381 -12003678 -3938865 1124611 7226533 19127375
40190A9127375J0621714k528873j5245397j4383178m024352J894164M53209K333137
$$ 19127375 29749089 27220216 11974819 -2408359 -6432711 -4538547 -4085338 -1752201
40182a752201J3059540K2048712J6248836j340975j4372216j2613265k359515
$$ -1752201 11307339 33356051 49604887 48263912 33891696 21278431 18918916
40175A8918916K846921l075685j4296052j9465342j1659115M805500J6972347
$$ 18918916 21765837 18690152 4394100 -15071242 -26730357 -21924857 -4952510
40168d952510J5675509N090148l382707m942461l563770k145996J009276M975329
$$ -4952510 10722999 15813147 12430440 7487979 3924209 1778213 2787489 7762818
40160G762818M489131j191995n335539l010240L698214J1477983J7476894J3869469
$$ 7762818 12251949 11059954 5724415 2714175 6412389 17890372 35367266 49236735
40152D9236735n443705k7957600k9101344n760867J3618238P135197r202759q523389
$$ 49236735 43793030 15835430 -13265914 -19026781 -5408543 1726654 -7476105 -15999494
40144a5999494M210808M473557p065015o100941R894328J3493935o594944k4172403
$$ -15999494 -11788686 -7315129 -14380144 -20481085 -10586757 2907178 -3687766 -27860169
40136b7860169j6587672J078372M189256k493967M13685J0623586J0969412K307019
$$ -27860169 -44447841 -43369469 -39180213 -41674180 -41260495 -30636909 -19667497 -17360478
40128a7360478J488425J0242394J2044230J120658q411210p002483l541620p243415
$$ -17360478 -15872053 -5629659 6414571 7535229 -875981 -7878464 -11420084 -18663499
40120a8663499j1445382n345098Q111262J5322436Q581841n587574j2638699m248192
$$ -18663499 -30108881 -35453979 -27342717 -12020281 -3438440 -9026014 -21664713 -25912905
40112b5912905J1075303J5157696K819343q864716l020308J1810995J2891533
$$ -25912905 -14837602 320094 3139437 -5725279 -8745587 3065408 15956941
40105A5956941l389436j6065455r694929N620267J0725900J965217q712332j0204746
$$ 15956941 12567505 -3497950 -13192879 -7572612 3153288 5118505 -3593827 -13798573
40097a3798573j787965Q763650J2132025O488460P88862L721593J0376736Q529146
$$ -13798573 -15586538 -6822888 5309137 11797597 12586459 16308052 26684788 35213934
40089C5213934k364938r805131p435722l005070l247575l900506j296637j100124
$$ 35213934 32848996 23043865 15608143 12603073 9355498 5454992 4158355 3058231
40081C058231o180038p103484L705873J7147751J9124336J0274930J615122l674743
$$ 3058231 -3121807 -10225291 -6519418 10628333 29752669 40027599 41642721 37967978
40073C7967978j0220900j5942175j2783808k172916M208594J829321p92428K283375
$$ 37967978 27747078 11804903 -978905 -3151821 1056773 2886094 2093666 4377041
40065D377041M534048m73093o307894l090962N755429O425810o228977k0584445
$$ 4377041 8911089 8437996 2130102 -960860 4794569 11220379 4991402 -15593043
40057a5593043k1575971p699047Q285757J3907214R529466N611040Q871216J4104293
$$ -15593043 -37169014 -44868061 -36582304 -22675090 -13145624 -7534584 1336632 15440925
40049A5440925J1607843M91365r748118j1213139o611278l832441n333651p252253
$$ 15440925 27048768 27540133 17792015 6578876 -32402 -3864843 -9198494 -16450747
40041a6450747o928428n657765l635721J972852J0811912J5808122J1095729J134319
$$ -16450747 -23379175 -29036940 -32672661 -30699809 -19887897 -4079775 7015954 8150273
40033H150273l871474r46080L337560L887751L243653L887541J861917n722288
$$ 8150273 4278799 3332719 6670279 10558030 13801683 17689224 19551141 13828853
40025A3828853j2170064q485234K912378R786734N683377k829867n940450k062625
$$ 13828853 1658789 -6826445 -3914067 5872667 11556044 8726177 2785727 723102
40017G23102K662921K508138k167690n401021j749368O421979J0108388N152698
$$ 723102 3386023 5894161 3726471 -1674550 -3423918 2998061 13106449 18259147
40009A8259147j373923j651816P57441k009343o813476l762218M884793M823346
$$ 18259147 16885224 15233408 15990849 13981506 7168030 3405812 8290605 13113951
40001A3113951p158719j4822793o123964P302498P130508l790650o010369O998269
$$ 13113951 5955232 -8867561 -14991525 -7689027 -558519 -4349169 -10359538 -3361269
39993c361269J8998015J3588768m406119j5898795r987915N717772J4949778R597637
$$ -3361269 15636746 29225514 24819395 8920600 -1067315 4650457 19600235 29197872
39985B9197872l421862j1206176r246930m262978l413153n776219o196825k276693
$$ 29197872 25776010 14569834 5322904 1059926 -2353227 -8129446 -14326271 -16602964
39977a6602964N164422J3016045J4238623K557285j5918793k3485579j1462300
$$ -16602964 -11438542 1577503 15816126 18373411 2454618 -21030961 -32493261
39970c2493261O238140R886817p63280r199955o523230J95994L373472M645922
$$ -32493261 -26255121 -16368304 -17131584 -26331539 -32854769 -32658775 -29285303 -24639381
39962b4639381N684111J988179p211247j2276728m790091R732917J8129586J5088261
$$ -24639381 -18955270 -16967091 -24178338 -36455066 -41245157 -31512240 -13382654 1705607
39954A705607O371694n51406l193540k708116r69682N77516J846175L945713O777730
$$ 1705607 8077301 7525895 4332355 1624239 654557 1232073 3078248 7023961 13801691
39945A3801691P762280M473486k106913q001674r551726o231434r10343K816349
$$ 13801691 21563971 26037457 23930544 15928870 6377144 145710 -764633 2051716
39937B051716L990941M035412L017106r06122o665948q643309l534145M034734
$$ 2051716 6042657 10078069 13095175 12189053 5523105 -3120204 -6654349 -2619615
39929b619615P125657N413500L871656M658113N347266L716506k64848n338865
$$ -2619615 4506042 9919542 13791198 18449311 23796577 27513083 27248235 21909370
39921B1909370p861643l516046M806441O277608l036651j0680150m194795Q365765
$$ 21909370 14047727 10531681 15338122 21615730 18579079 7898929 3704134 12069899
39913A2069899R163079j124298m156807N239669R527776k264606j5000575j1092648
$$ 12069899 21232978 20108680 15951873 21191542 30719318 28454712 13454137 2361489
39905B361489J627957L479242n852268r313498j205325N396453J054005o445274
$$ 2361489 3989446 7468688 1616420 -7697078 -8902403 -3505950 -2451945 -8897219
39897h897219n742050K532368R509381R692736M251218j990749l831756Q3978
$$ -8897219 -14639269 -12106901 -2597520 7095216 11346434 9355685 5523929 5607907
39889E607907M906783M700685m80806o112208r657624j0634499p015081J710282
$$ 5607907 10514690 15215375 14734569 8622361 -1035263 -11669762 -18684843 -16974561
39881a6974561R739926J0433815N351272R17660j767285n379654o974246j267284
$$ -16974561 -7234635 3199180 8550452 9468112 7700827 2321173 -4653073 -5920357
39873e920357O880016N977363l175925n099701P385291J9699683J5158621p02364
$$ -5920357 959659 6937022 3761097 -1338604 6046687 25746370 40904991 40202627
39865D0202627q023494o19007O834997M21675j4760796k2555693j5828619k975452
$$ 40202627 32179133 31560126 38395123 38816798 24056002 1500309 -14328310 -17303762
39857a7303762L833899K222775m01273J786098O012639P055701N975811P151998
$$ -17303762 -13469863 -11247088 -11648361 -9862263 -3849624 3206077 9181888 16333886
39849A6333886R003963N443272l074295q329178o812926m968236p146372o780125
$$ 16333886 25337849 30781121 27706826 19377648 12564722 7596486 450114 -6330011
39841f330011K352733J2505360J0322156l473842j3177797q044838N111284J1936424
$$ -6330011 -3977278 8528082 18850238 15376396 2198599 -5846239 -734955 11201469
39833A1201469P013673k947812q260142n379220J127458L944381J086192k140660
$$ 11201469 18215142 15267330 7007188 1627968 2755426 6699807 7785999 5645339
39825E645339j058334Q43275l118799j1305235j3332249l269777J1185180J6321319
$$ 5645339 4587005 5430280 2311481 -8993754 -22326003 -25595780 -14410600 1910719
39817A910719P780440m140956n250613O281005J5734637P777991j2841106k3514503
$$ 1910719 9691159 5550203 299590 6580595 22315232 30093223 17252117 -6262386
39809f262386j1643951P410476J0522209q12664l896184R634300K0324187J0903101
$$ -6262386 -17906337 -10495861 26348 -786316 -4682500 4951800 25275987 36179088
39801C6179088o800353r749790K336891Q939063K47419j1330560j2329685n073682
$$ 36179088 29378735 19628945 21965836 30904899 31152318 19821758 7492073 2418391
39793B418391J378021M264619M442904O40544o167795r704488o244805q8725L490151
$$ 2418391 3796412 8061031 12503935 13144479 6976684 -2727804 -8972609 -9061334 -5571183
39784e571183M626607M201969P37667k816582J539551J2896895J6281847K380560
$$ -5571183 -944576 3257393 3995060 1178478 2718029 15614924 31896771 34277331
39776C4277331j5663687j8646588q257857j735940l499313j197489Q948319J3301603
$$ 34277331 18613644 -32944 -8290801 -10026741 -13526054 -14723543 -5775224 7526379
39768G526379M631997l527014J530234J0496147P775339k558393m456862K530234
$$ 7526379 12158376 8631362 10161596 20657743 28433082 25874689 21417827 23948061
39760B3948061K624127r306090j8070070j0692816N135069J3139841R498509L031092
$$ 23948061 26572188 17266098 -803972 -11496788 -6361719 6778122 16276631 19307723
39752A9307723K61602q35591l996129q424130j0287072p130596j15150O748251
$$ 19307723 19569325 18733734 14737605 6313475 -3973597 -11104193 -11219343 -4471092
39744d471092R629537P915860M341263K444449L848692O353841M349601n412879
$$ -4471092 5158445 13074305 17415568 19860017 23708709 30062550 34412151 28999272
39736B8999272j6631019j7051951m040650Q306354N435191p305131j0640284K261934
$$ 28999272 12368253 -4683698 -8724348 -417994 5017197 -2287934 -12928218 -10666284
39728a0666284J6296178J5055513J374433r362562r421901m064362n10941N3676
$$ -10666284 5629894 20685407 22059840 12697278 3275377 -788985 -1299926 -1246250
39720a246250n18886k178937n947952j0276346j0353841l137039O150586O664884
$$ -1246250 -1765136 -3944073 -9892025 -20168371 -30522212 -33659251 -27508665 -20843781
39712b0843781l971798j2111452l641824J4530825K0776198Q528005m447369l341335
$$ -20843781 -24815579 -36927031 -40568855 -26038030 -5261832 3266173 -1181196 -4522531
39704d522531K083593l610972j3359111p827123J1403381K0437342P640072r330347
$$ -4522531 -2438938 -6049910 -19409021 -27236144 -15832763 4604579 12244651 2914304
39696B914304r317078M098175J1470698M926208n578856q717997l672290L219676
$$ 2914304 -6402774 -2304599 9166099 14092307 8513451 -204546 -3876836 -657160
39688f57160N678986J382767n820590q020153j992644N233605M052573n503191
$$ -657160 5021826 6404593 584003 -7436150 -9428794 -4195189 -142616 -5645807
39680e645807j3975265j4406093q932918k790149K965952R648812J5304426J5513982
$$ -5645807 -19621072 -34027165 -42960083 -45750232 -42784280 -33135468 -17831042 -2317060
39672b317060R738629L251883Q11503N25880k798113q818006j0635091m705349
$$ -2317060 7421569 10673452 11484955 12010835 9212722 394716 -10240375 -14945724
39664a4945724K405515J953539m505332o675012J17908Q131107P589882l76987
$$ -14945724 -12540209 -10586670 -15092002 -21767014 -21649106 -13517999 -5928117 -6305104
39656f305104n184331M33073J2066842J7957892J0798543m251304j3756753r842060
$$ -6305104 -11489435 -11056362 1010480 18968372 29766915 25515611 11758858 1916798
39648A916798J054639O062535J583777l302995L64741J0099467J5735000J0966397
$$ 1916798 2971437 9033972 10617749 7314754 7679495 17778962 33513962 44480359
39640D4480359j496064j3878853k0167017k0199860j7735191j3822520m747032
$$ 44480359 42984295 29105442 8938425 -11261435 -28996626 -42819146 -47566178
39633d7566178R591126J8844728J2369346l947227j1145560j128360J2118837
$$ -47566178 -37975052 -19130324 -6760978 -10708205 -21853765 -22982125 -10863288
39626a0863288J1296131k057349j2009583r169823J157467Q282072O239723k909132
$$ -10863288 432843 -1624506 -13634089 -22803912 -21646445 -13364373 -7124650 -10033782
39618a0033782r984278n948194O488659J2966287N113485p477709j0481012l993774
$$ -10033782 -20018060 -25966254 -19477595 -6511308 -1397823 -8875532 -19356544 -23350318
39610b3350318J442317K562623M579135P608267N621995q96924m001794j471403
$$ -23350318 -21908001 -19345378 -14766243 -7157976 -1535981 -2432905 -6434699 -7906102
39602g906102Q89223J660509N878026J1989195J0315722j70791o512103p01381
$$ -7906102 -7016879 -5356370 521656 12510851 22826573 22655782 16143679 15442298
39594A5442298P561902O044161j977384m990398q47792L312166L266557L92616
$$ 15442298 23004200 29048361 27070977 22080579 21232787 24544953 27811510 28204126
39586B8204126l698423p269221p180084m084524l886319p753538p260304K857196
$$ 28204126 24505703 17236482 10056398 5971874 2085555 -5667983 -12928287 -10071091
39578a0071091J3949326J4522246N892160k587277p362639r144228m504627P695557
$$ -10071091 3878235 18400481 24292641 21705364 14342725 5198497 693870 8389427
39570H389427J6686854J1357005j601823o107966j165979n30295q067998j1510676
$$ 8389427 25076281 36433286 34831463 28723497 27557518 27027223 18959225 7448549
39562G448549m487263K850708K433674J468043O897009J0464904K334846j0197709
$$ 7448549 2961286 5811994 8245668 9713711 16610720 27075624 29410470 19212761
39554A9212761j1801064j695402N919859K371614n501343p068736j839195J552435
$$ 19212761 7411697 5716295 11636154 14007768 8506425 1437689 -401506 1150929
39546A150929k589617q468912m457530J0811966K2080494J4501771n210995j5392331
$$ 1150929 -1438688 -9907600 -14365130 -3553164 18527330 33029101 27818106 12425775
$$ [...]
##END NTUPLES=NMR SPECTRUM
##END=
