##TITLE=31Pdec_10P143
 CDCl3, 24 sc
 10.1.2020
##JCAMPDX= 6.0         $$ Bruker NMR JCAMP-DX V2.0
##DATA TYPE= NMR SPECTRUM
##DATA CLASS= NTUPLES
##ORIGIN= UXNMR, Bruker Analytische Messtechnik GmbH
##OWNER= root
$$ XWIN-NMR		Version 3.5
$$ Fri Jan 10 14:42:59 2020 Russian Standard Time (UT+4h)  she@DPX200
##.OBSERVE FREQUENCY= 81.013821
##.OBSERVE NUCLEUS= ^31P
##.ACQUISITION MODE= SIMULTANEOUS
##.ACQUISITION SCHEME= undefined
##.AVERAGES= 24
##.DIGITISER RES= 17
##SPECTROMETER/DATA SYSTEM= spect
##.PULSE SEQUENCE= zgpg30
##.SOLVENT NAME= D2O
##.SHIFT REFERENCE= (INTERNAL, D2O, 0, 182.463)
##AUDIT TRAIL= $$ (NUMBER, WHEN, WHO, WHERE, WHAT)
$$ ##TITLE= Audit trail, XWIN-NMR		Version 3.5
$$ ##JCAMPDX= 5.01
$$ ##ORIGIN= Bruker BioSpin GmbH
$$ ##OWNER= she
$$ F:/spectra/data/she/nmr/P31/1/pdata/1/auditp.txt
$$ ##AUDIT TRAIL=  $$ (NUMBER, WHEN, WHO, WHERE, WHAT)
(   1,<2020-01-10 14:42:04.65 +0400>,<she>,<DPX200>,
      <created by zg, POWCHK disabled, PULCHK disabled
       configuration hash MD5:
       00 E9 B6 7A A2 85 ED C7 34 08 36 98 17 FE 4E 26
       data hash MD5: 32K
       EE A7 AC 28 C5 3E 82 6B 99 53 B8 E1 B0 8B 05 E1>)
(   2,<2020-01-10 14:42:08.12 +0400>,<she>,<DPX200>,
      <Start of raw data processing
       efp BC_mod = 2 LB = 1 FT_mod = 6 PKNL = 1 PHC0 = -1673.706 PHC1 = 134.6012 SI = 64K 
       data hash MD5: 64K
       A4 D9 B9 74 AD 2F 58 29 D6 63 14 43 C5 27 AA 40>)
(   3,<2020-01-10 14:42:32.09 +0400>,<she>,<DPX200>,
      <pk PHC0 = 2.354338 PHC1 = 0 
       data hash MD5: 64K
       E8 45 40 C6 D4 81 5E 18 1F 69 69 3E 54 62 1F 05>)
(   4,<2020-01-10 14:42:36.14 +0400>,<she>,<DPX200>,
      <abs ABSG = 5 
       data hash MD5: 64K
       0B D7 C3 84 F1 92 61 FD 2D 04 D7 11 E0 17 F7 83>)
$$ ##END=
$$ 
$$ hash MD5
$$ 55 57 90 ED 00 6C E2 CA C0 DF 8A 28 58 27 55 69
##$RELAX= 
##$RELAX= 
##$RELAX= 
##$RELAX= 
##$RELAX= 
##$RELAX= 
##$RELAX= 
##$RELAX= 
$$ Bruker specific parameters
$$ --------------------------
##$DU= <F:/spectra>
##$EXPNO= 1
##$NAME= <P31>
##$PROCNO= 1
##$TYPE= <nmr>
##$USER= <she>
##$AMP= (0..31)
100 100 100 100 100 100 100 100 100 100 100 100 100 100 100 100 100 100 
100 100 100 100 100 100 100 100 100 100 100 100 100 100 
##$AQSEQ= 0
##$AQ_mod= 1
##$AUNM= <au_zg>
##$AUTOPOS= <>
##$BF1= 81.014009
##$BF2= 200.13
##$BF3= 200.13
##$BF4= 200.13
##$BF5= 200.13
##$BF6= 200.13
##$BF7= 200.13
##$BF8= 200.13
##$BYTORDA= 1
##$CFDGTYP= 0
##$CFRGTYP= 5
##$CHEMSTR= <none>
##$CNST= (0..31)
1 1 145 1 1 1 1 1 1 1 1 1 1 1 1 1 1 1 1 1 1 1 1 1 1 1 1 1 1 1 1 1 
##$CPDPRG= <waltz16>
##$CPDPRG1= <>
##$CPDPRG2= <waltz16>
##$CPDPRG3= <>
##$CPDPRG4= <mlev>
##$CPDPRG5= <mlev>
##$CPDPRG6= <mlev>
##$CPDPRG7= <mlev>
##$CPDPRG8= <mlev>
##$CPDPRGB= <>
##$CPDPRGT= <>
##$D= (0..31)
0 1 0 0 0 0 0 0 0 0 0 0.03 2e-05 3e-06 0 0 0 0 0 0 0 0 0 0 0 0 0 0 0 0 
0 0 
##$DATE= 1578652924
##$DBL= (0..7)
120 120 120 11 120 120 24 19 
##$DBP= (0..7)
150 150 150 150 150 150 150 150 
##$DBP07= 0
##$DBPNAM0= <>
##$DBPNAM1= <>
##$DBPNAM2= <>
$$ [...]
##$SUBNAM3= <"">
##$SUBNAM4= <"">
##$SUBNAM5= <"">
##$SUBNAM6= <"">
##$SUBNAM7= <"">
##$SUBNAM8= <"">
##$SUBNAM9= <"">
##$SW= 369.568048894756
##$SWIBOX= (0..15)
0 1 3 0 0 0 0 0 0 0 0 0 0 0 0 0 
##$SW_h= 29940.119760479
##$TD= 32768
##$TD0= 1
##$TE= 0
##$TE2= 300
##$TE3= 300
##$TEG= 300
##$TL= (0..7)
0 120 53 12 22 120 120 120 
##$TP= (0..7)
150 150 150 150 150 150 150 150 
##$TP07= 0
##$TPNAME0= <>
##$TPNAME1= <>
##$TPNAME2= <>
##$TPNAME3= <>
##$TPNAME4= <>
##$TPNAME5= <>
##$TPNAME6= <>
##$TPNAME7= <>
##$TPOAL= (0..7)
0.5 0.5 0.5 0.5 0.5 0.5 0.5 0.5 
##$TPOFFS= (0..7)
0 0 0 0 0 0 0 0 
##$TUNHIN= 0
##$TUNHOUT= 0
##$TUNXOUT= 0
##$USERA1= <user>
##$USERA2= <user>
##$USERA3= <user>
##$USERA4= <user>
##$USERA5= <user>
##$V9= 5
##$VALIST= <valist>
##$VCLIST= <CCCCCCCCCCCCCCC>
##$VD= 0
##$VDLIST= <DDDDDDDDDDDDDDD>
##$VPLIST= <PPPPPPPPPPPPPPP>
##$VTLIST= <TTTTTTTTTTTTTTT>
##$WBST= 1024
##$WBSW= 4
##$XGAIN= (0..3)
0 0 0 0 
##$XL= 0
##$YL= 0
##$YMAX_a= 5879
##$YMIN_a= -10973
##$ZGOPTNS= <>
##$ZL1= 120
##$ZL2= 120
##$ZL3= 120
##$ZL4= 120
##$ABSF1= 182.463
##$ABSF2= -187.1042
##$ABSG= 5
##$ABSL= 3
##$ALPHA= 0
##$AQORDER= 0
##$ASSFAC= 0
##$ASSFACI= 0
##$ASSFACX= 0
##$ASSWID= 0
##$AUNMP= <proc_1d>
##$AZFE= 0.1
##$AZFW= 0.5
##$BCFW= 0
##$BC_mod= 2
##$BYTORDP= 0
##$COROFFS= 0
##$CY= -3
##$DATMOD= 1
##$DC= 0
##$DFILT= <>
##$DTYPP= 0
##$F1P= 0
##$F2P= 0
##$FCOR= 1
##$FTSIZE= 65536
##$FT_mod= 6
##$GAMMA= 0
##$GB= 0
##$INTBC= 1
##$INTSCL= 5.30512e-09
##$ISEN= 30
##$LB= 1
##$LEV0= 0
##$LPBIN= 0
##$MAXI= 10000
##$MC2= 0
##$MEAN= 0
##$ME_mod= 0
##$MI= 50
##$NCOEF= 0
##$NC_proc= -7
##$NLEV= 6
##$NOISF1= 182.463
##$NOISF2= 159.3651
##$NSP= 0
##$NTH_PI= 0
##$NZP= 0
##$OFFSET= 182.463
##$PC= 4
##$PHC0= -1671.352
##$PHC1= 134.6012
##$PH_mod= 1
##$PKNL= yes
##$PPARMOD= 0
##$PSCAL= 0
##$PSIGN= 0
##$REVERSE= no
##$SF= 81.0140089999434
##$SI= 65536
##$SIGF1= 159.3651
##$SIGF2= -187.1042
##$SINO= 113.3802
##$SIOLD= 16384
##$SREGLST= <1H.CDCl3>
##$SSB= 0
##$STSI= 65536
##$STSR= 0
##$SW_p= 29940.119760479
##$SYMM= 0
##$S_DEV= 0
##$TDeff= 32768
##$TDoff= 0
##$TI= <>
##$TILT= no
##$TM1= 0
##$TM2= 0
##$TOPLEV= 0
##$USERP1= <user>
##$USERP2= <user>
##$USERP3= <user>
##$USERP4= <user>
##$USERP5= <user>
##$WDW= 1
##$XDIM= 65536
##$YMAX_p= 279485211
##$YMIN_p= -18320053
$$ End of Bruker specific parameters
$$ ---------------------------------
##NTUPLES= NMR SPECTRUM
##VAR_NAME=  FREQUENCY,     SPECTRUM/REAL,   SPECTRUM/IMAG
##SYMBOL=    X,             R,               I
##VAR_TYPE=  INDEPENDENT,   DEPENDENT,       DEPENDENT
##VAR_FORM=  AFFN,          ASDF,            ASDF
##VAR_DIM=   65536,         65536,           65536
##UNITS=     HZ,            ARBITRARY UNITS, ARBITRARY UNITS
##FACTOR=    0.456856943014862, 1,           1
##FIRST=     14782.0589164792, 0,            0
##LAST=      -15158.0608439998, 0,           0
##MIN=       -15158.0608439998, -18320053,   0
##MAX=       14782.0589164792, 279485211,    0
$$ Real data points
##PAGE= N=1
##DATA TABLE= (X++(R..R)), XYDATA
$$ [...]
44809I29912o65752J332827J791518J830097K397720K007126j07716j593416n05145
$$ 929912 264160 1596987 3388505 5218602 7616322 9623448 9515732 7922316 7417171
44800G417171J121141L03459k096171l017725k356341k590520l653688k398343
$$ 7417171 8538312 8841771 6745600 3727875 1371534 -1218986 -4872674 -7271017
44792g271017J846441M998421L620192k45321k165768j116621N78756J442434
$$ -7271017 -5424576 -426155 3194037 2948716 782948 -333673 245083 1687517
44784A687517J758066J232099p74246k769684k298963n0515N84314j078277j740455
$$ 1687517 3445583 4677682 3903436 1133752 -1165211 -1215726 -631412 -1709689 -3450144
44775c450144J39265J377139k98233j581533J000614M092013J754354m663544
$$ -3450144 -3310879 -1933740 -2231973 -3813506 -2812892 1279121 3033475 -1630069
44767a630069p254904k608780L793961N860750M100462J988629J43581k120754
$$ -1630069 -8884973 -11493753 -7699792 -1839042 2261420 4250049 4393630 2272876
44759B272876l254946j704260P71194J641062J432791J825720K094581Q24828
$$ 2272876 -982070 -2686330 -1915136 -274074 1158717 2984437 5079018 5903846
44751E903846q09497r55630n15030j232363k067530j030294R68662J714716J517664
$$ 5903846 5094349 4138719 3623689 2391326 323796 -706498 262164 1976880 3494544
44742C494544J724078J254224j113589k817248q41362K429994K193015q73642
$$ 3494544 5218622 6472846 5359257 2542009 1700647 4130641 6323656 5450014
44734E450014j751331J73056K69472k512397l045667J169448M995352L285707
$$ 5450014 3698683 3871739 4141211 1628814 -1416853 -247405 4747947 8033654
44726H033654j588713m058336l136990j657954r93984o67881p38204r31857L78634
$$ 8033654 6444941 2386605 -750385 -2408339 -3402323 -4070204 -4808408 -5740265 -5361631
44717e361631L100552L706189j2322m618351m954756p51039L795177N449697M076710
$$ -5361631 -2261079 1445110 1432788 -3185563 -8140319 -8891358 -5096181 353516 4430226
44708D430226J026865j669711j922608K2324J273673M40941j45576J336735K613936
$$ 4430226 5457091 3787380 1864772 1887096 3160769 3601710 3456134 4792869 7406805
44699G406805J059278j766359k913795k685273k491264r18180L143444N880079
$$ 7406805 8466083 6699724 3785929 1100656 -1390608 -2308788 834656 6714735
44691F714735K942541k879496m508868p92329K220480P49797j952062j895562
$$ 6714735 9657276 6777780 2268912 1476583 3697063 4446860 2494798 599236
44683E99236M9273J335179J985199K679532K061938r15420m168758m589597j739082
$$ 599236 648509 1983688 3968887 6648419 8710357 7794937 3626179 -963418 -2702500
44674b702500J942178L424291J228673k955316m884110k323454J377846J337148
$$ -2702500 -760322 2663969 3892642 937326 -3946784 -6270238 -4892392 -3555244
44666c555244j682290k249373J323399M329468K885322p91295k612752k054171
$$ -3555244 -5237534 -7486907 -6163508 -1834040 1051282 259987 -2352765 -4406936
44658d406936o85494J024577K471827J808962q01358j830921N83494L195721K512753
$$ -4406936 -5092430 -4067853 -1596026 212936 -588422 -2419343 -1835849 1359872 3872625
44649C872625P9970q21239p79492k101088l559327k368601L11747J142935P11743
$$ 3872625 3952595 3131356 2351864 250776 -3308551 -5677152 -5365405 -4222470 -3510727
44640c510727K175519M296180K258902l487645n720173p78629N075320M060811
$$ -3510727 -1335208 2960972 5219874 1732229 -3987944 -4766573 308747 4369558
44632D369558k319915o057042l841725N5306J485980J514175K454674L323988
$$ 4369558 2049643 -4007399 -7849124 -7793818 -6307838 -4793663 -2338989 984999
44624I84999K144623M9366k69178R62584Q03116j789218m206738l711498o47329
$$ 984999 3129622 3178988 2909810 3872394 4675510 2886292 -1320446 -5031944 -5679273
44615e679273K702497M613371M241535J386250k393702l978345k062481P11259
$$ -5679273 -2976776 1636595 5878130 7264380 4870678 892333 -1170148 -458889
44607d58889J026766o89494j428826k85579Q33175Q01613N30700M58443j65756
$$ -458889 567877 -121617 -1550443 -1836022 -1002847 -201234 329466 787909 622153
44598F22153r03700p3886J951359K384130L02354j626999j415482q34825j920000
$$ 622153 -281547 -355433 1595926 3980056 4282410 2655411 1239929 405104 -1514896
44589a514896l018760j368308K103399L715184K027847p33769j970741j330835
$$ -1514896 -4533656 -5901964 -3798565 -83381 1944466 1210697 -760044 -2090879
44581b090879p9027O12205N75391M89967O61592K34091j207214j832997K05718
$$ -2090879 -2169906 -1557701 -982310 -492343 169249 403340 -803874 -2636871 -2431153
44572b431153K931066K304925j537504l741256j858007P27274P38052j81410J35628
$$ -2431153 499913 2804838 1267334 -2473922 -4331929 -3604655 -2866603 -3048013 -2912385
44563b912385j57668k490259l194758R14220N659370M840553R1129j749065L71762
$$ -2912385 -3070053 -5560312 -8755070 -7840850 -2181480 2659073 2750202 1001137 1372899
44554A372899J133053r98734j297106J971301L680880M27405l719788m056188
$$ 1372899 2505952 1507218 210112 2181413 5862293 6289698 2569910 -1486278
44546a486278k216347j840741j996102N3451K929539L069282N72498j189430o04472
$$ -1486278 -3702625 -5543366 -7539468 -7486017 -4556478 -1487196 -914698 -2104128 -2708600
44537b708600R02930J641346J109335l22998j359909p83641K64601p35502l151628
$$ -2708600 -1805670 -164324 945011 622013 -737896 -1521537 -1256936 -1992438 -5144066
44528e144066k827230J627774N538085M221766m93484l257565k377941m36916
$$ -5144066 -7971296 -6343522 -805437 3416329 2922845 -334720 -2712661 -3149577
44520c149577M12313J70054p05684j536444j015445Q78486K009187J441178J473854
$$ -3149577 -2737264 -2567210 -3272894 -4809338 -5824783 -4946297 -2937110 -1495932 -22078
44511b2078L492373M388420R60714m241338n852197l048202L77629K131306K991856
$$ -22078 3470295 7858715 8819429 4578091 -1274106 -4322308 -3944679 -1813373 1178483
44502A178483K969502Q13381k342695l263801j368266M67217N22675K02946P36129
$$ 1178483 4147985 4961366 2618671 -645130 -2013396 -1546179 -1023504 -820558 -84429
44493h4429J236528Q94140J87836p00274j963431k408434n29664K418888L391544
$$ -84429 1152099 2046239 2234075 1533801 -429630 -2838064 -3367728 -948840 2442704
44484B442704J808162m3032p46669p39155Q9792K022003K984156O80067k704555
$$ 2442704 4250866 4207834 3461165 2722010 2811802 4833805 7817961 8498028 5793473
44475E793473k673130L21040J132419j504077k594382O28745L741684K228722
$$ 5793473 3120343 3441383 4573802 3069725 475343 1104088 4845772 7074494
44467G074494j651142l403419l185569l300207k690789N38673L898750L454412
$$ 7074494 5423352 2019933 -1165636 -4465843 -7156632 -6617959 -2719209 735203
44459G35203K26770j601090j482191k173462l471901j966047K483968N124150
$$ 735203 961973 -639117 -2121308 -4294770 -7766671 -9732718 -7248750 -2124600
44451b124600K729037k113901m747471l653523o29143J889342K481381J402964
$$ -2124600 604437 -1509464 -6256935 -9910458 -10539601 -8650259 -6168878 -4765914
44443d765914L21587K64693J50842j128350k144565q83951J510072J968475K47629
$$ -4765914 -4444327 -4179634 -4028792 -5157142 -7301707 -8185658 -6675586 -4707111 -4459482
44434d459482p49844L04943J352627P44966j11168O10613K168589K546537J210645
$$ -4459482 -5209326 -4904383 -3551756 -2806790 -2917958 -2307345 -138756 2407781 3618426
44425C618426p25688j960612j749874k35884J316319J481606K24759j183540j587146
$$ 3618426 2892738 932126 -817748 -1053632 262687 1744293 1969052 785512 -801634
44416h01634n20598J773922L629300K502395j730966n229004m520734j280573
$$ -801634 -1322232 451690 4080990 6583385 4852419 -376585 -4897319 -6177892
44408f177892L67591J98929J335585L761963L576884r5442k551967m49679L030392
$$ -6177892 -5810301 -5611372 -4275787 -513824 3063060 2967618 415651 -34028 2996364
44399B996364L296499J019844k33699k21258j364173l472226l639283j088030
$$ 2996364 6292863 7312707 7079008 6857750 5493577 2021351 -1617932 -2705962
44391b705962J622316K442275J869939Q68078n31194j984199k467999j869376
$$ -2705962 -1083646 1358629 3228568 4096646 3565452 1581253 -886746 -2756122
44383b756122j252206j035800l50542J383219L405384M380475L365362L42546
$$ -2756122 -4008328 -5044128 -5394670 -4011451 -606067 3774408 7139770 7482316
44375G482316l103599m227638j859614J561753K369904K1449k582520l094846
$$ 7482316 4378717 151079 -1708535 -146782 2223122 2244571 -337949 -3432795
44367c432795k120557j195208l49569J058674K347099J963561k15641k167416
$$ -3432795 -5553352 -6748560 -7098129 -6039455 -3692356 -1728795 -1944436 -4111852
44359d111852j790772O52902K751570K777064J649270J308253J784896J451401
$$ -4111852 -5902624 -5249722 -2498152 278912 1928182 3236435 5021331 6472732
44351F472732j0956j035493j049109j496887k758498k603831J24017K575282J606197
$$ 6472732 6461776 5426283 4377174 2880287 121789 -2482042 -2358025 217257 1823454
44342A823454j238022j881740J49984J497181N88952l49720N07820J924566K282548
$$ 1823454 585432 -1296308 -1146324 350857 939809 590089 1097909 3022475 5305023
44333E305023J890003J256114k12101k288489l151832k106798r18722r89891j342060
$$ 5305023 7195026 8451140 8239039 5950550 2798718 691920 -226802 -1216693 -2558753
44324b558753p73903K57271J287897K779954L777807J675786l263125o161799
$$ -2558753 -3332656 -3075385 -1787488 992466 4770273 6446059 3182934 -2978865
44316b978865l541988J412127L229747J593891K69388M46511P5466j056733q26434
$$ -2978865 -6520853 -5108726 -1878979 -285088 -15700 430811 506277 -550456 -1376890
44307a376890N27033K94001j343553r30655J846704K589885n03297k807056m21715
$$ -1376890 -849857 -555856 -1899409 -2830064 -983360 1606525 1103228 -1703828 -2125543
44298b125543L206070K547857j357447k886719n79795J571333R78428n17754q56928
$$ -2125543 1080527 3628384 2270937 -615782 -1195577 375756 1354184 836430 -20498
44289b0498m82467R8134J520371L021678K204915j029806l324801k381814k8526
$$ -20498 -502965 -404831 1115540 4137218 6342133 5312327 1987526 -394288 -422814
44280d22814R72292P29042Q89209J628032K057733J999800J473218j33557k720569
$$ -422814 549478 1278520 2167729 3795761 5853494 7853294 9326512 9192955 6472386
44271F472386m717728n068446m361340k828794M10174M404379N529903K386351
$$ 6472386 1754658 -3313788 -7675128 -10503922 -10093748 -5689369 -159466 2226885
44263B226885j014047m74700K121589K006668o57442j333573R19947J675795j347209
$$ 2226885 1212838 738138 2859727 4866395 4208953 2875380 3795327 5471122 4123913
44254D123913m130692k468241J654696L173162R06898j875265k339429o66859
$$ 4123913 -6779 -2475020 -820324 2352838 3259736 1384471 -954958 -1621817
44246a621817J414194K392674J722834L48943p9114N32100L79605j338704k780705
$$ -1621817 -207623 2185051 3907885 4256828 4177714 4709814 5089419 3750715 970010
44237I70010k147149m72446K4491q60444j535508j032603L62028J900401K451850
$$ 970010 -1177139 -1649585 -1625094 -2485538 -4021046 -5053649 -4691621 -2791220 -339370
44228c39370J088618j030083j065421J451759K966535P36945k605626k585263
$$ -339370 749248 -280835 -1346256 105503 3072038 3808983 1203357 -1381906
44220a381906M33080J965885K96651j503091r85324J76089l01846j477183j130155
$$ -1381906 -948826 1017059 1313710 -189381 -1174705 -998616 -1300462 -2777645 -3907800
44211c907800N61361J645303J539018J443661J967900J970652J72163k767392
$$ -3907800 -3346439 -1701136 -162118 1281543 3249443 5220095 5392258 2624866
44203B624866m395037l036019J9670J836994J452224O79540P59556L86415j356664
$$ 2624866 -1770171 -4806190 -4786520 -2949526 -1497302 -817762 -58206 328209 -1028455
44194a028455k408577p15234K045701K921977K360145K719148L368609J772188
$$ -1028455 -3437032 -4152266 -2106565 815412 3175557 5894705 9263314 11035502
44186A1035502j054006j220734J401746K347403l11891l010035k867243j840831
$$ 11035502 9981496 8760762 10162508 12509911 12198020 9187985 6320742 4479911
44178D479911j921735j096311K047571M011816J444715k768664l518749j165216
$$ 4479911 2558176 1461865 3509436 7521252 8965967 6197303 2678554 1513338
44170A513338q0240j197957j328652P38880K383509J624549m82304k111686k103324
$$ 1513338 1433098 235141 -1093511 -354631 2028878 3653427 3171123 1059437 -1043887
44161a043887M15629M433386N845107J813621m172975n890215k792222j87449
$$ -1043887 -628258 3805128 9650235 11463856 7290881 1400666 -1391556 -1579005
44153a579005p98586j321474J230741M635698N293028L130512K93749j916949
$$ -1579005 -2377591 -3699065 -2468324 2167374 7460402 10590914 10884663 8967714
44145H967714k752657j669405j32066p39689k879747k644734J064519M146600
$$ 8967714 6215057 4545652 4413586 3673897 794150 -1850584 -786065 3360535
44137C360535L407822J099236K58281m70366l211962n491162l536809J180728
$$ 3360535 6768357 7867593 8125874 7655508 4443546 -1047616 -4584425 -3403697
44129c403697L668784K387639N0630j389151k096485j630342N94374K674150K401212
$$ -3403697 265087 2652726 2703356 1314205 -782280 -2412622 -1818248 855902 3257114
44120C257114J445160K747997M482458K142985l307046n545639k437226O57932
$$ 3257114 4702274 7450271 11932729 14075714 10768668 5223029 2785803 3443735
44112C443735m83792k853553k213700Q5965P20130M16449J348557J992688j5606
$$ 3443735 2959943 106390 -2107310 -2021345 -1301215 -884766 463791 2456479 2440873
44103B440873k483667j687458J016775J256387q32701j022457J330018K003114
$$ 2440873 -42794 -1730252 -713477 542910 -289791 -1312248 17770 2020884
44095B020884p99948l437650k882528q84768J86565J210894L156459L889843J588235
$$ 2020884 1220936 -2216714 -5099242 -5984010 -5797445 -4586551 -1430092 2459751 4047986
44086D047986j460841j871188P142J211061M44122j340786k939050l083229n89411
$$ 4047986 2587145 715957 723099 1934160 2378282 1037496 -1901554 -4984783 -5574194
44077e574194L114588L817281J8541l587916k028448K365918L073627p88578l193643
$$ -5574194 -2459606 1357675 1376216 -2211700 -4240148 -1874230 1199397 410819 -2782824
44068b782824m50730L552259L618673N19280j223637j5740J741674J764547J34302
$$ -2782824 -3233554 318705 3937378 4456658 3233021 3217281 4958955 6723502 6857804
44059F857804j896641l106339k655839r17427L11397l14905j881765k254735o05910
$$ 6857804 4961163 1854824 -801015 -1718442 -1407045 -1721950 -3603715 -5858450 -6464360
44050f464360J823217L108284K331836M06593n68413M74850J995385J638561m48761
$$ -6464360 -4641143 -1532859 798977 1205570 637157 1112007 3107392 4745953 4297192
44041D297192j812433j410859r26218j519293j671450N6793K121867K074237K25687
$$ 4297192 2484759 1073900 147682 -1371611 -3043061 -2986268 -864401 1209836 1435523
44032A435523j015882o85223j7124n1349l49693j21246O39839J153199M24061
$$ 1435523 419641 -265582 -282706 -334055 -683748 -804994 -165155 988044 1412105
44023A412105j560543k863625j322086J958137K892193j52417l342958k338891
$$ 1412105 -148438 -3012063 -4334149 -2376012 516181 363764 -2979194 -5318085
44015e318085J495194L163418J360110j34355J354109L519732K966074K41337
$$ -5318085 -3822891 -659473 700637 566282 1920391 5440123 8406197 8647534
44007H647534j299167l30973R33859M2176k334426l188141j135251J467795J438697
$$ 8647534 7348367 7017394 7951253 7993429 5659003 2470862 1335611 2803406 4242103
43998D242103q36689j961570n96002P34498K9370r46256q2393J088349K8609k141291
$$ 4242103 3405414 1443844 847842 1582340 1611710 665454 583061 1671410 1700019 -441272
43988d41272k231513J7840K049572K593593K175299O28436k037298l299629r99699
$$ -441272 -2672785 -2654945 -605373 1988220 4163519 4791955 2754657 -544972 -1544671
43979a544671K196391J981255n10910l33208K556229K634132j797756n235063
$$ -1544671 651720 2632975 2122065 1788857 4345086 6979218 5181462 -53601
43971e3601l750637q19998m53801l98832K597207N635771M035377m47536k141718
$$ -53601 -3804238 -4624236 -5078037 -5476869 -2879662 2756109 6791486 6343950 4202232
43962D202232k67232P83956j068917l415354m298808m222983l071395K60256M436862
$$ 4202232 3935000 4718956 3650039 234685 -4064123 -8287106 -11358501 -11098245 -6661383
43953f661383N907571L565606J01814j852006k104780j238473M40410J857640
$$ -6661383 -753812 2811794 2913608 1061602 -1043178 -2281651 -1841241 16399
43945A6399J755989P01077K40716K05655p31812k219411k667219k115389j814170
$$ 16399 1772388 2473465 2714181 2919836 2188024 -31387 -2698606 -4813995 -6628165
43936f628165j467261l328J501435J172613N9055N76675J714911M49810k079839
$$ -6628165 -8095426 -8098754 -6597319 -5424706 -5365651 -4788976 -3074065 -2624255 -4704094
43927d704094j270461L014106N000436J859647j638223r94609O60732j726935
$$ -4704094 -5974555 -2960449 2039987 3899634 2261411 1266802 1927534 200599
43919B00599n941736n376953N32922N016082L475840q53010k318723m4898K524188
$$ 200599 -5741137 -11118090 -10585168 -5569086 -2093246 -2946256 -5264979 -5309877 -2785689
43910b785689K773509J205838l25331p28837j07684P88742J155965N17399j001758
$$ -2785689 -12180 1193658 868327 139490 31806 820548 1976513 2493912 1492154
43901A492154k476407k568269q12092J509796K521210J781489L79224p93267j670328
$$ 1492154 -984253 -3552522 -4364614 -2854818 -333608 1447881 1827105 1033838 -636490
43892f36490k031077j432186l40710K24647M52386J387036K473675J641242j245008
$$ -636490 -2667567 -4099753 -4440463 -4215816 -3763430 -2376394 97281 1738523 493515
43883D93515l230825k074265O53125J979387J439168O67280M45126K85900Q5173
$$ 493515 -2737310 -4811575 -4158450 -2179063 -739895 -72615 372511 658411 743584
43874G43584J16377j04852j092148j887898j072808Q47813J725748O46207p99336
$$ 743584 859961 755109 -337039 -2224937 -3297745 -2449932 -724184 -77977 -877313
43865h77313n74111J263306K583640J636618o96487j572687L49318K802117K628921
$$ -877313 -1451424 -188118 2395522 4032140 3335653 1762966 2112284 4914401 7543322
43856G543322R1352j643834j244394o93678j334611j502594J84442J972729J782021
$$ 7543322 7634674 5990840 4746446 4052768 2718157 1215563 1400005 3372734 5154755
43847E154755N03660j62605r14201k710662l494204j024089K345083K205248j013293
$$ 5154755 5658415 5495810 4581609 1870947 -1623257 -2647346 -302263 1902985 889692
43838H89692k420630m46111P16133j655577l755483r98575M370257N916634K066773
$$ 889692 -1530938 -1977049 -1260916 -2916493 -6671976 -7670551 -3300294 2616340 4683113
43829D683113j795185p99306L225663M745060J687177k572140l877927k004965
$$ 4683113 2887928 2088622 5314285 10059345 11746522 9174382 5296455 3291490
43821C291490L0584K52531j78529O57519K255393K127710p56050m140902m748413
$$ 3291490 3322074 3574605 3396076 4053595 6308988 8436698 7680648 3539746 -1208667
43812a208667k024800J021624J066424j671506l558187j932999J540533L155185
$$ -1208667 -3233467 -2211843 -1145419 -2816925 -6375112 -8308111 -6767578 -3612393
43804c612393K169137J458051K881318M364528L035497n39731l247520l463120
$$ -3612393 -1443256 14795 2896113 7260641 10296138 9756407 6508887 3045767
43796C045767k167626o74871O82587J660032J674715O88288n07075j096043q15508
$$ 3045767 878141 203270 885857 2545889 4220604 4908892 4401817 3305774 2490266
43787B490266m1393K69957m87827j230886j31322K272567K775241j19858l460047
$$ 2490266 2448873 2718830 2231003 1000117 868795 3141362 5916603 5796745 2336698
43778B336698l755157j837288q49513q66024O81641L762581N026233K876232l27832
$$ 2336698 -1418459 -3255747 -4105260 -4971284 -4289643 -527062 4499171 7375403 7047571
43769G047571k092386k560702k388008j145950O03030P20907j079176j939831
$$ 7047571 4955185 2394483 6475 -1139475 -536445 184462 -894714 -2834545
43761b834545n8749K365832K621884J430360Q24478M24022j080734k616874k354767
$$ -2834545 -2893294 -527462 2094422 3524782 4349260 4773282 3692548 1075674 -1279093
43752a279093j323806j775729k753576j193071K593163M491556K587132N7360
$$ -1279093 -2602899 -4378628 -7132204 -8325275 -5732112 -1240556 1346576 1403936
43744A403936L56203K367347K640516M97456j586818j758406q00863n99051j989285
$$ 1403936 1760139 4127486 6768002 7265458 5678640 3920234 3119371 2520320 531035
43735E31035m024652m596631k303115J590400L911248L234459J718056J948271
$$ 531035 -3493617 -8090248 -10393363 -8802963 -4891715 -1657256 60800 2009071
43727B009071L110250K404996l88638k429799k095208j044742j058085j358350
$$ 2009071 5119321 7524317 7135679 4705880 2610672 1565930 507845 -850505
43719h50505p12220P3634m7553R185J320392J987974l65202l994987m617956j512999
$$ -850505 -1562725 -1489091 -1536644 -1527459 -207067 1780907 1415705 -2579282 -7197238 -8710237
43709h710237J663263K513432K355513K114980K77971k857629l278580Q87972
$$ -8710237 -7046974 -4533542 -2178029 -63049 214922 -2642707 -5921287 -5033315
43701e033315N163243M512511N14933j824993j991864l238295n404287m612461
$$ -5033315 129928 4642439 5157372 3332379 1340515 -1897780 -7302067 -11914528
43693a1914528l64286K832581K316039P52143R17443J581388R83956L41126J035777
$$ -11914528 -12278814 -9446233 -7130194 -6378051 -5460608 -3879220 -2895264 -2554138 -1518361
43684a518361J718042J106967O41866J392106J290909j168095l155528j415856
$$ -1518361 199681 1306648 1948514 3340620 4631529 3463434 307906 -1107950
43676a107950J976949K111012j424374l920618k343469R72983K240187Q91945
$$ -1107950 868999 2980011 1555637 -2364981 -4708450 -3735467 -1495280 -603335
43668f03335q56849j114528J71704J602815J564080j27454j738723j608593k56326
$$ -603335 -1460184 -2574712 -2403008 -800193 763887 636433 -1102290 -2710883 -2967209
43659b967209O41220Q69013J602419K782595K433696n65184m160692m766299j245691
$$ -2967209 -2325989 -1456976 145443 2928038 5361734 4796550 635858 -4130441 -5376132
43650e376132L324158M488009J272137k478705k557444M42085K087234J9865l291472
$$ -5376132 -2051974 2436035 3708172 1229467 -1327977 -885892 1201342 1221207 -2070265
43641b070265m191198j988484J453018M076642M365602J911627j251486k004208
$$ -2070265 -6261463 -8249947 -6796929 -2720287 1645315 3556942 2305456 301248
43633C01248l63094Q6227k186715l575707p91690L406928L954381R95373r33588
$$ 301248 -61846 24381 -2162334 -5738041 -6529731 -3122803 831578 1826951 893363
43624H93363k40328J22769j435723k400069p06157J771457K215756O26851j077966
$$ 893363 653035 775804 -659919 -3059988 -3766145 -1994688 221068 847919 -230047
43615b30047j557030l97116J922807L351482J711055k049424m156300k739231
$$ -230047 -1787077 -2184193 -261386 3090096 4801151 2751727 -1404573 -4143804
43607d143804j59988O61531Q8157K29075J391227K118216J713168R24350N88773
$$ -4143804 -4303792 -3642261 -3554104 -3325029 -1933802 184414 1897582 2821932 3410705
43598C410705P40903P32998j81346j690964j931251M03059L420182L569198L42167
$$ 3410705 4151608 4884606 4703260 3012296 1081045 1484104 4904286 8473484 8815651
43589H815651k792981l026635j349019J95691J623308L191395L063096M2512l031597
$$ 8815651 6022670 2996035 1647016 1842707 3466015 6657410 9720506 9763018 6731421
43580F731421k394154P77816J511936j565868l915858j845840J856892K116140
$$ 6731421 4337267 5115083 6627019 5061151 1145293 -700547 1156345 3272485
43572C272485q27869k028463L84146K300545J41562l266851k746131J221243K913163
$$ 3272485 2444616 416153 800299 3100844 3242406 -24445 -2770576 -1549333 1363830
43563A363830j39002l514818k656304N43273J313369m24758m99280K396943M588341
$$ 1363830 1224828 -2289990 -4946294 -4403021 -3089652 -3514410 -4013690 -1616747 2971594
43554B971594L140337r4724j752183j364486n72411j50565P1305j86591j134175
$$ 2971594 6111931 6017207 4265024 2900538 2328127 2177562 2248867 2062276 928101
43545I28101j874952j439326k12740P59522J126612R91242K99897n22631l43049
$$ 928101 -946851 -2386177 -2598917 -1839395 -712783 278459 578356 55725 -287324
43536b87324J118299K362520J938089M62167l67467j66679l6054o99943j647685
$$ -287324 830975 3193495 5131584 5593751 5226284 5059605 5023551 4323608 2675923
43527B675923k107450k005261j762157j552209r81239L40616J803389J966788
$$ 2675923 568473 -1436788 -3198945 -4751154 -5732393 -5391777 -3588388 -1621600
43519a621600M57043r26047l04944J454917J755326J14011j031195k6462J438474
$$ -1621600 -1164557 -2090604 -2395548 -940631 814695 928706 -102489 -128951 1309523
43510A309523Q02237j659503l126174j725114J346306L137857K047761l43509
$$ 1309523 2111760 452257 -2673917 -4399031 -3052725 85132 2132893 1789384
43502A789384r63090Q15933K085838N66324j627927r51887J840331K443956n48629
$$ 1789384 826294 1642227 3728065 4294389 2666462 1714575 3554906 5998862 5450233
43493E450233l751213m327647l381774k530901r79313J651770L085999J928447
$$ 5450233 1699020 -2628627 -6010401 -8541302 -9520615 -7868845 -4782846 -2854399
43485b854399M99593J030393J745825J66835k171927k172416l35732N79224M28964
$$ -2854399 -2354806 -1324413 421412 588247 -1583680 -3756096 -4091828 -3512604 -3083640
43476c083640R93065J758066R41093k14637R02023K684561P70144m252503o092375
$$ -3083640 -2090575 -332509 608584 393947 1295970 3980531 4750675 498172 -5594203
43467e594203j693806L959842M898007J967743J5194M08444N73221p19348j736645
$$ -5594203 -7288009 -3328167 1569840 3537583 3552777 3961221 4534442 3815094 2078449
43458B078449j202737j53134M7590n68161j210826j264826m74198O85460J044235
$$ 2078449 875712 722578 770168 202007 -1008819 -2273645 -2747843 -2062383 -1018148
43449a018148K73336q9721J360238L210703K496767r71236l477431j809069K542692
$$ -1018148 -744812 -834533 525705 3736408 6233175 5261939 1784508 -24561 2518131
43440B518131N185817M040667R04802j832980l657589m479744l262805l7782K549768
$$ 2518131 7703948 11744615 12649417 10816437 7158848 2679104 -583701 -621483 1928285
43431A928285K342067J171276K191177M323705L131022k258765o973069o782121
$$ 1928285 4270352 5441628 7632805 11956510 15087532 12828767 5855698 -926423
43423i26423l271960m42208P15219J392137J466028L38376o09051R3463J025692
$$ -926423 -4198383 -4640591 -3925372 -2533235 -1067207 -728831 -1337882 -1244419 -218727
43414b18727J31375j358551p99278J186977J749638P96932Q67593K233364K284542
$$ -218727 -87352 -1445903 -2245181 -1058204 691434 1488366 2355959 4589323 6873865
43405F873865J98636j683944j879904j539697j405626n73573P39265P30853n67264
$$ 6873865 7072501 5388557 3508653 1968956 563330 -10243 729022 1459875 892611
43396H92611r33692j68359q24278l217387l883633j333995P98069m13597j971041
$$ 892611 -41081 -209440 -1033718 -4251105 -8134738 -9468733 -8670664 -9084261 -11055302
43387a1055302K70601M482449N343561K076485q34463n86573P49920O58781j7963
$$ -11055302 -10784701 -6302252 -958691 1117794 283331 -303242 446678 1105459 1087496
43378A087496O44736K154116K383723O93193j291311j792263r61733n57891j545784
$$ 1087496 1732232 3886348 6270071 6963264 5671953 3879690 2917957 2360066 814282
43369H14282k526694j502690R67170J991660K56507k024161k158029l89114J182071
$$ 814282 -1712412 -3215102 -2247932 -256272 235 -2023926 -4181955 -4571069 -3388998
43360c388998J666216J576953J054927n6220r40670n80181L88939L04622j027298
$$ -3388998 -1722782 -145829 909098 852878 -87792 -667973 -279034 25588 -1001710
43351a001710k018014j667127q26013n90469n88426K52892J817752K716534K223955
$$ -1001710 -3019724 -4686851 -5512864 -6103333 -6691759 -6438867 -4621115 -1904581 319374
43342C19374J400015J463361J684622M92621j371629j171389J308710K261717
$$ 319374 1719389 3182750 4867372 5359993 3988364 2816975 4125685 6387402
43334F387402p39936m301384l756906l16241R54225o81820r89200J344206K169573
$$ 6387402 5647466 1346082 -2410824 -2727065 -1772840 -2454660 -3443860 -2099654 69919
43325F9919p53550l470351k214782P10587J414591O82815J306342K583754K275973
$$ 69919 -683631 -4153982 -6368764 -5658177 -4243586 -3560771 -2254429 329325 2605298
43316B605298J236568J199356M89684k764332n362790k984402J977772L006372
$$ 2605298 3841866 5041222 5530906 2766574 -2596216 -5580618 -3602846 -596474
43308e96474m49373k199538M85179K695671M52171k640610j441627K475679L506444
$$ -596474 -1045847 -3245385 -2760206 -64535 387636 -2252974 -3694601 -1218922 2287522
43299B287522M26660k555395k224685Q2753J511659J334445O82249M26569M80350
$$ 2287522 2714182 158787 -2065898 -1983145 -471486 862959 1545208 1971777 2452127
43290B452127N54895O43851N26912n97333k997301m923332l742395N36641M255435
$$ 2452127 3007022 3650873 4177785 3580452 583151 -4340181 -8082576 -7545935 -3290500
43281c290500M058211P91178j995218k259906n37558J812280L241449K125777
$$ -3290500 767711 1558889 -436329 -2696235 -3233793 -1421513 1819936 3945713
43273C945713j216627l526324k200662R46500K158761R69566r0579o0914j85406
$$ 3945713 2729086 -797238 -2997900 -2051400 107361 1076927 986348 925434 740028
43264G40028m55179N45474K178937J985634m7368j072291m508Q98689k6586j604063
$$ 740028 284849 830323 3009260 4994894 4947526 3875235 3870727 4769416 4742830 3138767
43254C138767k348221k104852o18685K142284L864963K006413j500820k099861
$$ 3138767 790546 -1314306 -1932991 209293 4074256 6080669 4579849 2479988
43246B479988J64008M52158k568957m200432j933305R0758j241594j945519J986458
$$ 2479988 2643996 3096154 527197 -3673235 -5606540 -5515782 -6757376 -8702895 -6716437
43237f716437O590284N656941O87594j985886j388192j672902l164443j670982
$$ -6716437 -126153 5530788 6218382 4232496 2844304 1171402 -1993041 -3664023
43229c664023K809492M359391M08851l606999k197800K410891M213249J690087
$$ -3664023 -854531 3504860 3913711 306712 -1891088 519803 4733052 6423139
43221F423139j656272k911711k410652j659696j255891q87529o9262J101976J583761
$$ 6423139 4766867 1855156 -555496 -2215192 -3471083 -4358612 -4427874 -3325898 -1742137
43212a742137M44263j539009k325028r47229J429990K837913K078612o57947l568568
$$ -1742137 -1297874 -2836883 -5161911 -6109140 -4679150 -1841237 237375 -420572 -3989140
43203c989140m021657j059727K953507M449282K313074j498935m333199m619847
$$ -3989140 -8010797 -9070524 -6117017 -1667735 645339 -853596 -5186795 -9806642
43195i806642k219701J335685L624184L826411L490938L490071K160531j179603
$$ -9806642 -12026343 -10690658 -7066474 -3240063 250875 3740946 5901477 4721874
43187D721874l125231m15094M147604M571035J39685l667630l192306q49739j22290
$$ 4721874 1596643 1181549 5329153 9900188 10039873 6372243 3179937 2330198 2207908
43178B207908q38635j527693k425728l460087k623144O95535L462730K943891
$$ 2207908 1369273 -158420 -2584148 -6044235 -8667379 -7971844 -4509114 -1565223
43170a565223O11487n17949k33692j35706l78201k12355j9047j97410K15198J395145
$$ -1565223 -953736 -1471685 -1705377 -1841083 -2219284 -2431639 -2450686 -2648096 -2432898 -1037753
43160a037753J361270n53334j382317R06587L077615J208011k532507k942024
$$ -1037753 323517 -229817 -1612134 -705547 2372068 3580079 1047572 -1894452
43152a894452l16830J06945k788455l885690l53569L676382L833446J773117J026982
$$ -1894452 -2211282 -2104337 -4892792 -8778482 -9132051 -5455669 -1622223 150894 1177876
43143A177876J002770l51817j382906M93577K996976J499759l350576n716476
$$ 1177876 2180646 1828829 445923 939500 3936476 5436235 2085659 -3630817
43135c630817k764303J652749K649999K7025l017014l820194j556850K616148
$$ -3630817 -6395120 -4742371 -2092372 -2065347 -5082361 -8902555 -10459405 -7843257
43127g843257N314179L455480j479176m249579k425925N72550Q36567o36161n72387
$$ -7843257 -2529078 926402 -552774 -4802353 -7228278 -6655728 -5819161 -6455322 -7027709
43118g027709J259525K749749L371608L698816K659305o41591l528242k650923
$$ -7027709 -5768184 -3018435 353173 4051989 6711294 6069703 2541461 -109462
43110a09462L42687Q49346j058567n20116L538063N548024J756143l671888m913276
$$ -109462 233225 1082571 24004 -496112 3041951 8589975 10346118 6674230 1760954
43101A760954k587302r98614p72857L96052J966493J251443j055883j436959M70673
$$ 1760954 -826348 -1824962 -2597819 -2201767 -235274 1016169 -39714 -1476673 -1006000
43092a006000J339456q6797j343558j034193p70331j272634r02383M88334N01070
$$ -1006000 333456 246659 -1096899 -2131092 -2901423 -4174057 -5076440 -4588106 -4087036
43083d087036j245651j726915J48754J131326o12815j678479Q00722L470919J767889
$$ -4087036 -5332687 -7059602 -6910848 -5779522 -6392337 -8070816 -7270094 -3799175 -2031286
43074b031286k311439l027430K09435K552562J766485P65139J494430J798959
$$ -2031286 -4342725 -7370155 -7160720 -4608158 -2841673 -2076534 -582104 1216855
43066A216855J79961j120198l44517M72505n70223j394486M46655K923143K290438
$$ 1216855 1396816 276618 -67899 404606 -165617 -1560103 -1113448 1809695 4100133
43057D100133q64464k421406j015413L98976l33127j457750p20625Q42073N89125
$$ 4100133 3235669 814263 -201150 197826 -135301 -1593051 -2313676 -1471603 -882478
43048h82478j706670l449416k403398Q73816L642422L542238Q38749j772509k090083
$$ -882478 -2589148 -6038564 -8441962 -7568146 -3925724 -383486 455263 -1317246 -3407329
43039c407329q74299m17912j101238j216816k59087J29315n03369J64623L293987
$$ -3407329 -4281628 -4699540 -5800778 -7017594 -7276681 -7147366 -7650735 -7486112 -4192125
43030d192125N625815L366767j868027m550416k498074P78699J465127j28300
$$ -4192125 1433690 4800457 2932430 -1617986 -4116060 -3337361 -1872234 -2000534
43022b000534j648091k152992j754804l33407J429248J813213P24152N23479K265433
$$ -2000534 -3648625 -5801617 -7556421 -7889828 -6460580 -4647367 -3923215 -3399736 -1134303
43013a134303L425806J852196l66929k07284J123535L02412k117753k358917K39960
$$ -1134303 2291503 4143699 3776770 3569486 4693021 4995433 2877680 518763 758723
43004G58723K189962J772791J341721K150016J450406k387112n668240m201153
$$ 758723 2948685 4721476 6063197 8213213 9663619 7276507 1608267 -2592886
42996b592886J38414J935814R5561j192332N86504K521700J150384k030767k735784
$$ -2592886 -2454472 -518658 -423097 -1615429 -1028925 1492775 2643159 612392 -2123392
42987b123392j78880J837584M06318k442367k793178l81295J408246P37883l48790
$$ -2123392 -2302272 -464688 -58370 -2500737 -5293915 -5675210 -4266964 -3529081 -3877871
42978c877871K48367J269377O67947n20799R8727J886010J819256p29486k997985
$$ -3877871 -3629504 -2360127 -1692180 -2212979 -2114252 -228242 1591014 861528 -2136457
42969b136457k841438r56297J167000K749363K880982J081571q60897n99489Q59536
$$ -2136457 -4977895 -5934192 -4767192 -2017829 863153 1944724 1083827 484338 1343874
42960A343874L86396j681669j465742J664205L036510k8027l514406k992009m82212
$$ 1343874 1730270 48601 -1417141 247064 3283574 3255547 -258859 -3250868 -3733080
42951c733080m15770k034397j258651J921377L535504K262039P61953N18348J33525
$$ -3733080 -4148850 -6183247 -7441898 -5520521 -1985017 277022 1038975 1557323 1690848
42942A690848q51125q54782K11458K39515j206488j760782p5493K279165L648481
$$ 1690848 839723 -15059 196399 435914 -770574 -2531356 -2606849 -327684 3320797
42933C320797M075959L416677P52772l106395n310250m493936k350169p52573
$$ 3320797 7396756 10813433 11566205 8459810 3149560 -1344376 -3694545 -4447118
42925d447118K84473R10415L62495j124186j654622l20594J339291J584244M70025
$$ -4447118 -4162645 -3252230 -2889735 -4013921 -5668543 -5989137 -4649846 -3065602 -2595577
42916b595577j052774k185999k026116l46022J122258N38035q56281k22667K154762
$$ -2595577 -3648351 -5834350 -7860466 -8206488 -7084230 -6546195 -7402476 -7625143 -5470381
42907e470381L120587J982340J505793K540108K106335j153451l910225l267212
$$ -5470381 -2349794 -367454 1138339 3678447 5784782 4631331 721106 -2546106
42899b546106j118169l44049k57201P31424J247919l68039k336871k275844j181457
$$ -2546106 -3664275 -4008324 -4265525 -3534101 -2286182 -2654221 -4991092 -7266936 -8448393
42890h448393p53742M05647L500623N256116K262782k463338l057133L45225K312640
$$ -8448393 -9202135 -8796488 -5295865 -39749 2223033 -240305 -3297438 -2952213 -639573
42881f39573R98869k5055R43499J146200m96947q37501J409831K511970r6232
$$ -639573 359296 334241 1277740 2423940 1926993 1089492 2499323 5011293 4915061
42872D915061l129373k682672l55430j67566k255099l593943k898946j125489
$$ 4915061 1785688 -896984 -1252414 -1419980 -3675079 -7269022 -10167968 -11293457
42864a1293457J247156L894246M847123K495742j178043k398541m70452J616208
$$ -11293457 -10046301 -6152055 -1304932 1190810 12767 -2385774 -2856226 -1240018
42856a240018J385674m71023j784501j555489o03730m82959j683023k579700j081301
$$ -1240018 145656 -325367 -2109868 -3665357 -4269087 -4752046 -6435069 -9014769 -10096070
42847a0096070K217161M017856K404673o18949j881748p60327J185635K573624
$$ -10096070 -7878909 -3861053 -1456380 -2075329 -3957077 -4717404 -3531769 -958145
42839i58145K554447M96806k714345m403216k986468L4158K334174L282689K835587
$$ -958145 1596302 2093108 -621237 -5024453 -8010921 -7976763 -5642589 -2359900 475687
42830D75687N08355k415347k595905M45261K154604m71990l341958j493220K049858
$$ 475687 984042 -1431305 -4027210 -3581949 -1427345 -1899335 -5241293 -6734513 -4684655
42821d684655O43783m281274m297687K459669P495074M896928M3573J32216K839545
$$ -4684655 -4040872 -8322146 -12619833 -10160164 -2665090 2231838 2275411 2407627 5247172
42812E247172J521669l042207m188866l98865K941681K437106N60842n6692k57879
$$ 5247172 6768841 3726634 -462232 -861097 2080584 4517690 5078532 5021840 4763961
42803D763961p81585j94822J519047J575468j021943l037048j735692P97286Q88897
$$ 4763961 3982376 3787554 5306601 6882069 5860126 2823078 1087386 1884672 2773569
42794B773569j221778k016996J55186L051157L580823J328687j295121j862580
$$ 2773569 1551791 -465205 -310019 2741138 6321961 7650648 6355527 4492947
42786D492947o14883J6363j260376k807434k515239p14785R70610K247860L343452
$$ 4492947 3878064 3894427 2634051 -173383 -2688622 -3403407 -2432797 -184937 3158515
42777C158515L012065M51709j901379j223223P77947J40724k447741k246989J352969
$$ 3158515 6170580 6622289 4720910 3497687 4275634 4416358 1968617 -278372 1074597
42768A074597L082511L50392k293544q09389J600021K88769k732632k380592Q96158
$$ 1074597 4157108 4507500 2213956 1404567 3004588 3293357 560725 -1819867 -923709
42759i23709K323776Q04864l87953k3170j42319j075677q56649K0144j270580
$$ -923709 1400067 2204931 1816978 1793808 1651489 575812 -280837 -260693 -1531273
42750a531273m050658l780569O98334M393800L093256q69412k422952k57420K907814
$$ -1531273 -5581931 -9362500 -8664166 -4270366 -1177110 -2046522 -4469474 -4726894 -1819080
42741a819080M090945K159264j597842l684461j665490J872384J800699k070262
$$ -1819080 2271865 4431129 2833287 -851174 -2516664 -644280 1156419 -913843
42733i13843l976833n97471L779156L598404j60809k462709j654263j48095M07076
$$ -913843 -4890676 -5488147 -1708991 1889413 1728604 -734105 -2388368 -2536463 -2129387
42724b129387L87441k33434j640925k153321k2469L060490L514293Q46226j792643
$$ -2129387 -1741946 -1975380 -3616305 -5769626 -5792095 -2731605 782688 1628914 -163729
42715a63729k021684o14335N38809N11629o16457j791831j304436J074731K909119
$$ -163729 -2185413 -2799748 -2260939 -1749310 -2365767 -4157598 -5462034 -4387303 -1478184
42706a478184K056599r3240o76908L64053Q21850J19013n00484j004486k274679
$$ -1478184 578415 485175 -191733 172320 994170 1113183 612699 -391787 -2666466
42697b666466l070291j110187K521574L866943J748669p23994j243294j069702
$$ -2666466 -5736757 -6846944 -4325370 -458427 1290242 566248 -677046 -1746748
42689a746748j340368o47481J451393K205121j01334k721888k428783l10144P59783
$$ -1746748 -3087116 -3734597 -2283204 -78083 -179417 -2901305 -5330088 -5640232 -4880449
42680d880449R91765K076537K686630K95160l341870l472182L96985L119775J329633
$$ -4880449 -3888684 -1812147 874483 1169643 -2172227 -5644409 -5247424 -2127649 -798016
42671g98016j781282j576825J325349K773980J575048O30151K006476M002557
$$ -798016 -2579298 -4156123 -2830774 -56794 1518254 2148405 4154881 8157438
42663H157438L789454Q39285l128503o038944o432816l963551j63161K183514
$$ 8157438 11946892 12786177 9657674 3618730 -2814086 -6777637 -6940798 -4757284
42655d757284J723165J36733k8893J341476K113598J139276k77322m98259K60209
$$ -4757284 -3034119 -2897386 -2926279 -1584803 528795 1668071 1390749 892490 1152699
42646A152699O03956j52579j518346k531251k398779j149325L5684P4412k84969
$$ 1152699 1756655 1604076 85730 -2445521 -4844300 -5993625 -5957941 -5883529 -6168498
42637f168498N33398J898306J152901k052069m098214k231113J151911K010176
$$ -6168498 -5635100 -3736794 -2583893 -4635962 -8734176 -10965289 -9813378 -7803202
42629g803202P02639P80210K713819L163156P12639j904972k386393j736024j034531
$$ -7803202 -7100563 -6320353 -3606534 -443378 269261 -1635711 -4022104 -5758128 -6792659
42620f792659P38475L350800L540105j52182l814209l235072j82100O20494r41428
$$ -6792659 -6054184 -2703384 836721 684539 -3129670 -6364742 -6546842 -5926348 -6867776
42611f867776p12094K318679L998587J511014k305355l126612n98549K422858
$$ -6867776 -7579870 -5261191 -1262604 248410 -2056945 -5183557 -5782106 -3359248
42603c359248L705656K690095k91859l598531m444244j704839K084981L252010
$$ -3359248 346408 3036503 2744644 -853887 -5298131 -7002970 -4917989 -1665979
42595a665979J095376j766935k626329j097744J198740K290495J501104J13644
$$ -1665979 -570603 -2337538 -4963867 -6061611 -4862871 -2572376 -1071272 -957628
42587i57628j26909N51326K36016j459845k376121j237937l085o72249j722765
$$ -957628 -1084537 -533211 -297195 -1757040 -4133161 -5371098 -5374183 -6046432 -7769197
42578g769197o85526J289832J258840K4354J259053M736481N408984J084816l627656
$$ -7769197 -8454723 -7164891 -5906051 -5881697 -4622644 113837 5522821 6607637 2979981
42569B979981m061883k055175j756545k417024o29589K451286K151136j860602
$$ 2979981 -1081902 -3137077 -4893622 -7310646 -7940235 -5488949 -3337813 -5198415
42561e198415m427275k506740J003611K491089K233833J858765J215427J92935
$$ -5198415 -9625690 -12132430 -11128819 -8637730 -6403897 -4545132 -3329705 -3136770
42553c136770K70073J744248K323696Q15762o51058l92371n4277j077849j526077
$$ -3136770 -2866697 -1122449 1201247 2017009 1365951 973580 919303 -158546 -1684623
42544a684623K17405J613820j12562k647456j697700K144630M204372K609078
$$ -1684623 -1467218 146602 34040 -2613416 -4311116 -2166486 2037886 4646964
42536D646964J46979n24425J51219M60843o75717l229555n101558l090030K362306
$$ 4646964 4793943 4269518 4420737 4881580 4205863 976308 -4125250 -7215280 -4852974
42527d852974N643293L033380j237555j055105J875978J018981l680703n326944
$$ -4852974 790319 3823699 2586144 1531039 3407017 4425998 745295 -4581649
42519d581649j427949K247850J385012o81543Q1278J734280R07788j252989j964579
$$ -4581649 -6009598 -3761748 -2376736 -3058279 -2977001 -1242721 -334933 -1587922 -3552501
42510c552501j257288J19852K794836N321709L639015k040342n070905j861756
$$ -3552501 -4809789 -4689937 -1895101 3426608 7065623 5025281 -45624 -1907380
42502a907380J832398j05939m057228k785647K412236L981803K82143k820706
$$ -1907380 -74982 -180921 -4238149 -7023796 -4611560 -629757 -347614 -3168320
42494c168320j859602L87243J307874J874932K630174K086858L03229q10543j301846
$$ -3168320 -5027922 -4640679 -3332805 -1457873 1172301 3259159 3562388 2751845 1449999
42485A449999k610723l285063n66204L657723M253221Q38018j442650j67163J288581
$$ 1449999 -1160724 -4445787 -5011991 -1354268 2898953 3736971 2294321 2127158 3415739
42476C415739N04794k03731P89117Q64928j774164m246887l535053r38582R05577
$$ 3415739 3920533 3716802 4505919 5370847 3596683 -650204 -4185257 -5123839 -4218262
42467d218262J679950J491225o28455l553334l528313J14039K770802J431674
$$ -4218262 -2538312 -1047087 -1675542 -5228876 -8757189 -8643150 -5872348 -4440674
42459d440674m86278Q34718K836184R01472l575902m980651j738329K276042L879506
$$ -4440674 -4926952 -4092234 -1256050 -354578 -3930480 -8911131 -10649460 -8373418 -4493912
42450d493912L688269L169881K309468P18609j327202l128501l527109j612568
$$ -4493912 -805643 2364238 4673706 5392315 4065113 936612 -2590497 -4203065
42442d203065J257445J944360l05216k348741j696022P3254Q05102J583936L716741
$$ -4203065 -2945620 -1001260 -1306476 -3655217 -5351239 -5277985 -4472883 -2888947 827794
42433H27794M848177K331604j715815l216568k277557j888990j941917K20264
$$ 827794 5675971 8007575 6291760 3075192 797635 -1091355 -3033272 -2813008
42425b813008L819506M559163J121892k809660l925764k705189o77474J740911
$$ -2813008 1006498 5565661 6687553 3877893 -47871 -2753060 -3430534 -1689623
42417a689623L515576K790319n0750k058430j655589k71995N94510R70129N03070
$$ -1689623 1825953 4616272 4565522 2507092 851503 579508 1174018 2144147 2647217
42408B647217j614876l923785l435411l42460J539502M94990n99341O46622K374808
$$ 2647217 1032341 -2891444 -6326855 -6669315 -5129813 -4634823 -5234164 -4587542 -2212734
42399b212734K300036J627215J968351J658909r83321l413104k290756O51099
$$ -2212734 87302 1714517 3682868 5341777 4358456 945352 -1345404 -694305
42391f94305Q39890j908462l039475k09018L697812N224978M183097J760714j456327
$$ -694305 145585 -1762877 -4802352 -5011370 -1313558 3911420 8094517 9855231 8398904
42382H398904l875224k833077J303906L814725J451460k586358k969019Q3330
$$ 8398904 4523680 1690603 2994509 6809234 8260694 5674336 2705317 2788647
42374B788647J595924k37618j621844K60664K678883K043696l08565p73257L51420
$$ 2788647 4384571 4146953 2525109 2785773 5464656 7508352 7199787 6426530 6777950
42365F777950k53044k804017l791540j900609k22817j018233k068203o33050K053313
$$ 6777950 6524906 3720889 -70651 -1971260 -2194077 -3212310 -5280513 -5913563 -3860250
42356c860250L168350K777616K645007K315631N3209l097825l832377j376074
$$ -3860250 -691900 2085716 4730723 7046354 7099563 4001738 169361 -1206713
42348a206713J281672J597317M20772j20800L86842Q47728M19030q24520k038857
$$ -1206713 74959 1672276 2093048 1972248 2359090 3206818 3625848 2801328 762471
42339G62471k002116k91114J775869K364352J288409r2744q98921j262251r90883
$$ 762471 -1239645 -1530759 245110 2609462 3897871 3805127 2906206 1643955 653072
42330F53072N65508K906543M108147K912912K73240j670966j665874l25282N42728
$$ 653072 1218580 4125123 8233270 11146182 11419422 9748456 8082582 7757300 8300028
42321H300028j85974j489167j384225R6335N92030j037099k749508k573821j832156
$$ 8300028 8114054 6624887 5240662 5336997 5929027 4891928 2142420 -431401 -2263557
42312b263557k580440l499824j670123K364355M753811L521616N70598j544889
$$ -2263557 -4843997 -8343821 -10013944 -7649589 -2895778 625838 1196436 -348453
42304c48453k026748j027470O75417J180025m81325j956071m25933K491815K612398
$$ -348453 -2375201 -3402671 -2727254 -1547229 -2028554 -3984625 -4410558 -1918743 693655
42295F93655k1365q15883J977646M324590K783318n60485k055986j540954o85284
$$ 693655 672290 -143593 1834053 6158643 8941961 8381476 6325490 4784536 4099252
42286D099252K64316J201330P00234j355620k549338j823764j404922k317824
$$ 4099252 4363568 5564898 6265132 4909512 2360174 536410 -868512 -3186336
42278c186336j798226J557761M030700K317520q13000j163378k2156r18597k367052
$$ -3186336 -4984562 -3426801 603899 2921419 2108419 945041 922885 4288 -2362764
42269b362764l03185L954174M939174J788175o75304O416Q20847o64757k576073
$$ -2362764 -2665949 1288225 6227399 8015574 7340270 7346686 8167533 7502776 4926703
42260D926703k609677j070708J234156L873409M738663J728308k678694l494544
$$ 4926703 2317026 1246318 2480474 6353883 11092546 12820854 10142160 6647616
42252F647616q16909J68178j922668k188092J629039M487389K438821o24733P220
$$ 6647616 5830707 5998885 4076217 1888125 3517164 8004553 10443374 9818641 9825861
42243I825861J758274K83038j696761R65036N556530M720206j192166l910145
$$ 9825861 11584135 11867173 10170412 11135448 16691978 21412184 20220018 16309873
42235A6309873j62959L747751K791590O84972K224280M910867M172777K063221
$$ 16309873 16146914 19894665 22686255 23371227 25595507 30506374 34679151 36742372
42227C6742372L863026Q742022J0877249R175549R160159J3985856J9394888K0359876
$$ 36742372 40605398 49347420 60224669 69400218 78560377 92546233 111941121 132300997
42219A32300997J8309487J8043222K0391225K2081208K1377996J9547704J6759561
$$ 132300997 150610484 168653706 189044931 211126139 232504135 252051839 268811400
42212B68811400J0583957Q9854j1372480j9454845k3074935k3706222k2314180
$$ 268811400 279395357 279485211 268112731 248657886 225582951 201876729 179562549
42205A79562549j9424710j6898104j6529080j7018817j5191502j0712144o935749
$$ 179562549 160137839 143239735 126710655 109691838 94500336 83788192 76852443
42198G6852443o095179o269869m850519k703283k364606l619354l853361k299134
$$ 76852443 70757264 64487395 59636876 56933593 54568987 50949633 47096272 44797138
42190D4797138j050880j597064k929655l855473m781178n855009n443118k521833
$$ 44797138 43746258 42149194 39219539 35364066 30582888 24727879 19284761 16762928
42182A6762928P59851J298232o89131j934355p68855P86942L73550j335548k119963
$$ 16762928 17522779 18821011 18131880 16197525 15428670 16215612 16589162 15253614 13133651
42173A3133651j576672j085310j262323j463838j450021j495078r02129J336655
$$ 13133651 11556979 10471669 9209346 7745508 6295487 4800409 3898280 5234935
42165E234935L979528M054555J055918j658567j386421N8627o25281k960038l483746
$$ 5234935 9214463 13269018 14324936 12666369 11279948 11338575 10713294 7753256 4269510
42156D269510j089737J621210K455653K104687J758425R55677q29589k554127
$$ 4269510 3179773 4800983 7256636 9361323 11119748 12075425 11245836 8691709
42148H691709l108247k944456k831684k264071m49141K070595L858889L908863
$$ 8691709 5583462 2639006 -192678 -2456749 -2905890 -835295 3023594 6932457
42140F932457K054625p47087k262164r38968J409056J166569j852480l493489
$$ 6932457 8987082 8239995 5977831 5038863 6447919 7614488 5762008 2268519
42132B268519j334060J367234P18540j534602r14574K335343L566880J133484
$$ 2268519 934459 2301693 3020233 1485631 571057 2906400 6473280 7606764
42124G606764j427682j437982o88702j213379j586032j38026J462327J080915
$$ 7606764 6179082 4741100 4052398 2839019 1252987 1114961 2577288 3658203
42116C658203Q6865R59280K633628J920940j208069l290210k365916k23404R27717
$$ 3658203 3745068 4704348 7337976 9258916 8050847 4760637 2394721 2171317 3099034
42107C099034J339726K116692K706607J614601j126403l323344k603229R17928
$$ 3099034 4438760 6555452 9262059 10876660 9750257 6426913 3823684 4741612
42099D741612L992908L263361n01336k701282q24379J746828M16584l624241m900849
$$ 4741612 8734520 11997881 11496545 8795263 7970884 9717712 10134296 6510055 1609206
42090A609206j832801J064773L68501j276994j41682K249758J789499j330746
$$ 1609206 -223595 841178 1209679 -67315 -208997 2040761 3830260 2499514
42082B499514k838708r00871J608266J850815O94052M17679J211919J533102N65259
$$ 2499514 -339194 -1240065 368201 2219016 2913068 3330747 4542666 6075768 6641027
42073F641027r54148j749599j243726j17608M28568K92241N58309J335830R92094
$$ 6641027 5686879 3937280 2693554 2575946 3004514 3296755 3855064 5190894 6182988
42064F182988r95665k159585m26529K122190K052891K3191m56612Q42936N61992
$$ 6182988 5187323 3027738 2601209 4723399 6776290 6799481 6342869 7185805 7747797
42055G747797j976462l071892q12023J697161J622410N95482P05251M96534j364547
$$ 7747797 5771335 2699443 1887420 3584581 5206991 5802473 6507724 7004258 5639711
42046E639711k275845O7236K874716K477383M81516M60074J079802j274806m718295
$$ 5639711 3363866 3431102 6305818 8783201 9264717 9724791 10804593 9529787 4811492
42037D811492l706880J526466M372839J838006j384207r25500J198555J543091
$$ 4811492 1104612 2631078 7003917 8841923 7457716 6532216 7730771 9273862
42029I273862R42034J500308K078781P41029j398724k271998k182170k103713
$$ 9273862 10215896 11716204 13794985 14536014 13137290 10865292 8683122 6579409
42021F579409j384896J00246N03530m09335M60642M284503O783677M189320m28335
$$ 6579409 5194513 5294759 5798289 5388954 5849596 10134099 16917776 21107096 20678761
42012B0678761j771239o29766j761718n042844n179606l87669M581180N398045
$$ 20678761 18907522 18277756 16516038 11473194 6293588 5905919 10487099 15885144
42004A5885144L161962P25950j498344l693522m288633k378511r4678N1729j358252
$$ 15885144 19047106 19773056 18274712 14581190 10292557 7914046 7819368 7871097 6512845
41995F512845j887185p38349P44112J297649J067824R43513J191794Q04390j252464
$$ 6512845 4625660 3887311 4631423 5929072 6996896 7940409 9132203 9936593 8684129
41986H684129l688528l269703Q32115M648384M028597M10288j430152n41106l61141
$$ 8684129 4995601 1725898 2558013 7206397 11234994 11645282 10215130 9674024 9312883
41977I312883k001251k007246J332235M055886K156428k212822l891651j917049
$$ 9312883 7311632 5304386 6636621 10692507 12848935 10636113 6744462 4827413
41969D827413J23256k34104j681434j884079k98859J830854K694363J373823r00503
$$ 4827413 4950669 4716565 3035131 1151052 852193 2683047 5377410 6751233 5850730
41960E850730j831091j217019j330772k882875l011585L17616M154251M221472
$$ 5850730 4019639 2802620 1471848 -1411027 -4422612 -4104996 49255 4270727
41952D270727J262417k33762R50046J342559j066011l511396l095670j188791
$$ 4270727 5533144 5299382 6249428 7591987 6525976 3014580 -81090 -1269881
41944a269881n32042o10861P83654K927176K736394j80741k345979j273873J047876
$$ -1269881 -1801923 -2412784 -1629130 1298046 4034440 3853699 1507720 233847 1281723
41935A281723J259830n83903j640178q38794j39637q72325j367719K14745K535277
$$ 1281723 2541553 1957650 317472 -521322 -660959 -1533284 -2901003 -2686258 -150981
41926a50981K825747J083233o798P33815J344665n097k215781k904098j353452
$$ -150981 2674766 3757999 3751201 4485016 5829681 5824584 3608803 704705 -648747
41917f48747J271522L364502L578627J512717j180374j798416j696J205778n70037
$$ -648747 622775 3987277 7565904 9078621 7898247 6099831 6098135 7303913 6733876
41908F733876l597041m340276k105358P81602K503090L076756K698346J294096
$$ 6733876 3136835 -1203441 -3308799 -2527197 -24107 3052649 5750995 7045091
41900G045091k10685l84270O43929J376383J240663Q58742J86872j335822k662510
$$ 7045091 6834406 6450136 7094065 8470448 9711111 10569853 10756725 9420903 6758393
41891F758393j753686R96586K469203J076608j020835j366068o27469p10177j417729
$$ 6758393 5004707 6001293 8470496 9547104 8526269 7160201 6532732 5822555 4404826
41882D404826j328876o21138n39986q55821k23556J307496K280609K096305J288765
$$ 4404826 3075950 2454812 1914826 1059005 835449 2142945 4423554 6519859 7808624
41873G808624j93156k714548m919920m467946j482681J029387J274400R88248
$$ 7808624 7615468 4900920 -19000 -4486946 -5969627 -4940240 -3665840 -2677592
41865b677592K147461L489115K647899K84084q16114k09873l18047k102884l181986
$$ -2677592 -530131 2958984 5606883 5890967 5074853 4864980 4546933 2444049 -737937
41856g37937j616519Q73102J573243Q96540J232331K628930K567360J77913k051597
$$ -737937 -2354456 -1481354 91889 988429 2220760 4849690 7417050 7594963 5543366
41847E543366j813762j15932N75420k11918r94835p91882J06502J156788J773153
$$ 5543366 3729604 3613672 4189092 3977174 2982339 2190457 2296959 3453747 5226900
41838E226900J007420j319798l383380k984463n82457R60360J57101j142020m70849
$$ 5226900 6234320 4914522 1531142 -1453321 -2035778 -1075418 -918317 -2060337 -2531186
41829b531186J832392L193598K109085l59898k175040k354587j323995k1744R81569
$$ -2531186 -698794 2494804 4603889 4243991 2068951 -285636 -1609631 -1631375 -649806
41820f49806J757560K605292L316126L006553J002848k050926m247638l942582
$$ -649806 1107754 3713046 7029172 10035725 11038573 8987647 4740009 797427
41812G97427j438651J000857J270161l22057j450161p68239K47674o01933k859488
$$ 797427 -641224 359633 1629794 1307737 -142424 -910663 -662989 -1264922 -4124410
41803d124410l709010j846775O64982J434028J151305K095230L950501L656577
$$ -4124410 -7833420 -9680195 -9015213 -7581185 -6429880 -4334650 -384149 3272428
41795C272428J43468l033638j866254K340598L998616M28094m370864m728441
$$ 3272428 3415896 382258 -1483996 856602 4855218 5283312 912448 -3815993
41787c815993m55601L355138L036387J94853j563406j202601j12222O86594J148793
$$ -3815993 -4271594 -916456 2119931 2314784 751378 -451223 -563445 123149 1271942
41778A271942J045900J80967o75375o54457j97243k11384m83046n05604j001796
$$ 1271942 2317842 2498809 1823434 1168977 971734 760350 277304 -228300 -1230096
41769a230096k462741k926140p2136M529805O350077L680934m40645k870732l639929
$$ -1230096 -3692837 -6618977 -6691113 -2161308 4188769 7869703 7429058 4558326 918397
41760I18397l327205j000664K609332L431224n97403n042830m207601Q36442M070174
$$ 918397 -2408808 -3409472 -800140 2631084 2033681 -3009149 -7216750 -6380308 -2310134
41751b310134L271844J780068J703230J001598j356086k634311j252577o478j295186
$$ -2310134 961710 2741778 4445008 5446606 4090520 1456209 203632 197154 -1098032
41742a098032k954653k273351p03830o56372o82805J584211M177108L616388J266057
$$ -1098032 -4052685 -6326036 -7029866 -7686238 -8369043 -6784832 -2607724 1008664 2274721
41733B274721J283352L098078J973492k647925n489945l603307l70767R42020
$$ 2274721 3558073 6656151 8629643 5981718 491773 -3111534 -3482301 -2540281
41725b540281J924964L975681M056318K86414k866858q63897K946249K248199
$$ -2540281 -615317 3360364 7416682 7703096 4836238 3972341 6918590 9166789
41717I166789j798000k516889Q38710J818037j898254m142720p69368K830329
$$ 9166789 7368789 4851900 5690610 7508647 5610393 1467673 698305 3528634
41709C528634M36422m355098l513154K521367N231463Q75940m456104m400224
$$ 3528634 3965056 -390042 -3903196 -1381829 3849634 4725574 269470 -4130754
41701d130754p24171J179330N04524J94691P17031j96206k224646j665480K681498
$$ -4130754 -4854925 -3675595 -3171071 -2976380 -2259349 -2455555 -4680201 -6345681 -3664183
41692c664183O377037M693423q25121m142737k513900N75534R70583o20569r64055
$$ -3664183 2712854 7406277 6581156 2438419 -75481 500053 1470636 850067 -113988
41683a13988m6570p56851l187258l454030J71342L594485K499831r42325j137240
$$ -113988 -160558 -917409 -4104667 -7558697 -7387355 -3792870 -1293039 -2235364 -3372604
41674c372604K393078M360255K047134o07874M24280K729797J371989l189172
$$ -3372604 -979526 3380729 5427863 4819989 5244269 7974066 9346055 6156883
41666F156883n703129l855405q69757J87844N13610K068631L385934J906594j471607
$$ 6156883 453754 -3401651 -4271408 -4083564 -3569954 -1501323 1884611 3791205 2319598
41657B319598l373146k582395q13881O66315K127187K936214J345475k011404
$$ 2319598 -1053548 -3635943 -4449824 -3783509 -1656322 1279892 2625367 613963
41649F13963l326467n36092L097186L038378k63272k278475j041946N18313l59845
$$ 613963 -2712504 -3248596 -151410 2886968 2623696 345221 -696725 -178412 -538257
41640e38257k006079j196143J629946K748284M27888k470677k048697J706292
$$ -538257 -2544336 -3740479 -2110533 637751 1065639 -1405038 -3453735 -1747443
41632a747443M841767M134781O96920j803685j698188o31714m50248p63663n63152
$$ -1747443 3094324 7229105 7926025 6122340 4424152 3792438 3342190 2578527 2015375
41623B015375m07317j170740j926370j284785L660J29935p17889r19301n16680
$$ 2015375 1608058 437318 -1489052 -2773837 -2770177 -2640242 -3358131 -4277432 -4794112
41614d794112p76410r33340J040897M013022M004970K83749k755534j898244L86721
$$ -4794112 -5570522 -6503862 -5462965 -1449943 2555027 2838776 83242 -1815002 -1428281
41605a428281N14208o18738j83718J260664J110199n91231j831033k393356k898973
$$ -1428281 -914073 -1532811 -1716529 -455865 654334 63103 -1767930 -4161286 -7060259
41596g060259j676074K699244O699803M959535j623623n868892l571819J582287
$$ -7060259 -8736333 -6037089 662714 5622249 3998626 -1870266 -5442085 -3859798
41588c859798L960000K843562J134729M24117K8462q83759k196648k903123j685446
$$ -3859798 100202 2943764 4078493 4502610 4531072 3647313 1450665 -1452458 -3137904
41579c137904J184226K869123J252735j327300r47537J579219J509124k169992
$$ -3137904 -1953678 915445 2168180 840880 -106657 1472562 2981686 811694
41571H11694m640381k457901J661871L494743K500338r0064l909858p036803n412504
$$ 811694 -3828687 -6286588 -4624717 -1129974 1370364 1280300 -2629558 -9666361 -15078865
41562a5078865J213649O602161N738543J731751K70210Q17046p71190l751601
$$ -15078865 -13865216 -7263055 -1524512 207239 477449 1294495 523305 -3228296
41554c228296l560117j8097K391511K172680K206010L201959K310089o60158k008790
$$ -3228296 -6788413 -6806510 -4414999 -2242319 -36309 3165650 5475739 4815581 2806791
41545B806791q62179q77176k923306k495646K102610N257758K637587j130663
$$ 2806791 1944612 1067436 -1855870 -4351516 -2248906 3008852 5646439 4515776
41537D515776M71166N224901N692177R15883k851984k458788j536717k781143
$$ 4515776 4986942 10211843 15904020 16819903 13967919 11509131 9972414 7191271
41529G191271l317407o27947K309718J713375r60216j771116n22040j18740j290788
$$ 7191271 3873864 3245917 5555635 7269010 6308794 4537678 4015638 3896898 2606110
41520B606110j966265j251847l70389K66128J491377K597238J517529j305964
$$ 2606110 639845 -612002 -982391 -716263 775114 3372352 4889881 3583917
41512C583917k481825n44565J741681J833208J132047J586109J410798j914579
$$ 3583917 1102092 557527 2299208 4132416 5264463 6850572 8261370 6346791
41504F346791o152578o324696j899243K211571K342211N8683j392191j089276
$$ 6346791 194213 -6130483 -8029726 -5818155 -3475944 -3417261 -4809452 -5898728
41496e898728L75184K432050L633519K143540j130610k585906p87022J438499
$$ -5898728 -5523544 -3091494 542025 2685565 1554955 -1030951 -1817973 -379474
41488c79474J450301L23112r0230l78067j248461j152175O72310J740373L36524
$$ -379474 1070827 1393939 1303709 925642 -322819 -1474994 -802684 937689 1274213
41479A274213r30596N25685K274321Q57583j786090j326281J355726J552189j133116
$$ 1274213 343617 869302 3143623 4001206 2215116 888835 2244561 3796750 2663634
41470B663634k204788l642J940406J256679r1063m66670j282766l144870l848085
$$ 2663634 458846 455204 2395610 3652289 3561226 3094556 1811790 -1333080 -5181165
41461e181165k307795m95404L30828J408549K951007L041267J673267J464025
$$ -5181165 -7488960 -7984364 -7653536 -6244987 -3293980 -252713 1420554 2884579
41453B884579K537771J513095k155252l965079j529597J121490J52319k005076
$$ 2884579 5422350 6935445 4780193 815114 -714483 407007 559326 -1445750
41445a445750j586447R226k60957j037744L47962K031788Q39506j255025j14460
$$ -1445750 -3032197 -3022971 -3283928 -4321672 -3973710 -1941922 -1102416 -2357441 -2471901
41436b471901L014668L272646L16493j617420j159900j013066j772023r50027
$$ -2471901 542767 3815413 4131906 2514486 1354586 341520 -1430503 -2380530
41428b380530J111639P02024k326271l130287K53504L244080K079835k08180Q20024
$$ -2380530 -1268891 -566867 -2893138 -6023425 -5769921 -2525841 -446006 -654186 165838
41419A65838L779753M224095J769901k53460n71501r06485j944584k487237k574448
$$ 165838 3945591 8169686 9939587 9686127 9114626 8208141 6263557 3776320 1201872
41410A201872l644656m937671l339209J523336N036257L184588j469106k798719
$$ 1201872 -2442784 -7380455 -10719664 -9196328 -4160071 -975483 -2444589 -5243308
41402e243308M18943K913193R27526k069585q80393L088880L874993K95836k408124
$$ -5243308 -4824365 -1911172 -983646 -3053231 -3933624 -844744 3030249 3326085 917961
41393I17961j180795L07201j454338l447138j149429L629980N148859J988670
$$ 917961 -262834 44367 -1409971 -4857109 -6006538 -2376558 2772301 4760971
41385D760971k005573l887835m067826l192894r83288J724086L297949L573769
$$ 4760971 2755398 -1132437 -5200263 -8393157 -9376445 -7652359 -4354410 -780641
41377g80641K960822N37114l465997n079104j244628M295256N244775K032997
$$ -780641 2180181 2717295 -748702 -5827806 -7072434 -2777178 2467597 4500594
41369D500594O47787K447763K358175j501506l928450j481906J562552M42881
$$ 4500594 5148381 7596144 9954319 8452813 4524363 3042457 4605009 5047890
41361E047890k589228k953306j215636n51465n29848R93853K579750J320934j588059
$$ 5047890 2458662 -494644 -1710280 -2261745 -2791593 -1797740 782010 2102944 514885
41352E14885k456480r50673K42312M29806J079880J775673M35854k554821m220912
$$ 514885 -1941595 -2892268 -2649956 -2220150 -1140270 635403 1071257 -1483564 -5704476
41343e704476l091466m35680K192589L783659L045785o9367k685431k037903M54006
$$ -5704476 -8795942 -9231622 -7039033 -3255374 -209589 -278956 -2964387 -5002290 -4548284
41334d548284J323707L82966K54338J262782J013101q08784j415600L66611K002788
$$ -4548284 -3224577 -2841611 -2587273 -1324491 -311390 -1120174 -2535774 -2169163 -166375
41325a66375J162176j246655l122784l609355k530728m3027K169550J955845M716
$$ -166375 995801 -250854 -3373638 -6982993 -9513721 -9556748 -7387198 -5431353 -5426637
41316e426637m57957J651730L572167L003777J372257R12906R76177l16511k503936
$$ -5426637 -5884594 -4232864 -660697 2343080 3715337 4628243 5604420 5287909 2783973
41307B783973l459019k590781j045162N67098K300767L027900J004079k918270
$$ 2783973 -675046 -3265827 -4310989 -3743891 -1443124 1584776 2588855 -329415
41299c29415m625687j094553N177818P908761L848516l273721o790803m457371
$$ -329415 -4955102 -6049655 -871837 7036924 10885440 7611719 820916 -3636455
41291c636455k29616J133297p43854k738261k430817n3098K512065L314537J802616
$$ -3636455 -3866071 -2732774 -3476628 -6214889 -8645706 -8698804 -6186739 -2872202 -1069586
41282a069586l10344o45128P37018J400978L92389l03828N46907J057081k91726
$$ -1069586 -1379930 -2025058 -1288040 112938 505327 201499 748406 1805487 1513761
41273A513761j553045o42206P89758L30677o67946L35828J987106J265652p27176
$$ 1513761 -39284 -681490 108268 438945 -229001 106827 2093933 3359585 2632409
41264B632409n13248J154844K23516l240165m608201k414001m52360p10689l00434
$$ 2632409 2119161 3274005 3497521 257356 -4350845 -6764846 -7217206 -7927895 -8228329
41255h228329K295681L885793K516411J097041J504276O81301k940123m583732
$$ -8228329 -5932648 -2046855 469556 1566597 3070873 3752174 812051 -3771681
41247c771681m11907M865015M274302p83269l158150j098630M82252q53587j835387
$$ -3771681 -4183588 681427 4955729 4172460 1014310 -84320 397932 -455655 -2291042
41238b291042k25987J504760J186474N94758J718034L171188K655474L11350k116338
$$ -2291042 -2517029 -1012269 174205 768963 2486997 5658185 8313659 8625009 6508671
41229F508671l362189k889237j096674K09732l01933j033305N98699L731145M529463
$$ 6508671 3146482 257245 -839429 -629697 -931630 -1964935 -1366236 2364909 6894372
41220F894372J511935k480173m208800l242293q20039J666236K591907J276859
$$ 6894372 8406307 5926134 1717334 -1524959 -2344998 -678762 1913145 3190004
41212C190004m33470n04069k92247k174756m077054j450744M651871P262945L343932
$$ 3190004 2756534 2252465 1960218 -214538 -4291592 -5742336 -1090465 6172480 9516412
41203I516412j728287k628189j370776j746380j887288J443549N163548L705818
$$ 9516412 7788125 5159936 3789160 2042780 155492 1599041 6762589 10468407
41195A0468407j574217m007640j808587L16136j16266r2364J958852K625072j83432
$$ 10468407 8894190 4886550 3077963 3394099 3277833 3185469 5144321 7769393 7585961
41186G585961k975460k368861m98978p88437k131681j665393l14587q06787k163488
$$ 7585961 4610501 2241640 1742662 954225 -1177456 -2842849 -3157436 -3964223 -6127711
41177f127711j069962K166091L644560J845959n01007j014828m78666k09992K3488
$$ -6127711 -7197673 -5031582 -1387022 458937 -42070 -1056898 -1535564 -1745556 -1722068
41168a722068J52470j117917l586219m365783j554088K639933M520641L396312
$$ -1722068 -1569598 -2687515 -6273734 -10639517 -12193605 -9553672 -5033031 -1636719
41160a636719J482702L88839r2535j87840N79553J948039K455293J232042o44352
$$ -1636719 -154017 234822 142287 -45553 534000 2482039 4937332 6169374 5525022
41151E525022j303709k29080J171620J089921o77620k394683k366407j025645
$$ 5525022 4221313 3992233 5163853 6253774 5576154 3181471 815064 -210581
41143b10581k00468l79375j70529J009108J577009N47356j59705J407712L322245
$$ -210581 -411049 -790424 -960953 48155 1625164 2172520 2012815 3420527 6742772
41134F742772K004134j944206l848765j775312N25644m55344k588548j971687
$$ 6742772 8746906 6802700 2953935 1178623 1704267 1248923 -1339625 -3311312
41126c311312M64104O70448j445794j650057J499775L922222K303655q43594j328940
$$ -3311312 -2847208 -2176760 -3622554 -5272611 -3772836 149386 2453041 1609447 280507
41117B80507M71339J074144k23159p24929R59297K992978L332766J988441o5254
$$ 280507 751846 1825990 1602831 877902 1837199 4830177 8162943 10151384 10086130
41108A0086130j872544k158908m87115R06425q01982m367433m977213r00147L429681
$$ 10086130 8213586 6054678 5567563 6473988 5672006 1304573 -3672640 -4572787 -1143106
41099a143106L352941K90103j116755q4271J41106j699896l008650j929668J3017
$$ -1143106 2209835 2499938 1383183 1298912 1440018 -259878 -3268528 -5198196 -5185179
41090e185179J135107K119757L488749L415593N84405k763434l392974j552108
$$ -5185179 -4050072 -1930315 1558434 4974027 5558432 2794998 -597976 -2150084
41082b150084k81088q23495j272864N9321K123886K804672J723954L84867O3149
$$ -2150084 -2431172 -3254667 -4527531 -4468210 -2344324 460348 2184302 2569169 2632318
41073B632318K88702m46490k529528m128570l019759L94510K987835K462534J6103
$$ 2632318 2921020 2474530 -54998 -4183568 -7203327 -6808817 -3820982 -1358448 -1342345
41064a342345j421260p04749R12535J981673K280769K185708J740468O29170j222339
$$ -1342345 -2763605 -3468354 -2555819 -574146 1706623 3892331 5632799 6261969 5039630
41055E039630k916791k751282j93082K386762J807755j510600l424559j580641
$$ 5039630 2122839 -628443 -821525 1565237 3372992 1862392 -1562167 -3142808
41047c142808J351351J947464J030647J346490K290853J039160j970000l052807
$$ -3142808 -1791457 156007 1186654 2533144 4823997 5863157 3893157 840350
41039H40350j004725J219028J355126O00789L11757m05248j969938k480442q67111
$$ 840350 -164375 1054653 2409779 3010568 3322325 2917077 947139 -1533303 -2400414
41030b400414Q37729P33672N8668M38352N37262j428650l632434k613948J405984
$$ -2400414 -1562685 -829013 -770345 -331993 205269 -1223381 -4855815 -7469763 -6063779
41021f063779M356187L474723K04363k208936k057586O7J801228J272927j472264
$$ -6063779 -1707592 1767131 1971494 -237442 -2295028 -2294961 -493733 779194 -693070
41012f93070l659819k667602Q24841L613685L669541J924639M94286K03796J24584
$$ -693070 -4352889 -7020491 -6195650 -2581965 1087576 3012215 3506501 3710297 3834881
41003C834881r12545k540201k926094j185194R20960J158632J83890M73394K041331
$$ 3834881 2922336 382135 -2543959 -3729153 -2808193 -1649561 -1465671 -992277 1049054
40994A049054K256848N39586k86303J101957J881181j29096k392779j710283N05143
$$ 1049054 3305902 3845488 3559185 4661142 6542323 6413227 4020448 2310165 2815308
40985B815308Q71906l62226o04888K2288n18541j551482o15507J542529J597407
$$ 2815308 3687214 3324988 2720100 2742388 2223847 672365 56858 1599387 3196794
40976C196794p77187k429877k005236j282927r26250M96631K519909K516850O39188
$$ 3196794 2419607 -10270 -2015506 -3298433 -4224683 -3728052 -1208143 1308707 1947895
40967A947895L44403K331121K649787q04454m380166m253280k027948j371128
$$ 1947895 2292298 4623419 7273206 6468752 2088586 -2164694 -4192642 -5563770
40959e563770k330746k570485j583880j64996K018048M840581N742269K914225
$$ -5563770 -7894516 -10465001 -12048881 -12213877 -10195829 -5355248 387021 3301246
40951C301246j069621k214477m53796J164630J404090J502406J705697P18421
$$ 3301246 2231625 17148 -436648 727982 2132072 3634478 5340175 6058596
40943F058596j325722k362660j398799J75312P14852J31289o65188q96697m22988
$$ 6058596 4732874 2370214 971415 1146727 1861579 1992868 1327680 430983 7995
40934G995J52817K23115K58206R97063J439648j58450k667450k475578R08843
$$ 7995 160812 383927 642133 1639196 3078844 2920394 252944 -2222634 -1313791
40925a313791K971820N82404k894227k513891Q66760K528969J307288J44595K03477
$$ -1313791 1658029 2240433 -653794 -3167685 -2300925 228044 1535332 1679927 1883404
40916A883404m29573k015676j969808N50519K859291K806682J287963l20715j930460
$$ 1883404 1453831 -561845 -2531653 -1981134 878157 3684839 4972802 4652087 2721627
40907B721627k871344j594063J308486K755139J373055o30245j145940r49215
$$ 2721627 -149717 -1743780 -435294 2319845 3692900 3062655 1916715 967500
40899I67500j289473j493590q92746o74637j688475k415581j191595J180228K791700
$$ 967500 -321973 -1815563 -2708309 -3382946 -5071421 -7487002 -8678597 -7498369 -4706669
40890d706669L054136K300975P24469q31408r11474K00558K27361j390774j931374
$$ -4706669 -1652533 648442 1372911 541503 -369971 -169413 57948 -1332826 -3264200
40881c264200L20119K686329J881097q71654j843962m29511Q35042R07737J081575
$$ -3264200 -2944081 -257752 1623345 751691 -1092271 -1521782 -686740 220997 1302572
40872A302572J486626O08909j267006j743935l71597L45843o81122j052361Q65725
$$ 1302572 2789198 3398107 2131101 387166 15569 361412 -319710 -1372071 -506346
40863e06346K661458J612979o91071q02602J046821J504368m25333k186287k225218
$$ -506346 2155112 3768091 3077020 2274418 3321239 4825607 4400274 2213987 -11231
40854a1231k076299k717799k291261L68256K767825K249145L78678M53433J985988
$$ -11231 -2087530 -4805329 -7096590 -6728334 -3960509 -1711364 -1332686 -879253 1106735
40845A106735J575493j147088k640005j221686L20099m20074j657221r71657M43503
$$ 1106735 2682228 1535140 -1104865 -2326551 -2006452 -2426526 -4083747 -5055404 -4611901
40836d611901L00676m07491P48140K914711K928468M16268j602921j163980O72852
$$ -4611901 -4311225 -4718716 -3970576 -1055865 1872603 2288871 685950 -478030 194822
40827A94822K294704K998383J935053j245904m280053l963349p69532J137267
$$ 194822 2489526 5487909 7422962 6177058 1897005 -2066344 -2835876 -1698609
40819a698609m63056k994990l115236r35718J274663K210288J722569K3639j645744
$$ -1698609 -2161665 -5156655 -8271891 -9207609 -7932946 -5722658 -4000089 -3976450 -5622194
40810e622194j424184N61468J772436Q18112m73726N832J633630K606876K561609
$$ -5622194 -7046378 -6484910 -4712474 -3894362 -4368088 -4362256 -2728626 -121750 2439859
40801B439859J871610K18514k171632l502281k567751n52734R15179J850617K512053
$$ 2439859 4311469 4529983 2358351 -1143930 -3711681 -4264415 -3349236 -1498619 1013434
40792A013434J989648J21784j240239r91125o75474j430697j506059M31132K122269
$$ 1013434 3003082 3124866 1884627 893502 218028 -1212669 -2718728 -2287596 -165327
40783a65327J259610k83653K01874J032841q34192l364796j918111K489849L674888
$$ -165327 1094283 810630 1012504 2045345 1211153 -2153643 -4071754 -1581905 2092983
40774B092983k71096m110416l738133j523195p31381r6778K231240L945904K478565
$$ 2092983 1821887 -2288529 -6026662 -7549857 -8281238 -8378016 -6146776 -2200872 277693
40765B77693K63526J137582L728409L426179k50774l030491k387796m49619N0967
$$ 277693 541219 1678801 5407210 8833389 8582615 5552124 3164328 2714709 2765676
40756B765676p93814j525459j477061o34967N77767R28755l32681j729974j120804
$$ 2765676 1971862 446403 -1030658 -1665625 -1087858 -159103 -491784 -2221758 -3342562
40747c342562J079844K497593K441833K193004J639746q52380m241196m261392
$$ -3342562 -2262718 234875 2676708 4869712 6509458 5657078 1415882 -2845510
40739b845510N61412N406700M847398k7718l591012l357197j888404j539273j384097
$$ -2845510 -2284098 3122602 7970000 7942282 4351270 994073 -894331 -2433604 -3817701
40730c817701k53946P01167L65134L5822J241518K860708K658046O92195q65742
$$ -3817701 -4071647 -3370480 -3005346 -2969524 -1728006 1132702 3790748 4482943 3617201
40721C617201p57378L32734J406416K066704J919530P28472o48687r15817k36236
$$ 3617201 2859823 3192557 4598973 6665677 8585207 9313679 8664992 7749175 7512939
40712G512939j93427j459685k693150k343404o36159Q18967P14802j014368l155727
$$ 7512939 7319512 5859827 3166677 823273 187114 1006081 1720883 706515 -2449212
40703b449212l772554j735031J676178L486377K140192o43814j937528j094369
$$ -2449212 -6221766 -7956797 -6280619 -2794242 -654050 -1297864 -3235392 -4329761
40695d329761j38383o61006j537461p03021J390683J840315m40474k218670R7284
$$ -4329761 -4468144 -5129150 -6666611 -7369632 -5978949 -4138634 -4579108 -6797778 -6700494
40686f700494M784791O223978K518240j719458j991343Q3157N11357l58048N62061
$$ -6700494 -1915703 4308275 6826515 5107057 3115714 3198871 3710228 3352180 3914241
40677C914241K639578K101191j269054l393450k507094j289541j171422O5520
$$ 3914241 6553819 8655010 7385956 3992506 1485412 195871 -975551 -910031
40669i10031K833308L285244l92729m023609l614737j161194j55306K93769J915264
$$ -910031 1923277 5208521 4815792 792183 -2822554 -3983748 -4139054 -3845285 -1930021
40660a930021K170880j157576l874402j011516M015917L774368j140142k965770
$$ -1930021 240859 -916717 -4791119 -5802635 -1786718 1987650 847508 -2118262
40652b118262M11609K565053J45065j648387J067808L716963J380087k698201
$$ -2118262 -1706653 858400 1003465 -644922 422886 4139849 5519936 2821735
40644B821735l042606r94286r41604j729184O36922M411579M043612l32809k756966
$$ 2821735 -220871 -1215157 -2156761 -3885945 -3249023 1162556 5206168 4873359 2116393
40635B116393j031748N09596q44684j845783K02410K236010O13053k649981l134124
$$ 2116393 1084645 1594241 749557 -1096226 -893816 1342194 1955247 -694734 -3828858
40626c828858p44340J077350J093569J003579J251610K56118j859340k411346
$$ -3828858 -4573198 -3495848 -2402279 -1398700 -147090 109028 -1750312 -4161658
40618d161658k40815K179077K300766R34698L09507N26181J15938j099994j966015
$$ -4161658 -4402473 -2223396 77370 1012068 1321575 1847756 1963694 863700 -1102315
40609a102315k031387j505162K8958K413623L226345N00022l084356k585105J896015
$$ -1102315 -3133702 -4638864 -4609906 -2196283 1030062 1530084 -1554272 -4139377 -2243362
40600b243362M474216J825942j967133j851650Q90261J838096O07474j56513m81992
$$ -2243362 2230854 4056796 2089663 238013 1128274 2966370 3573844 3417331 2935339
40591B935339k120409l424829j267092K457019K556668q09259j721110J777182
$$ 2935339 814930 -2609899 -3876991 -1419972 1136696 327437 -1393673 383509
40583C83509M092182J061890l504929m245447k037964o56381L7637K037016L435944
$$ 383509 4475691 5537581 2032652 -2212795 -4250759 -4907140 -4869503 -2832487 603457
40574F03457Q00725m047318n252075j052758L796034M509018J714237p16539q08407
$$ 603457 1404182 -2643136 -7895211 -8947969 -5151935 -642917 1071320 354781 -453626
40565d53626j1404n82358k408098k881592m69923K437512K317806k24656j090125
$$ -453626 -465030 -1047388 -3455486 -6337078 -6807001 -4369489 -2051683 -2276339 -3366464
40556c366464J046930K804163J606814q17351k262236l189598l652877j544762
$$ -3366464 -2319534 484629 2091443 1274092 -988144 -4177742 -7830619 -9375381
40548i375381K795094M632443J583797j828173r66010J696019J523442j07133
$$ -9375381 -6580287 -1947844 -364047 -2192220 -3158230 -1462211 61231 -45902
40540d5902Q84118L069906K006464j252509j871398j61116p66595l363540k570504
$$ -45902 838216 3908122 5914586 4662077 2790679 2629563 1862968 -1500572 -4071076
40531d071076K002318L923633L01824l641041l268922q69952R0713O01198K033428
$$ -4071076 -2068758 1854875 2156699 -1484342 -4753264 -5623216 -5532503 -4931305 -2897877
40522b897877K236796N5078j254525N22024K211498P31705j385992o28505J195103
$$ -2897877 -661081 -606003 -1860528 -1338504 872994 1604699 218707 -409798 785305
40513G85305L00083k469221l302954j385614J159259L072500L698792J423994
$$ 785305 1085388 -1383833 -4686787 -6072401 -4913142 -1840642 1858150 3282144
40505C282144l304450n782587k586341K640709L783310J010386k66003J835929
$$ 3282144 -22306 -5804893 -8391234 -5750525 -1967215 -956829 -1222832 613097
40497F13097L546211K311920M65994N43058J225262K08492j834511k537067j462872
$$ 613097 4159308 6471228 6937222 7480280 8705542 8914034 7079523 4542456 3079584
40488C079584m72597j018399k307917k372273o61560J072714J236652R45866K173449
$$ 3079584 2606987 1588588 -719329 -3091602 -3753162 -2680448 -1443796 -497930 1675519
40479A675519L806846K670789j013243k948984j201437N59372j011415l399698
$$ 1675519 5482365 8153154 7139911 4190927 2989490 3548862 2537447 -862251
40471h62251k424762R06541K166524L43231j424861r88511P32504K158183K355921
$$ -862251 -3287013 -2380472 -213948 129283 -1295578 -2284089 -1551585 606598 2962519
40462B962519P55677j693397k398217p47614K71167r47467j129459K120797M488964
$$ 2962519 3718196 2024799 -373418 -1121032 -849865 -1797332 -2926791 -805994 3682970
40453C682970J027778m483841l888270K510732N706497J552864l598345l470830
$$ 3682970 4710748 226907 -3661363 -1150631 4555866 6108730 2510385 -960445
40445i60445m67595M56891n0130R24623K137908R69173r12526l33842J474072
$$ -960445 -1428040 -971149 -1021279 -96656 2041252 3010425 2097899 1764057 3238129
40436C238129J175661l65180M35874L117824L313307k17465l517638l373527j315695
$$ 3238129 4413790 4048610 4484484 7602308 10915615 10698150 7180512 3806985 2491290
40427B491290k27197k49391k6546L02069m27046k012200k725428j419162R81715
$$ 2491290 2264093 2014702 1988156 2290225 1863179 -149021 -2874449 -4293611 -3311896
40418c311896K165670P00408k082619k930454k08859L749772M938557K268072
$$ -3311896 -1146226 -445818 -2528437 -5458891 -5667750 -1917978 3020579 5288651
40410E288651j289708k416089j141891n717l13787o93275L32710J671797R81650
$$ 5288651 3998943 1582854 440963 435246 121459 -571816 -239106 1432691 2414341
40401B414341j755086l789282l250350j487654o01685k68270J093047L159905
$$ 2414341 659255 -3130027 -6380377 -7868031 -8469716 -8737986 -7644939 -4485034
40393d485034M040363L222201J940114R22053K8907j57728J045586K261438J307754
$$ -4485034 -444671 2777530 4717644 5639697 5668604 5510876 6556462 8817900 10125654
40384A0125654j099824j872165l82568M18567j175126l012024k972450k135234
$$ 10125654 9025830 7153665 6771097 7189664 6014538 3002514 30064 -2105170
40376b105170j709287q5283L724538O398655M252101o46605k669905m86065J493279
$$ -2105170 -3814457 -3899740 -175202 6223453 10475554 9828949 7159044 6672979 8166258
40367H166258l4298k910622l466486j598607K67822J060648J418109J343412j9981
$$ 8166258 8131960 5221338 1754852 156245 424067 1484715 2902824 4246236 4226255
40358D226255k300997l449807k067493P50711K624568K507498J377513M53145
$$ 4226255 1925258 -1524549 -3592042 -2841331 -216763 2290735 3668248 4121393
40350D121393l04488j356286k076791j320419O23632J909131J364746q7298p28660
$$ 4121393 3816905 2460619 383828 -936591 -312959 1596172 2960918 2873620 2144960
40341B144960n4447R31485R00584n06054k107764k166576o57805J71218j057962
$$ 2144960 2090513 3021998 3922582 3416528 1308764 -857812 -1515617 -1344399 -2402361
40332b402361k075642J21235L960181M471761O57794k266276m14444K597979R84748
$$ -2402361 -4478003 -4356768 -396587 4075174 4732968 2466692 2052248 4650227 5634975
40323E634975m149558o082670k196878K575330L079237M39363j008231q8428R47802
$$ 5634975 1485417 -4597253 -6794131 -4218801 -1139564 -700201 -1708432 -1796860 -849058
40314h49058P78723M82764R42935J256157L75826j098220j642305p82260K91763
$$ -849058 -70335 412429 1355364 2611521 2987347 1889127 246822 -535438 -243675
40305b43675J12080j279064k198559j227429R36611K085240J045585r91438j993731
$$ -243675 -131595 -1410659 -3609218 -4836647 -3900036 -1814796 -769211 -1760649 -3754380
40296c754380j312263J89994J637120K724449K990819J872544j4518r29717l68517
$$ -3754380 -5066643 -4876649 -3239529 -515080 2475739 4348283 4333765 3404048 3035531
40287C035531j82301j732200l002332j119406K602463L469190J36684k952416
$$ 3035531 2853230 1121030 -1881302 -3000708 -398245 3070945 3207629 255213
40279B55213j941680R11501J296003l54915m41938J265062J722545N64581O00866
$$ 255213 -1686467 -774966 521037 166122 -275816 989246 2711791 3276372 3877238
40270C877238J934002J028886k728250m730698k138127J340089J126364j443593
$$ 3877238 5811240 6840126 4111876 -618822 -2756949 -1416860 -290496 -1734089
40262a734089j943842L46670K528799L003457K490383J515334K89784m9196Q77006
$$ -1734089 -3677931 -3331261 -802462 2200995 4691378 6206712 6496496 6447300 7324306
40253G324306R59907j522298m549439m814547k372867l0093O79757K11464p82533
$$ 7324306 8284213 6761915 2212476 -2602071 -4974938 -5005031 -4325274 -4113810 -4896343
40244d896343j200345O55828L925270M289732O1273l490629r57764M335371M573341
$$ -4896343 -6096688 -5440860 -1515590 2774142 2835415 -655214 -1612978 2722393 7295734
40235G295734o70173l952114j594369J663351J491185K63393J123574K041017
$$ 7295734 6625561 2673447 1079078 2742429 4233614 4497007 5620581 7661598
40227G661598L48152j743538j151341L30761p17844l249962l777303k236752j106271
$$ 7661598 8009750 6266212 5114871 5445632 4727788 1477826 -2299477 -4536229 -5642500
40218e642500m73975J258826L069945K530711O21039N81987K134535J640938j425626
$$ -5642500 -6116475 -4857649 -1787704 743007 1364046 1946033 4080568 5721506 4295880
40209D295880k986813r09504J349168K75081k095349j635562J114632J750257
$$ 4295880 1309067 399563 1748731 2023812 -71537 -1707099 -592467 1157790
40201A157790j050665l250454j171307L272067N032534K245151j987142l769471
$$ 1157790 107125 -3143329 -4314636 -1042569 3989965 6235116 4247974 478503
40193D78503k496569l36296Q18941P67415J62496m82520r48670j111712p08379
$$ 478503 -2018066 -2354362 -1535421 -768006 -605510 -1088030 -2036700 -3148412 -3856791
40184c856791N97213K355669K807588O80460k261674k558669K0762J332956j281805
$$ -3856791 -3259578 -903909 1903679 2584139 322465 -2236204 -2215442 -882486 -2164291
40175b164291m400794l088561J651508M228119K646756O46304R86080J312052
$$ -2164291 -6565085 -9653646 -8002138 -3774019 -1127263 -480959 505121 1817173
40167A817173j078776m104437l646483P07749N326227O634129L782208j320186
$$ 1817173 738397 -3366040 -7012523 -6304774 -978547 5655582 9437790 8117604
40159H117604n054230m633539j053502J780744J733335M31269j29149l55381j080303
$$ 8117604 3063374 -1570165 -2623667 -842923 890412 1321681 1192532 837151 -243152
40150b43152j545764j247646j259479j735924q12144J687583K393684o85095m065088
$$ -243152 -1788916 -3036562 -4296041 -6031965 -6844109 -5156526 -2762842 -3447937 -7513025
40141g513025l286912O35390L174567K894195J867143R16647q84512k619297k187843
$$ -7513025 -10799937 -10164547 -6989980 -4095785 -2228642 -1311995 -2196507 -4815804 -7003647
40132g003647o24821j153202l346028k819358J884252O311662O046706K218726
$$ -7003647 -7628468 -8781670 -12127698 -14947056 -13062804 -6751142 -704436 1514290
40124A514290j094514k009581j131459O45535K098047J479102j144572k900497
$$ 1514290 419776 -1589805 -2721264 -2075729 22318 1501420 356848 -2543649
40116b543649j668012Q04479J514152N12255Q1915O66700N13721q39768j538151
$$ -2543649 -4211661 -3407182 -1893030 -1380775 -1298860 -632160 -118439 -958207 -2496358
40107b496358n18785O24441J30586j130341q81947J311553L505591L897908K592646
$$ -2496358 -3015143 -2390702 -2260116 -3390457 -4272404 -2960851 544740 4442648 7035294
40098G035294O74598j189341k525686k530484j002851P84947J444667J259012
$$ 7035294 7709892 6520551 3994865 1464381 461530 1246477 2691144 3950156
40090C950156J171122N80192j593020l709374k304951K627748O147918M378870
$$ 3950156 5121278 5701470 4108450 399076 -1905875 721873 6869791 11248661
40082A1248661k88935k749217k020244j098570j219602n04407J392607J455664
$$ 11248661 10959726 8210509 6190265 5091695 3872093 3367686 4760293 6215957
40074F215957j911960n186973l632803K211323O460764M589884j284514m799812
$$ 6215957 4303997 -882976 -4515779 -2304456 4156308 8746192 7461678 2661866
40066B661866k670910J630525K452600p67474l116038j277236J972396K137479
$$ 2661866 -9044 1621481 4074081 3306607 190569 -1086667 885729 3023208
40058C023208o60165k610461j938607n19060m10542j623429l064417l339461j173827
$$ 3023208 2363043 -247418 -2186025 -2705085 -3115627 -4739056 -7803473 -11142934 -12316761
40049a2316761K592805M353358J915302j639501j671295J264899K427547L05747
$$ -12316761 -9723956 -5370598 -3455296 -5094797 -6766092 -5501193 -3073646 -2767899
40041b767899j580550q00450Q03772J350101J743055K374067J421548j105430
$$ -2767899 -4348449 -5148899 -4345127 -2995026 -1251971 1122096 2543644 1438214
40033A438214j809766P16034K928794K017378N63978J539672K483972k19316m237570
$$ 1438214 -371552 344482 3273276 5290654 5854632 7394304 9878276 9658960 5421390
40024E421390m326215p14254J547879Q01854K20204R46484J44151k667238l383687
$$ 5421390 1095175 380921 1928800 2730654 2950858 3897342 4041493 1374255 -2009432
40015b009432j71012K722175J619457o75574p2874J569804o538l249704k657376
$$ -2009432 -2180444 541731 2161188 1485614 1412740 2982544 2976006 -273698 -2931074
40006b931074J777658L661238P6395l786049k849967L46069Q02028n94953K87512
$$ -2931074 -1153416 2507822 2584217 -1201832 -4051799 -3705730 -2903702 -3498655 -3211143
39997c211143K571539J621219k141235k777323J512874M942372L150640m16684
$$ -3211143 -639604 981615 -1159620 -3936943 -2424069 2518303 5668943 5252259
39989E252259j175152q42739k711661m178393r74342M173064M745783Q80708j125374
$$ 5252259 4077107 3234368 522707 -3655686 -4630028 -456964 4288819 5169527 4044153
39980D044153N18027R83379j496292k115978J324218L432727J20644m016976l046026
$$ 4044153 4562180 5545559 4049267 1933289 3257507 6690234 6810878 2793902 -252124
39971b52124P14771J029102j949066k647176N49148L477923L294944J710191P70710
$$ -252124 462647 1491749 -457317 -3104493 -2555345 922578 4217522 5927713 6698423
39962F698423R9835q77755j624100k094439k809538l139307k067771m00807L39907
$$ 6698423 6798258 5920503 4296403 2201964 -607574 -3746881 -5814652 -6215459 -5875552
39953e875552O01982J631584K481124J389571n40642n59902J156241J700466J74537
$$ -5875552 -5273570 -3641986 -1160862 228709 -311933 -871835 284406 1984872 2159409
39944B159409j260472j273583q79297o76679R6779J202186J252380M53324L59832
$$ 2159409 898937 -374646 -1253943 -1930622 -1833843 -631657 620723 1074047 1433879
39935A433879N16726j122839l772664l742879k12942K715262J803668q73373j763251
$$ 1433879 1950605 827766 -2944898 -6687777 -6900719 -4185457 -2381789 -3255162 -5018413
39926e018413j088434j189951j908249j100888J322054L001164K547569J013875
$$ -5018413 -6106847 -7296798 -9205047 -10305935 -8983881 -5982717 -3435148 -2421273
39918b421273j07460n35169n86836k70601M79768J277027J405345M90726r58058
$$ -2421273 -2528733 -3063902 -3650738 -3921339 -3441571 -2164544 -759199 -268473 -1226531
39909a226531j919033j960440j521075q62077K83973J430837J154435n48772j283918
$$ -1226531 -3145564 -5106004 -6627079 -7489156 -7205183 -5774346 -4619911 -5168683 -6452601
39900f452601M55263K481791J847102o43355j698190l91021J347992K310677K678936
$$ -6452601 -5997338 -3515547 -1668445 -2311800 -4009990 -4401011 -3053019 -742342 1936594
39891A936594J762729j052624l376345k075766J355010K188592k04309j311721
$$ 1936594 3699323 2646699 -729646 -2805412 -1450402 738190 533881 -777840
39883g77840R96827L090882J945041j05447p3095O51515l81728k077232k265632
$$ -777840 218987 3309869 5254910 5149463 5076368 5727883 5346155 3268923 1003291
39874A003291j543819j073871J89319K386949K353859j382226m508411k727319
$$ 1003291 -540528 -1614399 -1425080 961869 3315728 1933502 -2574909 -5302228
39866e302228J278731K077590J19635J8107J964877J621666j792746l893565k383594
$$ -5302228 -4023497 -1945907 -1826272 -1808165 156712 1778378 -14368 -3907933 -6291527
39857f291527k4208R25604J773921L151186K811541N3757k025681j287541J38903
$$ -6291527 -6315735 -5390131 -3616210 -465024 2346517 2400274 374593 -912948 -774045
39848g74045j72305r73550L9532K372290L867907L432470R40691k962847n494851
$$ -774045 -946350 -1919900 -1880368 491922 4359829 7792299 8732990 5770143 275292
39839B75292l429431J833700M328049J250244k739253k179855J420651K624971
$$ 275292 -3154139 -1320439 3007610 4257854 1518601 -661254 759397 3384368
39831C384368M43657j191092k84632O73890o34977l014760m072388l186823j261910
$$ 3384368 3828025 2636933 2352301 3026191 2391214 -623546 -4695934 -7882757 -9144667
39822i144667N57461J417204J466709J923496L026839K841119K41176k029722
$$ -9144667 -8587206 -7170002 -5703293 -3779797 -752958 2088161 2329337 299615
39814B99615m94497L288888L897163l48776m692388m497304j142821J074364J174384
$$ 299615 -194882 3094006 6991169 6642393 1950005 -2547299 -3690120 -2615756 -1441372
39805a441372J414284K634716L144073J877888j46085j666768k256076j467890
$$ -1441372 -27088 2607628 5751701 7629589 7483504 5816736 3560660 2092770
39797B092770Q60495L079887K712639j85201k550956k270432q29008o27268j349378
$$ 2092770 2953265 6033152 8745791 8560590 6009634 3739202 2910194 2282926 933548
39788I33548j033080M06484J183673P67240M67530O50344r4726k009717k752066
$$ 933548 -99532 306952 1490625 2257865 2725395 3375739 3281013 1271296 -1480770
39779a480770p46443J791055J537116j176285k804338j570003M99611R74912J58444
$$ -1480770 -2227213 -436158 1100958 -75327 -2879665 -4449668 -3950057 -2975145 -2816701
39770b816701k70366J08369O39551J074314J303626O30295j015106j893878m15876
$$ -2816701 -3087067 -2978698 -2339147 -1264833 38793 669088 -346018 -2239896 -2655772
39761b655772K024108K213944n39482l084401k299781J072019L556549L031171
$$ -2655772 -631664 1582280 1042798 -2041603 -4341384 -3269365 287184 3318355
39753C318355O17047j024019m36818J341580J831399j28319k580521k486916O1251
$$ 3318355 3935402 2911383 2474565 3816145 5647544 5519225 2938704 451788 513039
39744E13039J333409j048444m244017l672921M83322L199145J357786k221224
$$ 513039 1846448 798004 -3446013 -7118934 -6635612 -3436467 -2078681 -4299905
39736d299905k851866O4125L041059L183522R68614j064371r10364J352665L613256
$$ -4299905 -7151771 -7087646 -4046587 -863065 105549 -958822 -1869186 -516521 3096735
39727C096735L648890J588306k68444n60177m63169j278651k081083j440430j39010
$$ 3096735 6745625 8333931 8065487 7505310 7042141 5763490 3682407 2241977 2102967
39718B102967p8346j305263k150872j732853m96033R88090J905506R41242j622095
$$ 2102967 2024621 719358 -1431514 -3164367 -3660400 -2672310 -766804 174438 -1447657
39709a447657k751969m31836K542460J999640j183514k226427J88981K333175
$$ -1447657 -4199626 -4631462 -2089002 -89362 -1272876 -3499303 -3310322 -977147
39701i77147J830146P61684Q60571M77361j256630j831757O587J251942k42542
$$ -977147 852999 1614683 2475254 2952615 1695985 -135772 -129185 1122757 880215
39692H80215j701963n03054P06004j135519l124692p54073L986967N221596K264897
$$ 880215 -821748 -1324802 -618798 -1754317 -4879009 -5633082 -1646115 3575481 5840378
39683E840378k93767n45094o88746r88675O37939K567738L98195m528066n024243
$$ 5840378 5546611 5001517 4312771 3324096 3962035 6529773 6927968 2399902 -2624341
39674b624341P11472N138919K815198j240260m10994K478798O58732m273221m403588
$$ -2624341 -1912869 3226050 6041248 4800988 4389994 6868792 7527524 3254303 -1149285
39665a149285J487173N523025K519572k940157l990105p10218J744077Q43541
$$ -1149285 337888 5860913 8380485 5440328 1450223 740005 2484082 3327623
39657C327623j183835j447669J84913J539677O92589j815217l209192j673366
$$ 3327623 2143788 696119 881032 2420709 3113298 1298081 -1911111 -3584477
39649c584477J051166J746343J10565j010297M1988J575453J598173P11580L67103
$$ -3584477 -2533311 -786968 -676403 -1686700 -1644712 -69259 1528914 2240494 2607597
39640B607597J03394j321409l132139l216205j367896K43728J88764m46498j53839
$$ 2607597 2710991 1389582 -1742557 -4958762 -6326658 -6082930 -5894166 -6340664 -6494503
39631f494503P24947J107475J290586K098937K617727J161412j377494j866668
$$ -6494503 -5769556 -4662081 -3371495 -1272558 1345169 2506581 1129087 -737581
39623g37581K50259J295148j111593l376481o43018N166922O869757K002127l591585
$$ -737581 -487322 807826 -303767 -3680248 -4323266 843656 7713413 9715540 6123955
39614F123955m104555j230712J5850p95671m34723J406074J711408j40603j177412
$$ 6123955 2019400 788688 804538 8867 -425856 980218 2691626 2551023 1373611
$$ [...]
##END NTUPLES=NMR SPECTRUM
##END=
