##TITLE=31Pdec_DE-26_TFA
 CDCl3
  128 sc
 11.1.2024
##JCAMPDX= 6.0         $$ Bruker NMR JCAMP-DX V2.0
##DATA TYPE= NMR SPECTRUM
##DATA CLASS= NTUPLES
##ORIGIN= UXNMR, Bruker Analytische Messtechnik GmbH
##OWNER= root
$$ XWIN-NMR		Version 3.5
$$ Thu Jan 11 14:46:00 2024 Russian Standard Time (UT+4h)  she@DPX200
##.OBSERVE FREQUENCY= 81.013821
##.OBSERVE NUCLEUS= ^31P
##.ACQUISITION MODE= SIMULTANEOUS
##.ACQUISITION SCHEME= undefined
##.AVERAGES= 128
##.DIGITISER RES= 16
##SPECTROMETER/DATA SYSTEM= spect
##.PULSE SEQUENCE= zgpg30
##.SOLVENT NAME= CDCl3
##.SHIFT REFERENCE= (INTERNAL, CDCl3, 0, 248.564)
##AUDIT TRAIL= $$ (NUMBER, WHEN, WHO, WHERE, WHAT)
$$ ##TITLE= Audit trail, XWIN-NMR		Version 3.5
$$ ##JCAMPDX= 5.01
$$ ##ORIGIN= Bruker BioSpin GmbH
$$ ##OWNER= she
$$ F:/spectra/data/she/nmr/P31/1/pdata/1/auditp.txt
$$ ##AUDIT TRAIL=  $$ (NUMBER, WHEN, WHO, WHERE, WHAT)
(   1,<2024-01-11 14:43:36.67 +0400>,<she>,<DPX200>,
      <continue with go, POWCHK disabled, PULCHK disabled
       configuration hash MD5:
       00 E9 B6 7A A2 85 ED C7 34 08 36 98 17 FE 4E 26
       data hash MD5: 32K
       EB 05 DF E2 D9 71 08 16 3E F9 81 C5 6F 35 0F CB>)
(   2,<2024-01-11 14:43:41.43 +0400>,<she>,<DPX200>,
      <Start of raw data processing
       efp BC_mod = 2 LB = 10 FT_mod = 6 PKNL = 1 PHC0 = -12188.64 PHC1 = 138.2888 SI = 64K 
       data hash MD5: 64K
       52 46 4B 4D A2 FF 41 87 8B 1D 22 FC 52 5E E8 AE>)
(   3,<2024-01-11 14:44:01.62 +0400>,<she>,<DPX200>,
      <pk PHC0 = -71.81068 PHC1 = 252.7998 
       data hash MD5: 64K
       4C CE C9 6A 46 39 91 13 71 EC 06 1F D0 07 CB F5>)
$$ ##END=
$$ 
$$ hash MD5
$$ 5C FE 48 E2 04 0E A7 8D 56 B9 C8 DF 5E 29 E9 2B
##$RELAX= 
##$RELAX= 
##$RELAX= 
##$RELAX= 
##$RELAX= 
##$RELAX= 
##$RELAX= 
##$RELAX= 
##$RELAX= 
$$ Bruker specific parameters
$$ --------------------------
##$DU= <F:/spectra>
##$EXPNO= 1
##$NAME= <P31>
##$PROCNO= 1
##$TYPE= <nmr>
##$USER= <she>
##$AMP= (0..31)
100 100 100 100 100 100 100 100 100 100 100 100 100 100 100 100 100 100 
100 100 100 100 100 100 100 100 100 100 100 100 100 100 
##$AQSEQ= 0
##$AQ_mod= 1
##$AUNM= <au_zg>
##$AUTOPOS= <>
##$BF1= 81.014009
##$BF2= 200.13
##$BF3= 200.13
##$BF4= 200.13
##$BF5= 200.13
##$BF6= 200.13
##$BF7= 200.13
##$BF8= 200.13
##$BYTORDA= 1
##$CFDGTYP= 0
##$CFRGTYP= 5
##$CHEMSTR= <none>
##$CNST= (0..31)
1 1 145 1 1 1 1 1 1 1 1 1 1 1 1 1 1 1 1 1 1 1 1 1 1 1 1 1 1 1 1 1 
##$CPDPRG= <waltz16>
##$CPDPRG1= <>
##$CPDPRG2= <waltz16>
##$CPDPRG3= <>
##$CPDPRG4= <mlev>
##$CPDPRG5= <mlev>
##$CPDPRG6= <mlev>
##$CPDPRG7= <mlev>
##$CPDPRG8= <mlev>
##$CPDPRGB= <>
##$CPDPRGT= <>
##$D= (0..31)
0 1 0 0 0 0 0 0 0 0 0 0.03 2e-05 3e-06 0 0 0 0 0 0 0 0 0 0 0 0 0 0 0 0 
0 0 
##$DATE= 1704969624
##$DBL= (0..7)
120 120 120 11 120 120 24 19 
##$DBP= (0..7)
150 150 150 150 150 150 150 150 
##$DBP07= 0
##$DBPNAM0= <>
##$DBPNAM1= <>
##$DBPNAM2= <>
##$DBPNAM3= <>
##$DBPNAM4= <>
##$DBPNAM5= <>
##$DBPNAM6= <>
##$DBPNAM7= <>
##$DBPOAL= (0..7)
0.5 0.5 0.5 0.5 0.5 0.5 0.5 0.5 
$$ [...]
##$SUBNAM2= <"">
##$SUBNAM3= <"">
##$SUBNAM4= <"">
##$SUBNAM5= <"">
##$SUBNAM6= <"">
##$SUBNAM7= <"">
##$SUBNAM8= <"">
##$SUBNAM9= <"">
##$SW= 501.771253377433
##$SWIBOX= (0..15)
0 1 3 0 0 0 0 0 0 0 0 0 0 0 0 0 
##$SW_h= 40650.406504065
##$TD= 32768
##$TD0= 1
##$TE= 0
##$TE2= 300
##$TE3= 300
##$TEG= 300
##$TL= (0..7)
0 120 53 12 22 120 120 120 
##$TP= (0..7)
150 150 150 150 150 150 150 150 
##$TP07= 0
##$TPNAME0= <>
##$TPNAME1= <>
##$TPNAME2= <>
##$TPNAME3= <>
##$TPNAME4= <>
##$TPNAME5= <>
##$TPNAME6= <>
##$TPNAME7= <>
##$TPOAL= (0..7)
0.5 0.5 0.5 0.5 0.5 0.5 0.5 0.5 
##$TPOFFS= (0..7)
0 0 0 0 0 0 0 0 
##$TUNHIN= 0
##$TUNHOUT= 0
##$TUNXOUT= 0
##$USERA1= <user>
##$USERA2= <user>
##$USERA3= <user>
##$USERA4= <user>
##$USERA5= <user>
##$V9= 5
##$VALIST= <valist>
##$VCLIST= <CCCCCCCCCCCCCCC>
##$VD= 0
##$VDLIST= <DDDDDDDDDDDDDDD>
##$VPLIST= <PPPPPPPPPPPPPPP>
##$VTLIST= <TTTTTTTTTTTTTTT>
##$WBST= 1024
##$WBSW= 4
##$XGAIN= (0..3)
0 0 0 0 
##$XL= 0
##$YL= 0
##$YMAX_a= 3198
##$YMIN_a= -4060
##$ZGOPTNS= <>
##$ZL1= 120
##$ZL2= 120
##$ZL3= 120
##$ZL4= 120
##$ABSF1= 0
##$ABSF2= 0
##$ABSG= 0
##$ABSL= 0
##$ALPHA= 0
##$AQORDER= 0
##$ASSFAC= 0
##$ASSFACI= 0
##$ASSFACX= 0
##$ASSWID= 0
##$AUNMP= <proc_1d>
##$AZFE= 0.1
##$AZFW= 0.5
##$BCFW= 0
##$BC_mod= 2
##$BYTORDP= 0
##$COROFFS= 0
##$CY= -3
##$DATMOD= 1
##$DC= 0
##$DFILT= <>
##$DTYPP= 0
##$F1P= 0
##$F2P= 0
##$FCOR= 1
##$FTSIZE= 65536
##$FT_mod= 6
##$GAMMA= 0
##$GB= 0
##$INTBC= 1
##$INTSCL= 6.047779e-11
##$ISEN= 30
##$LB= 10
##$LEV0= 0
##$LPBIN= 0
##$MAXI= 10000
##$MC2= 0
##$MEAN= 0
##$ME_mod= 0
##$MI= 50
##$NCOEF= 0
##$NC_proc= -9
##$NLEV= 6
##$NOISF1= 182.463
##$NOISF2= 159.3651
##$NSP= 0
##$NTH_PI= 0
##$NZP= 0
##$OFFSET= 248.5645
##$PC= 4
##$PHC0= -12260.45
##$PHC1= 391.0886
##$PH_mod= 1
##$PKNL= yes
##$PPARMOD= 0
##$PSCAL= 0
##$PSIGN= 0
##$REVERSE= no
##$SF= 81.0140089999694
##$SI= 65536
##$SIGF1= 159.3651
##$SIGF2= -187.1042
##$SINO= 113.3802
##$SIOLD= 16384
##$SREGLST= <1H.CDCl3>
##$SSB= 0
##$STSI= 65536
##$STSR= 0
##$SW_p= 40650.406504065
##$SYMM= 0
##$S_DEV= 0
##$TDeff= 32768
##$TDoff= 0
##$TI= <>
##$TILT= no
##$TM1= 0
##$TM2= 0
##$TOPLEV= 0
##$USERP1= <user>
##$USERP2= <user>
##$USERP3= <user>
##$USERP4= <user>
##$USERP5= <user>
##$WDW= 1
##$XDIM= 65536
##$YMAX_p= 414063740
##$YMIN_p= -107891057
$$ End of Bruker specific parameters
$$ ---------------------------------
##NTUPLES= NMR SPECTRUM
##VAR_NAME=  FREQUENCY,     SPECTRUM/REAL,   SPECTRUM/IMAG
##SYMBOL=    X,             R,               I
##VAR_TYPE=  INDEPENDENT,   DEPENDENT,       DEPENDENT
##VAR_FORM=  AFFN,          ASDF,            ASDF
##VAR_DIM=   65536,         65536,           65536
##UNITS=     HZ,            ARBITRARY UNITS, ARBITRARY UNITS
##FACTOR=    0.620285442955139, 1,           1
##FIRST=     20137.2065510682, 0,            0
##LAST=      -20513.1999529968, 0,           0
##MIN=       -20513.1999529968, -107891057,  0
##MAX=       20137.2065510682, 414063740,    0
$$ Real data points
##PAGE= N=1
##DATA TABLE= (X++(R..R)), XYDATA
$$ [...]
12515B67503K63654K43423J92207J18369L1560o6335j80383l11118m45150n60295
12505d46565o42171o95553p38255p82982q25041q47529q38140q01117p54425p17343
12495h089121p00314p02634p14772p22070p10813o76438o27754n81221n48599
12486a4073736n28610n09259m77379m27097l62096k91511k22425j53696p6306
12477a7122115J8903J31834K50302L56247M35677M84701N08486N15474N11373
12468a3909118M96346M66965M21822L66872L15351K80117K62950K49781K18307
12459a0830607J54802O8280r591l9789M422J26945L11752N32495P59970R65437
12449g955884J123767J218769J247696J221260J159454J086281J025105R94184
$$ y = [267503, 531157, 774580, 966787, 1085156, 1116716, 1050381, 869998, 558880, 113730, -446565, -1088736, -1784289, -2522544, -3305526, -4130567, -4978096, -5816236, -6617353, -7371778, -8089121, -8789435, -9492069, -10206841, -10928911, -11639724, -12316162, -12943916, -13525137, -14073736, -14602346, -15111605, -15588984, -16016081, -16378177, -16669688, -16892113, -17045809, -17122115, -17103212, -16971378, -16721076, -16364829, -15929152, -15444451, -14935965, -14420491, -13909118, -13412772, -12945807, -12523985, -12157113, -11841762, -11561645, -11298695, -11048914, -10830607, -10675805, -10607525, -10617116, -10656905, -10652483, -10525538, -10213786, -9681291, -8921321, -7955884, -6832117, -5613348, -4365652, -3144392, -1984938, -898657, 126448, 1120632]
12441A120632J002129J044989J106946J165400J198613J191976J139270J039449
12433A0009404Q93507P04894M81763K37003j4473k57697m77380o58173p88228
12424A0130620q63692q89054q72015q17822p28811o09117m68373l19341j71932
12415D390463l1070R8553K06458K76914K96418K61111J78205O2323o9001j98520
12405E471854l12024m01569m68276n22019n75528o34232o88742p17643p00441
12396D51380o31083n21659l94797k71463j61639o2064L7865J44440K49849L32819
12386h26352L70921L54992K93886K06700J10598J4912p5250j51416j98186j96711
12376i5906j32153k23J89446M13020O35471Q17959R29035R55153R04424Q00470
$$ y = [1120632, 2122761, 3167750, 4274696, 5440096, 6638709, 7830685, 8969955, 10009404, 10902911, 11607805, 12089568, 12326571, 12312098, 12054401, 11577021, 10918848, 10130620, 9266928, 8377874, 7505859, 6688037, 5959226, 5350109, 4881736, 4562395, 4390463, 4359393, 4457946, 4664404, 4941318, 5237736, 5498847, 5677052, 5739375, 5670374, 5471854, 5159830, 4758261, 4289985, 3767966, 3192438, 2558206, 1869464, 1151821, 451380, -179703, -701362, -1096159, -1367622, -1529261, -1591325, -1553460, -1409020, -1159171, -826352, -455431, -100439, 193447, 400147, 510745, 525657, 450407, 298991, 100805, -95906, -228059, -228282, -38836, 374184, 1009655, 1827614, 2756649, 3711802, 4616226, 5416696]
12366E416696O69848N30900L90458K48684J06309l1778j58456k68693l61892m40300
12356F101776n05656n58173n99558o36762o81322p43058q23053r11433r90730
12347c47969j040975j043508r83992q56153o65987m33749j91117K7208J95004
12338e341238L03922L65363M02542M36006M70482M91705M76621M11494L06095
12329a677008J94417J21641J25478K21400L97214O17422Q34770J004333J094875
12320B934542J093562J003945Q40581O24781L83102J45777n8858k13450l17683
12311F436299l85100m32235m68653m94962n07832n05706m90381m64669m28857
12302B257904l78275l03382j93255m2143J44270L47815N43710P09439Q30074Q97792
$$ y = [5416696, 6086544, 6617444, 7007902, 7256586, 7362895, 7331117, 7172661, 6903968, 6542076, 6101776, 5596120, 5037947, 4438389, 3801627, 3120305, 2377247, 1554194, 642761, -347969, -1388944, -2432452, -3416444, -4272597, -4938584, -5372333, -5563450, -5536242, -5341238, -5037316, -4671953, -4269411, -3833405, -3362923, -2871218, -2394597, -1983103, -1677008, -1482591, -1360950, -1235472, -1014072, -616858, 564, 835334, 1839667, 2934542, 4028104, 5032049, 5872630, 6497411, 6880513, 7026290, 6967432, 6753982, 6436299, 6051199, 5618964, 5150311, 4655349, 4147517, 3641811, 3151430, 2686761, 2257904, 1879629, 1576247, 1382992, 1340849, 1485119, 1832934, 2376644, 3086083, 3916157, 4813949]
12292D813949R09038Q63719P66674O28631M64830K91912J24253k8796j63194k77574
12282H393442l69848m35991m71594m74976m50708m12205l80109l74084m01516
12273D622411m51226m97224n09835m67713l65931k17502m7469J17239K54946L48785
12263B786481L82924L43993K29865N8443j32258k94409l85664l82451k85819j17206
12253B203899R3901L23015N55620P81684R86829J150433J253537J288860J263002
12244I900780J189476J080262R42836P81828O00480M00666J83934m5664k79856
12235A4754742n07232p15134q90057j018046j088181j098685j060821r95835r24961
12226F455790q57819p86720o91809n55333l76409j76161J0796J52977K36045K66349
$$ y = [4813949, 5722987, 6586706, 7353380, 7982011, 8446841, 8738753, 8863006, 8834210, 8671016, 8393442, 8023594, 7587603, 7116009, 6641033, 6190325, 5778120, 5398011, 5023927, 4622411, 4171185, 3673961, 3164126, 2696413, 2330482, 2112980, 2065511, 2182750, 2437696, 2786481, 3169405, 3513398, 3743263, 3801706, 3669448, 3375039, 2989375, 2606924, 2321105, 2203899, 2297800, 2620815, 3176435, 3958119, 4944948, 6095381, 7348918, 8637778, 9900780, 11090256, 12170518, 13113354, 13895182, 14495662, 14896328, 15080262, 15034598, 14754742, 14247510, 13532376, 12642319, 11624273, 10536092, 9437407, 8376586, 7380751, 6455790, 5597971, 4811251, 4119442, 3564109, 3187700, 3011539, 3022335, 3175312, 3411357, 3677706]
12216C677706K63719K49132K34078K16128J82158J16996J2493j28309k93500m67989
12206D062612o37813p91060r16860j004872j046082j034329r68019q52118o99920
12197c888461n32398l73201k40569j41444p2582k7864n893j2162n4616j35542
12187e484732k44305l55803m37783m64871m30965l51251k52136j56393p3683j569
12177h253491O5922J30089J85562K23897K37513K20690J69238Q2013l5788j70385
12167g144740l00547m02263m55584m50687l89798k84539j52579j6575R7102J64339
12157i335871J72395J24960L9053o2547j57821k29308k66358k65618k29716j66107
12147a0376938q7088q094N8331J09168J50837J91104K30740K63197K82085K88414
$$ y = [3677706, 3941425, 4190557, 4424635, 4640763, 4822921, 4939917, 4952410, 4824101, 4530601, 4062612, 3424799, 2633739, 1716879, 712007, -334075, -1368404, -2336423, -3188541, -3888461, -4420859, -4794060, -5034629, -5176073, -5248655, -5276519, -5282412, -5294574, -5349190, -5484732, -5729037, -6084840, -6522623, -6987494, -7418459, -7769710, -8021846, -8178239, -8251922, -8253491, -8187569, -8057480, -7871918, -7648021, -7410508, -7189818, -7020580, -6938567, -6974355, -7144740, -7445287, -7847550, -8303134, -8753821, -9143619, -9428158, -9580737, -9597312, -9500210, -9335871, -9163476, -9038516, -8999463, -9062010, -9219831, -9449139, -9715497, -9981115, -10210831, -10376938, -10464026, -10472120, -10413789, -10304621, -10153784, -9962680, -9731940, -9468743, -9186658, -8898244]
12137h898244K90564K97193L09492L19228L13825K84043K28471J52353O2528l7829
12127f678376j51066k81746m29309n81323p12847p93452p98136p15810n51758
12118a1693823l25223o5604J91576M11327N69852O64281P12680P41888P71968
12109h021078Q09294Q50546Q89416R18587R28626R09401Q55101P68099O57857
12100d34151N35875M10901K87963J72115P3629R103m865L8031J27433K39081L44669
12089A799784M22344M62552M67709M46818M07957L52783K76912J76663N7744o0996
12079D810270j52688j93690j73497r7238J8860J53768K85769L95306M68963N03107
12069F018930N02421M72396M12386L17415J88034L7869j10274k37418l39162m25935
$$ y = [-8898244, -8607680, -8310487, -8000995, -7681767, -7367942, -7083899, -6855428, -6703075, -6640547, -6678376, -6829442, -7111188, -7540497, -8121820, -8834667, -9628119, -10426255, -11142065, -11693823, -12019046, -12084650, -11893074, -11481747, -10911895, -10247614, -9534934, -8793046, -8021078, -7211784, -6361238, -5471822, -4553235, -3624609, -2715208, -1860107, -1092008, -434151, 101724, 512625, 800588, 972703, 1046332, 1055435, 1050570, 1088601, 1216034, 1455115, 1799784, 2222128, 2684680, 3152389, 3599207, 4007164, 4359947, 4636859, 4813522, 4871266, 4810270, 4657582, 4463892, 4290395, 4193157, 4212017, 4365785, 4651554, 5046860, 5515823, 6018930, 6521351, 6993747, 7406133, 7723548, 7911582, 7949451, 7839177, 7601759, 7262597, 6836662]
12059F836662n14591o18901p44165q86745j037353j186167j326157j451320j551459
12050b480196j610164j610996j548479j434824j296270j161727j051466r71566
12042a3165688r14243q61215p88220o71046m93896k58117J4177K86535N22988
12033a6328725P01940Q19601Q82406Q97082Q67144P96824O96989N87924M97285
12024i581530M53766M78281N76281P35323R29030J124448J288643J392798J414756
12015a188204J341820J174201R27518O31522L24067M3023j80016l23756l81563
12006B368612l65992l07873k45269k06332j97315k03611k01443j71107j04477
11997C65193n703J11816K28939L24051L77432L77412L25471K35642J26953J4083
$$ y = [6836662, 6322071, 5703170, 4959005, 4072260, 3034907, 1848740, 522583, -928737, -2480196, -4090360, -5701356, -7249835, -8684659, -9980929, -11142656, -12194122, -13165688, -14079931, -14941146, -15729366, -16400412, -16894308, -17152425, -17138248, -16851713, -16328725, -15626785, -14807184, -13924778, -13027696, -12160552, -11363728, -10666739, -10078815, -9581530, -9127764, -8649483, -8073202, -7337879, -6408849, -5284401, -3995758, -2602960, -1188204, 153616, 1327817, 2255335, 2886857, 3210924, 3253947, 3073931, 2750175, 2368612, 2002620, 1694747, 1449478, 1243146, 1045831, 842220, 640777, 469670, 365193, 359490, 471306, 700245, 1024296, 1401728, 1779140, 2104611, 2340253, 2467206, 2481289]
11987B481289r6415k02312k99520l79752m33060m51757m32907l79522l00949k11257
11977g06162j24810n1047Q038N6471J00505J44391J86610K17581K20335J74843
11967B26755O4524j17288l62807o49370r44801j216906j441327j602841j691394
11958g735455j698968j620826j458937j223535r31981o06778k73724M0733L13694
11949a5195777N30778O89651P99691Q76381R32427R70889R85520R68246R17745
11940g524449Q42170P54053O62085N66795M62907L44649K08254N0748j29735l28228
11930d090751n25904o90625p88499p99545p26667n92800m29265k62325j04806
11921i011187M3062J84476L15585M22064M84761M88162M24230K90512Q7340j81265
$$ y = [2481289, 2384874, 2182562, 1883042, 1503290, 1070230, 618473, 185566, -193956, -494905, -706162, -830972, -882019, -873981, -817510, -717005, -572614, -386004, -168423, 51912, 226755, 291279, 173991, -188816, -838186, -1782987, -2999893, -4441220, -6044061, -7735455, -9434423, -11055249, -12514186, -13737721, -14669702, -15276480, -15550204, -15509471, -15195777, -14664999, -13975348, -13175657, -12299276, -11366849, -10395960, -9410440, -8442194, -7524449, -6682279, -5928226, -5266141, -4699346, -4236439, -3891790, -3683536, -3632788, -3762523, -4090751, -4616655, -5307280, -6095779, -6895324, -7621991, -8214791, -8644056, -8906381, -9011187, -8968125, -8783649, -8468064, -8046000, -7561239, -7073077, -6648847, -6358335, -6270995, -6452260]
11911f452260n02677q50050j181017j444616j595553j608333j482343j236207
11903a6353056q98926n06142j01551K63721N39402O89895P06426O10869M48641
11894a4600721K72237J20988O009r0803k01008l44786n12459o64791p51917p38148
11884a7505399o17599m13651j65360R0224L30161N46031P34750Q89640J000847
11875a5110356J064027J087326J088924J087293J091636J098199J093960J066316
11867f432675J013446R47403Q86515Q43318Q18036Q00460P74966P24803O37667
11858A013939N13600L69526K33966J34375Q6668R3143J46312K33194L38216M45751
11848C608690N42487O18727O68864O92186O93434O80994O62398O40201O11692
$$ y = [-6452260, -6954937, -7804987, -8986004, -10430620, -12026173, -13634506, -15116849, -16353056, -17251982, -17758124, -17859675, -17595954, -17056552, -16366657, -15660231, -15049362, -14600721, -14328484, -14207496, -14201487, -14292290, -14493298, -14838084, -15350543, -16015334, -16767251, -17505399, -18122998, -18536649, -18702009, -18611785, -18281624, -17735593, -17000843, -16111203, -15110356, -14046329, -12959003, -11870079, -10782786, -9691150, -8592951, -7498991, -6432675, -5419229, -4471826, -3585311, -2741993, -1923957, -1123497, -348531, 376272, 1013939, 1527539, 1897065, 2131031, 2265406, 2352074, 2445217, 2591529, 2824723, 3162939, 3608690, 4151177, 4769904, 5438768, 6130954, 6824388, 7505382, 8167780, 8807981, 9419673]
11839I419673N72246N18652M49231L61071K47285R7008j00655l49346o37781r36706
11829I640678j204607j401015j500749j501660j422830j295424j150863j010917
11821h47387q83415p64811o47364n26286m03006k83441j72772o9828L4910J54852
11811d408548K97720M56775O09327P24337P75010P49706O56450N20118L74630
11802G55525K53453J80929J65707J97897K52107K96992L07453K72420J93840P9584
11792B955907o2440k24460l95457n59512o98104p94351q36736q21715p54873o48959
11782b840700n18338l73537k21193o9911O3951J57000J86497J39662J9043j57798
11772c615324l62832n63615p28536q30645q51388p85520o45569m61675k74089
$$ y = [9419673, 9991919, 10510571, 10959802, 11320873, 11568158, 11665166, 11564511, 11215165, 10577384, 9640678, 8436071, 7035056, 5534307, 4032647, 2609817, 1314393, 163530, -847387, -1730802, -2495613, -3142977, -3669263, -4072269, -4355710, -4528482, -4598310, -4563400, -4408548, -4110828, -3654053, -3044726, -2320389, -1545379, -795673, -139223, 380895, 755525, 1008978, 1189907, 1355614, 1553511, 1805618, 2102610, 2410063, 2682483, 2876323, 2955907, 2893467, 2669007, 2273550, 1714038, 1015934, 221583, -615153, -1436868, -2191741, -2840700, -3359038, -3732575, -3953768, -4023679, -3959728, -3802728, -3616231, -3476569, -3457526, -3615324, -3978156, -4541771, -5270307, -6100952, -6952340, -7737860, -8383429, -8845104, -9119193]
11763i119193j20113k0923K5827M4262O9811J34410K53542M20111O07443P80405
11753f924418R10020R83542J003819R80080R19796Q28556P14083N85057M42334
11744D42869K71277M5627k56252o32593j049664j449352j768280j956987j989948
11735h343303j866091j605486j246005q38412m37558r0753J73156L50517M61730
11726a3442205N40265O15773P01373P92476Q74684R32449R53749R31641Q64259
11717f235536P53760O06189M34069K58605J05705l990o2886p5444n0802L834Q5508
11706d180988J94326L29892M86602O50623Q00719R11929R60660R31821Q26995
11697A912579O67403M86246L14871J73517P1122Q778j8635k0724o777J8698N4463
$$ y = [-9119193, -9239306, -9260229, -9234402, -9190140, -9120329, -8985919, -8732377, -8312266, -7704823, -6924418, -6014398, -5030856, -4027037, -3046957, -2127161, -1298605, -584522, 535, 442869, 714146, 759773, 503521, -129072, -1178736, -2628088, -4396368, -6353355, -8343303, -10209394, -11814880, -13060885, -13899297, -14336855, -14427608, -14254452, -13903935, -13442205, -12901940, -12286167, -11584794, -10792318, -9917634, -8985185, -8031436, -7099795, -6235536, -5481776, -4875587, -4441518, -4182913, -4077208, -4081198, -4144084, -4219528, -4270330, -4266496, -4180988, -3986662, -3656770, -3170168, -2519545, -1718826, -806897, 153763, 1085584, 1912579, 2579982, 3066228, 3381099, 3554616, 3625738, 3634516, 3615881, 3595157, 3588380, 3607078, 3661541]
11686C661541R6318J33433J51208J37434Q6150k470j24227k72249m36669o03853
11676B826616p57165q79308r54138r67265r08206p76247n86525l69460j61255
11667c532953R213J29425K03988K47905K76108K95140L01858K89006K52324J94195
11657a333791J23446N3209k926l6528m8484m7447m3272m1399m2361m4396m5579
11646a509528m5946n1679p8114j44178k56887l96690n18245n69685n17618l60998
11636d449568j27739J38858L93559N97704P23644P56661O95244N51267L51432
11627c68938J37916l7048j25118r9488L3634K36366M52057O23056P06572O84631
11617B243640N66550L83828J79453m564j37121k02681k00609j41353m2302P5176
$$ y = [3661541, 3757859, 3891292, 4042500, 4179934, 4266084, 4263614, 4139387, 3867138, 3430469, 2826616, 2069451, 1190143, 236005, -731260, -1639466, -2415713, -3002238, -3371698, -3532953, -3523740, -3394315, -3190327, -2942422, -2666314, -2371174, -2069316, -1780310, -1527986, -1333791, -1210345, -1157136, -1160062, -1196590, -1245074, -1292521, -1335793, -1377192, -1419553, -1463949, -1509528, -1555474, -1607153, -1685267, -1829445, -2086332, -2483022, -3001267, -3570952, -4088570, -4449568, -4577307, -4438449, -4044890, -3447186, -2723542, -1966881, -1271637, -720370, -368938, -231022, -268070, -393188, -492676, -459042, -222676, 229381, 852437, 1559009, 2243640, 2810190, 3194018, 3373471, 3368907, 3231786, 3029105, 2828496, 2687143, 2644841, 2720017]
11607B720017J88008K74384L17427L08061K45538J36071q625j71561l29948m56172
11597C223200n22474n09489m15263k59764q1871P0291J52471J37996K8619j42761
11587A680955l22000m53911n02569m60809l46482j92025l5272Q6713J44049J22297
11577b79054K8751j09230k55012l76612m55429m86446m73254m23267l45388k49046
11567c423987j43471l7647N8883J35191J79491J81301J34986M4165p4603j92171
11557c137862k73845k91297k32976j06699O5945K58079M43422N98891P06797P58095
11547a211450P54803P08890O37311N54991M68114L70444K45862P8097j36918l84382
11537B085762o34930q56941j028181j140258j195956j203916j173858j112637
$$ y = [2720017, 2908025, 3182409, 3499836, 3807897, 4053435, 4189506, 4180881, 4009320, 3679372, 3223200, 2700726, 2191237, 1775974, 1516210, 1434339, 1504630, 1657101, 1795097, 1823716, 1680955, 1358955, 905044, 402475, -58334, -404816, -596841, -632113, -545400, -401351, -279054, -250303, -359533, -614545, -991157, -1446586, -1933032, -2406286, -2829553, -3174941, -3423987, -3567458, -3605105, -3546222, -3411031, -3231540, -3050239, -2915253, -2871088, -2945691, -3137862, -3411707, -3703004, -3935980, -4042679, -3976734, -3718655, -3275233, -2676342, -1969545, -1211450, -456647, 252243, 889554, 1444545, 1912659, 2283103, 2528965, 2607062, 2470144, 2085762, 1450832, 593891, -434290, -1574548, -2770504, -3974420, -5148278, -6260915]
11529f260915j021113q94188p26283n19969k91213o6629J25506K64573L43250
11520i046981L68299L56308L25199K86520K45361K08517J92034K18078L01474
11511f545191M36637N95312P36638Q23090Q34261P72570O58972N21695L84917
11502g81099K62948J60447P5046m95p6627j64202k69536l88433n02495n82038
11492b266484n96981n30675l87390j87596M5087K94423N51579Q06984J043441
11483a227612J237128J364664J410038J368300J247124J067198Q59848O60506
11475G987194M99735L95181L47040L39185L47179L50509L41456L24307L07045
11466A1238831K94373K87806K89970L06700L44394M05172M83438N65907O35357
$$ y = [-6260915, -7282028, -8176216, -8902499, -9422468, -9713681, -9780310, -9654804, -9390231, -9046981, -8678682, -8322374, -7997175, -7710655, -7465294, -7256777, -7064743, -6846665, -6545191, -6108554, -5513242, -4776604, -3953514, -3119253, -2346683, -1687711, -1166016, -781099, -518151, -357704, -282658, -283153, -359780, -523982, -793518, -1181951, -1684446, -2266484, -2863465, -3394140, -3781530, -3969126, -3924039, -3629616, -3078037, -2271053, -1227612, 9516, 1374180, 2784218, 4152518, 5399642, 6466840, 7326688, 7987194, 8486929, 8882110, 9229150, 9568335, 9915514, 10266023, 10607479, 10931786, 11238831, 11533204, 11821010, 12110980, 12417680, 12762074, 13167246, 13650684, 14216591, 14851948]
11457A4851948O76484O80631O47104N81548M93307L92349K85487J73000M7775
11448A8829633j02058k87873n13871p71011j035249j272929j450832j544238j539628
11439A0311944j435192j242721r88158p05501m25145j64934O9913K80426M67401
11430F168033O27627P51753Q23995Q25628P41882N67915L10320j4506l81330p55533
11420I665784j094233j352204j492011j494856j368533j149508q96169o72078
11412A46192n23815m64584m73878n13421n48048n58175n39379m94791m29055l48302
11402d747256k64289j96858j68978j94478k66802l58972m36353m72267m55398
11393g561651l87895k81120j53292k5794Q4814J74648K52302L29140M07982M79529
$$ y = [14851948, 15528432, 16209063, 16856167, 17437715, 17931022, 18323371, 18608858, 18781858, 18829633, 18727575, 18439702, 17925831, 17154820, 16119571, 14846642, 13395810, 11851572, 10311944, 8876752, 7634031, 6645873, 5940372, 5515227, 5350293, 5420206, 5700632, 6168033, 6795660, 7547413, 8371408, 9197036, 9938918, 10506833, 10817153, 10802647, 10421317, 9665784, 8571551, 7219347, 5727336, 4232480, 2863947, 1714439, 818270, 146192, -377623, -842207, -1316085, -1829506, -2377554, -2935729, -3475108, -3969899, -4398954, -4747256, -5011545, -5208403, -5377381, -5571859, -5838661, -6197633, -6633986, -7106253, -7561651, -7949546, -8230666, -8383958, -8409752, -8324938, -8150290, -7897988, -7568848, -7160866, -6681337]
11383f681337N28823N45586N30326M92319M41829L82395L08558K10693Q3829o5609
11373c222588k19759l55362m50784m90363m67145l86247k66921j38747l1822L2668
11363e997070M5626Q347o8723j65417k53832l06361l07144k60086j88199j23789
11353g616648r4109j09739j61922k29682k91526l34025l52734l47061l15145k54003
11343a0106594j64487n5430N7392J55799K22444K41909K03170J04885m0717k09806
11333i591435l73117n01117n66714n48642m37074k38003K7506L28298O28273Q90035
11323a0381990J079016J169979J154000J041502Q58295O35906M01270J71240m6398
11314c917180k48602m33691n99939p43967q58257r30698r48762r05721q03495
$$ y = [-6681337, -6152514, -5606928, -5076602, -4584283, -4142454, -3760059, -3451501, -3240808, -3156979, -3222588, -3442347, -3797709, -4248493, -4738856, -5206001, -5592248, -5859169, -5997916, -6029738, -5997070, -5951444, -5943097, -6011820, -6177237, -6431069, -6737430, -7044574, -7304660, -7492859, -7616648, -7710757, -7820496, -7982418, -8212100, -8503626, -8837651, -9190385, -9537446, -9852591, -10106594, -10271081, -10326511, -10269119, -10113320, -9890876, -9648967, -9445797, -9340912, -9381629, -9591435, -9964552, -10465669, -11032383, -11581025, -12018099, -12256102, -12228596, -11900298, -11272025, -10381990, -9302974, -8132995, -6978995, -5937493, -5079198, -4443292, -4042022, -3870782, -3917180, -4165782, -4599473, -5199412, -5943379, -6801636, -7732334, -8681096, -9586817, -10390312]
11305a0390312o50534m59443k48429m3757J23546K28469K63542K42240J91522
11296a0743156J38449R8780P3118N0875J7950l6698j17338k19381l28793m25370
11286a1491564m90508n14896m99603m49585l65680k42052p0382J53375M24605
11277a3546290P29665J047611J351283J607808J782286J847466J796068J647136
11269a736967J440341J220899J024138Q67449P51510O67726O06938N65095N43996
11260E951125N48132N80260O38236P14669P99756Q85409R67232J042486J106180
11251A3233485J148750J156342J112365J000406Q09696N42008K15385j38432m81254
11242A8598751p76909r99422j140069j209881j233681j237154j234393j223134
$$ y = [-10390312, -11040846, -11500289, -11748718, -11792475, -11668929, -11440460, -11176918, -10934678, -10743156, -10604707, -10505927, -10432809, -10381934, -10363984, -10400682, -10518020, -10737401, -11066194, -11491564, -11982072, -12496968, -12996571, -13446156, -13811836, -14053888, -14124270, -13970895, -13546290, -12816625, -11769014, -10417731, -8809923, -7027637, -5180171, -3384103, -1736967, -296626, 924273, 1948411, 2815860, 3567370, 4235096, 4842034, 5407129, 5951125, 6499257, 7079517, 7717753, 8432422, 9232178, 10117587, 11084819, 12127305, 13233485, 14382235, 15538577, 16650942, 17651348, 18461044, 19003052, 19218437, 19080005, 18598751, 17821842, 16822420, 15682351, 14472470, 13238789, 12001635, 10767242, 9544108]
11234I544108j188992j115101r92206q24952o31243m35007k56951j09223L848
11225C994281Q1965J26841J43720J43946J44106J60078J99416K58133L24432L85240
11215E962158M29121M44413M18292L41960K18765O5970r4567k49821m00315n51475
11205F584501p00622q33309r32808r93303j024542j045078j070845j107013j145598
11196b268617j167532j148412j067658r18732p15402m90061k84148j34511o0931
11187h256004n9573j05600j64447k06164k14729j87992j31337n2092M1804J41301
11177i194833K37992L28325M16708N14503O34798P85113R60439J139314J285986
11168b891655J360646J335563J209425J010025P81210N61306L67257J94060K6494
$$ y = [9544108, 8355116, 7240015, 6247809, 5422857, 4791614, 4356607, 4099656, 3990433, 3994281, 4076246, 4203087, 4346807, 4490753, 4634859, 4794937, 4994353, 5252486, 5576918, 5962158, 6391279, 6835692, 7253984, 7595944, 7814709, 7880679, 7786112, 7536291, 7135976, 6584501, 5883879, 5050570, 4117762, 3124459, 2099917, 1054839, -16006, -1123019, -2268617, -3436149, -4584561, -5652219, -6570951, -7286353, -7776414, -8060562, -8195073, -8256004, -8315577, -8421177, -8585624, -8791788, -9006517, -9194509, -9325846, -9377938, -9336134, -9194833, -8956841, -8628516, -8211808, -7697305, -7062507, -6277394, -5316955, -4177641, -2891655, -1531009, -195446, 1013979, 2024004, 2805214, 3366520, 3733777, 3927837, 3954331]
11159C954331j47560l29873n10717o71128p88151q43610q33374p71154o83132
11150a624368n95896n24820m69468m18012l57322k82825k02923j35702r9401j01436
11140d812173j32451j69101j83814j55316p4436N5761K22628M06547N83278P27922
11130c531155Q21193Q54972Q32483P62430O52591N09315L42186J66930J716j40051
11120A272610k53938l43107m13621m69041n05913n12595m74489l84566k52230
11111b336890j03100L0839J23938J64717J56608J14501O0330J8536J1350N5127
11101a704044J58483L20631N27888P50661R46739J073323J102038J027442Q64683
11092E067844O40103L82141J17227j29861l34968m76118n37391n12502m06517
$$ y = [3954331, 3806771, 3476898, 2966181, 2295053, 1506902, 663292, -170082, -941236, -1624368, -2220264, -2745084, -3214552, -3632564, -3989886, -4272711, -4475634, -4611336, -4710737, -4812173, -4944624, -5113725, -5297539, -5452855, -5527291, -5471530, -5248902, -4842355, -4259077, -3531155, -2709962, -1854990, -1022507, -260077, 392514, 901829, 1244015, 1410945, 1412661, 1272610, 1018672, 675565, 261944, -207097, -713010, -1225605, -1700094, -2084660, -2336890, -2439990, -2409151, -2285213, -2120496, -1963888, -1849387, -1789057, -1770521, -1759171, -1704044, -1545561, -1224930, -697042, 53619, 1000358, 2073681, 3175719, 4203161, 5067844, 5707947, 6090088, 6207315, 6077454, 5742486, 5266368, 4728977, 4216475, 3809958]
11083C809958k36688l2439J68446L29551M27444M57225M28314L55243K51500J29529
11073F088083K925j15339k19835l18684m30344n70059p35417r03384j041893j126903
11063F29150j152766j131029j081168j019562r51358q67973p51738n86706l70815
11054g283965j21629J29994L55708N43544O98443Q29092R32847R91734R82337
11045a941895Q91462P26594N14964K92715R0985p3203j97623k89478l59277m17781
11035g62537m76282n47557o43927p71122r21785j075125j205168j292089j327987
11026i023579j313900j252549j143798r86406p84726n55535l29508j44644l3955
11017a5568600j2815p1148j73506k68481l05657k53340j08109J07808L57141N98874
$$ y = [3809958, 3573270, 3540831, 3709277, 4038828, 4466272, 4923497, 5351811, 5707054, 5958554, 6088083, 6091008, 5975669, 5755834, 5437150, 5006806, 4436747, 3701330, 2797946, 1756053, 629150, -523616, -1654645, -2735813, -3755375, -4706733, -5574706, -6326444, -6913150, -7283965, -7405594, -7275600, -6919892, -6376348, -5677905, -4848813, -3915966, -2924232, -1941895, -1050433, -323839, 191125, 483840, 574825, 501622, 303999, 14521, -344756, -762537, -1238819, -1786376, -2430303, -3201425, -4123210, -5198335, -6403503, -7695592, -9023579, -10337479, -11590028, -12733826, -13720232, -14504958, -15060493, -15390001, -15534645, -15568600, -15581415, -15652563, -15826069, -16094550, -16400207, -16653547, -16761656, -16653848, -16296707, -15697833]
11007a5697833P96937R27323R83693R77913R32392Q66926P88318O90142N62387
10998h171802M02884K21252L2989j49811l22302m82725o25694p39972q12044q31212
10988a1478437p92339o96565n51908l73643j82774k326J47261K53033L13773L40565
10978a3023360L50260L54286L51537L32020K87787K20803J41497O1283j3646q3631
10968a1021164j53384k28605l12095m00081m81372n42054n74602n85111n91914
10959a4890382o14803o61858p23061p74831p91975p59430o77089n56207m11942
10950b0861578k58898j12302R901R0692J23721J21509J14083J37216K16807L57568
10940b0061281N40931P32560Q95592J003103J043873J020753R46310Q40460P28752
$$ y = [-15697833, -14900896, -13973573, -12989880, -12011967, -11079575, -10212649, -9424331, -8734189, -8171802, -7768918, -7547666, -7514677, -7664488, -7986790, -8469515, -9095209, -9835181, -10647225, -11478437, -12270776, -12967341, -13519249, -13892892, -14075666, -14077992, -13930731, -13677698, -13363925, -13023360, -12673100, -12318814, -11967277, -11635257, -11347470, -11126667, -10985170, -10923887, -10937533, -11021164, -11174548, -11403153, -11715248, -12115329, -12596701, -13138755, -13713357, -14298468, -14890382, -15505185, -16167043, -16890104, -17664935, -18456910, -19216340, -19893429, -20449636, -20861578, -21120476, -21232778, -21222877, -21132185, -21008464, -20886955, -20772872, -20635656, -20418849, -20061281, -19520350, -18787790, -17892198, -16889095, -15845222, -14824469, -13878159, -13037699, -12308947]
10931a2308947O35973N74748N37947N04490M56065L90578L21372K66180K38107
10922h383487K44045K85313L55330M37400N08670N49509N51097N15727M51283
10913d485113L64606K56844J22442m6608k51293m76048o87459q45047r18143q97570
10903g863389p95780o38669m56404k77184j23585j0635N4241P0248M3261j3193
10893a0011089p8738j30697j50417j27528o0446M5401J79610L28332M75864O06762
10883h922946P07862P68840P81034P36623O30903M67785K64883N3989j24749k33391
10873d869167k47727j64542p67K14486M48888O71377Q52765R67082R95493R29642
10863b02470P71387N30738K26109j12640m43122p16165q88143r34449q57474o85583
$$ y = [-12308947, -11672974, -11098226, -10560279, -10055789, -9599724, -9209146, -8887774, -8621594, -8383487, -8139442, -7854129, -7498799, -7061399, -6552729, -6003220, -5452123, -4936396, -4485113, -4120507, -3863663, -3741221, -3787829, -4039122, -4515170, -5202629, -6047676, -6965819, -7863389, -8659169, -9297838, -9754242, -10031426, -10155011, -10165646, -10111405, -10041157, -9997896, -10011089, -10089827, -10220524, -10370941, -10498469, -10558915, -10513514, -10333904, -10005572, -9529708, -8922946, -8215084, -7446244, -6665210, -5928587, -5297684, -4829899, -4565016, -4511027, -4635776, -4869167, -5116894, -5281436, -5282203, -5067717, -4618829, -3947452, -3094687, -2127605, -1132112, -202470, 568917, 1099655, 1325764, 1213124, 770002, 53837, -834306, -1768755, -2626229, -3311812]
10853c311812m64155k43314o7051L4350M9486j1213j17666k30566l17668l67413
10843e047022l91650m16322m66208n51411o60676p63528q20841q00438o91277
10834a0609373n09421k92445q5092P6205J72443K02519J78202J17347L6748n4121
10824a0766988j54580k66487l84168m89842n59894n77478n41689m67464l77938
10815a4586528k95313k35493k08038k18606k69445l56162m63708n66456o34850
10806a7834599o46576n96846n01724l91777k99394k47284k43135k80003l39478
10797b1380816l96651m26814m11636l41606k15251l8564J74158M01142O17835
10788b2018203Q02416R37644J009293J006359R26194P81008N99007M16985K67813
$$ y = [-3311812, -3775967, -4019281, -4086332, -4051982, -4002496, -4013709, -4131375, -4361941, -4679609, -5047022, -5438672, -5854994, -6321202, -6872613, -7533289, -8296817, -9117658, -9918096, -10609373, -11118794, -11411239, -11496331, -11420126, -11247683, -11045164, -10866962, -10749615, -10712867, -10766988, -10921568, -11188055, -11572223, -12062065, -12621959, -13199437, -13741126, -14208590, -14586528, -14881841, -15117334, -15325372, -15543978, -15813423, -16169585, -16633293, -17199749, -17834599, -18481175, -19078021, -19579745, -19971522, -20270916, -20518200, -20761335, -21041338, -21380816, -21777467, -22204281, -22615917, -22957523, -23172774, -23211338, -23037180, -22636038, -22018203, -21215787, -20278143, -19268850, -18262491, -17336297, -16555289, -15956282, -15539297, -15271484]
10779a5271484J69650J22004J09710J11620J08801Q8120M1407l5607j40619k59524
10769a4955922l64594m21337m02779l03161j41686M6717K27309L77199M86366
10760a5451888N51496N71077N46215M83679L95176K91604J77470N1904q3276k15610
10750a2682153l22659l82052l82738l29081k37621j31667l5877L0839O2391O6594
10740a4344024N8037M8860M4780M6568N2848O2778P9572J12415J72230K62031
10730a3403905L69571M69313N33171N43120M98476M13998L10360K03122R7563
10721i965211q078j14869k17469l04322l63290l88968l86774l70852l56895l54379
10711a2831107l62415l71267l69209l51992l29371l22912l54378m31381n40179
$$ y = [-15271484, -15101834, -14979830, -14870120, -14758500, -14649699, -14561579, -14520172, -14555779, -14696398, -14955922, -15320516, -15741853, -16144632, -16447793, -16589479, -16542762, -16315453, -15938254, -15451888, -14900392, -14329315, -13783100, -13299421, -12904245, -12612641, -12435171, -12383267, -12466543, -12682153, -13004812, -13386864, -13769602, -14098683, -14336304, -14467971, -14503848, -14473009, -14410618, -14344024, -14285987, -14237127, -14192347, -14145779, -14092931, -14030153, -13950581, -13838166, -13665936, -13403905, -13034334, -12565021, -12031850, -11488730, -10990254, -10576256, -10265896, -10062774, -9965211, -9973289, -10088158, -10305627, -10609949, -10973239, -11362207, -11748981, -12119833, -12476728, -12831107, -13193522, -13564789, -13933998, -14285990, -14615361, -14938273, -15292651, -15724032, -16264211]
10702a6264211o51021p32522p64896p43509o73148n61440m17883k56319r4528
10693b1159477N0182J64874K42172K81401K90781K86423K85473K98670L29894
10684a8929607L82132M61353N72717P12846Q65601J004296J097887J118427J049134
10675a1665214Q92385O73800M37393K30694Q6499J2495m591J5560N9976J25416
10665i135587K12019L15018M20885N09524N60766N62152N14614M33115L41836
10656e265658K66541K27560K35059K87055L70740M67046N56137O20136O42333
10647a593051O06443M99972L21393Q6341j72323m11964n92269o86487o87009o04187
10637c233141m60899k86234j09768M2909J52422K05457J94375J18635j3350j85358
$$ y = [-16264211, -16915232, -17647754, -18412650, -19156159, -19829307, -20390747, -20808630, -21064949, -21159477, -21109295, -20944421, -20702249, -20420848, -20130067, -19843644, -19558171, -19259501, -18929607, -18547475, -18086122, -17513405, -16800559, -15934958, -14930662, -13832775, -12714348, -11665214, -10772829, -10099029, -9661636, -9430942, -9344443, -9331948, -9336539, -9320979, -9261003, -9135587, -8923568, -8608550, -8187665, -7678141, -7117375, -6555223, -6040609, -5607494, -5265658, -4999117, -4771557, -4536498, -4249443, -3878703, -3411657, -2855520, -2235384, -1593051, -986608, -486636, -165243, -78902, -251225, -663189, -1255458, -1941945, -2628954, -3233141, -3694040, -3980274, -4090042, -4047133, -3894711, -3689254, -3494879, -3376244, -3389594, -3574952]
10627c574952l78241n75202p63969r35699j082075j191698j247131j225740j106822
10618a2081529q83062n69642k04602J60567M74975O99875Q14056Q14205P13089
10609a0062068N36527L18691R6304r6540k32561k95894k87023k24870j42648p7942
10599a0468024o1242j07119k09968l45054m75807n67307o01471n85543n47285
10590a3968820n19118n21661n56873o12474o71563p20525p52385p66385p65586
10581a9855390p54178p35422p10002o75067o25446n58170m77772l97714l35721
10572b5124882l05977l13078l50496m02970m50642m73282m54423l86056k72807
10563b8534613j32445R045J25009J93696K01102J43914L3050j06509k42856l48465
$$ y = [-3574952, -3953193, -4528395, -5292364, -6228063, -7310138, -8501836, -9748967, -10974707, -12081529, -12964591, -13534233, -13738835, -13578268, -13103293, -12403418, -11589362, -10775157, -10062068, -9525541, -9206850, -9110546, -9207086, -9439647, -9735541, -10022564, -10247434, -10390082, -10468024, -10529266, -10636385, -10846353, -11191407, -11667214, -12234521, -12835992, -13421535, -13968820, -14487938, -15009599, -15566472, -16178946, -16850509, -17571034, -18323419, -19089804, -19855390, -20609568, -21344990, -22054992, -22730059, -23355505, -23913675, -24391447, -24789161, -25124882, -25430859, -25743937, -26094433, -26497403, -26948045, -27421327, -27875750, -28261806, -28534613, -28667058, -28658013, -28533004, -28339308, -28138206, -27994292, -27961242, -28067751, -28310607, -28659072]
10553b8659072m09448m29067m25364m23441m43843m91799n54401o08591o34895
10544c3079921o27455n94896n53613n18769m96834m81788m57436m06675l23145
10535c7540532k16691j08592k1242L0085M0642J6215l0092q5173j44806k18368
10525c8278554l26069m89855p21365j011247j325691j614216j826304j928956
10517d7522257j918063j820322j684862j567037j511287j540132j650446j814663
10509f1029069j988000k124281k195946k206929k190939k197170k270314k432989
10501g8635637k678938k979823l296661l583595l783520l824667l620356l066033
10493a05469230k035251l86576K010144N223499R176113J3537653J7674385K0769005
$$ y = [-28659072, -29068520, -29497587, -29922951, -30346392, -30790235, -31282034, -31836435, -32445026, -33079921, -33707376, -34302272, -34855885, -35374654, -35871488, -36353276, -36810712, -37217387, -37540532, -37757223, -37865815, -37887057, -37856972, -37816330, -37800115, -37830207, -37915380, -38060186, -38278554, -38604623, -39094478, -39815843, -40827090, -42152781, -43766997, -45593301, -47522257, -49440320, -51260642, -52945504, -54512541, -56023828, -57563960, -59214406, -61029069, -63017069, -65141350, -67337296, -69544225, -71735164, -73932334, -76202648, -78635637, -81314575, -84294398, -87591059, -91174654, -94958174, -98782841, -102403197, -105469230, -107504481, -107891057, -105880913, -100657414, -91481301, -77943648, -60269263, -39500258]
10485c9500258K2124771K1486959J9150646J5779422J2085749Q591923N567100
10478F5286312L087012J123983l82335j485586k224912k637598k771425k685476
10470E7309975k444566k113702j750608j396287j071902p86694n49585l74271
10462D6822360k76213k66166l43671m92775o82948q75640j032968j125434j138532
10453D0588013j076922r61919q21417o78837n48794m39834l57953l06481k83847
10444C5112009k83277k95443l11174l21874l19915l03002k80897k76058l12994
10435C2407375m02552n33744o78772q06325q94790r39250r48733r33954q94170
10426B5375085q16091o89003n23947l58722k42283k09986k68207l97647n68544
$$ y = [-39500258, -17375487, 4111472, 23262118, 39041540, 51127289, 59719212, 65286312, 68373324, 69497307, 69114972, 67629386, 65404474, 62766876, 59995451, 57309975, 54865409, 52751707, 51001099, 49604812, 48532910, 47746216, 47196631, 46822360, 46546147, 46279981, 45936310, 45443535, 44760587, 43884947, 42851979, 41726545, 40588013, 39511091, 38549172, 37727755, 37048918, 36500124, 36060290, 35702337, 35395856, 35112009, 34828732, 34533289, 34222115, 33900241, 33580326, 33277324, 32996427, 32720369, 32407375, 32004823, 31471079, 30792307, 29985982, 29091192, 28151942, 27203209, 26269255, 25375085, 24558994, 23869991, 23346044, 22987322, 22745039, 22535053, 22266846, 21869199, 21300655]
10417B1300655p53266r28391j071402j161442j185428j142234j039742q88181
10409A3130569o96629m75028k38351q266J90284L36506M20473M44131M16401L47425
10399A3867515K46724J25148k917j19869k08367k56779k63779k38702j96761j51844
10389A2800369j11108p4169l7201O23L3220M9968M2483R780m2051j03657j66157
10378A2402100k23871k76630l30533l95548m81086n92281p28108q80388j033341
10369G460314j164914j250969j271677j217647j092601r11068o93599m63960k49073
10360h55194p6939L1603P3522O7242M4267L3662M9570Q8682J37284J82314K19783
10349d204K56068L01921L63538M37546N13986N84771O49682P14300P82911Q54692
$$ y = [21300655, 20547389, 19618998, 18547596, 17386154, 16200726, 15058492, 14018750, 13130569, 12433940, 11958912, 11720561, 11712295, 11902579, 12239085, 12659558, 13103689, 13520090, 13867515, 14114239, 14239387, 14236470, 14116601, 13908234, 13651455, 13387676, 13148974, 12952213, 12800369, 12689261, 12615092, 12577891, 12578514, 12611734, 12661702, 12704185, 12713965, 12671914, 12568257, 12402100, 12178229, 11901599, 11571066, 11175518, 10694432, 10102151, 9374043, 8493655, 7460314, 6295400, 5044431, 3772754, 2555107, 1462506, 551438, -142161, -606121, -855194, -932133, -900530, -827008, -759766, -715499, -681837, -632267, -543585, -406301, -223987, -4204, 251864, 553785, 917323, 1354869, 1868855, 2453626, 3103308, 3817608, 4600519, 5455211]
10339E455211R26809R99006J072732J144946J203041J225157J184893J058248
10331A4270043Q32309N13860J32427k66718o36719r41526j159478j278903j292451
10322A0172844j196437r96136p12182l80957m5149K61202N22917P41369R22249
10313I289720J064120J156292J185528J145097J040820Q91873P25307N65245M22599
10304A7486601K93377J67818M2756p3207j65158k22345k45558k47211k44839k51949
10294A6540285k71528k96410l16464l27276l33347l43181l60821l81626l96123
10285A3513509l98332l91347l86108l94796m22905m63816m98827n04117m62322
10276I590939l72305k50956j26240k6501K7893K7694k5469j19505k31558l30299
$$ y = [5455211, 6382020, 7381026, 8453758, 9598704, 10801745, 12026902, 13211795, 14270043, 15102352, 15616212, 15748639, 15481921, 14845202, 13903676, 12744198, 11465295, 10172844, 8976407, 7980271, 7268089, 6887132, 6841983, 7103185, 7626102, 8367471, 9289720, 10353840, 11510132, 12695660, 13840757, 14881577, 15773450, 16498757, 17064002, 17486601, 17779978, 17947796, 17990552, 17917345, 17752187, 17529842, 17284284, 17037073, 16792234, 16540285, 16268757, 15972347, 15655883, 15328607, 14995260, 14652079, 14291258, 13909632, 13513509, 13115177, 12723830, 12337722, 11942926, 11520021, 11056205, 10557378, 10053261, 9590939, 9218634, 8967678, 8841438, 8814937, 8842830, 8870524, 8845055, 8725550, 8493992, 8163693]
10266H163693l84248l74088l00997j84418n0997P6702J84207K61608K98888K86963
10256G977313K25519J30648L3115l4616n3915k6625L0165R4953J50428J87375
10246H714360K04975K08585K05788K02468K00743J99065J93704J81244J61904
10237A0472836J42215J34756J53680K07223K91050L87198M70943N22260N34114
10228A3316275N11883M65797M03871L30688K50336J67870Q6414K744r3727k16751
10218A5225400l76797n76618q10670j067022j329183j576588j784704j927571
10210E776247j984935j951835j843994j693045j532944j385884j255124j126100
10202f997614r73638p74245n21236k34375M5911K79538M48101N59710O34945O87545
$$ y = [8163693, 7779445, 7405357, 7104360, 6919942, 6868945, 6945647, 7129854, 7391462, 7690350, 7977313, 8202832, 8333480, 8366595, 8331979, 8278064, 8251439, 8281604, 8376557, 8526985, 8714360, 8919335, 9127920, 9333708, 9536176, 9736919, 9935984, 10129688, 10310932, 10472836, 10615051, 10749807, 10903487, 11110710, 11401760, 11788958, 12259901, 12782161, 13316275, 13828158, 14293955, 14697826, 15028514, 15278850, 15446720, 15533134, 15535878, 15442151, 15225400, 14848603, 14271985, 13461315, 12394293, 11065110, 9488522, 7703818, 5776247, 3791312, 1839477, -4517, -1697562, -3230506, -4616390, -5871514, -6997614, -7971252, -8745497, -9266733, -9501108, -9455197, -9175659, -8727558, -8167848, -7532903, -6845358]
10192f845358P15176P04258O42370N30037L87290K52607J73069J87495L08600
10183b944456N12479P41574R21930R88708R08776O89289L68706k832l81339p36500
10173A066335j049388j306555j495944j606284j629706j566318j428033j237530
10165a0253423j021015p98919n81515l72219j74295O090J63280K97841M17764
10156a2316411N32004O40867P31927P86652P93460P57398P00217O53010O46982
10147f073894P05179Q35329J025692J247271J462581J636639J745235J778470
10139D362502J739459J638449J484958J283344J035583P48719M40221J37289j28289
10130A2742235l26799m38234m60810m16447l46850k98238l01450l59316m49526
$$ y = [-6845358, -6130182, -5425924, -4783554, -4253517, -3866227, -3613620, -3440551, -3253056, -2944456, -2431977, -1690403, -768473, 220235, 1129011, 1818300, 2187006, 2184174, 1802835, 1066335, 16947, -1289608, -2785552, -4391836, -6021542, -7587860, -9015893, -10253423, -11274438, -12073357, -12654872, -13027091, -13201386, -13195296, -13032016, -12734175, -12316411, -11784407, -11143540, -10411613, -9624961, -8831501, -8074103, -7373886, -6720876, -6073894, -5368715, -4533386, -3507694, -2260423, -797842, 838797, 2584032, 4362502, 6101961, 7740410, 9225368, 10508712, 11544295, 12293014, 12733235, 12870524, 12742235, 12415436, 11977202, 11516392, 11099945, 10753095, 10454857, 10153407, 9794091, 9344565]
10121I344565n41242o14551o70284p24908p96140q90579j000698j109319j194949
10112A801895j235088j210171j110600r43509p33034n12043l10307j46662k8641
10103d428160M3446P4229P5638P0074Q7380J53578K77741M46235O28060P87197
10093a784582Q94983R37754R18537Q54350P71815P02780O78990P24019Q43910
10084E542556J021803J221577J400089J521598J566140J528095J408658J210096
10076A6420612R36479N98393K16160j81107n59730q87931j143632j320204j425732
10067A2653308j475479j482730j453696j388228j284670j145707r81116q04471
10059B637211o25963m48017k67993q5166R4158K56176L82433M53981M55945L82245
$$ y = [9344565, 8803323, 8188772, 7518488, 6793580, 5997440, 5106861, 4106163, 2996844, 1801895, 566807, -643364, -1753964, -2697473, -3430507, -3942550, -4252857, -4399519, -4428160, -4384714, -4310485, -4234847, -4164773, -4077393, -3923815, -3646074, -3199839, -2571779, -1784582, -889599, 48155, 966692, 1821042, 2592857, 3295637, 3974627, 4698646, 5542556, 6564359, 7785936, 9186025, 10707623, 12273763, 13801858, 15210516, 16420612, 17357091, 17955484, 18171644, 17990537, 17430807, 16542876, 15399244, 14079040, 12653308, 11177829, 9695099, 8241403, 6853175, 5568505, 4422798, 3441682, 2637211, 2011248, 1563231, 1295238, 1210072, 1304230, 1560406, 1942839, 2396820, 2852765, 3235010]
10049C235010K40240N4115j36977k90058l75924l91927l59870l10729k67703k37423
10039A158754k11126j72379j06610p268J24857K87002M78080O96871R37089J183646
10029D368916J411970J590775J689272J687839J586647J406152J179286R41473
10021A5862330P24293N53061M44786M04433M21364M69840N15987N29693M96166
10012B0421953M20802L24504K32441J62851J20452R4955O4310L760j00414k40061
10002B1505553l86371n03658n66176n68052n24548m67577m36699m66140n72366
9993A7013966p48460r67093j188804j372137j483852j506243j438167j290188
9985G019022j078706q23182n46046k72852l0800J55026K67217L00579K62424J68778
$$ y = [3235010, 3475250, 3529365, 3392388, 3102330, 2726406, 2334479, 1974609, 1663880, 1396177, 1158754, 947628, 775249, 668639, 661371, 786228, 1073230, 1551310, 2248181, 3185270, 4368916, 5780886, 7371661, 9060933, 10748772, 12335419, 13741571, 14920857, 15862330, 16586623, 17139684, 17584470, 17988903, 18410267, 18880107, 19396094, 19925787, 20421953, 20842755, 21167259, 21399700, 21562551, 21683003, 21777958, 21842268, 21846028, 21745614, 21505553, 21119182, 20615524, 20049348, 19481296, 18956748, 18489171, 18052472, 17586332, 17013966, 16265506, 15298413, 14109609, 12737472, 11253620, 9747377, 8309210, 7019022, 5940316, 5117134, 4571088, 4298236, 4267436, 4422462, 4689679, 4990258, 5252682, 5421460]
9975E421460L9923j02396k37250l47833m24898m68074m83961m81521m66816m40470
9965B008164l99875l44147k77271k07626j45816j02594q6122r7825j28706j58942
9955E9240j62174j14115k972J63435L59175N50444P08818Q20910Q91217R37560
9945D211538R80218J029709J081586J122881J144941J151274J154115J164629
9937A3040891J187141J221978J271269J339434J428099J533050J647755J768786
9929B4438403J896731K033218K178661K331122K484507K628726K756152K871445
9921D3618965K996419L166961L426384L818288M378373N127758O073186P213647
9913G9819981Q547106J0075213J1809299J3775479J6010346J8544182K1376082
$$ y = [5421460, 5461383, 5358987, 5121737, 4773904, 4349006, 3880932, 3396971, 2915450, 2448634, 2008164, 1608289, 1264142, 986871, 779245, 633429, 530835, 444713, 346888, 218182, 59240, -102934, -217049, -220021, -56586, 302589, 853033, 1561851, 2382761, 3273978, 4211538, 5191756, 6221465, 7303051, 8425932, 9570873, 10722147, 11876262, 13040891, 14228032, 15450010, 16721279, 18060713, 19488812, 21021862, 22669617, 24438403, 26335134, 28368352, 30547013, 32878135, 35362642, 37991368, 40747520, 43618965, 46615384, 49782345, 53208729, 57027017, 61405390, 66533148, 72606334, 79819981, 88367087, 98442300, 110251599, 124027078, 140037424, 158581606, 179957688]
9906A79957688K4441194K7566531L0423384L2497206L3097134L1437559K6843207
9899C86263903J9085968Q713869k892812j3901808k2689242k8381204l0974116
9892C15224558l1067614k9479276k6968281k4114995k1298512j8721451j6458886
9885A47115543j4510006j2835148j1379300j0090674q933259p888852o952740
9878G4525564o130232n432891m870043m438571m118280l875017l669002l465944
9870C8525584l247537l014691k780296k557529k353455k170627k011585j880835
9862A8509029j782977j718537j680304j652956j616922j554288j453901j314200
9854E734944j142837r52200p51876n42001l11654m4337K70224O22360R75405J272951
$$ y = [179957688, 204398882, 231965413, 262388797, 294886003, 327983137, 359420696, 386263903, 405349871, 414063740, 411170928, 397269120, 374579878, 346198674, 315224558, 284156944, 254677668, 227709387, 203594392, 182295880, 163574429, 147115543, 132605537, 119770389, 108391089, 98300415, 89367156, 81478304, 74525564, 68395332, 62962441, 58092398, 53653827, 49535547, 45660530, 41991528, 38525584, 35278047, 32263356, 29483060, 26925531, 24572076, 22401449, 20389864, 18509029, 16726052, 15007515, 13327211, 11674255, 10057333, 8503045, 7049144, 5734944, 4592107, 3639907, 2888031, 2346030, 2034376, 1990039, 2260263, 2882623, 3858028, 5130979]
9844E130979J459173J501159J401414J195808R39012O83209M59180K69504R6825
9835A3136263q0085k72835m77211o73725q34457r35193r67217r40585q76764p97345
9825F280846p17080o43184n77413n17781m60452m02619l44734k89448k38158j89686
9815A900291j43436j02663p2100n1033k9861N080O2732J41714K29578L04338L38121
9804B582761L05458J95106J8716j90142l86731n29992n94423n75056m86049l56098
9794a6450k22615j23444q5535j14807j94692k96418l95243m81722n60550o38497
9784c129973p10908p57127p48305o62250m96311k72102l0112J85052L43782M44890
9774e833364N13758N85772O86784Q22548R79125J128645J236627J271629J216871
$$ y = [5130979, 6590152, 8091311, 9492725, 10688533, 11627545, 12310754, 12769934, 13039438, 13136263, 13056178, 12783343, 12306132, 11632407, 10797950, 9862757, 8895540, 7954955, 7078191, 6280846, 5563766, 4920582, 4343169, 3825388, 3364936, 2962317, 2617583, 2328135, 2089977, 1900291, 1756855, 1654192, 1582092, 1531059, 1501198, 1506278, 1569010, 1710724, 1940302, 2244640, 2582761, 2888219, 3083325, 3102041, 2911899, 2525168, 1995176, 1400753, 825697, 339648, -16450, -239065, -362509, -448044, -562851, -757543, -1053961, -1449204, -1930926, -2491476, -3129973, -3840881, -4598008, -5346313, -6008563, -6504874, -6776976, -6807088, -6622036, -6278254, -5833364, -5319606, -4733834, -4047050, -3224502, -2245377, -1116732, 119895, 1391524, 2608395]
9765B608395J078676Q86152O81784N07187L89025L29705L07537K88423K44133
9756G321017J66574O9791j9610p6142q5841n0295J5262Q7793J43615J64726J43196
9745G880086Q2977j649r0689j63887k04759k03442j59380q2838P257Q8871J42810
9734G295357J57259J31170P5251P228n8080j16571j73411k34197k97629l55889
9724F430488m00909m30521m49652m65592m80547m87806m75741m36743l73459k97747
9714B131771k24963j68672j37886j35934j60449k04696k60027l18636l75679m29196
9704b84367m76284n06811m99608m25962k60270P118L60693P58134J138150J436632
9694A247425J605322J624328J503022J271163R67054O28358K86834l3907l17815
$$ y = [2608395, 3687071, 4573223, 5255007, 5762194, 6151219, 6480924, 6788461, 7076884, 7321017, 7487591, 7557382, 7537772, 7461630, 7375789, 7325494, 7340756, 7428549, 7572164, 7736890, 7880086, 7963063, 7961414, 7870725, 7706838, 7502079, 7298637, 7139257, 7056419, 7063676, 7152547, 7295357, 7452616, 7583786, 7659037, 7666265, 7608185, 7491614, 7318203, 7084006, 6786377, 6430488, 6029579, 5599058, 5149406, 4683814, 4203267, 3715461, 3239720, 2802977, 2429518, 2131771, 1906808, 1738136, 1600250, 1464316, 1303867, 1099171, 839144, 520508, 144829, -284367, -760651, -1267462, -1767070, -2193032, -2453302, -2446184, -2085491, -1327357, -189207, 1247425, 2852747, 4477075, 5980097, 7251260, 8218314, 8846672, 9133506, 9099599, 8781784]
9685H781784n52637p24868q17917q17102p19915n44633l29680j21682M2041J46049
9675D341440J96897K12055K06790J88350J59274J23832R0182O6099N2623M1819
9665E679361K1342j7299p2805j34292j86424k15176k11119j70167r3506J1956
9655D611871J32892K50392L43945L97487M03538L62354K77783J54478j044j77832
9645F755864l59896n28392o64811p53533p83781p51761o63514n37528m04799l03995
9635A003854k71677l30508m80069o94554r29597j136270j275557j325899j281936
9626f722213j149531r43088o85603m07280j40061Q9726K65937L82122M37827M35854
9616h436310L82994K92561J84350P9859m373o0223q6070q2384m9284J2031R6192
$$ y = [8781784, 8229147, 7504279, 6686362, 5869260, 5149345, 4604712, 4275032, 4153350, 4195391, 4341440, 4538337, 4750392, 4957182, 5145532, 5304806, 5428638, 5518820, 5584919, 5637542, 5679361, 5700703, 5683404, 5610599, 5476307, 5289883, 5074707, 4863588, 4693421, 4599915, 4611871, 4744763, 4995155, 5339100, 5736587, 6140125, 6502479, 6780262, 6934740, 6933696, 6755864, 6395968, 5867576, 5202765, 4449232, 3665451, 2913690, 2250176, 1712648, 1307849, 1003854, 732177, 401669, -78400, -772954, -1702551, -2838821, -4114378, -5440277, -6722213, -7871744, -8814832, -9500435, -9907715, -10047776, -9958050, -9692113, -9309991, -8872164, -8436310, -8053316, -7760755, -7576405, -7496546, -7500919, -7561142, -7647212, -7729596, -7778880, -7766849, -7670657]
9605g670657J92550K87450L67722M22477M43390M25895L71776K90204J95321J02703
9595d571169K7717j5528j7932J9871Q8269J76867K82419M07114N48307O91188
9585b362877Q13345Q97572R41099R53950R49969R39564R29147R24707R33325R59058
9575F878859R96005J025585J023064R70572Q67050P27711N74477M25703K91242
9566A3780268J72535O4678m0869j52947k77807m17536n69020p22638q62245r68432
9556A0005987j023976j018390r50711q31672o84399n39998m27222l61629l41465
9547C826525l52151l74800l93103l96296l79221l40876k81888k01432r5515M0835
9537A052078K07377L92908N76068P33954Q52451R30297R74903R95248R97680R85171
$$ y = [-7670657, -7478107, -7190657, -6822935, -6400458, -5957068, -5531173, -5159397, -4869193, -4673872, -4571169, -4543452, -4558980, -4576912, -4557041, -4468772, -4291905, -4009486, -3602372, -3054065, -2362877, -1549532, -651960, 289139, 1243089, 2193058, 3132622, 4061769, 4986476, 5919801, 6878859, 7874864, 8900449, 9923513, 10894085, 11761135, 12488846, 13063323, 13489026, 13780268, 13952803, 14017481, 13976612, 13823665, 13545858, 13128322, 12559302, 11836664, 10974419, 10005987, 8982011, 7963621, 7012910, 6181238, 5496839, 4956841, 4529619, 4167990, 3826525, 3474374, 3099574, 2706471, 2310175, 1930954, 1590078, 1308190, 1106758, 1011243, 1052078, 1259455, 1652363, 2228431, 2962385, 3814836, 4745133, 5720036, 6715284, 7712964, 8698135]
9527H698135R56687R05753Q21193O93014N21386L22704J27385l1288j32411j78398
9517A2704160j94247k14725k67331l60858m83450o07557o98851p28393o85196
9508H463552n81945m48682l18073k11971j36073q2815l9101N121N1497R3480J19978
9497F914968J18552P7978o896j28526k64528l84739m64493m96259m93846m87482
9487D384729n10939n85399p08061q51672r73729j029278r82970q19491n50667
9478b627477k14633J35741M51587P04455Q90956J022543J107385J137921J093878
9469C702356R58136P32707M43709J34195j48764l66113m95095n33177m96875m14678
9459C516401l15064k14381j11783M464J42835K96304M40646N44450N84446N56786
$$ y = [8698135, 9654822, 10560575, 11381768, 12074782, 12596168, 12918872, 13046257, 13014969, 12882558, 12704160, 12509913, 12295188, 12027857, 11666999, 11183549, 10575992, 9877141, 9148748, 8463552, 7881607, 7432925, 7114852, 6902881, 6766808, 6683993, 6644892, 6650013, 6701510, 6794990, 6914968, 7033520, 7111498, 7104602, 6976076, 6711548, 6326809, 5862316, 5366057, 4872211, 4384729, 3873790, 3288391, 2580330, 1728658, 754929, -274349, -1257319, -2076810, -2627477, -2842110, -2706369, -2254782, -1550327, -659371, 363172, 1470557, 2608478, 3702356, 4660492, 5393199, 5836908, 5971103, 5822339, 5456226, 4961131, 4427954, 3931079, 3516401, 3201337, 2986956, 2875173, 2879637, 3022472, 3318776, 3759422, 4303872, 4888318, 5445104]
9449E445104M77555L72978K66820J73941J02421N9035N1216Q3588J52240K41260
9439G426158L25125L77839L85215L52970L05012K73131K84639L53684M77900O39820
9429A1201493Q11964R63899J068011J102009J049302R00569O58012L39778k0034
9420A8075003l78057o92446r32467j083908j150863j154815j129283j108554j114329
9411I330281j148231j195358j235800j255746j251512j225973j181992j118744
9403b83075j033613r27269q06352o80408n55296m28480k89989j28219O2672K77037
9393d792992M95730O89224Q25943Q83155Q55072P53260N99511M17172K27432N0793
9383A004300r2258j86270k28509k31436k15817j98934j86402j72681j48649j10311
$$ y = [5445104, 5922659, 6295637, 6562457, 6736398, 6838819, 6897854, 6949070, 7032658, 7184898, 7426158, 7751283, 8129122, 8514337, 8867307, 9172319, 9445450, 9730089, 10083773, 10561673, 11201493, 12013457, 12977356, 14045367, 15147376, 16196678, 17097247, 17755259, 18095037, 18075003, 17696946, 17004500, 16072033, 14988125, 13837262, 12682447, 11553164, 10444610, 9330281, 8182050, 6986692, 5750892, 4495146, 3243634, 2017661, 835669, -283075, -1316688, -2243957, -3050309, -3730717, -4286013, -4714493, -5004482, -5132701, -5070029, -4792992, -4297262, -3608038, -2782095, -1898940, -1043868, -290608, 308903, 726075, 953507, 1004300, 912042, 725772, 497263, 265827, 50010, -148924, -335326, -508007, -656656, -766967]
9373g66967o3118j9970N086L551k3223o2994r4612r2831l5238R0371K80264N12757
9361b66924P51685R55902J091848J143057J111355J010346Q56648O64238M43290
9352G761445K01912n1120l04129n42148p49037r11236j021098j078156j088083
9343B218350j060129j004325r29258q40988p43646o42271n46415m70851m30191
9334d449724m29423m57449m89371m96624m58804l71927k51153j27325l6892p649
9324g576341m6862j38457k50771l49986m12193m29014m05731l54622k88083k14902
9314a0466962j39466o2196J8852J03930J87074K57078L06599L42249L84221M53064
9304h615557N54518O74974P88445Q66582Q86341Q37263P29043N92982M71259L98301
$$ y = [-766967, -830085, -850055, -844969, -841418, -864641, -927635, -1022247, -1115078, -1150316, -1059945, -779681, -266924, 484761, 1440663, 2532511, 3675568, 4786923, 5797269, 6653917, 7318155, 7761445, 7963357, 7912237, 7608108, 7065960, 6316923, 5405687, 4384589, 3306433, 2218350, 1158221, 153896, -775362, -1616350, -2359996, -3002267, -3548682, -4019533, -4449724, -4879147, -5336596, -5825967, -6322591, -6781395, -7153322, -7404475, -7531800, -7568692, -7576341, -7623203, -7761660, -8012431, -8362417, -8774610, -9203624, -9609355, -9963977, -10252060, -10466962, -10606428, -10668624, -10649772, -10545842, -10358768, -10101690, -9795091, -9452842, -9068621, -8615557, -8061039, -7386065, -6597620, -5731038, -4844697, -4007434, -3278391, -2685409, -2214150, -1815849]
9294a815849L86262M22403M76777N14051N04923M34109L02641J24562p8607k82449
9284I88823m63354o02601o89944p24286p11043o58461n75294m70117l51495k28539
9274d486311j12059j5892M3316N0062k757j07862k44207l84543n04242n85740
9264f350235o18542n98786n30395m25945l04580j86675q7282j1319M6806R8419
9254h968534J53436K15447K81659L46437M05422M58040N07714N59695O16931O75594
9244d748159P23279P42932P22718O66969N99941N57009N66231O30654P22709P95385
9234A979668Q04908P31399N84495L91468J78881l7883k52883m62984o64491q53425
9224B399153j025267j173168j287807j360722j388361j372637j317239j223896
$$ y = [-1815849, -1429587, -1007184, -530407, -16356, 488567, 922676, 1225317, 1349879, 1271272, 988823, 525469, -77132, -767076, -1491362, -2202405, -2860866, -3436160, -3906277, -4257772, -4486311, -4598370, -4614262, -4570946, -4520884, -4523641, -4631503, -4875710, -5260253, -5764495, -6350235, -6968777, -7567563, -8097958, -8523903, -8828483, -9015158, -9102440, -9113759, -9066953, -8968534, -8815098, -8599651, -8317992, -7971555, -7566133, -7108093, -6600379, -6040684, -5423753, -4748159, -4024880, -3281948, -2559230, -1892261, -1292320, -735311, -169080, 461574, 1184283, 1979668, 2784576, 3515975, 4100470, 4491938, 4670819, 4632936, 4380053, 3917069, 3252578, 2399153, 1373886, 200718, -1087089, -2447811, -3836172, -5208809, -6526048, -7749944]
9216g749944j093750r34067p63593o09450m95953m33374m13834m15103m09427
9207a3318495l75009l06098k15097j23599m8780M585M3175Q0292J31688K11180
9197a3916158L25144M68872O27741P81385R07372R84265R95820R35361Q07100
9188g083098O23909M04649J73646l8986j99786k79239k62267j56606O851J83819
9178f627108L32318M25955M58240M37164L75073K80840J58508J1489j52314l18706
9168d618541m69807n89379o67771p03856p03276o74808o27374n68416n03105m34539
9158a0560872l65394k99568k41445j93144j53029j16828p9199l4278K2719R1478
9148a1929560J63915K27301K71519K93513K95249K78331K41141J81225J01200
$$ y = [-7749944, -8843694, -9777761, -10541354, -11150804, -11646757, -12080131, -12493965, -12909068, -13318495, -13693504, -13999602, -14214699, -14338298, -14387078, -14382493, -14339318, -14259026, -14127338, -13916158, -13591014, -13122142, -12494401, -11713016, -10805644, -9821379, -8825559, -7890198, -7083098, -6459189, -6054540, -5880894, -5919880, -6119666, -6398905, -6661172, -6817778, -6810927, -6627108, -6294790, -5868835, -5410595, -4973431, -4598358, -4317518, -4159010, -4147521, -4299835, -4618541, -5088348, -5677727, -6345498, -7049354, -7752630, -8427438, -9054812, -9623228, -10126333, -10560872, -10926266, -11225834, -11467279, -11660423, -11813452, -11930280, -12009479, -12043757, -12021038, -11929560, -11765645, -11538344, -11266825, -10973312, -10678063, -10399732, -10158591, -9977366, -9876166]
9139i876166J3721n8846r0808o1777L6773J97751L96923N95992P53666Q41386
9129g251385Q53857Q07596P30700O51929N93370N65837N66413N79783N84470N62035
9119g55395N05254M21227L27544K43619J82913J50516J45148J61032J87430K08720
9109A778008K08641J77737J18572M4396k7637q3726j17758j32818j40707j57742
9099A666966j95582k51033l03078l21953k85429j90996n5485R6535K45605L81555
9089G87105M98008N85745O33541O35768N98116N35129M61635L84809L01532K01935
9079E623323P6987p4504k44499m20665n92531p53513q98687j021580j112279j157830
9069e75778j146345j074789r55647q16143o88764n98631n54637n48170n59335
$$ y = [-9876166, -9862445, -9921291, -10012099, -10073876, -10037103, -9839352, -9442429, -8846437, -8092771, -7251385, -6397528, -5589932, -4859232, -4207303, -3613933, -3048096, -2481683, -1901900, -1317430, -755395, -250141, 171086, 498630, 742249, 925162, 1075678, 1220826, 1381858, 1569288, 1778008, 1986649, 2164386, 2282958, 2327354, 2299717, 2215991, 2098233, 1965415, 1824708, 1666966, 1471384, 1220351, 917273, 595320, 309891, 118895, 63410, 159945, 405550, 787105, 1285113, 1870858, 2504399, 3140167, 3738283, 4273412, 4735047, 5119856, 5421388, 5623323, 5700310, 5625806, 5381307, 4960642, 4368111, 3614598, 2715911, 1694331, 582052, -575778, -1722123, -2796912, -3752559, -4568702, -5257466, -5856097, -6410734, -6958904, -7518239]
9060g518239n67130n56988n20704m51040l39201j80149J8644K34335M36001N97423
9050h847048P05946P61488P68138P27050O37338N03160L38938J67520J3143j05719
9040d330046j81129k17652k30352k37774k52587k75783k98579l09974l03744k79631
9030f917251k39108j80805j00882R71J14387K15854K73683K58031J50596m9939
9020f474463l25806o38563r29446j128732j177678j054174p85365m37577q9852
9011a3041656J93650L80189M69630M82896M45914L79766L02264K34839K04101
9002i948407K34798L40860N21285P60622J031057J296438J519959J673170J741297
8993h28921J723609J631817J488033J320049J152902J000626Q63010P27821N75866
$$ y = [-7518239, -8085369, -8642357, -9163061, -9614101, -9953302, -10133451, -10114807, -9880472, -9444471, -8847048, -8141102, -7379614, -6611476, -5884426, -5247088, -4743928, -4404990, -4237470, -4224327, -4330046, -4511175, -4728827, -4959179, -5196953, -5449540, -5725323, -6023902, -6333876, -6637620, -6917251, -7156359, -7337164, -7438046, -7437075, -7322688, -7106834, -6833151, -6575120, -6424524, -6474463, -6800269, -7438832, -8368278, -9497010, -10674688, -11728862, -12514227, -12951804, -13041656, -12848006, -12467817, -11998187, -11515291, -11069377, -10689611, -10387347, -10152508, -9948407, -9713609, -9372749, -8851464, -8090842, -7059785, -5763347, -4243388, -2570218, -828921, 894688, 2526505, 4014538, 5334587, 6487489, 7488115, 8351125, 9078946, 9654812]
8984I654812L87749J52352j25958m26484p18891r72881j165962j288174j343782
8975D152781j348006j318504j267081j197968j112270j011805q98927p76017o48254
8966e426051n26831m27440l64910l50080l91119m93757o54481q50272j036541
8957a0521482j160760j185203j102878r36443p24264n05264l09662j55056m5719
8948a6646731K5400P3532J20668J94754L23784N23002P83400J072411J347531
8939a2182249J572470J725415J797955J789746J703815J544333J317024J031032
8931B99541P00064L41048k9112l96092p47316j067591j334512j518610j590513
8922e343093j531533j340864j035246o42917j97286K65841P08384J091784J383597
$$ y = [9654812, 10042561, 10194913, 10068955, 9642471, 8923580, 7950699, 6784737, 5496563, 4152781, 2804775, 1486271, 219190, -978778, -2091048, -3102853, -4001780, -4777797, -5426051, -5952882, -6380322, -6745232, -7095312, -7486431, -7980188, -8634669, -9484941, -10521482, -11682242, -12867445, -13970323, -14906766, -15631030, -16136294, -16445956, -16601012, -16646731, -16621331, -16547799, -16427131, -16232377, -15908593, -15385591, -14602191, -13529780, -12182249, -10609779, -8884364, -7086409, -5296663, -3592848, -2048515, -731491, 299541, 999605, 1340653, 1311541, 915449, 168133, -899458, -2233970, -3752580, -5343093, -6874626, -8215490, -9250736, -9893653, -10090939, -9825098, -9116714, -8024930, -6641333]
8913f641333J566521J642896J630067J549990J421309J258387J073972Q79722
8905D381531O83106M84364K77701N7806j70904l87442n55155o32605n91124m31232
8895C116046j89357P0169K76317L77210L58534K45735R0225n1883j37854j46982
8885D008160q0023M6354K06155L70246N12151O12669O61251O53645N88527M67163
8875H046298K96580R2253j24452l34576n30653p19961r17802j132594j350845
8866C324248j533246j628129j596549j432753j166006q44123n12585k03501O2934
8857e529710K71990M11017M71242M52365L66973K42201J16276K9534J3104Q0336
8847c074672K23569M15318O12989P68395Q42156Q17338P03766N30357L32323J42694
$$ y = [-6641333, -5074812, -3431916, -1801849, -251859, 1169450, 2427837, 3501809, 4381531, 5064637, 5549001, 5826702, 5884508, 5713604, 5326162, 4771007, 4138402, 3547278, 3116046, 2926689, 2996858, 3273175, 3650385, 4008919, 4254654, 4344879, 4292996, 4155142, 4008160, 3928137, 3974491, 4180646, 4550892, 5063043, 5675712, 6336963, 6990608, 7579135, 8046298, 8342878, 8435131, 8310679, 7976103, 7445450, 6725489, 5807687, 4675093, 3324248, 1791002, 162873, -1433676, -2866429, -4032435, -4876558, -5389143, -5592644, -5529710, -5257720, -4846703, -4375461, -3923096, -3556123, -3313922, -3197646, -3168112, -3155008, -3074672, -2851103, -2435785, -1822796, -1054401, -212245, 605093, 1308859, 1839216, 2171539, 2314233]
8837B314233r135r6569r8046l367J78839M17384O63552Q65884R88097J019684
8827F240556R73890Q77089P57030O34278N17850M05218K85568J43587l7227k69383
8817A0528456n53696q73669j196971j482093j684684j763306j689322j460129
8809a75414j106206o83875k57682J15957L96259N58575N93680N08594L27121Q6641
8799C63650j69637m01447n77057o75401o88269o23831n07775l77984k74018k26252
8789d158021k47808l29862m41929n40097n82839n47565m38726k82963j15030L6691
8779g648149J57867K47973L15688L73406M31844M95782N63408O30421O95369P60368
8769b976023Q25504Q81768R09449Q84614P90043O23858M01328J50456r4724l00734
$$ y = [2314233, 2305098, 2208529, 2110483, 2107116, 2285955, 2703339, 3366891, 4232775, 5220872, 6240556, 7214446, 8091535, 8848565, 9482843, 10000693, 10405911, 10691479, 10835066, 10797839, 10528456, 9974760, 9101091, 7904120, 6422027, 4737343, 2974037, 1284715, -175414, -1281620, -1965495, -2223177, -2107220, -1710961, -1152386, -558706, -50112, 277009, 363650, 194013, -207434, -784491, -1459892, -2148161, -2771992, -3279767, -3657751, -3931769, -4158021, -4405829, -4735691, -5177620, -5717717, -6300556, -6848121, -7286847, -7569810, -7684840, -7648149, -7490282, -7242309, -6926621, -6553215, -6121371, -5625589, -5062181, -4431760, -3736391, -2976023, -2150519, -1268751, -359302, 525312, 1315355, 1939213, 2340541, 2490997, 2396273, 2095539]
8759B095539m41991n09052n13591m84321m53563m42167m52469m73609m94790n16790
8749b686804n52657o15993p05326p97798q59031q62910q06477p09455o00213m99976
8739i696640m16055l45346k80793k13514j31194j9323J30940L13102N02916O66861
8729i489046P75945Q15289P84829O93983N56489L88983K12289N1752o6606j24609
8719e400702j21607p8613l1629j5575m7752j20513k06285k70239k83948k35785
8709f812648j36123j5407Q5641J30485R9428m814j59209l27563m70589n57437
8699h168236n75645n34246m57202l71077k95228k39641k08240k01939k18548k51066
8689a1521068k86684l07568k93723k28495j05250O8492K72607M80410O64894Q02333
$$ y = [2095539, 1653548, 1144496, 630905, 146584, -306979, -749146, -1201615, -1675224, -2170014, -2686804, -3239461, -3855454, -4560780, -5358578, -6217609, -7080519, -7886996, -8596451, -9196664, -9696640, -10112695, -10458041, -10738834, -10952348, -11083542, -11102865, -10971925, -10658823, -10155907, -9489046, -8713101, -7897812, -7112983, -6419000, -5862511, -5473528, -5261239, -5209487, -5276093, -5400702, -5522309, -5600922, -5632551, -5648126, -5695878, -5816391, -6022676, -6292915, -6576863, -6812648, -6948771, -6964178, -6878537, -6748052, -6648624, -6653438, -6812647, -7140210, -7610799, -8168236, -8743881, -9278127, -9735329, -10106406, -10401634, -10641275, -10849515, -11051454, -11270002, -11521068, -11807752, -12115320, -12409043, -12637538, -12742788, -12674296, -12401689, -11921279, -11256385, -10454052]
8679a0454052Q74395Q71153P94784O61005M95905L29112J86501Q5250L2193K4992
8669f098762N5129J11170J81146K54120L21993L81339M32653M75397N02098M98167
8659b885550M50464L58653K39114J16728J0512p6101j54218k40180l44835m66872
8649b992285n92208o99184p67584p87088p60159o97498o09744n01739l72913k22199
8639i002601n3520J20955K80993M02760M66982M66733M09401L11666J92710P1477
8629f332444l2766j02171j26351j07395n7973N982P1269J28298J69862J91655
8619f192034J93825J80249J55308J21849Q2703M3350J1339q237j6929k2292l2718
8608e483587n2523q1570j18968j66533k27765l01904l76945m27689m22441l36193
$$ y = [-10454052, -9579657, -8708504, -7913720, -7252715, -6756810, -6427698, -6241197, -6155947, -6123754, -6098762, -6043633, -5932463, -5751317, -5497197, -5175204, -4793865, -4361212, -3885815, -3383717, -2885550, -2435086, -2076433, -1837319, -1720591, -1710079, -1786180, -1940398, -2180578, -2525413, -2992285, -3584493, -4283677, -5051261, -5838349, -6598508, -7296006, -7905750, -8407489, -8780402, -9002601, -9056121, -8935166, -8654173, -8251413, -7784431, -7317698, -6908297, -6596631, -6403921, -6332444, -6365210, -6467381, -6593732, -6701127, -6759100, -6753118, -6681849, -6553551, -6383689, -6192034, -5998209, -5817960, -5662652, -5540803, -5458100, -5414750, -5403411, -5411648, -5428577, -5450869, -5483587, -5536110, -5617680, -5736648, -5903181, -6130946, -6432850, -6809795, -7237484, -7659925, -7996118]
8598g996118j63108P8677L52200O13624Q25008R62036J014234R80636Q67379O90291
8588a775141M78226K70309J06021J3576K059N8764J51735K38368K79016K50140
8578G3073J50562q24j72439l28447m36251m72942m31230l24312j86639o6170p821
8567b203440l5936j46726l14963n08186o97524q60035r76513j031379j016483
8558g791185r34712p99309o30015m49964k84384j58379r2185r6506j70599l02428
8548a1709666m69382o40783p83654q69205q75965p90352o09328l45721k9916K97653
8538a6826319O00406Q57406J066352J237372J381276J498490J575342J591147
8530g018528J532062J401769J221030J017000Q10903O12264M20964K32794M4827
$$ y = [-7996118, -8159226, -8080549, -7728349, -7114725, -6289717, -5327681, -4313447, -3332811, -2465432, -1775141, -1296915, -1026606, -920585, -907009, -904950, -846186, -694451, -456083, -177067, 73073, 223635, 222811, 50372, -278075, -714326, -1187268, -1618498, -1942810, -2129449, -2195619, -2203440, -2239376, -2386102, -2701065, -3209251, -3906775, -4766810, -5743323, -6774702, -7791185, -8725897, -9525206, -10155221, -10605185, -10889569, -11047948, -11140133, -11236639, -11407238, -11709666, -12179048, -12819831, -13603485, -14472690, -15348655, -16139007, -16748335, -17094056, -17123972, -16826319, -16225913, -15368507, -14302155, -13064783, -11683507, -10185017, -8609675, -7018528, -5486466, -4084697, -2863667, -1846667, -1035764, -423500, -2536, 230258, 275085]
8521B75085j39832l08291m38387n05806m94415m02745k43280l7545J88686M08884
8511a697646N98719P38415Q14362Q20390P58223O35258M60126K40475j3369k81707
8501C073246n32890p28627q34672q31428p20515n25476k86573n1473J35371K42301
8491a060736K57074J88068N8996r9802k57869l86981m62919m70599m10862l02834
8481b948464j78317p0254o79K6716K6208K1481L2599O5681J11386J52584J75614
8470b585445J78085J69875J68228J89767K42082L18112L96699M50182M55042L99236
8460C81863K83185J17139q0539k83576m60065n79847o24903n96755n15979m13974
8450b773451l21397k58236k28027k16766j96889j36878j5445J64592L70675N49580
$$ y = [275085, 135253, -173038, -611425, -1117231, -1611646, -2014391, -2257671, -2295216, -2106530, -1697646, -1098927, -360512, 453850, 1274240, 2032463, 2667721, 3127847, 3368322, 3354953, 3073246, 2540356, 1811729, 977057, 145629, -574886, -1100362, -1386935, -1438408, -1303037, -1060736, -803662, -615594, -556598, -656400, -914269, -1301250, -1764169, -2234768, -2645630, -2948464, -3126781, -3197035, -3197714, -3170998, -3144790, -3123309, -3090710, -3025029, -2913643, -2761059, -2585445, -2407360, -2237485, -2069257, -1879490, -1637408, -1319296, -922597, -472415, -17373, 381863, 665048, 782187, 701648, 418072, -41993, -621840, -1246743, -1843498, -2359477, -2773451, -3094848, -3353084, -3581111, -3797877, -3994766, -4131644, -4147089, -3982497, -3611822, -3062242]
8440c062242O50264O49635N66103M52244L71226L70877M67072O39574Q38202R98108
8430B941063J062618J006684Q48930O43877M57631L40017L06752L38514L95462
8421H341548M38939M48511M24984L79592L19944K45093J52771N0223m2903j03601
8411A0655101j19871r9877o9769o2412j04399k07993l70100n76357q07410j044849
8401G192064j274608j485912j666474j798321j859722j834252j721412j540968
8393e989605j327631j119607r47399q27076p59112p31736p26347p21671o95418
8384a3845602o26278m99990l17766r9829J21025L12682M55662N48065O03035O40596
8374a2708400O77531P20491P66219Q06860Q34217Q40543Q19537P70650P03112
$$ y = [-3062242, -2411978, -1762343, -1196240, -743996, -372770, -1893, 465179, 1104753, 1942955, 2941063, 4003681, 5010365, 5859295, 6503172, 6960803, 7300820, 7607572, 7946086, 8341548, 8780487, 9228998, 9653982, 10033574, 10353518, 10598611, 10751382, 10801605, 10758702, 10655101, 10535230, 10435353, 10365584, 10303172, 10198773, 9990780, 9620680, 9044323, 8236913, 7192064, 5917456, 4431544, 2765070, 966749, -892973, -2727225, -4448637, -5989605, -7317236, -8436843, -9384242, -10211318, -10970430, -11702166, -12428513, -13150184, -13845602, -14471880, -14971870, -15289636, -15389465, -15268440, -14955758, -14500096, -13952031, -13348996, -12708400, -12030869, -11310378, -10544159, -9737299, -8903082, -8062539, -7243002, -6472352, -5769240]
8365e769240O33568N76927N37145N04932M64103M02654L21752K36761J69248J35661
8355a786489J39942J72742K14429K39430K22406J46641J1202j67930l63966n48778
8345a720371p00125q03314q48692q30028p47577o13467m52182k92274j54333m4700
8335g207063M0862J07935J56197J78176J63274J04183K366j29922k71581l96920
8325g252493m80181n00104m44942l16979j33412P8727K92053M87040O53448P85211
8315f831632Q75223R16152R06126Q52067P66372O60764N44159M25429L15348K23122
8305c46870J50229Q8586K6593m0803j06262j54170j72552j63499j42922j29215
8295i90885j30275j40040j47304j48920j55883j86718k52839l46966m42996n06813
$$ y = [-5769240, -5135672, -4558745, -4021600, -3516668, -3052565, -2649911, -2328159, -2091398, -1922150, -1786489, -1646547, -1473805, -1259376, -1019946, -797540, -650899, -639697, -807627, -1171593, -1720371, -2420496, -3223810, -4072502, -4902530, -5650107, -6263574, -6715756, -7008030, -7162363, -7207063, -7166201, -7058266, -6902069, -6723893, -6560619, -6456436, -6454070, -6583992, -6855573, -7252493, -7732674, -8232778, -8677720, -8994699, -9128111, -9049384, -8757331, -8270291, -7616843, -6831632, -5956409, -5040257, -4134131, -3282064, -2515692, -1854928, -1310769, -885340, -569992, -346870, -196641, -108055, -81462, -122265, -228527, -382697, -555249, -718748, -861670, -990885, -1121160, -1261200, -1408504, -1557424, -1713307, -1900025, -2152864, -2499830, -2942826, -3449639]
8285c449639n10212m40522l03609j21509P4502K53899L95522M89574N32956N24226
8275b554812M64066L60080K29009R1902l5018j46824k49369l53301m67254n93011
8265c254532p22628q37378r10690r17405q46950p12820n50646m04078l05760k63443
8255i726330k57159k47327j90567n8904J44317L80683N90048P15165P23585O16278
8245g310211M23152J91944k5303j86399k70027k78404k31336j57054q4526l7191
8235g965355k7281n2848r9628j46184j69516j50916q2599K7881J59759K87222
8225h219465L87926M47789M63323M43818M11455L95203M18525M87019N83738O75596
8215c505073P27810P18934O48751N35230M03330K73664J58248O3829m042m2953
$$ y = [-3449639, -3959851, -4400373, -4703982, -4825491, -4750989, -4497090, -4101568, -3611994, -3079038, -2554812, -2090746, -1730666, -1501657, -1409755, -1444773, -1591597, -1840966, -2194267, -2661521, -3254532, -3977160, -4814538, -5725228, -6642633, -7489583, -8202403, -8753049, -9157127, -9462887, -9726330, -9983489, -10230816, -10421383, -10480287, -10335970, -9955287, -9365239, -8650074, -7926489, -7310211, -6887059, -6695115, -6720418, -6906817, -7176844, -7455248, -7686584, -7843638, -7928164, -7965355, -7992636, -8045484, -8145112, -8291296, -8460812, -8611728, -8694327, -8666446, -8506687, -8219465, -7831539, -7383750, -6920427, -6476609, -6065154, -5669951, -5251426, -4764407, -4180669, -3505073, -2777263, -2058329, -1409578, -874348, -471018, -197354, -39106, 24723, 20681, -22272]
8205b2272o0201p5199j11244j80448k73150l59770m03401l75287k66850r6112
8195b223934R3094K42162K99197K42653R2751r8037k69839l79982m14792l86461
8185b803188l20565k41964j66592j03266o1787n6809j00935j93023l14209m36693
8175d799031n37605o06890o45070o54988o34573n75739m70116l16817j25247Q9850
8165i276226L16632N50298P89516J027897J247129J417904J509988J505598J406410
8156D95146J228974R93593P16996M14302J05769j80545m14867n77025o64749o92598
8146A424996o81987o49391o00529n32406m38293l09969j37611Q6806L59491O54158
8136h24735R21990J107440J171822J108829R41956P08074M41485J69421q2763
$$ y = [-22272, -82473, -157672, -268916, -449364, -722514, -1082284, -1485685, -1860972, -2127822, -2223934, -2130840, -1888678, -1589481, -1346828, -1254077, -1352114, -1621953, -2001935, -2416727, -2803188, -3123753, -3365717, -3532309, -3635575, -3697362, -3754171, -3855106, -4048129, -4362338, -4799031, -5336636, -5943526, -6588596, -7243584, -7878157, -8453896, -8924012, -9240829, -9366076, -9276226, -8959594, -8409296, -7619780, -6591883, -5344754, -3926850, -2416862, -911264, 495146, 1724120, 2717713, 3434709, 3849011, 3954780, 3774235, 3359368, 2782343, 2117594, 1424996, 743009, 93618, -506911, -1039317, -1477610, -1787579, -1925190, -1838384, -1478893, -824735, 97255, 1204695, 2376517, 3485346, 4427302, 5135376, 5576861, 5746282, 5663519]
8127E663519k88170m24925m88396m96814m83795m83410n18258n94947p04664q26593
8117C53547r33980j001118j007394r38067p86325n59083k81531O492K61927M50422
8107d435110N52558N64274M94028L58185J75718l5547k59251m78023o70797q12330
8097d546295q76044q39960o94283m47978j31930K03350M97002O94091P64510P15195
8087d662342N86656M33672L01130K09714J57761J32909J22017J13527R5007N1624
8077b458325l1470j63037l38355n35292p18794q53146r13840q90879p84278o00074
8067h287490l51891o4607K26011M78812O54734P23867O71842N04501K48685n1752
8057e247288l43653n74563p03595p10143n96922l86711j15754J73316M39070O49758
$$ y = [5663519, 5375349, 4950424, 4462028, 3965214, 3481419, 2998009, 2479751, 1884804, 1180140, 353547, -580433, -1581551, -2588945, -3527012, -4313337, -4872420, -5153951, -5147459, -4885532, -4435110, -3882552, -3318278, -2824250, -2466065, -2290347, -2325894, -2585145, -3063168, -3733965, -4546295, -5422339, -6262299, -6956582, -7404560, -7536490, -7333140, -6836138, -6142047, -5377537, -4662342, -4075686, -3642014, -3340884, -3131170, -2973409, -2840500, -2718483, -2604956, -2509949, -2458325, -2489795, -2652832, -2991187, -3526479, -4245273, -5098419, -6012259, -6903138, -7687416, -8287490, -8639381, -8703988, -8477977, -7999165, -7344431, -6620564, -5948722, -5444221, -5195536, -5247288, -5590941, -6165504, -6869099, -7579242, -8176164, -8562875, -8678629, -8505313, -8066243, -7416485]
8047g416485P89985Q61621Q78564Q59402Q21941P80220P42676P11320O82654O50070
8037C61968O06897N49639M81134M11385L53704L17067L00054K91407K77333K50748
8027D201336K17070J93638K02877K61833L72566N18172O67105P84330Q43536Q33370
8017I095833P54575O12583M14197J72128q8870l33725n28297o52022p03447o97850
8007H045105o61449o25027o16460o52686p34369q46245r62965j057845j111540
7998G76519j117601j082568j020505r44926q62238p69870o59959n26626l72144
7989f579918k07651m8132R3699K10147K97471L53605L76579L64425L17482K42700
7979d579593J55927P7502K2460o930k0325l2523n7609j06487j84694k88492m02570
$$ y = [-7416485, -6626500, -5764879, -4886315, -4026913, -3204972, -2424752, -1682076, -970756, -288102, 361968, 968865, 1518504, 1999638, 2411023, 2764727, 3081794, 3381848, 3673255, 3950588, 4201336, 4418406, 4612044, 4814921, 5076754, 5449320, 5967492, 6634597, 7418927, 8262463, 9095833, 9850408, 10462991, 10877188, 11049316, 10960446, 10626721, 10098424, 9446402, 8742955, 8045105, 7383656, 6758629, 6142169, 5489483, 4755114, 3908869, 2945904, 1888059, 776519, -341082, -1423650, -2444155, -3389081, -4251319, -5021189, -5681148, -6207774, -6579918, -6787569, -6835701, -6742002, -6531855, -6234384, -5880779, -5504200, -5139775, -4822293, -4579593, -4423666, -4346164, -4323704, -4330634, -4350959, -4383482, -4441091, -4547578, -4732272, -5020764, -5423334]
7968e423334n03620n69223n86636n56347m89164l99203k97176j87903p3185M2750
7958i043041J49833K33487K79892K82100K43340J74894Q9077p749j15527k32433
7948g946127l45188m28112m54781m14379l19729j99990q3192J9133J15608K26134
7938i830623L67370N41091P30308R03117J021770J054296R85503Q22812N93293
7929b811063L32905P4240j60746l61085n22778o43733p19971p44486p09618o12015
7919f878350m57620k63890n7496J32376K82521L81593M30772M40675M27836M11099
7909e150484M05976M17936M40206M59708M66344M56302M26227L65977K60416J01734
7899a349658r7494l02501m68431n58289n55557m66229l12536j23945P0019K43310
$$ y = [-5423334, -5926954, -6496177, -7082813, -7639160, -8128324, -8527527, -8824703, -9012606, -9085791, -9043041, -8893208, -8659721, -8379829, -8097729, -7854389, -7679495, -7590418, -7598167, -7713694, -7946127, -8291315, -8719427, -9174208, -9588587, -9908316, -10108306, -10191498, -10172365, -10056757, -9830623, -9463253, -8922162, -8191854, -7288737, -6266967, -5212671, -4227168, -3404356, -2811063, -2478158, -2403918, -2564664, -2925749, -3448527, -4092260, -4812231, -5556717, -6266335, -6878350, -7335970, -7599860, -7657356, -7524980, -7242459, -6860866, -6430094, -5989419, -5561583, -5150484, -4744508, -4326572, -3886366, -3426658, -2960314, -2504012, -2077785, -1711808, -1451392, -1349658, -1447152, -1749653, -2218084, -2776373, -3331930, -3798159, -4110695, -4234640, -4164621, -3921311]
7889c921311L74218M46348M51119L89660K70939J07125q8793l00605n05895o78565
7879c455760p97485q55677q64336q49985q45929q80274r64129j084785j207280
7870a1805640j284268j270906j139752q89965n46439j49342K59536O45333R80220
7861a5201223J239472J401537J455692J412027J303549J174853J062681R80879
7853e170533R19225Q55513P71982O66139N50902M45375L62354L00312K45106J80399
7843A26774R9856J2832n9505r4049p5573k913J09547K36313L51458M40911N07491
7832A653142N63925O19577O72234P10081P19051O87954O09836M83217L15272J23980
7822G158269o4783k25066l38642l97816m02885l58201k71085j54225k8761P5882
$$ y = [-3921311, -3547093, -3100745, -2649626, -2259966, -1989027, -1881902, -1970695, -2271300, -2777195, -3455760, -4253245, -5108922, -5973258, -6823243, -7669172, -8549446, -9513575, -10598360, -11805640, -13089908, -14360814, -15500566, -16390531, -16936970, -17086312, -16826776, -16181443, -15201223, -13961751, -12560214, -11104522, -9692495, -8388946, -7214093, -6151412, -5170533, -4251308, -3395795, -2623813, -1957674, -1406772, -961397, -599043, -298731, -53625, 126774, 226630, 239462, 179957, 85908, 10335, 7422, 116969, 353282, 704740, 1145651, 1653142, 2217067, 2836644, 3508878, 4218959, 4938010, 5625964, 6235800, 6719017, 7034289, 7158269, 7093486, 6868420, 6529778, 6131962, 5729077, 5370876, 5099791, 4945566, 4916805, 4992687]
7812D992687J28024J05102N553j46244l06431m26771m70259m20313k81896p7004
7802C102448J62107L99185N98695P29807P70882P13424N62870L35376N3010k59539
7792G168265n76088q69375j112596j282646j364140j351367j246340j054852p85448
7783b474587m53330q5310K79756N96648Q23255R30954R13174P88124N92285L67046
7773B278015J46079m9864k10341l29586m02778m26637m03521l45424k73292k09884
7763b27233j69738j53235j49310j44634j31614j08790p4774k3834N0690J47680
7753i84792K52914L42256L90555L80452L08190J86017L9902r8197k00684k51865
7743C64748k49881k04470j32749n3478J9156P9097J26516J62025J82132J79814
$$ y = [4992687, 5120711, 5225813, 5231366, 5085122, 4778691, 4351920, 3881661, 3461348, 3179452, 3102448, 3264555, 3663740, 4262435, 4992242, 5763124, 6476548, 7039418, 7374794, 7427804, 7168265, 6592177, 5722802, 4610206, 3327560, 1963420, 612053, -634287, -1689139, -2474587, -2927917, -3013227, -2733471, -2136823, -1313568, -382614, 530560, 1318684, 1910969, 2278015, 2424094, 2374230, 2163889, 1834303, 1431525, 1004888, 601367, 255943, -17349, -227233, -396971, -550206, -699516, -844150, -975764, -1084554, -1159328, -1183162, -1132472, -984792, -731878, -389622, 933, 381385, 689575, 875592, 915494, 817297, 616613, 364748, 114867, -89603, -222352, -275830, -256674, -177577, -51061, 110964, 293096, 472910]
7733D72910J49745R3941K3200m6999j03002j36859j46332j34617j13001j03149
7723d4163j32500k21828l72869n64099p55135q94663r30017q20922n56767j68999
7713e461962K71266O71971R46488J036097R21800O24910J99067k82891p44050
7704a817304j117844j359617j453626j413872j277716j092972r01738p26832n67016
7695a1728537m04064k18463n188K19829M26132N83485O75055P01344O74596O10188
7685h465623N22148M24362L33333K67689K44259K74513L64052N13821P20222R73796
7675c827428J258133J549604J817208K023869K132515K117102J972071J712761
7667A0755835J367038R66039N40533J20806k66120o03096q86674j121850j310057
$$ y = [472910, 622655, 716596, 739796, 692797, 589795, 452936, 306604, 171987, 58986, -44163, -176663, -398491, -771360, -1335459, -2090594, -2985257, -3915274, -4736196, -5292963, -5461962, -5190696, -4518725, -3572237, -2536140, -1614340, -989430, -790363, -1073254, -1817304, -2935148, -4294765, -5748391, -7162263, -8439979, -9532951, -10434689, -11161521, -11728537, -12132601, -12351064, -12356252, -12136423, -11710291, -11126806, -10451751, -9750407, -9075811, -8465623, -7943475, -7519113, -7185780, -6918091, -6673832, -6399319, -6035267, -5521446, -4801224, -3827428, -2569295, -1019691, 797517, 2821386, 4953901, 7071003, 9043074, 10755835, 12122873, 13088912, 13629445, 13750251, 13484131, 12881035, 11994361, 10872511, 9562454]
7658I562454j440905j496405j465315j355452j193375j011919q35650o73995n24152
7649d34714l79633k38748j08755l883O1221P8201M7969k0646j14486k19933l25989
7638a659396m25760n16016n95275o60925p05908p17089o78990n83197m36986k62712
7628g242254q7581O6881J87114K63431K88461K62116J97551J20104N8028L0670
7618e855479M0341P0492R0705O8275j6475j58553l28568m86315n99117o52686
7608g827380o48896n95349m96379l51486j59991P2732L31184N88967Q11427R61945
7598g313226J011539R49008P86528N56512L00491N5942j52297l13911m30933n14366
7588e064713n79786o40983p03306p60762p99473q05649p72982p04802o09835m94619
$$ y = [9562454, 8121549, 6625144, 5159829, 3804377, 2611002, 1599083, 763433, 89438, -434714, -814347, -1053095, -1161850, -1165733, -1104512, -1026311, -978342, -998988, -1113474, -1333407, -1659396, -2085156, -2601172, -3196447, -3857372, -4563280, -5280369, -5959359, -6542556, -6979542, -7242254, -7329835, -7262954, -7075840, -6812409, -6523948, -6261832, -6064281, -5944177, -5886149, -5855479, -5815138, -5744646, -5653941, -5585666, -5602141, -5760694, -6089262, -6575577, -7174694, -7827380, -8476276, -9071625, -9568004, -9919490, -10079481, -10006749, -9675565, -9086598, -8275171, -7313226, -6301687, -5352679, -4566151, -4009639, -3709148, -3653206, -3805503, -4119414, -4550347, -5064713, -5644499, -6285482, -6988788, -7749550, -8549023, -9354672, -10127654, -10832456, -11442291, -11936910]
7578a1936910l58641j97121j0577J86776L68637N09134N96450O35133O34457N93926
7568h978736N00889L44007J30580j08633l31553n03276o06802o41362o13406n27387
7558a1335679l80710j65766J20140M62073Q22010J147300J388823J517262J528673
7549d895874J439270J275823J068301Q47364O44348M89339M05452M02033M71094
7540B147150N88732P20514Q29521Q85914Q75265Q01977O86083N55036M33620L35455
7530H859267K59827J96362J34941P3280J6109l2003p2165j09621j47189j79764
7520H999044j93615j70286r3603M1606K22116M15326N77634O68970O65760N66822
7510A1699774L92087J76362m0786k27193l66647m58071n06460n14431m82256m15228
$$ y = [-11936910, -12295551, -12492672, -12503249, -12316473, -11947836, -11438702, -10842252, -10207119, -9572662, -8978736, -8477847, -8133840, -8003260, -8111893, -8443446, -8946722, -9553524, -10194886, -10808292, -11335679, -11716389, -11882155, -11762015, -11299942, -10477932, -9330632, -7941809, -6424547, -4895874, -3456604, -2180781, -1112480, -265116, 379232, 868571, 1274023, 1676056, 2147150, 2735882, 3456396, 4285917, 5171831, 6047096, 6849073, 7535156, 8090192, 8523812, 8859267, 9119094, 9315456, 9450397, 9523677, 9539786, 9507783, 9435618, 9325997, 9178808, 8999044, 8805429, 8635143, 8541540, 8583146, 8805262, 9220588, 9798222, 10467192, 11132952, 11699774, 12091861, 12268223, 12227437, 12000244, 11633597, 11175526, 10669066, 10154635, 9672379, 9257151]
7500I257151l30088k53667k13724k27629k95457m01220n21124o33744p26355p95345
7490D858798q43041q74182q92951q99611q87662q44786p59097o26690m54048k53683
7480b476953l8407J79942L87864N68701P04793P81564P91364P36606O31087M97140
7470B763701L59236K38768J53344J17692J40839K19360L32590M45544N19719N26796
7460E817589M58493L27697J60784j3888j74828l10330m16108m90207n28105n21249
7450D309848m60530l42330j72463L4252K56955M71304O50654P67242P96135P23994
7440G035061N60376L42863J26845l8692j34266j74885j93284k14658k41301k55956
7430F812103k38030j78643q4180L0471J49795K59626L45042L90628L85638L30365
$$ y = [9257151, 8927063, 8673396, 8459672, 8232043, 7936586, 7535366, 7014242, 6380498, 5654143, 4858798, 4015757, 3141575, 2248624, 1349013, 461351, -383435, -1142532, -1769222, -2223270, -2476953, -2515360, -2335418, -1947554, -1378853, -674060, 107504, 898868, 1635474, 2266561, 2763701, 3122937, 3361705, 3515049, 3632741, 3773580, 3992940, 4325530, 4771074, 5290793, 5817589, 6276082, 6603779, 6764563, 6750675, 6575847, 6265517, 5849409, 5359202, 4831097, 4309848, 3849318, 3506988, 3334525, 3368777, 3625732, 4097036, 4747690, 5514932, 6311067, 7035061, 7595437, 7938300, 8065145, 8026453, 7892187, 7717302, 7524018, 7309360, 7068059, 6812103, 6574073, 6395430, 6311250, 6341721, 6491516, 6751142, 7096184, 7486812, 7872450, 8202815]
7420H202815K38451J33038L8304k9843o9081q9030j04232j26772j62141k08148
7410G823361k55854k93636l14629l23093l32821l56689l95785m38638m72064m93886
7400D146266n15815n53905o14850o89182p56080p95498p98622p69577p18252o51122
7390b716637n67997m66352l47432k17489q4091M7340J73019K87952L84648M55276
7380c051763M95948N10285N09212N05767N07517N11836N07392M80114M19391L22251
7370A717950J95735N7717o5782j48148j72563j39501o5829K4884J14525J96504
7360A715492K72186L42115M00024M34282M35504M04871L56774L11684K81775K59280
7350E213987K18478J32402p460j83836l63958n18238o32163p03738p32397p11693
$$ y = [8202815, 8441266, 8574304, 8612608, 8582765, 8513684, 8424654, 8320422, 8193650, 8031509, 7823361, 7567507, 7273871, 6959242, 6636149, 6303328, 5946639, 5550854, 5112216, 4640152, 4146266, 3630451, 3076546, 2461696, 1772514, 1016434, 220936, -577686, -1347263, -2065515, -2716637, -3284634, -3750986, -4098418, -4315907, -4399998, -4352658, -4179639, -3891687, -3507039, -3051763, -2555815, -2045530, -1536318, -1030551, -523034, -11198, 496194, 976308, 1395699, 1717950, 1913685, 1971402, 1905620, 1757472, 1584909, 1445408, 1379579, 1404463, 1518988, 1715492, 1987678, 2329793, 2729817, 3164099, 3599603, 4004474, 4361248, 4672932, 4954707, 5213987, 5432465, 5564867, 5557407, 5373571, 5009613, 4491375, 3859212, 3155474, 2423077, 1711384]
7340A711384o32305m90731k94806o3181J77570L95333N56556O34594O19758N25449
7330C139621L87215K54936J79247J94540L04712M79597O65087Q01669Q42510P64733
7320H013867N71747K87352n5178m23504p91387j138038j444912j693215j863789
7311A462943j940142j914424j793586j600737j369081j131201r09532p11563n29685
7302a0437008l45049j36050J09397L83098O54709Q81694J026051J068076J010296
7293e784786Q72000O80803M67434K64840J07692K7952M6561J65284L63555O02381
7283b186284Q34198J014752J111990J109126J003696Q07216N46621K63108L868
7274D508291j90765k96945l09193k37607j05439N3043J98594K97868L33717L08041
$$ y = [1711384, 1079079, 588348, 293542, 230361, 407931, 803264, 1359820, 1994414, 2614172, 3139621, 3526836, 3781772, 3961019, 4155559, 4460271, 4939868, 5604955, 6406624, 7249134, 8013867, 8585614, 8872966, 8817788, 8394284, 7602897, 6464859, 5019947, 3326732, 1462943, -477199, -2391623, -4185209, -5785946, -7155027, -8286228, -9195760, -9907323, -10437008, -10782057, -10918107, -10808710, -10425612, -9770903, -8889209, -7863158, -6795082, -5784786, -4912786, -4231983, -3764549, -3499709, -3392017, -3364065, -3317504, -3152220, -2788665, -2186284, -1352086, -337334, 774656, 1883782, 2887478, 3694694, 4241315, 4504423, 4508291, 4317526, 4020581, 3711388, 3473781, 3368342, 3421385, 3619979, 3917847, 4251564, 4559605]
7264D559605K36220J38754L6431n0402j03690j14615r1893o1850n5272q8115j50509
7253D254664k12854k44064k28257j69279q3024J3789J09291J94200K56806K82413
7243D173685K58948J83875O5789q1391k47973m35058o52144r05067j181393j445184
7233b65913j647659j747803j729019j602565j399433j157620r09745o73689m49754
7224a1583200k26990M289K41807M68758O59304P87548Q35550P98277O85265N19502
7214f809890L33649J63062L6210l3309m7506j6435N1135J50338K74406M07343
7204e490997N23379N94757O02373N42889M29960K90728J59374O9145M4648R6141
7194b137603K16478L81313N54545P00155P96288Q42537Q54918Q52830Q47472Q37152
$$ y = [4559605, 4795825, 4934579, 4971010, 4920608, 4816918, 4702303, 4610410, 4548560, 4493288, 4405173, 4254664, 4041810, 3797746, 3569489, 3400210, 3317186, 3330975, 3440266, 3634466, 3891272, 4173685, 4432633, 4616508, 4682297, 4600906, 4352933, 3917875, 3265731, 2360664, 1179271, -265913, -1913572, -3661375, -5390394, -6992959, -8392392, -9550012, -10459757, -11133446, -11583200, -11810190, -11805901, -11564094, -11095336, -10436032, -9648484, -8812934, -8014657, -7329392, -6809890, -6476241, -6313179, -6276969, -6310278, -6357784, -6374219, -6323084, -6172746, -5898340, -5490997, -4967618, -4372861, -3770488, -3227599, -2797639, -2506911, -2347537, -2278392, -2233744, -2137603, -1921125, -1539812, -985267, -285112, 511176, 1353713, 2208631, 3061461, 3908933, 4746085]
7184D746085Q08232P40061O14289M26823J95717m1159k37791l54465l68793k80744
7174F248255j11965R8411K99145M34355M56694L45684J21306j59235m23249o11148
7164F698253o97348o96075o52366o22661o52442p60408r35337j143776j341913
$$ y = [4746085, 5554317, 6294378, 6908667, 7335490, 7531207, 7490048, 7252257, 6897792, 6528999, 6248255, 6136290, 6234701, 6533846, 6968201, 7424895, 7770579, 7891885, 7732650, 7309401, 6698253, 6000905, 5304830, 4652464, 4029803, 3377361, 2616953, 1681616, 537840, -804073]
$$ [...]
##END NTUPLES=NMR SPECTRUM
##END=
