##TITLE=31Pdec_SR75_DMSO
 DMSO-d6, 24 sc
 13.5.2022
##JCAMPDX= 6.0         $$ Bruker NMR JCAMP-DX V2.0
##DATA TYPE= NMR SPECTRUM
##DATA CLASS= NTUPLES
##ORIGIN= UXNMR, Bruker Analytische Messtechnik GmbH
##OWNER= root
$$ XWIN-NMR		Version 3.5
$$ Fri May 13 13:57:24 2022 Russian Standard Time (UT+4h)  she@DPX200
##.OBSERVE FREQUENCY= 81.013821
##.OBSERVE NUCLEUS= ^31P
##.ACQUISITION MODE= SIMULTANEOUS
##.ACQUISITION SCHEME= undefined
##.AVERAGES= 26
##.DIGITISER RES= 16
##SPECTROMETER/DATA SYSTEM= spect
##.PULSE SEQUENCE= zgpg30
##.SOLVENT NAME= CDCl3
##.SHIFT REFERENCE= (INTERNAL, CDCl3, 0, 248.564)
##AUDIT TRAIL= $$ (NUMBER, WHEN, WHO, WHERE, WHAT)
$$ ##TITLE= Audit trail, XWIN-NMR		Version 3.5
$$ ##JCAMPDX= 5.01
$$ ##ORIGIN= Bruker BioSpin GmbH
$$ ##OWNER= she
$$ F:/spectra/data/she/nmr/P31/1/pdata/1/auditp.txt
$$ ##AUDIT TRAIL=  $$ (NUMBER, WHEN, WHO, WHERE, WHAT)
(   1,<2022-05-13 13:55:00.51 +0400>,<she>,<DPX200>,
      <created by zg, POWCHK disabled, PULCHK disabled
       terminated by command 'halt'
       configuration hash MD5:
       00 E9 B6 7A A2 85 ED C7 34 08 36 98 17 FE 4E 26
       data hash MD5: 32K
       E7 62 CA 1C 41 49 08 A6 9C A6 4B 97 C5 2F 60 A4>)
(   2,<2022-05-13 13:55:07.23 +0400>,<she>,<DPX200>,
      <Start of raw data processing
       efp BC_mod = 2 LB = 1 FT_mod = 6 PKNL = 1 PHC0 = -10011.85 PHC1 = 412.4539 SI = 64K 
       data hash MD5: 64K
       68 A4 FB FF AF CF 1A 4F 1C DB 5D 2A 68 C1 B5 70>)
(   3,<2022-05-13 13:55:26.76 +0400>,<she>,<DPX200>,
      <pk PHC0 = -31.43933 PHC1 = 0 
       data hash MD5: 64K
       CD 62 0C 68 42 0F E8 1B 41 F2 FD EA B5 90 A3 BD>)
(   4,<2022-05-13 13:55:29.71 +0400>,<she>,<DPX200>,
      <abs ABSG = 5 
       data hash MD5: 64K
       B1 85 CF 34 F7 2F 6D D5 B1 35 B3 B5 C0 10 6C 94>)
$$ ##END=
$$ 
$$ hash MD5
$$ DC B8 40 F7 C5 24 95 B8 E2 D5 1A 52 25 8F 77 E9
##$RELAX= 
##$RELAX= 
##$RELAX= 
##$RELAX= 
##$RELAX= 
##$RELAX= 
##$RELAX= 
##$RELAX= 
$$ Bruker specific parameters
$$ --------------------------
##$DU= <F:/spectra>
##$EXPNO= 1
##$NAME= <P31>
##$PROCNO= 1
##$TYPE= <nmr>
##$USER= <she>
##$AMP= (0..31)
100 100 100 100 100 100 100 100 100 100 100 100 100 100 100 100 100 100 
100 100 100 100 100 100 100 100 100 100 100 100 100 100 
##$AQSEQ= 0
##$AQ_mod= 1
##$AUNM= <au_zg>
##$AUTOPOS= <>
##$BF1= 81.014009
##$BF2= 200.13
##$BF3= 200.13
##$BF4= 200.13
##$BF5= 200.13
##$BF6= 200.13
##$BF7= 200.13
##$BF8= 200.13
##$BYTORDA= 1
##$CFDGTYP= 0
##$CFRGTYP= 5
##$CHEMSTR= <none>
##$CNST= (0..31)
1 1 145 1 1 1 1 1 1 1 1 1 1 1 1 1 1 1 1 1 1 1 1 1 1 1 1 1 1 1 1 1 
##$CPDPRG= <waltz16>
##$CPDPRG1= <>
##$CPDPRG2= <waltz16>
##$CPDPRG3= <>
##$CPDPRG4= <mlev>
##$CPDPRG5= <mlev>
##$CPDPRG6= <mlev>
##$CPDPRG7= <mlev>
##$CPDPRG8= <mlev>
##$CPDPRGB= <>
##$CPDPRGT= <>
##$D= (0..31)
0 1 0 0 0 0 0 0 0 0 0 0.03 2e-05 3e-06 0 0 0 0 0 0 0 0 0 0 0 0 0 0 0 0 
0 0 
##$DATE= 1652435700
##$DBL= (0..7)
120 120 120 11 120 120 24 19 
##$DBP= (0..7)
150 150 150 150 150 150 150 150 
##$DBP07= 0
$$ [...]
##$SUBNAM3= <"">
##$SUBNAM4= <"">
##$SUBNAM5= <"">
##$SUBNAM6= <"">
##$SUBNAM7= <"">
##$SUBNAM8= <"">
##$SUBNAM9= <"">
##$SW= 501.771253377433
##$SWIBOX= (0..15)
0 1 3 0 0 0 0 0 0 0 0 0 0 0 0 0 
##$SW_h= 40650.406504065
##$TD= 32768
##$TD0= 1
##$TE= 0
##$TE2= 300
##$TE3= 300
##$TEG= 300
##$TL= (0..7)
0 120 53 12 22 120 120 120 
##$TP= (0..7)
150 150 150 150 150 150 150 150 
##$TP07= 0
##$TPNAME0= <>
##$TPNAME1= <>
##$TPNAME2= <>
##$TPNAME3= <>
##$TPNAME4= <>
##$TPNAME5= <>
##$TPNAME6= <>
##$TPNAME7= <>
##$TPOAL= (0..7)
0.5 0.5 0.5 0.5 0.5 0.5 0.5 0.5 
##$TPOFFS= (0..7)
0 0 0 0 0 0 0 0 
##$TUNHIN= 0
##$TUNHOUT= 0
##$TUNXOUT= 0
##$USERA1= <user>
##$USERA2= <user>
##$USERA3= <user>
##$USERA4= <user>
##$USERA5= <user>
##$V9= 5
##$VALIST= <valist>
##$VCLIST= <CCCCCCCCCCCCCCC>
##$VD= 0
##$VDLIST= <DDDDDDDDDDDDDDD>
##$VPLIST= <PPPPPPPPPPPPPPP>
##$VTLIST= <TTTTTTTTTTTTTTT>
##$WBST= 1024
##$WBSW= 4
##$XGAIN= (0..3)
0 0 0 0 
##$XL= 0
##$YL= 0
##$YMAX_a= 2860
##$YMIN_a= -2898
##$ZGOPTNS= <>
##$ZL1= 120
##$ZL2= 120
##$ZL3= 120
##$ZL4= 120
##$ABSF1= 248.5645
##$ABSF2= -253.2056
##$ABSG= 5
##$ABSL= 3
##$ALPHA= 0
##$AQORDER= 0
##$ASSFAC= 0
##$ASSFACI= 0
##$ASSFACX= 0
##$ASSWID= 0
##$AUNMP= <proc_1d>
##$AZFE= 0.1
##$AZFW= 0.5
##$BCFW= 0
##$BC_mod= 2
##$BYTORDP= 0
##$COROFFS= 0
##$CY= -3
##$DATMOD= 1
##$DC= 0
##$DFILT= <>
##$DTYPP= 0
##$F1P= 0
##$F2P= 0
##$FCOR= 1
##$FTSIZE= 65536
##$FT_mod= 6
##$GAMMA= 0
##$GB= 0
##$INTBC= 1
##$INTSCL= 5.30512e-09
##$ISEN= 30
##$LB= 1
##$LEV0= 0
##$LPBIN= 0
##$MAXI= 10000
##$MC2= 0
##$MEAN= 0
##$ME_mod= 0
##$MI= 50
##$NCOEF= 0
##$NC_proc= -8
##$NLEV= 6
##$NOISF1= 182.463
##$NOISF2= 159.3651
##$NSP= 0
##$NTH_PI= 0
##$NZP= 0
##$OFFSET= 248.5645
##$PC= 4
##$PHC0= -10043.29
##$PHC1= 412.4539
##$PH_mod= 1
##$PKNL= yes
##$PPARMOD= 0
##$PSCAL= 0
##$PSIGN= 0
##$REVERSE= no
##$SF= 81.014009
##$SI= 65536
##$SIGF1= 159.3651
##$SIGF2= -187.1042
##$SINO= 113.3802
##$SIOLD= 16384
##$SREGLST= <1H.CDCl3>
##$SSB= 0
##$STSI= 65536
##$STSR= 0
##$SW_p= 40650.406504065
##$SYMM= 0
##$S_DEV= 0
##$TDeff= 32768
##$TDoff= 0
##$TI= <>
##$TILT= no
##$TM1= 0
##$TM2= 0
##$TOPLEV= 0
##$USERP1= <user>
##$USERP2= <user>
##$USERP3= <user>
##$USERP4= <user>
##$USERP5= <user>
##$WDW= 1
##$XDIM= 65536
##$YMAX_p= 594971229
##$YMIN_p= -246003203
$$ End of Bruker specific parameters
$$ ---------------------------------
##NTUPLES= NMR SPECTRUM
##VAR_NAME=  FREQUENCY,     SPECTRUM/REAL,   SPECTRUM/IMAG
##SYMBOL=    X,             R,               I
##VAR_TYPE=  INDEPENDENT,   DEPENDENT,       DEPENDENT
##VAR_FORM=  AFFN,          ASDF,            ASDF
##VAR_DIM=   65536,         65536,           65536
##UNITS=     HZ,            ARBITRARY UNITS, ARBITRARY UNITS
##FACTOR=    0.620285442955139, 1,           1
##FIRST=     20137.2065510759, 0,            0
##LAST=      -20513.1999529892, 0,           0
##MIN=       -20513.1999529892, -246003203,  0
##MAX=       20137.2065510759, 594971229,    0
$$ Real data points
##PAGE= N=1
##DATA TABLE= (X++(R..R)), XYDATA
$$ [...]
41405G383651j330441k367037K43564J20230k925676l504947q80460j62848k884042
$$ 7383651 6053210 3686173 3929737 4049967 1124291 -2380656 -3261116 -3423964 -6308006
41396f308006m099428q62393L110684M079055L681523M161601L439002n23348
$$ -6308006 -10407434 -11269827 -8159143 -4080088 -398565 3763036 7202038 6678690
41388F678690m433130l792034J44848K212207P08553j172054m79523K369495N057476
$$ 6678690 2245560 -1546474 -1401626 810581 1519134 347080 -132443 2237052 7294528
41379G294528N136241J195484m856751p645499l824056K691836M472271k13445
$$ 7294528 12430769 13626253 8769502 1124003 -2700053 -8217 4464054 4250609
41371D250609n334713n094369o57442K859102L208369J954060L09962k360033
$$ 4250609 -1084104 -6178473 -6835915 -3976813 -768444 1185616 1495578 -864455
41363h64455n655128o772253l728700J585299N359611O112459N333320M443945
$$ -864455 -6519583 -13291836 -17020536 -15435237 -10075626 -3963167 1370153 5814098
41355E814098L173973J083253j296801l391846m911069m877206k508609L98374
$$ 5814098 8988071 10071324 8774523 5382677 471608 -4405598 -6914207 -6515833
41347f515833P44754j201356j757246n9956n6604l140735l633904K773699R893133
$$ -6515833 -5771079 -6972435 -8729681 -8789637 -8846241 -11986976 -15620880 -12847181 -2954048
41338b954048Q033007j468150p149899l498316K296934K317409j203592j742673
$$ -2954048 5078959 3610809 -3539090 -7037406 -4740472 -2423063 -3626655 -5369328
41330e369328R63154K265727O90680j056004j127383j33992Q23669N63080j793914
$$ -5369328 -4406174 -2140447 -1449767 -2505771 -3633154 -3767146 -2943477 -2380397 -4174311
41321d174311m284997k806654K774228O609175M552150K92114o14301O73276o67190
$$ -4174311 -8459308 -11265962 -8491734 -1882559 2669591 2961705 2347404 3020680 2353490
41312B353490m074114m260503j61311L132285K151781m61503p08361J514628L460656
$$ 2353490 -1720624 -5981127 -6142438 -3010153 -858372 -1319875 -2028236 -513608 2947048
41303B947048L024176J57699l168636m215756k392480k19880L50548P79871K623292
$$ 2947048 5971224 6128923 2960287 -1255469 -3647949 -3867829 -3517281 -2737410 -114118
41294a14118L889567K425246M43567R47605J877171m57034l909408l317009J14734
$$ -114118 3775449 6200695 6644262 7591867 9469038 9012004 5102596 1785587 1900321
41285A900321Q7376l635941l918943J490386N047060J400454l498683j919874
$$ 1900321 1987697 -1648244 -5567187 -4076801 970259 2370713 -1127970 -3047844
41277c047844L173074L247811k109306n266388k785158O55185J041581L98581
$$ -3047844 125230 3373041 1263735 -4002653 -6787811 -6132626 -5091045 -4692464
41269d692464J312874K122096P64220r99408p97553J0610j073544k722046j327099
$$ -4692464 -3379590 -1257494 -493274 -1492682 -2290235 -2279625 -3353169 -6075215 -7402314
41260g402314K941765N191426K043114l454475n042025o68745N001755N902189
$$ -7402314 -4460549 730877 2773991 -680484 -5722509 -6391254 -1389499 4512690
41252D512690J314126l691266m272157j046104J391998M38591j524578p65305
$$ 4512690 5826816 2135550 -2136607 -3182711 -1790713 -1352122 -2876700 -3642005
41244c642005K279123L123200n55368m874461m210992J232596N495943M851547
$$ -3642005 -1362882 1760318 1204950 -3669511 -7880503 -6647907 -1151964 3699583
41236C699583K156386J454208J861553L78514j930000j502071J040995J161235
$$ 3699583 5855969 7310177 9171730 9550244 7620244 6118173 7159168 8320403
41228H320403k088165l995971j532732J907506K149483O96378J409539L427272
$$ 8320403 6232238 2236267 703535 2611041 4760524 5456902 6866441 10293713
41220A0293713K325862k480585o142728m930058q36206J830388J867055J239747
$$ 10293713 12619575 10138990 3996262 -933796 -1770002 60386 1927441 3167188
41212C167188J270036J003642o64291k799772l306944j668585J76167K62588q02617
$$ 3167188 4437224 5440866 4776575 1976803 -1330141 -2998726 -2822559 -2559971 -3362588
41203c362588q64517M93541J444259J070209J003566K558790L869282K037378
$$ -3362588 -4227105 -3733564 -2289305 -1219096 -215530 2343260 6212542 8249920
41195H249920k517019o016305n780015l014652o87348l9519j00083K38242Q64647
$$ 8249920 5732901 -283404 -6063419 -9078071 -9765419 -9804938 -9905021 -9666779 -8802132
41186h802132J190121J362940J964476K534262J438844j780993m523886l340541
$$ -8802132 -7612011 -6249071 -4284595 -1750333 -311489 -2092482 -6616368 -9956909
41178i956909J575101N777858N478411J722209j542915k196644j039910N78203
$$ -9956909 -8381808 -2603950 2874461 4596670 3053755 857111 -182799 395404
41170C95404J784801J404960j075188l556887l051436o7593J502201J43625o92737
$$ 395404 2180205 3585165 2509977 -1046910 -4098346 -4165939 -2663738 -2520113 -3212850
41161c212850J821980M574804K700162k486844m533875j044776K830165J861778
$$ -3212850 -1390870 3183934 5884096 3397252 -1136623 -2181399 648766 2510544
41153B510544k187117l763792j034853K942161M754319L381208k45892l633052
$$ 2510544 323427 -3440365 -4475218 -1533057 3221262 6602470 6356578 2723526
41145B723526l818542p40460J738212Q53897q11558L45180K394479P78306l292978
$$ 2723526 -1095016 -1835476 -97264 756633 -54925 290255 2684734 3463040 170062
41136A70062l733123M41131K831896k1618k614814N80301N580142M680196j523198
$$ 170062 -3563061 -3121930 -290034 -311652 -2926466 -2346165 3233977 7914173 6390975
41127F390975m877361j457703L750581M681739J534755j522928k357850k273641
$$ 6390975 1513614 55911 3806492 8488231 10022986 8500058 6142208 3868567
41119C868567l103305m483283l919338N6962M708019N238743J399551j112125
$$ 3868567 765262 -3718021 -7637359 -7580397 -2872378 2366365 3765916 2653791
41111B653791J375679M419859J907821l960510n315674n15919L322116J055621
$$ 2653791 4029470 8449329 10357150 6396640 1080966 565047 3887163 4942784
41103D942784l368444l602833O1056K384709R65456j663877k392707q84831J037082
$$ 4942784 1574340 -2028493 -1967437 417272 1382728 -281149 -2673856 -3558687 -2521605
41094b521605J459140K9304j627892j669106k71714R86960J563419J825949J033150
$$ -2521605 -1062465 -1033161 -2661053 -4330159 -4601873 -3614913 -2051494 -225545 807605
41085H07605j616348l899957k216956K615196M943956J735373k854306l185942
$$ 807605 -808743 -4708700 -6925656 -4310460 633496 2368869 -485437 -3671379
41077c671379K11533K134581L00277k154242j607152J480832L734570L051188
$$ -3671379 -3459846 -1325265 -1024988 -3179230 -4786382 -3305550 429020 3480208
41069C480208O83455o21913j86359l04945k734732n291403m200170L49046L821677
$$ 3480208 4163663 3541750 3355391 3050446 315714 -4975689 -9175859 -8826813 -5005136
41060e005136L235366N87362r74073j473646k277652k450349k80780K820920L494886
$$ -5005136 -1769770 -1182408 -2156481 -3630127 -5907779 -8358128 -8638908 -5817988 -2323102
41051b323102J450757J11986J360331K461210K74502l356362l532905N38704L685186
$$ -2323102 -872345 -760359 599972 3061182 3335684 -20678 -3553583 -3014879 670307
41042F70307J839069j849179j532333K273374L160764j173282m932497k946102
$$ 670307 2509376 660197 -872136 1401238 4562002 3388720 -1543777 -4489879
41034d489879J542848K259906o81295k179216m94954J602590K619440L425989
$$ -4489879 -2947031 -687125 -1368420 -3547636 -4042590 -2440000 179440 3605429
41026C605429L274602N66332k566331k229891N74906J199685n93823n46838J357325
$$ 3605429 6880031 7446363 4880032 2650141 3225047 4424732 3830909 3284071 4641396
41017D641396j64238n576842p363221j488680N054426M230987j105875k300894
$$ 4641396 4477158 -1099684 -8462905 -9951585 -4897159 -666172 -1772047 -4072941
41009d072941J863383M440552J302038l781056n339511k685748P94770K010962
$$ -4072941 -2209558 2230994 3533032 -248024 -5587535 -8273283 -7478513 -5467551
41001e467551J138271J183055L818785N720496K129276n175705q070243k807231
$$ -5467551 -4329280 -3146225 672560 6393056 8522332 3346627 -4723616 -7530847
40993g530847M136169M965084J153177k21775K230881K920418j339813o241922
$$ -7530847 -3394678 1570406 2723583 2501808 4732689 7653107 6313294 71372
40985G1372n711869M22473O077802N417891o17289m872193k455442K667722L103719
$$ 71372 -5640497 -5218024 859778 6277669 5660380 788187 -1667255 1000467 4104186
40976D104186j102233k873001L28993K698082K92335k614385j666137L89736J72015
$$ 4104186 3001953 128952 457945 3156027 3448362 833977 -832160 -442424 -270409
40967b70409L06347K909101L190712k278227o903442l163119M372612N490163
$$ -270409 35938 2945039 6135751 3857524 -3045918 -6209037 -1836425 3653738
40959C653738L84641j805838J343040K899760j81170k302050J768K124608k72293
$$ 3653738 4038379 2232541 3575581 6475341 6294171 3992121 3993889 6118497 5846204
40950E846204m454113n529330k561840K326563O057841N217812j52812l848215
$$ 5846204 1392091 -4137239 -6699079 -4372516 1685325 6903137 6750325 2902110
40942B902110o82102M793422M181659j499990l644123n99282L90937k927652l537865
$$ 2902110 2220008 7013430 11195089 9695099 6050976 5451694 5842631 2914979 -622886
40933f22886J626510N187490J564972l876762m200024j038956J004271K256756
$$ -622886 1003624 6191114 7756086 3879324 -320700 -1359656 -355385 1901371
40925A901371L563681J516058m452837p026681j238493N997324N132117j805374
$$ 1901371 5465052 6981110 2528273 -4498408 -5736901 260423 5392540 3587166
40917C587166m897772r47526L988821M685514J837339j855327m401037m084353
$$ 3587166 -1310606 -2258132 1730689 6416203 8253542 6398215 1997178 -2087175
40909b087175j216441R09891N34333K87895J923942K287466p14592k725716L91576
$$ -2087175 -3303616 -2393725 -1859392 -1571497 352445 2639911 1925319 -800397 -408821
40900d08821M690572L840655q64438l417524k784326k062148r99209K250430M351322
$$ -408821 4281751 8122406 7257968 3840444 1056118 -1006030 -2005239 245191 4596513
40891D596513R01457m227042l292074K213834L093813k320253n298786j582644
$$ 4596513 5497970 1270928 -2021146 192688 3286501 966248 -4332538 -5915182
40883e915182J719313j101468m562154j855934L488486L997249M96285o74006
$$ -5915182 -4195869 -5297337 -9859491 -11715425 -8226939 -4229690 -3733405 -4407411
40875d407411J140987J218249j012169j264904R72616J119870j784982k435894
$$ -4407411 -3266424 -2048175 -3060344 -4325248 -3352632 -2232762 -4017744 -6453638
40867f453638J609058M588828J129700m701770n052216l0420L127949J656830
$$ -6453638 -4844580 -255752 873948 -3827822 -8880038 -8910458 -5782509 -4125679
40859d125679M69200K423570L089682o45641l575153l62778M440059L029081k210762
$$ -4125679 -3656479 -1232909 1856773 1211132 -2364021 -2726799 1713260 4742341 2531579
40850B531579j913234M304903O110986p62606o721791l028251M655407N341967
$$ 2531579 618345 4923248 11034234 10271628 3549837 521586 5176993 10518960
40842A0518960j133689n749692l992542M23327L039237K391150j821436p377444
$$ 10518960 9385271 3635579 -356963 66364 3105601 5496751 3675315 -3702129
40834c702129q139257r57221P534705Q036498J235330l868843l142312p91683
$$ -3702129 -11841386 -12798607 -5263902 2772596 4007926 139083 -3003229 -3794912
40826c794912J9257J210082L045498J929711k104022l285847P20194M229601K453929
$$ -3794912 -3775655 -2565573 479925 2409636 305614 -2980233 -2260039 1969562 4423491
40817D423491j013749p04019J829773J493131j535836k619996n45798R97818l72464
$$ 4423491 3409742 2705723 4535496 6028627 4492791 1872795 1326997 2324815 1952351
40808A952351k501526k513598q13691J21915n47722r95014M54062K339624J568604
$$ 1952351 -549175 -3062773 -3876464 -3754549 -4302271 -5297285 -4843223 -2503599 -934995
40799i34995j606099k597494J213672N500745M233255j390769m078968n93660
$$ -934995 -2541094 -5138588 -3924916 1575829 5809084 4418315 339347 -254313
40791b54313M163717M530325J060140k120291l255770l374540l165421k262655
$$ -254313 3909404 8439729 9499869 7379578 4123808 749268 -2416153 -4678808
40783d678808o14998J168159K294900K056794M27316j578043k872425k913360
$$ -4678808 -5293806 -4125647 -1830747 226047 653363 -924680 -3797105 -6710465
40775f710465q56074L553107O894048L812852m749914r391951l860944N001365
$$ -6710465 -7566539 -4013432 2880616 6693468 1943554 -7448397 -11309341 -6307976
40767f307976O246403O39040j778270J663615L138192r89075l878266p05065L055383
$$ -6307976 -61573 577467 -1200803 462812 3601004 2611929 -1266337 -1971402 1083981
40758A083981J839225o30388O42475K415999j61898l907857l211427r2984P5111
$$ 1083981 2923206 2292818 2935293 5351292 5189394 1281537 -1929890 -2022874 -1947763
40749a947763j455589j59740K001333j35119m143777k660374L647389N765013
$$ -1947763 -3403352 -3563092 -1561759 -1696878 -5840655 -8501029 -4853640 911373
40741I11373M33602m587066k473377L193287N275640L416182K270199L052631
$$ 911373 1344975 -3242091 -5715468 -2522181 2753459 6169641 8439840 11492471
40733A1492471K229207k112514o420042n574659L50221M932802K705607l143205
$$ 11492471 13721678 11609164 5189122 -385537 -35316 4897486 7603093 4459888
40725D459888m074710J864712O411084K679264m679222o501286k242184J140304
$$ 4459888 385178 2249890 8660974 11340238 6661016 159730 -2082454 -942150
40717i42150Q99646Q02384K259077J674624j777412l415162r99481J168210k07762
$$ -942150 -42504 759880 3018957 4693581 2916169 -498993 -1498474 -330264 -538026
40708e38026j517302J439272N614337M609635j813432p044446o072994j085915
$$ -538026 -2055328 -616056 4998281 9607916 7794484 750038 -5322956 -6408871
40700f408871K049820R19069j133722J05203L589039M113922J98849k748362k03479
$$ -6408871 -4359051 -3439982 -4573704 -4468501 -879462 3234460 3433309 684947 481468
40691D81468M015069L253777j417836k928452J97013J541289k435109o564242
$$ 481468 4496537 7750314 6332478 3404026 3601039 5142328 2707219 -3857023
40683c857023n200938l59811K385498J474991j063812l481056l880508P8542O763145
$$ -3857023 -9057961 -9417772 -7032274 -5557283 -6621095 -10102151 -13982659 -13904117 -7140972
40674g140972R419245M228231l264327m696300J98367M225741K976995o91774
$$ -7140972 2278273 6506504 3242177 -1454123 -1255756 2969985 5946980 5255206
40666E255206k376143j688854p90054m70390L97899K545343M511734L558787r79291
$$ 5255206 2879063 1190209 400155 -70235 327664 2873007 7384741 10943528 9964237
40657I964237n729972o560648l760941j351175j048193m48823J881292L670713
$$ 9964237 4234265 -2326383 -6087324 -7438499 -8486692 -8935515 -7054223 -3383510
40649c383510L197188K123138J616099l4690k895456l235492J0776J513151k277379
$$ -3383510 -186322 1936816 3552915 3518225 622769 -2612723 -2601947 -1088796 -3366175
40640c366175n804501k243373M959631O722259K428429J28984K740787L742664
$$ -3366175 -9170676 -11414049 -6454418 267841 2696270 2825254 5566041 9308705
40632I308705q92095n394168l579131J418469K635574l00364k193980p54596J377403
$$ 9308705 8416610 3022442 -556689 861780 3497354 3196990 1003010 248414 1625817
40623A625817J556895j86401k438050l222779p76393L735213N774141K586595
$$ 1625817 3182712 2996311 558261 -2664518 -3440911 294302 6068443 8655038
40615H655038k549597m088455j087585K407017K833307L39137k612641l453062
$$ 8655038 6105441 2016986 929401 3336418 6169725 6508862 3896221 443159
40607D43159j178926K008835J940638k307776n962652m246378R32624L590426
$$ 443159 -735767 1273068 3213706 905930 -5056722 -9303100 -8370476 -4780050
40599d780050J908949m33322r29822j366355l027014l375349k85435L664061M369176
$$ -4780050 -2871101 -3304423 -4234245 -5600600 -8627614 -12002963 -12288398 -8624337 -4255161
40590d255161J785344n30212k67556J673853L233840L180172J733649P09406J962724
$$ -4255161 -2469817 -3000029 -3267585 -1593732 1640108 4820280 6553929 7263335 9226059
40581I226059M339636M015308r4011l529531k165706J110833K16060m587879o612777
$$ 9226059 13565695 17581003 17486992 13957461 11791755 12902588 13118648 8530769 1917992
40572A917992k926184J351928J438244j13014R76955K975272J787700j133759
$$ 1917992 -1008192 343736 1781980 1668966 2645921 5621193 7408893 6275134
40564F275134j264875N75589m62745m054939m416191l29001K109454n06421l225063
$$ 6275134 5010259 5585848 5123103 1068164 -3348027 -3677028 -1567574 -2073995 -5299058
40555e299058j216400K437123K755701J198979J619819K317136n16386m394620
$$ -5299058 -6515458 -4078335 -1322634 -123655 1496164 3813300 3296914 -1097706
40547a097706l482573J397709L460109O26231j837652l21803K330995K793841
$$ -1097706 -4580279 -3182570 277539 903770 -933882 -1255685 1075310 3869151
40539C869151J826803P03939j231759l065816j847846J750269K723940l90758
$$ 3869151 5695954 6399893 5168134 2102318 254472 2004741 4728681 4337923
40531D337923k493753l46911J660111j062637n210224m737409k39892K896757
$$ 4337923 1844170 1497259 3157370 2094733 -3115491 -7852900 -8092792 -5196035
40523e196035K847584J830975N20804j846146l231619p64716L624975N044295
$$ -5196035 -2348451 -517476 3328 -1842818 -5074437 -5839153 -2214178 2830117
40515B830117K789478N73581N9542n24637j500774j024009L74684j0226j612036
$$ 2830117 5619595 6193176 6252718 5728081 4227307 3203298 3577982 3567756 1955720
40506A955720q82529J900275J994145j695052l822844j070757K132511P50003
$$ 1955720 1073191 2973466 4967611 3272559 -550285 -1621042 511469 1261472
40498A261472k555126j767389K665866M332334M95391m007955l608540R36820
$$ 1261472 -1293654 -3061043 -395177 3937157 4432548 424593 -3183947 -2247127
40490b247127M324249L600616J028856J34047O95625m45638l733128m968581j293743
$$ -2247127 2077122 5677738 6706594 6840641 7536266 7090628 3357500 -1611081 -2904824
40481b904824L257633K278829l717717p269967m013232J862726M210289K787723
$$ -2904824 352809 2631638 -1086079 -8356046 -12369278 -10506552 -6296263 -3508540
40473c508540J395701J425117J250648L64849K53119J370895K066760R58664j200383
$$ -3508540 -2112839 -687722 562926 927775 1180894 2551789 4618549 5577213 4376830
40464D376830k398465j476429N77036J414680n2289k214266k877309j916776l03425
$$ 4376830 1978365 501936 1078972 2493652 2441363 227097 -2650212 -4566988 -4870413
40455d870413J977379M353102L790807j216181n873320l836621L117993O357273
$$ -4870413 -2893034 1460068 5250875 4034694 -1838626 -5675247 -2557254 3800019
40447C800019K661521j431056l31609K393224J158899k364520l195335j596184
$$ 3800019 6461540 5030484 4698875 7092099 8250998 5886478 2691143 1094959
40439A094959j099294j498040n27399K49315j776818l686736o62438M876389N424132
$$ 1094959 -4335 -1502375 -2029774 -1780459 -3557277 -7244013 -7906451 -3030062 2394070
40430B394070p4438m221835k136522K321180L630502J929481J46633j158064k416699
$$ 2394070 2319632 -1902203 -4038725 -1717545 1912957 3842438 3989071 2831007 414308
40421D14308k332386k97407J118605m40943l010410k661390J013359M367496M416498
$$ 414308 -1918078 -2215485 -1096880 -1537823 -4548233 -7209623 -6196264 -1828768 2587730
40412B587730K150926O62096R95200J068256p67745k382467m99051L510282M078411
$$ 2587730 4738656 5400752 6395952 7464208 6696463 4313996 3814945 7325227 11403638
40403A1403638q48380o272860o851636l492027o8535K416202M052526K581373
$$ 11403638 10555258 4282398 -2569238 -6061265 -6129800 -3713598 338928 2920301
40395B920301k385122n227094j397534M101053L182710k427288l736749R46010
$$ 2920301 535179 -4691915 -6089449 -1988396 1194314 -1232974 -4969723 -4023713
40387d023713L913959J364084j425744p16419L709j124402K34802M784900M807780
$$ -4023713 -109754 1254330 -171414 -887833 -884124 -2008526 -1773724 3011176 7818956
40378G818956l352743j0420575o744970K956336P025101L716566L85150j94430
$$ 7818956 4466213 -5954362 -12699332 -9742996 -2717895 998671 1383821 1189391
40370A189391j576009l584964j721814K963561L637971q42759l454868o90186
$$ 1189391 -386618 -3971582 -5693396 -2729835 908136 65377 -3389491 -4079677
40362d079677J977128J41270k105340j36466K641295Q63607l088466k836735J373790
$$ -4079677 -2102549 -1961279 -4066619 -4203085 -1561790 -698183 -3786649 -6623384 -5249594
40353e249594L206510N76263j437876R23064M500610M529375J195530k157215
$$ -5249594 -2043084 -1466821 -2904697 -1981633 2518977 7048352 8243882 6086667
40345F086667m161112n231373m413239n16539M220115N445736K291765j326269
$$ 6086667 1925555 -3305818 -7719057 -8235596 -4015481 1430255 3722020 2395751
40337B395751j856576M2302J671093J633742k3975k210191k269575J508347N555943
$$ 2395751 539175 581477 2252570 3886312 3862337 1652146 -617429 890918 6446861
40328F446861L767680l000203n795993l96553M791401Q78671o751370o004274
$$ 6446861 10214541 7214338 1418345 1021792 5813193 6691864 -59506 -6063780
40320f063780K577748O284120M66107m597688j100121M127636K123578l530622
$$ -6063780 -3486032 2798088 3264195 -1333493 -2433614 1694022 3817600 286978
40312B86978l989114J44587J651304m24228q81971J238236J871018M37808N26438
$$ 286978 -3702136 -3557549 -1906245 -2330473 -3212444 -1974208 -103190 334618 861056
40303H61056K239288J736047j111338j921143K69810J096821j364234l142210
$$ 861056 3100344 4836391 3725053 1803910 2073720 3170541 1806307 -1335903
40295a335903j201893J541837J117732j568754k763189j073772J878054M020805
$$ -1335903 -2537796 -995959 121773 -1446981 -4210170 -5283942 -3405888 614917
40287F14917M080232J817447j365895l017565j889348Q03256K561747J740112
$$ 614917 4695149 6512596 5146701 2129136 239788 1043044 3604791 5344903
40279E344903r99868l022978k406542l19305Q63329J332362K663986L223442k25352
$$ 5344903 4345035 1322057 -1084485 -1403790 -540461 791901 3455887 6679329 6453977
40270F453977n269994m600271K701423P203084J967202o463735p149573k75112
$$ 6453977 1183983 -3416288 -714865 6488219 8455421 1991686 -5157887 -5432999
40262e432999M798018L950681J630542J002182J9860j942446j814895Q94245K336187
$$ -5432999 -634981 3315700 4946242 5948424 5968284 4025838 2210943 3105188 5441375
40253E441375P68630j096915j647846k452708l356352j416372L305809O285243
$$ 5441375 6210005 5113090 3465244 1012536 -2343816 -3760188 -454379 5830864
40245E830864M900118J477340j494313m177551n985265m668790p30401K054352
$$ 5830864 10730982 12208322 10714009 6536458 551193 -4117597 -4847998 -2793646
40237b793646K193854J914257J979869M78496j947916j671772J165423J608421
$$ -2793646 -599792 1314465 3294334 3772830 1824914 153142 1318565 2926986
40229B926986j831409l983159j341814K300099K385271L45560l67480o3686k29423
$$ 2926986 1095577 -2887582 -4229396 -1929297 455974 801534 434054 370368 140945
40220A40945K77053J847028J163487l431410p236423n021624J194063N023706
$$ 140945 417998 2265026 3428513 -2897 -7239320 -12260944 -11066881 -6043175
40212f043175M112967J206822j120936k371661k217298o99968O13000P69007J448161
$$ -6043175 -1930208 -723386 -1844322 -4215983 -6433281 -7133249 -6520249 -5751242 -4303081
40203d303081M026132O184415M514033n49660n010708n788656l143385L18857
$$ -4303081 -276949 5907466 10421499 9871839 4861131 -927525 -4070910 -3752053
40195c752053J778966O34683n79606M85352J976361M26050k773229k391786K019092
$$ -3752053 -1973087 -1338404 -1918010 -1432658 543703 969753 -1803476 -4195262 -2176170
40186b176170M217195P37012l258718j798472K884141M295708J275866j713195
$$ -2176170 2041025 2778037 -480681 -2279153 604988 4900696 6176562 4463367
40178D463367j803871k81871R42922J267817L94202j436323k752739k592743j879219
$$ 4463367 2659496 2377625 3320547 4588364 4982566 3546243 793504 -1799239 -3678458
40169c678458j470093o65575P60134J385627P51508N83725J645704K153244J051286
$$ -3678458 -5148551 -5814126 -5053992 -3668365 -2916857 -2333132 -687428 1465816 2517102
40160B517102k10462p89162j711049k368032k16750L720113M106382n69731m145515
$$ 2517102 2306640 1517478 -193571 -2561603 -2778353 941760 5048142 4478411 332896
40151C32896j513512L318458L190568j700870m868909k854193J609469M377226
$$ 332896 -1180616 2137842 5328410 3627540 -1241369 -4095562 -2486093 1891133
40143A891133L821987J096026q39845r6189Q42233j988014o708053o569069n15101
$$ 1891133 5713120 6809146 5969301 5873112 6715345 4727331 -1980722 -8549791 -9064892
40134i064892L926993K235360J5967K684544N409906J544405m988068n498385
$$ -9064892 -5137899 -2902539 -2886572 -202028 5207878 6752283 1764215 -3734170
40126c734170o37950J473662j136218k609815l47877J715290J329090R46681J489643
$$ -3734170 -4372120 -2898458 -4034676 -6644491 -6992368 -5277078 -3947988 -3001307 -1511664
40117a511664N11507k182548l503423k582782j573791p24996J584939M017684
$$ -1511664 -1000157 -3182705 -6686128 -9268910 -10842701 -11567697 -9982758 -5965074
40109e965074L436516P30587m13282m1925j037949k473878p95944K745630L175069
$$ -5965074 -2528558 -1797971 -2211253 -2253178 -3291127 -5765005 -6560949 -3815319 -640250
40100f40250M24919n16274J426537J847472p49208k462903j345850j14203m2904
$$ -640250 -215331 -731605 694932 2542404 1793196 -669707 -2015557 -2129760 -2172664
40091b172664Q37041K125644R47249j243300K92412M010415K393694n170766q918719
$$ -2172664 -1335623 790021 1737270 493970 786382 4796797 7190491 2019725 -6898994
40082f898994k894112N583784O580963Q33509l963374m423453k454204N13456
$$ -6898994 -9793106 -4209322 2371641 3205150 -758224 -5181677 -7635881 -7122425
40074g122425L774340M924785K752520J65760p1562K57315j349698l034956j655080
$$ -7122425 -3348085 1576700 4329220 4494980 4423418 4680733 3331035 296079 -1359001
40065a359001J709789L458335K583751O78399j019518j694075m91750J429804
$$ -1359001 350788 3809123 6392874 7071273 6051755 4357680 3865930 5295734
40057E295734J143025j414004k335377K38592K797940K149995M54565Q80257J950097
$$ 5295734 6438759 5024755 2689378 2927970 5725910 7875905 8330470 9210727 11160824
40048A1160824N69902k243250l109043j625978K5614J012935J772231J626654
$$ 11160824 11730726 9487476 6378433 4752455 4778069 5791004 7563235 9189889
40040I189889j97852k474053l510431l344779k472028n66609J578811J582061
$$ 9189889 8992037 6517984 3007553 -337226 -2809254 -3375863 -1797052 -214991
40032b14991p42683k017324k92334J608198O90468j223288n81590K242670L959628
$$ -214991 -957674 -2974998 -3267332 -1659134 -968666 -2191954 -2773544 -530874 3428754
40023C428754L260026J502031j08052j324444k034426k595118l635031m298639
$$ 3428754 6688780 8190811 8082759 6758315 4723889 2128771 -1506260 -5804899
40015e804899k810459J44459J405822l1149j480401r70428K40702Q24995J188290
$$ -5804899 -8615358 -8470899 -7065077 -7096226 -8576627 -9547055 -9306353 -8481358 -7293068
40006g293068Q91580j183259k766521J63239N721079O550768J018034l054901
$$ -7293068 -6401488 -7584747 -10351268 -10188029 -4466950 2083818 3101852 46951
39998D6951m05815L127376M89372m744737m580640L36841K983766K006590K047814
$$ 46951 -358864 2768512 3257884 -1486853 -6067493 -5730652 -2746886 -740296 1307518
39989A307518L549695J697314l868367o661792k888438K973759M624994J428182
$$ 1307518 4857213 6554527 2686160 -3975632 -6864070 -3890311 734683 2162865
39981B162865k487855l238933k08069L379444L030500j449868m431369j683319
$$ 2162865 -324990 -3563923 -3771992 -392548 2637952 1188084 -3243285 -4926604
39973d926604L114353L569154J61019j119309J390800K913437L59899l317747
$$ -4926604 -1812251 1756903 1917922 798613 2189413 5102850 5462749 2145002
39965B145002m367528k958542q66265J531828L911722M606643K478610j352014
$$ 2145002 -2222526 -5181068 -6047333 -4515505 -603783 4002860 6481470 5129456
39957E129456m384650m441913j276123K303748K660847K28694o26940J252818
$$ 5129456 744806 -3697107 -4973230 -2669482 -8635 220059 -406881 845937
39949H45937J069323l680761p067013l139623L493771L670448j985493l887348
$$ 845937 1915260 -1765501 -8832514 -11972137 -8478366 -4807918 -6793411 -10680759
39941a0680759J492691O672706N166604J11686k415451j669102J02885K322022
$$ -10680759 -9188068 -2515362 2651242 2762928 347477 -1321625 -1218740 1103282
39933A103282M131753K687603k191721n464074l097707K052784M180577J871589
$$ 1103282 5235035 7922638 5730917 266843 -2830864 -778080 3402497 5274086
39925E274086j578373k966692j504161J763636M393917L907904N38115k732109
$$ 5274086 3695713 729021 -775140 988496 5382413 9290317 9828432 7096323
39917G096323l846132l578299l177408k486073j136862P43924L430392O566680
$$ 7096323 3250191 -328108 -3505516 -5991589 -7128451 -6384527 -2954135 3612545
39909C612545P307428L061765l535511o400149l664947L66227J838688J505789
$$ 3612545 10919973 13981738 10446227 4046078 381131 747358 2586046 4091835
39901D091835R52290m16645k273480j928515R26935K168525o03449l516630j882386
$$ 4091835 5044125 4627480 2354000 425485 1352420 3520945 2917496 -599134 -2481520
39892b481520K786274N184181L420877J11917k032342k350109j216538L30911
$$ -2481520 304754 5488935 8909812 9021729 6989387 4639278 3422740 3753651
39884C753651R54685Q01277J305722J944851J3371m464140p020609m812677j074639
$$ 3753651 4708336 5509613 6815335 8760186 8773557 4309417 -2711192 -7523869 -8598508
39875h598508M6361j06787K040228N233227N003183J163420j666848j061447M70040
$$ -8598508 -8552147 -8658934 -6618706 -1385479 3617704 4781124 3114276 2052829 2522869
39866B522869M66400k7822N45543J215094L51307j599832k836560k317792l70337
$$ 2522869 2989269 2961447 3506990 4722084 5073391 3473559 636999 -1680793 -2051130
39857b051130J583881J668557n77119k874705k514834j37690Q81488o20639j572800
$$ -2051130 -467249 1201308 624189 -2250516 -4765350 -4903040 -4021552 -4642191 -6214991
39848f214991R10008M841345N414332J322581l188151l415605J48514K889895
$$ -6214991 -5304983 -463638 4950694 6273275 3085124 -330481 -181967 2707928
39840B707928K179287J51568k83932J85207q85024l040448l315790j061177Q12130
$$ 2707928 4887215 5038783 4754851 4940058 4055034 1014586 -2301204 -3362381 -2550251
39831b550251J35159j727423k435012j512663M80065L016576M491684K848962
$$ -2550251 -2415092 -4142515 -6577527 -8090190 -7610125 -4593549 -101865 2747097
39823B747097q44546k300054J34917K343282K58886l732326m124757k45802L431185
$$ 2747097 1902551 -397503 -262586 2080696 2339582 -1392744 -5517501 -5763303 -2332118
39814b332118L933951K315353q3335l170765n351009l906172K93088K583835J067316
$$ -2332118 1601833 3917186 3833851 663086 -4687923 -8594095 -8301007 -5717172 -4649856
39805d649856m97624J087998L255869K378310K74949R50851K936706R94539m598085
$$ -4649856 -5147480 -4059482 -803613 1574697 1849646 2800497 5737203 6731742 2133657
39796B133657o765103j836155M343280M441611j57918k309430l6406J417768j429396
$$ 2133657 -4631446 -6467601 -2124321 2317290 2159372 -150058 -186464 1231304 -198092
39787a98092m867416l829241Q39582M152082L677893J336547k40750l26678M27639
$$ -198092 -5065508 -8894749 -8055167 -3903085 -225192 1111355 870605 543927 971566
39778I71566Q86331k8350k029580l062438j717584M99160R90701l02863r44166
$$ 971566 1857897 1829547 -200033 -3262471 -4980055 -4480895 -3490194 -3793057 -4737223
39769d737223M79511K617182L269701J680716j108066l020782k282875P66296
$$ -4737223 -4257712 -1640530 1629171 3309887 2201821 -818961 -3101836 -2335540
39761b335540L429760L344775R91838j456652k725414k440952j16392L363532
$$ -2335540 1094220 4438995 5430833 3974181 1248767 -1192185 -1308577 2054955
39753B054955M518565R77269l986909m477718j28293K695740m58983n827223o521135
$$ 2054955 6573520 7550789 3563880 -913838 -1042131 1653609 1194626 -4632597 -11153732
39744a1153732j390444M468198O626143N413826L416674J905466O03526q97334
$$ -11153732 -12544176 -8075978 -1449835 3963991 7380665 9286131 9889657 8992323
39736H992323k600574m084906m374736k615508M65657K513142K027139N77616
$$ 8992323 6391749 2306843 -2067893 -4683401 -4217744 -1704602 322537 900153
39728I00153J064177L391903L757416j04853m641984m579360p00940O74422k920716
$$ 900153 1964330 5356233 9113649 9008796 4366812 -212548 -913488 -239066 -3159782
39719c159782n845292k617515L513859N173147J626840q73877J047369L587418
$$ -3159782 -9005074 -11622589 -8108730 -2935583 -1308743 -2182620 -1135251 2452167
39711B452167K555231o06719k042834r91266O54581J637423J664464M09480j598339
$$ 2452167 5007398 4400679 2357845 1366579 2021160 3658583 5323047 5732527 4134188
39702D134188k560645j628635k15163K40084L27633J159687K210002K015606R3213
$$ 4134188 1573543 -55092 -270255 -30171 297462 1457149 3667151 5682757 5775970
39693E775970k560191l919925k090531K069382L936748l895o019608o124574J086319
$$ 5775970 3215779 -704146 -2794677 -725295 3211453 3207558 -2812050 -8936624 -7850305
39684g850305P095772M322759l549031o898273l195523J161188J273367k65720
$$ -7850305 -754533 3568226 19195 -6879078 -10074601 -8913413 -7640046 -7905766
39676g905766N85615K679509K667012J117595J210628K862519K650732l12376
$$ -7905766 -7320151 -4640642 -1973630 -856035 354593 3217112 5867844 5555468
39668E555468k603538k042285j301461l121890m875751k218165L265327N210625
$$ 5555468 2951930 909645 -391816 -3513706 -8389457 -10607622 -7342295 -2131670
39660b131670J713892j686294k70750L258279L726093J185165n62905l58582K416
$$ -2131670 -417778 -2104072 -2374822 883457 4609550 5794715 5231810 4873228 4875644
39651D875644L4038O42359J139734L00651p48573n80698p26207k544921l089893
$$ 4875644 4909682 5552041 6691775 6992426 6243853 5663155 4936948 2392027 -697866
39642f97866K94290L423571N83518m851108l919430L194308N748365j013341p622622
$$ -697866 -403576 3019995 3603513 -1247595 -5167025 -1972717 3775648 2762307 -4860315
39633d860315m728426K668291L716629j447016l208028J769498O001903L178488
$$ -4860315 -9588741 -6920450 -3203821 -4650837 -7858865 -6089367 -87464 3091024
39625C091024k982095m707616l36808M529852M106129j149548n001535k580625
$$ 3091024 108929 -4598687 -4935495 -405643 3700486 2550938 -2450597 -5031222
39617e031222L247795N054085Q28588l220352j943841J377816J107076j516533
$$ -5031222 -1783427 3270658 4099246 878894 -1064947 312869 1419945 -96588
39609i6588j177991K182718L688049K188494J596676K894233J617821m085732
$$ -96588 -1274579 908139 4596188 6784682 8381358 11275591 12893412 8807680
39601H807680q526194n696755K028872O661293M430172p46435l141978j561095
$$ 8807680 281486 -5415269 -3386397 3274896 7705068 6958633 3816655 2255560
39593B255560Q50936J158407m61828j909949j964498j225095q03755j015758j309114
$$ 2255560 3106496 4264903 3803075 1893126 -71372 -1296467 -2100222 -3115980 -4425094
39584d425094p46847J208657L554497M006631J724882j028167j802671j472936
$$ -4425094 -5171941 -3963284 -408787 3597844 5322726 4294559 2491888 1018952
39576A018952k147844k754466p06633K562201K794614J37186n44823J842326K196533
$$ 1018952 -1128892 -3883358 -4589991 -2027790 766824 904010 359187 2201513 4398046
39567D398046j599860l754633N5919M469376K566413k578432k872934J288074
$$ 4398046 2798186 -956447 -900528 3568848 6135261 3556829 683895 1971969
39559A971969J872597l104643o167455k466099K948098L442846r8412k676718
$$ 1971969 3844566 739923 -5427532 -7893631 -4945533 -1502687 -1601099 -4277817
39551d277817k633130j299292Q96232L387722L374810n09245m104482k074597
$$ -4277817 -6910947 -8210239 -7314007 -3926285 -551475 -1060720 -5165202 -7239799
39543g239799L937630O093147P67541n520284l955066M419777Q894101K825164
$$ -7239799 -3302169 2790978 3558519 -1961765 -5916831 -1497054 7397047 10222211
39535A0222211o878823q298350m24881N678015K446481m204326m548716Q37265
$$ 10222211 3343388 -4954962 -5379843 298172 2744653 -1459673 -6008389 -5171124
39527e171124L311053l11592l992153k340006K315305M659555L303346N03898
$$ -5171124 -1860071 -2171663 -6163816 -8503822 -6188517 -1528962 1774384 2278282
39519B278282j444346j231805J203635L368669J784395k970347n273413j311983
$$ 2278282 833936 -397869 805766 4174435 5958830 2988483 -2284930 -3596913
39511c596913M882634N703578j35375n494427l926873J882134L833978n15639
$$ -3596913 1285721 6989299 6853924 1359497 -2567376 -685242 3148736 2633097
39503B633097m754309k872031K250873L378707o77508m378278m182824k126208
$$ 2633097 -2121212 -4993243 -2742370 636337 -41171 -4419449 -8602273 -10728481
39495a0728481k13401K577054N680204N289814N97003l479257l392494j818507
$$ -10728481 -10941882 -8364828 -2684624 2605190 3202193 -277064 -3669558 -5488065
39487e488065j635567o36591K820329M553298J356472j924207M59045N105444
$$ -5488065 -7123632 -7760223 -4939894 -386596 969876 -954331 -495286 4610158
39479D610158M750650J74613k138819j661550l270666o326256m821804J068064
$$ 4610158 9360808 9535421 7396602 5735052 2464386 -3861870 -8683674 -7615610
39471g615610L940045J499051m6591K218372K691028j756429m943578j637467
$$ -7615610 -3675565 -2176514 -2223105 -4733 2686295 929866 -4013712 -5651179
39463e651179L286426K918995r00835k260237j375333k234915l762122j444948
$$ -5651179 -2364753 554242 -346593 -2606830 -3982163 -6217078 -9979200 -11424148
39455a1424148L933116O537050M227552J042475M69889J180080N04412j530905
$$ -11424148 -7491032 -953982 3273570 4316045 4785934 5966014 6470426 4939521
39447D939521k965633k549575r02676n7195j364346l042817j440960L733681P418883
$$ 4939521 1973888 -575687 -1478363 -1535558 -2899904 -5942721 -7383681 -3650000 3768883
39438C768883M908360j726902n641210l262513J911177L794437M71056m187265
$$ 3768883 8677243 6950341 1309131 -1953382 -42205 3752232 4223288 36023
39430C6023n190782j986772J541038K462080J959364J895262J231884j003066
$$ 36023 -5154759 -7141531 -5600493 -3138413 -1179049 716213 1948097 945031
39422I45031k000141P21135L429307O13042n338500o026409L14303N488778L524950
$$ 945031 -1055110 -333975 3095332 3708374 -1630126 -7656535 -7342232 -1853454 1671496
39413A671496r33984j019736J787739J665679j432180k629122p47230N89589k24101
$$ 1671496 737512 -282224 1505515 3171194 1739014 -890108 -1637338 -1047749 -1271850
39404a271850p40175K51605L70153j832648l638805j750799K780984N395646L445788
$$ -1271850 -2012025 -1760420 -1390267 -3222915 -6861720 -8612519 -5831535 -435889 3009899
39395C009899o96379k629972j221173O82880Q34295L44879O12187N41024n08402
$$ 3009899 2313520 -316452 -1537625 -854745 -20450 324429 936616 1477640 969238
39386I69238j50065K700236M029806N82992l318847j652280K752260J923679l849216
$$ 969238 819173 3519409 7549215 8132207 4813360 3161080 5913340 7837019 3987803
39377C987803o004671j996666Q40439j361435k470084J686484M994683J915231
$$ 3987803 -2016868 -4013534 -3173095 -4534530 -7004614 -5318130 -323447 1591784
39369A591784k227594m60334L717614K878122j623262l325109k226656k448846
$$ 1591784 -635810 -1096144 2621470 5499592 3876330 551221 -1675435 -4124281
39361d124281k166585L140693R510648P805605j734207q426158o000164L52904
$$ -4124281 -6290866 -3150173 6360475 14166080 12431873 4005715 -1994449 -1641545
39353a641545L527241K813010K58649l594554o906842n756380J4182M827749M515691
$$ -1641545 1885696 4698706 4957355 1362801 -5544041 -11300421 -11286239 -6458490 -1942799
39344a942799J613882P00175J762213J199745k448597o055090m913067J782117
$$ -1942799 -328917 371258 2133471 3333216 884619 -5170471 -10083538 -8301421
39336h301421Q197798O897106j651094p906123m918194K490366N008442J637822
$$ -8301421 -103623 6793483 5142389 -2763734 -7681928 -5191562 -183120 1454702
39328A454702j326757j255172j066336j331663R04091M739129M977786R57486
$$ 1454702 127945 -1127227 -2193563 -3525226 -2621135 2117994 7095780 8053266
39320H053266j504688N68170K788675J066455k433295m184750m408549l873379
$$ 8053266 6548578 7116748 9905423 10971878 8538583 4353833 -54716 -3928095
39312c928095j017537L878577O410554L952070j80370k068092k642502m021444
$$ -3928095 -4945632 -1067055 5343499 9295569 9115199 7047107 4404605 383161
39304C83161m465590j613384K312618L320742J737172J139452K393548K666275
$$ 383161 -4082429 -5695813 -3383195 -62453 1674719 2814171 5207719 7873994
39296G873994J22961l306267m173060j195747L080167M063890p8928n329872n781635
$$ 7873994 7996955 4690688 517628 -678119 2402048 6465938 6387010 1057138 -4724497
39287d724497j058691L024244K018429k017647m276766l103153k68229K178797
$$ -4724497 -5783188 -2758944 -740515 -2758162 -7034928 -10138081 -10406310 -8227513
39279h227513L338633L413502L523635M140635L527793O0783m003380m441055
$$ -8227513 -4888880 -1475378 2048257 6188892 9716685 9777468 5774088 1333033
39271A333033j184787J251962M34292r43918k41759J021950O85161n0908P92989
$$ 1333033 148246 1400208 1834500 890582 648823 1670773 2355934 2305026 3098015
39262C098015J986789P76974k866339n914693n457496j435217K782444L017998
$$ 3098015 5084804 5861778 2995439 -2919254 -8376750 -9811967 -7029523 -4011525
39254d011525o02853k502098J197183O193213N542579M8917l412143l045177l407596
$$ -4011525 -4614378 -7116476 -5919293 273920 5816499 5865416 2453273 -591904 -3999500
39245c999500n066780k743914L348328M645614j698857n690642M68375Q727606
$$ -3999500 -9066280 -11810194 -8461866 -3816252 -5515109 -11205751 -10737376 -2009770
39237b009770O877978k460706o357660j502869K672705K42012l403622k118350
$$ -2009770 4868208 2407502 -3950158 -5453027 -2780322 -2538310 -5941932 -8060282
39229h060282K120861M436883M057159K574723N45792j286530j600756j256709
$$ -8060282 -5939421 -1502538 2554621 5129344 5675136 4388606 2787850 1531141
39221A531141k580432m872760m829219k095693K59450J425383L718459O723637
$$ 1531141 -1049291 -5922051 -10751270 -12846963 -12587513 -11162130 -7443671 -720034
39213g20034O340064J754180k113147j873276l72402j056004k476261k166196
$$ -720034 5620030 7374210 5261063 3387787 3015385 1959381 -516880 -2683076
39205b683076j583211k666747l000445M99317N330427N978978J867016j768936
$$ -2683076 -4266287 -6933034 -9933479 -9434162 -4103735 1875243 3742259 1973323
39197A973323j018441K288245L898754K159817j140312l198215k723967r73548
$$ 1973323 954882 3243127 7141881 9301698 8161386 4963171 2239204 1265656
39189A265656n09041k388723m803091m971161j984420K532535N907498O274321
$$ 1265656 756615 -1632108 -6435199 -11406360 -13390780 -10858245 -4950747 1323574
39181A323574L781096L67106k109510l252424l056516q08714K960102M735264
$$ 1323574 5104670 5471776 3362266 109842 -2946674 -3755388 -795286 3939978
39173C939978J640676l449654m392014j73914L270134J407152k783347l833755
$$ 3939978 5580654 2131000 -2261014 -2434928 835206 2242358 -540989 -4374744
39165d374744j310743J307582K359973K458337J398503r35167k083538k3326K378434
$$ -4374744 -5685487 -4377905 -2017932 440405 1838908 903741 -1179797 -1203123 1175311
39156A175311Q15464l129580l624719J01130K200940k14678k261295J94478K977007
$$ 1175311 1990775 -1138805 -4763524 -4662394 -2461454 -2676132 -4937427 -4742949 -1765942
39147a765942M68618m141288l017957L611950P044667L301052j095076N0671K859802
$$ -1765942 -1297324 -5438612 -8456569 -4844619 2200048 5501100 4406024 4456695 7316497
39138G316497L88118n350408o071972l82081L614989L56513n169615n132498J39803
$$ 7316497 7704615 2354207 -3717765 -4099846 -484857 -128344 -5297959 -10430457 -10290654
39129a0290654L779275K511340j9765K05087K151891K354941K29411j359462k8864
$$ -10290654 -6511379 -4000039 -4019804 -3814717 -1662826 692115 921526 -437936 -466800
39120d66800L012062M130947J554576j945559k002028J318956K665748j475967
$$ -466800 2545262 6676209 8230785 6285226 4283198 5602154 8267902 6791935
39112F791935o920538o643595o39216L640652J641237k131922j196621L384533
$$ 6791935 -128603 -6772198 -7411414 -3770762 -2129525 -4261447 -5458068 -2073535
39104b073535N095800J728762k064437k196593m62075m82241j740601o74593L735134
$$ -2073535 3022265 4751027 2686590 489997 27922 -454319 -2194920 -2869513 865621
39095H65621Q038847P857655K274759m848802p669806l943770J740138K564120
$$ 865621 8904468 16762123 19036882 14188080 6518274 2574504 4314642 6878762
39087F878762j785274m299561p79531L363376J285186l670385k152787N961822
$$ 6878762 5093488 793927 14396 3377772 4662958 992573 -1160214 4801608
39079D801608R438338J922515p788833p900368q7570M190619N16098m090989l108146
$$ 4801608 14239946 16162461 8373628 473260 385690 4576309 5092407 1001418 -2106728
39070b106728J244879L439156J976540j180555l737694l487579K61794M024494
$$ -2106728 -861849 2577307 4553847 3373292 -364402 -3851981 -3590187 434307
39062D34307L077341j553040l687746j040100J788972J544489J322099L617486
$$ 434307 3511648 1958608 -1729138 -2769238 -980266 564223 1886322 5503808
39054E503808M603775Q40922l573081l190372m19298j155013m229793l408974
$$ 5503808 10107583 10948505 7375424 4185052 3765754 2610741 -1619052 -5028026
39046e028026J502012L996258J633372n74431O68689J730352q23152l947385l037901
$$ -5028026 -3526014 470244 2103616 1529185 2197874 3928226 3105074 -842311 -3880212
39037c880212J107926M045474L486487N16317k403742k567094J032072N085328
$$ -3880212 -2772286 1273188 4759675 5275992 2872250 305156 1337228 6422556
39029F422556M473016p35556m282391k028438K354816K977760l15235l219583
$$ 6422556 10895572 10160016 5877625 3849187 6204003 9181763 8866528 5646945
39021E646945l579203k714344j708638j76704J720064K761445K031247n55574
$$ 5646945 2067742 -646602 -2355240 -2531944 -811880 1949565 3980812 3425238
39013C425238m036357n802238l339093K086996N951235O098917M751721L315639
$$ 3425238 -611119 -6413357 -9752450 -7665454 -1714219 4384698 9136419 12452058
39005A2452058l09558n996560p928622k480490M143552L194662l661611o363253
$$ 12452058 12142500 6145940 -1782682 -4263172 -119620 3075042 -586569 -6949822
38997f949822j222975M315092L598539r1076m31444J926175J999832n01671j072692
$$ -6949822 -8172797 -3857705 -259166 -350242 -781686 1144489 3144321 2642650 1569958
38988A569958J715922L742339J717319j874030k324476Q60610L457680K141372
$$ 1569958 3285880 7028219 8745538 6871508 4547032 5407642 8865322 11006694
38980A1006694j364667k876221j393681M8478n95306j249157N12741K898984K310585
$$ 11006694 9642027 6765806 5372125 5420603 4825297 3576140 4088881 6987865 9298450
38971I298450q99728k730741j401071O49102J064517M59535M6023m30375j042133
$$ 9298450 8398722 5667981 4266910 4916012 5980529 6440064 6486087 6055712 5013579
38962E013579q07042J16983N1586r92423o24755J668339K647656J63314k885394
$$ 5013579 4206537 4323520 4375106 3382683 2757928 4426267 7073923 7237237 4351843
38953D351843k523490M81304K198923J533483J011707K025582K723768J276587
$$ 4351843 1828353 2309657 4508580 6042063 7053770 9079352 11803120 13079707
38945A3079707j273520k543536j809070m95622j35996l87576N40405L126493M944498
$$ 13079707 11806187 9262651 7453581 6957959 6821963 6434387 6974792 10101285 15045783
38936A5045783L322317p61656l529593l174619j343018K74474J669055K222518
$$ 15045783 18368100 17606444 14076851 10902232 9559214 9833688 11502743 13725261
38928A3725261N50240j861222j046028K988593M598069Q34727k917497o35874
$$ 13725261 14275501 12414279 11368251 14356844 18954913 19789640 16872143 16236269
38920A6236269M608271M826935j067847o135362n395489q92556L174807M657973
$$ 16236269 20844540 25671475 24603628 18468266 13072777 12180221 15355028 20013001
38912B0013001K539114k428550n413570j603775O062889Q875753L816058k524271
$$ 20013001 22552115 20123565 14709995 13106220 19169109 28044862 31860920 29336649
38904B9336649l706296j386953k90710o83443k64383O83566Q10067J306270L530849
$$ 29336649 25630353 24243400 23952690 23269247 23004864 23688430 24498497 25804767 29335616
38895B9335616N427742M473386K199163J795635K856245K455275M54956P6938
$$ 29335616 34763358 39236744 41435907 43231542 46087787 48543062 48998018 49074956
38887D9074956L271387P977963J0140057P641228L119132K621284Q884655J6359922
$$ 49074956 52346343 60324306 70464363 78105591 81224723 83846007 92730662 109090584
38879A09090584J7324379J3046951J2477862J8263900K2369502K0098586J9478131
$$ 109090584 126414963 139461914 151939776 170203676 192573178 212671764 232149895
38872B32149895K8374436L9853442M1869671L6816205L7958064M7400827N1496340
$$ 232149895 260524331 300377773 342247444 379063649 417021713 464422540 515918880
38865E15918880M1097073K3952250J1313158K689868q304089k0777683k8261209
$$ 515918880 557015953 580968203 592281361 594971229 586667140 565889457 537628248
38858E37628248k9352749k8835975l0192036l2719080l4365704l3057277k7399784
$$ 537628248 508275499 479439524 449247488 416528408 382162704 349105427 321705643
38851C21705643j9846870j6273667j8515577k0817952j8177729j4208623j4822308
$$ 321705643 301858773 285585106 267069529 246251577 228073848 213865225 199042917
38844A99042917j7760497j6050978r929478o896575r685370j2317296j0267187
$$ 199042917 181282420 165231442 155301964 148405389 138720019 126402723 116135536
38837A16135536p306260q438776j1661695j1504616p218981k949584j774795l192686
$$ 116135536 108829276 100390500 88728805 77224189 70005208 67055624 65280829 62088143
38829F2088143n206849o061954m916312k871195k155889k801472k114898P61394
$$ 62088143 56881294 50819340 45903028 43031833 40875944 38074472 35959574 36720968
38821C6720968K479658N49612j953118r84660J187260r85921o332462o683094
$$ 36720968 39200626 39750238 37797120 36812460 37999720 37013799 30681337 23998243
38813B3998243Q99528P667389M151590o238977j1066680n047783M180739P333713
$$ 23998243 24897771 32565160 36716750 30477773 19411093 14363310 18544049 25877762
38805B5877762M279659N90173j461468l339483m579491k577912K075951M873468
$$ 25877762 30157421 30747594 29286126 25946643 21367152 18789240 20865191 25738659
38797B5738659L342847L64042j57390J585159K507950J354264J4716N18428K316270
$$ 25738659 29081506 29445548 29288158 30873317 33381267 34735531 34750247 35268675 37584945
38788C7584945L051105J480484j031069k291030j969444j271880k33607K284534
$$ 37584945 40636050 42116534 41085465 38794435 36824991 35553111 35319504 37604038
38780C7604038N172313M729114N6461m036833l048229N29509R65004j836013k612521
$$ 37604038 42776351 47505465 47561926 43525093 40476864 41006373 41971377 40135364 37522843
38771C7522843M67644L167573K317884m5277j530826k920531m298793l132861
$$ 37522843 37990487 41158060 43475944 43430667 41899841 38979310 34680517 31547656
38763C1547656K62560O37055m182291p948443m417547K667879M609727K50099
$$ 31547656 31810216 32447271 28264980 20316537 15898990 18566869 23176596 23426695
38755B3426695l599067l047604j243857j226969j480525n26430k97142k156122
$$ 23426695 19827628 16780024 15536167 14309198 12828673 12302243 12005101 9848979
38747I848979l747143k563782L75852K504796K660358N89398l395877o569359
$$ 9848979 6101836 3538054 3913906 6418702 9079060 9668458 6272581 -296778
38739b96778m900298J530876O921000O300136J695124r78157L56054K196297Q07440
$$ -296778 -5197076 -3666200 3254800 9554936 11250060 10271903 10627957 12824254 13631694
38730A3631694l274584o358886n638744j649336K560338M335000L543690J905097
$$ 13631694 10357110 3998224 -1640520 -3289856 -729518 3605482 7149172 9054269
38722I054269P54501L8928r84194k731136m420171l897375J71967N218395O278861
$$ 9054269 9808770 9847698 8863504 6132368 1712197 -2185178 -2013211 3205184 9484045
38713I484045K356817j456063r39226J216206L47238k232147j911561P62551J267332
$$ 9484045 11840862 10384799 9445573 10661779 11009017 8776870 6865309 7627860 8895192
38704H895192k62638N57579L073439J435180m356891o457905k010264J316889
$$ 8895192 8632554 9190133 12263572 13698752 9341861 2883956 873692 2190581
38696B190581j628237l997159J316954Q398185P174245k43088l718200j908459
$$ 2190581 562344 -3434815 -2117861 6280324 13454569 13211481 9493281 7584822
38688G584822k436083o597596o826230q85544L563538K183947P76305L753933
$$ 7584822 5148739 -1448857 -8275087 -9160631 -5597093 -3413146 -2636841 1117092
38680A117092N753121J604686l555066k262657L122648M564715P54954k476936
$$ 1117092 6870213 8474899 4919833 2657176 5779824 10344539 11099493 8622557
38672H622557j858971K31128J252716J216404M20842r19449j368206j84614O96023
$$ 8622557 6763586 6994714 8247430 9463834 9884676 8965227 7597021 7412407 8108430
38663H108430k06795r27079K34272O80547k257457n470619l815872J702081M904233
$$ 8108430 7901635 6974556 7208828 7889375 5631918 161299 -3654573 -1952492 2951741
38654B951741L065725l36825j408772p0878J499453J115965k200195o091696n514546
$$ 2951741 6017466 5680641 4271869 4200991 5700444 6816409 4616214 -1475482 -6990028
38645f990028P84105O662590O095219J765311L12919J479295m25356n455057p144452
$$ -6990028 -6205923 456667 6551886 8317197 8630116 10109411 9684055 4228998 -2915454
38636b915454l394709L48631Q15660J436390M004313M053774p29965m773289l064503
$$ -2915454 -6310163 -5961532 -5145872 -3709482 294831 4348605 3618640 -1154649 -4219152
38627d219152O88181N56606k034251j926611N33199R18408j047584j344297J343479
$$ -4219152 -3530971 -2974365 -5008616 -6935227 -6402028 -5483620 -6531204 -7875501 -6532022
38618f532022M076010M648804L664347K105792N62744K43208J616519K854382
$$ -6532022 -2456012 2192792 5857139 7962931 8525675 8768883 10385402 13239784
38610A3239784K077860j77085k597910m820959n662355l138161J201097K168771
$$ 13239784 15317644 15140559 12542649 7721690 2059335 -1078826 122271 2291042
38602B291042j401867l526313j104M396594L290782j335613l343639k454195k220391
$$ 2291042 889175 -2637138 -2638242 1758352 5049134 3713521 369882 -2084313 -4304704
38593d304704j526017K717782O584610L040834n299725p532185l87633O629716
$$ -4304704 -5830721 -3112939 3471671 6512505 1212780 -6319405 -6707038 -77322
38585g7322N277031o89333l238526j427257L01242K7468p20331p92631j83994
$$ -77322 5199709 4510376 1271850 -155407 145835 173303 -547028 -1339659 -1523653
38576a523653Q45687J134655m71182k450467k047858J1499K81056j434808j695200
$$ -1523653 -677966 456689 -14493 -2464960 -4512818 -4501319 -4220263 -5655071 -7350271
38567g350271K77386J419398J086547K366826N246654M930998j05140m550185
$$ -7350271 -7072885 -5653487 -4566940 -2200114 3046540 7977538 7872398 3322213
38559C322213m204117j691437o04333J40555J895409K090157o24735k391081n02607
$$ 3322213 -881904 -2573341 -3177674 -3037119 -1141710 948447 323712 -2067369 -2569976
38550b569976J335576m35607k563622j094676P99582j544917m871602k555211
$$ -2569976 -1234400 -1670007 -4233629 -5328305 -4528723 -6073640 -10945242 -13500453
38542a3500453L837860O064422J667827k913994k407065R51539K761257K549427
$$ -13500453 -9662593 -3598171 -1930344 -4844338 -7251403 -6299864 -3538607 -989180
38534i89180K185198K138478J643350M65074p86191j087135N2271J243875K49187
$$ -989180 1196018 3334496 4977846 5442920 4656729 3569594 3621865 4865740 5114927
38525E114927k540805l876722k271471M9167J329263K507536L197462N00916m726704
$$ 5114927 2574122 -1302600 -3574071 -3524904 -2195641 311895 3509357 4010273 -716431
38516g16431n953613l33936N240989L652767j702563k969569l24335J69644j933462
$$ -716431 -6670044 -7003980 -1762991 1889776 187213 -2782356 -3106691 -2937047 -4870509
38507d870509j580526J619268K804239J225161J117140K692822J287895l073582
$$ -4870509 -6451035 -4831767 -2027528 -802367 314773 3007595 4295490 1221908
38499A221908m098690L16015M182314L046696J01375n97471K7926N31101K369628
$$ 1221908 -2876782 -2560767 1621547 4668243 4769618 4172147 4200073 4731174 7100802
38490G100802M865328L294775l301029q222103o019857k58320K530135J873982
$$ 7100802 11966130 15260905 11959876 3737773 -2282084 -2540404 -10269 1863713
38482A863713J145526O55467j247490l283084k944933r82612L67413J477662L439625
$$ 1863713 3009239 3664706 2417216 -865868 -3810801 -4793413 -4426000 -2948338 491287
38473D91287M359647J981419j779454l155104j960110q71867o97449j90809N16834
$$ 491287 4850934 6832353 5052899 1897795 -62315 -934182 -1631631 -1822440 -1305606
38464a305606J4747j472928k333908k087110j159698O75466L027597L522563Q23881
$$ -1305606 -1290859 -2763787 -5097695 -7184805 -8344503 -7669037 -4641440 -1118877 -294996
38455b94996k149541j459108J931363K886289r57230n853287o488166j961645
$$ -294996 -2444537 -3903645 -1972282 914007 -43223 -5896510 -12384676 -14346321
38447a4346321L758438O253489M583017J143221j412354k141189r98465J716736
$$ -14346321 -10587883 -4334394 248623 1391844 -20510 -2161699 -3160164 -1443428
38439a443428L883396K269385k399695l841340J627806P539632M526361n471067
$$ -1443428 2439968 4709353 2309658 -1531682 96124 7635756 12162117 6691050
38431F691050j0220710m097273M318165N444327J575188L36168J892705R08572
$$ 6691050 -3529660 -7626933 -3308768 2135559 3710747 4046915 5939620 6848192
38423F848192k769686l994276j317334J397174J944660J947026K131334J266043
$$ 6848192 4078506 84230 -1233104 164070 2108730 4055756 6187090 7453133
38415G453133n176L67504J248967o40419m588021n846616k695891J097918K121582
$$ 7453133 7447957 7815461 9064428 8424009 3835988 -2010628 -4706519 -3608601 -1487019
38406a487019J394489J178618J477922J373993R20663M35061J72707R62807K657899
$$ -1487019 -92530 1086088 2564010 3938003 4858666 5293727 5466434 6429241 9087140
38397I087140K515008j414027n827170n410274n41782K896421J922587k80056
$$ 9087140 11602148 10188121 4360951 -1049323 -1591105 1305316 3227903 2947847
38389B947847o16531l71222j082656r69752J445470L887396L520680P18596k534205
$$ 2947847 2331316 1960094 877438 -92314 1353156 5240552 8761232 9479828 6945623
38380F945623m916369m791113r28554L739646L665056j230092l945452n59338
$$ 6945623 2029254 -2761859 -3690413 49233 3714289 2484197 -1461255 -2020593
38372b020593L306130J363934l008190k303974K885396N313885K934562P78684
$$ -2020593 1285537 2649471 -358719 -2662693 222703 5536588 8471150 9249834
38364I249834R90154m80577n158747p644585l757064K568136M695026J651114
$$ 9249834 10239988 9759411 4600664 -3043921 -6800985 -4232849 462177 2113291
38356B113291k458180m140910k590550J031426L767923K949226l6811j075760
$$ 2113291 -344889 -4485799 -7076349 -6044923 -2277000 672226 635415 -440345
38348d40345L79473O49294j044037n57594L078404M032286q28517m990693j797920
$$ -440345 -60872 588422 -455615 -1013209 2065195 6097481 5268964 278271 -1519649
38339a519649M268727M288196q95530k853364N3459J022060k238973l525886L30030
$$ -1519649 2749078 7037274 6141744 3288380 3341839 4363899 2124926 -1400960 -1070930
38330a070930L691485K181533L9853J882698M182166J450069m256807o521732
$$ -1070930 2620555 4802088 4841941 6724639 10906805 12356874 8100067 1578335
38322A578335l847937j87867J305392O00799r09331j122023J191554L334764J145749
$$ 1578335 -2269602 -2457469 -1152077 -551278 -1460609 -2582632 -1391078 1943686 3089435
38313C089435l548625l651575K048771N398152J316565l589942j559838M008627
$$ 3089435 -459190 -4110765 -2061994 3336158 4652723 1062781 -497057 3511570
38305C511570N070086J883358O4196l76228k724374m222379k16482N026573L340805
$$ 3511570 8581656 10465014 10529210 10152982 7428608 3206229 2989747 8016320 11357125
38296A1357125l025742m185911Q40181L040915l70467j945876J244706K228380
$$ 11357125 8331383 4145472 4985653 8026568 7656101 5710225 6954931 9183311
38288I183311k054701m440462j072019J022343k687101m966081l0836M711449
$$ 9183311 7128610 2688148 1616129 2638472 -48629 -5014710 -5045546 -334097
38280c34097J018995n160572l321289L774993M921640j149533m954004j879959
$$ -334097 684898 -4475674 -7796963 -4021970 899670 -249863 -5203867 -7083826
38272g083826K921822M766860M407506K631880j116997m287347l269918l0735
$$ -7083826 -4162004 604856 5012362 7644242 6527245 2239898 -1030020 -1060755
38264a060755N22499r29163O2082K395668Q43845l326718k787451L326295O744329
$$ -1060755 -538256 -1467419 -1405337 990331 1834176 -1492542 -4279993 -953698 5790631
38255E790631K812103k712694l443283j178150l72385o04858K57626Q85406l30683
$$ 5790631 8602734 5890040 2446757 1268607 896222 291364 548990 1434396 1103713
38246A103713j269257Q5003J556183O52562j048875j110656j66512P45368K515330
$$ 1103713 -165544 -80541 1475642 2128204 1079329 -31327 -197839 547529 3062859
38237C062859L997570Q94622o385094r167250j898254P256470O095927l672117
$$ 3062859 7060429 7955051 1569957 -7597293 -9495547 -2239077 3856850 184733
38229A84733q226876j670657O168965N412452o3697j187734J365514J11419n102163
$$ 184733 -8042143 -9712800 -3543835 1868617 1804920 617186 1982700 2094119 -3008044
38220c008044o100265R9856N777271L901443j738510k865348J234267L864519
$$ -3008044 -9108309 -9008453 -3231182 670261 -1068249 -3933597 -2699330 1165189
38212A165189J274089k668257k547110J717385N311578L901119j962404o725039
$$ 1165189 2439278 -228979 -2776089 -1058704 4252874 8153993 6191589 -533450
38204e33450m830519K725616Q212127N668574j952762o902027o146846l004467
$$ -533450 -5363969 -2638353 5573774 11242348 9289586 2387559 -3759287 -6763754
38196f763754o91183Q37932J781860J301540K83514P55827J704975K16980k383830
$$ -6763754 -7454937 -6617005 -4835145 -3533605 -3250091 -2494264 -789289 -572309 -2956139
38187b956139j253315L350315M587492l91054m704599j795080M095220M161452
$$ -2956139 -4209454 -859139 3728353 3337299 -1367300 -3162380 932840 5094292
38179E094292j797055n681529l041529K012818L878928J872508j271285l082142
$$ 5094292 3297237 -2384292 -5425821 -3413003 465925 2338433 1067148 -2014994
38171b014994k559970n69894O50608L55799O21904K592402L543508J093963j909825
$$ -2014994 -4574964 -5144858 -4494250 -4138451 -3516547 -924145 2619363 3713326 1803501
38162A803501j256683J534242J295406k269176l805436o79269L178604L512719
$$ 1803501 546818 2081060 3376466 1107290 -2698146 -3377415 -198811 3313908
38154C313908J377737J56313L42067K1653j483907k837940k712007j266063Q0476
$$ 3313908 4691645 4847958 5190025 5211678 3727771 889831 -1822176 -3088239 -3007763
38145c007763J86567j70615Q76909K952563K743378j305273n434174m852996m64036
$$ -3007763 -2821196 -2991811 -2114902 837661 3581039 2275766 -3158408 -8011404 -8475440
38136h475440K303557J066573q49246M9089K626425L470478J678891o85287j806832
$$ -8475440 -6171883 -5105310 -5954556 -5905467 -3279042 191436 1870327 1185040 -621792
38127f21792j951996j979808j342141R55537L450931K759673j143941k894331
$$ -621792 -2573788 -4553596 -5895737 -4940200 -1489269 1270404 126463 -2767868
38119b767868J120330N843954L712674l399310o113996k004855J098458q57381
$$ -2767868 -1647538 4196416 7909090 4509780 -1604216 -3609071 -2510613 -3367994
38111c367994j147139M533390P975156J281345q234564p946103O12125N031658
$$ -3367994 -4515133 18257 7993413 9274758 1040194 -6905909 -6293784 -1262126
38103a262126J719125j165343K65385L17364l540808n238082j529821J920812
$$ -1262126 456999 -708344 -442959 -125595 -3666403 -8904485 -10434306 -8513494
38095h513494Q56012n55677J630175L850819K229405k84565p4604J94522k838303
$$ -8513494 -7657482 -8213159 -6582984 -2732165 -502760 -787325 -861929 -667407 -3505710
38086c505710n885746l722632K354459O384624N537233J860388j356584j893168
$$ -3505710 -9391456 -13114088 -10759629 -4375005 1162228 3022616 1666032 -227136
38078b27136J11884J199217j696541n461177l705820L136065O945472L677689
$$ -227136 -115252 1083965 -612576 -6073753 -9779573 -6643508 301964 3979653
38070C979653r43761j219729K26328q57302k163802l6001K596950P95112l797343
$$ 3979653 3035892 1816163 2042491 1185189 -978613 -1014614 1582336 2377448 -1419895
38061a419895n770308m141890j463332J950310O373911Q304136M650116r76707
$$ -1419895 -7190203 -11332093 -12795425 -10845115 -4471204 3832932 8483048 7506341
38053G506341k818767j711748k431542m243413j851512M655809Q411563N484270
$$ 7506341 4687574 2975826 544284 -3699129 -5550641 -894832 7516731 13001001
38045A3001001k14551l257823k840342j205050l59915j620539m647082o108354
$$ 13001001 12786450 9528627 6688285 5483235 5123320 3502781 -1144301 -7252655
38037g252655k838408L183210O443628M708192Q41369j944693k821580j603201
$$ -7252655 -10091063 -6907853 -464225 4243967 5085336 3140643 319063 -1284138
38029a284138J285442K850523J51524m357640m734906m3762L684163J851385k785025
$$ -1284138 1304 2851827 3003351 -1354289 -6089195 -6132957 -2448794 -597409 -3382434
38020c382434n100547m330924k535930k2501L450097N386346L187138r41631k087492
$$ -3382434 -8482981 -12813905 -15349835 -15372336 -11922239 -6535893 -3348755 -4290386 -6377878
38011f377878L99914K056629J42588k524240k373638l84717L43801L319J316081
$$ -6377878 -5977964 -3921335 -3778747 -6302987 -8676625 -9061342 -8717541 -8714222 -7398141
38002g398141M287896N618119L737018R73746l54017q58307j639313k033746j738062
$$ -7398141 -3110245 2507874 6244892 7218638 6864621 6006314 4367001 2333255 595193
37993E95193k123903l072825j699514K719127N769439L739502n13282j993956
$$ 595193 -1528710 -4601535 -6301049 -3581922 2187517 5927019 5413737 3419781
37985C419781r87254p77568p65465J585685L955934J862018k761697l632863o18669
$$ 3419781 2432527 1654959 889494 2475179 6431113 8293131 5531434 1898571 1279902
37976A279902L94717j309349O6976M812801M892875k186441o922875k255710M546918
$$ 1279902 1674619 365270 432246 5245047 10137922 7951481 1028606 -1227104 3319814
37967C319814L292109l177602m639329J25424L454094K272547O73506J71945k258995
$$ 3319814 6611923 3434321 -1205008 -1079584 2374510 4647057 5320563 5492508 3233513
37958C233513n768361m765395J284744N292384K864492j520329k123463j6624
$$ 3233513 -2534848 -7300243 -6015499 -723115 2141377 621048 -1502415 -1519039
37950a519039M74351j047033j793640r13500J39579Q39433J869046K780743K051427
$$ -1519039 -1044688 -2091721 -3885361 -4798861 -4659282 -3819849 -1950803 829940 2881367
37941B881367k95359j984182j277472M91740N00036j545067k739655j315377M36734
$$ 2881367 2586008 601826 -675646 -183906 316130 -1228937 -3968592 -5283969 -4847235
37932d847235j67683j658256j105913L78169j98938j184407J611177O107995M942586
$$ -4847235 -5014918 -6673174 -7779087 -7400918 -7599856 -8784263 -7173086 -1065091 3877495
37923C877495k590958p514950m075961J865926K721820L12608L36666K036967
$$ 3877495 1286537 -6228413 -10304374 -8438448 -5716628 -5404020 -5067354 -3030387
37915c030387J455177J8753J303236L068617J206500j581885q8161L065665J130100
$$ -3030387 -1575210 -1556457 -253221 2815396 4021896 2440011 2351850 5417515 6547615
37906F547615m295725m807919P41402L989493N72770l680351l135721m23298K9999
$$ 6547615 2251890 -2556029 -1814627 2174866 2747636 -932715 -4068436 -4491734 -4461735
37897d461735n50172Q12361K653999J564342k202384n016853l958054P00926N143976
$$ -4461735 -5011907 -4199546 -1545547 18795 -2183589 -7200442 -11158496 -10457570 -5313594
37888e313594M591897q41884m423059j176186M217673L941673o59149j422104
$$ -5313594 -721697 -1563581 -5986640 -7162826 -2945153 996520 337371 -1084733
37880a084733K772276M116523n97985m379604j834146K242483J563303j614701
$$ -1084733 1687543 5804066 5206081 826477 -1007669 1234814 2798117 1183416
37872A183416j530678J446916K647004Q45330j357162k185227j404566R77939
$$ 1183416 -347262 1099654 3746658 4591988 3234826 1049599 -354967 622972
37864F22972L328637K707030n55788k192351n96300L34104j907063l687822j484918
$$ 622972 3951609 6658639 6102851 3910500 3314200 3648304 1741241 -1946581 -3431499
37855c431499J999192K751961J890634J933540J174998k099416l929058l41215
$$ -3431499 -1432307 1319654 3210288 5143828 6318826 4219410 290352 -50863
37847e0863M485818L503060j821790l586878p1401K265020Q2794k062895p42968
$$ -50863 4434955 7938015 6116225 2529347 2457946 4722966 4805760 2742865 1999897
37838A999897M45434j750866l612096q30084L408000L162193n94023j858538L58439
$$ 1999897 2445331 694465 -2917631 -3747715 -339715 2822478 2228455 369917 728356
37829G28356R77654j781404l076208j36622K051820j343391o086282m473595K483271
$$ 728356 1706010 -75394 -3151602 -3288224 -1236404 -2579795 -8666077 -13139672 -10656401
37820a0656401N863016J992368k436346q49475L939613N207222K274710k83165
$$ -10656401 -4793385 -2801017 -5237363 -6086838 -2147225 3059997 5334707 5051542
37812E051542l90041j21420j105702k767019m217818m317453j245084M398608
$$ 5051542 4661501 4540081 3434379 667360 -3550458 -7867911 -9112995 -4714387
37804d714387P794060N216593m29160l441347k856538j690307p82497J056690
$$ -4714387 3079673 8296266 7867106 4425759 1569221 -121086 -903583 153107
37796A53107K328397N16608k213632j346001K084477K414017j389280m000180
$$ 153107 2481504 2998112 784480 -561521 1522956 3936973 2547693 -1452487
37788a452487k386893K80690J004457R76678J174414n4103k582037l231303j257655
$$ -1452487 -3839380 -3558690 -2554233 -1577555 -403141 -457244 -3039281 -6270584 -7528239
37779g528239K04840J47901J367947M086689M253664R31479j109794N67335J946955
$$ -7528239 -7323399 -7175498 -5807551 -1720862 2532802 3464281 2354487 2921822 4868777
37770D868777J69014j418711j74576N67925j726714l250852r12742J272150o66453
$$ 4868777 5037791 3619080 3444504 4012429 2285715 -965137 -1877879 -605729 -1272182
37761a272182l038950j231856J575239N52941j076104K148188O449225L707017
$$ -1272182 -4311132 -5542988 -3967749 -3414808 -4490912 -2342724 4106501 7813518
37753G813518m252850p139774j999423K850492J472263j704928j057356J340156
$$ 7813518 3560668 -3579106 -5578529 -2728037 -1255774 -2960702 -4018058 -2677902
37745b677902J023572p89964j17409K521918L022723K57236k330221j487099J912057
$$ -2677902 -1654330 -2444294 -2561703 -39785 2982938 3240174 909953 -577146 1334911
37736A334911M088516K639065q64995k995722k885536k713026l373156k628979
$$ 1334911 5423427 8062492 7197497 4201775 1316239 -1396787 -4769943 -7398922
37728g398922O68941L742932M098249L473602M031081L713595k5725m461852m864614
$$ -7398922 -6729981 -2987049 1111200 4584802 8615883 12329478 12303753 7841901 2977287
37719B977287j779151K78436j8981m00555m14604j326099j630376Q40188K926729
$$ 2977287 1198136 1476572 1457591 1057036 642432 -683667 -2314043 -1473855 1452874
37710A452874m56308o609910o723581Q61061P041144N035939m34490j897105k10016
$$ 1452874 996566 -5613344 -12336925 -11475864 -4434720 601219 166729 -1730376 -1940392
37701a940392l94957j756981o2974L378594K970770j379596l168178N45891M089586
$$ -1940392 -2335349 -4092330 -4155304 -776710 2194060 814464 -2353714 -1807823 2281763
37692B281763J415451m925643p141550k514091L609438N068348J878778j471005
$$ 2281763 3697214 -1228429 -8369979 -10884070 -7274632 -2206284 -327506 -1798511
37684a798511k430513k217104j845294l5670L202115M124936O4591n034711m511194
$$ -1798511 -4229024 -6446128 -8291422 -8327092 -5124977 -1000041 -935450 -5970161 -10481355
37675a0481355J586818N736156L136706j780643k083894J922501L957156J008889
$$ -10481355 -8894537 -3158381 -21675 -1802318 -3886212 -1963711 1993445 3002334
37667C002334l129184l592916j61910L660577M797081K761523o11012k658467
$$ 3002334 -126850 -3719766 -3881676 -221099 4575982 7337505 6726493 4068026
37659D068026k235495r67645j014328j699112m31857K579761L317550m08528m608748
$$ 4068026 1832531 864886 -149442 -1848554 -2280411 299350 3616900 3208372 -1400376
37650a400376l662339J710374M757843J571368l785099m822936o50380M032350
$$ -1400376 -5062715 -3352341 1405502 2976870 -808229 -5631165 -6281545 -2249195
37642b249195N135410K609636j224541l896105l657926p10756K283496K790745
$$ -2249195 2886215 5495851 4271310 375205 -3282721 -3993477 -1709981 1080764
37634A080764J333410J36265l14527r62921j287331R7368K161283K172879l8913
$$ 1080764 2414174 2550439 2235912 1272991 -14340 83028 2244311 4417190 4378277
37625D378277j887775k462409l428137m720865l479960J008844N112746N765372
$$ 4378277 2490502 28093 -3400044 -8120909 -11600869 -10592025 -5479279 286093
37617B86093M210558K733187J209187n99243r36872O65994J266880j053391l671686
$$ 286093 4496651 7229838 8439025 7839782 6902910 7568904 8835784 7782393 4110707
37608D110707l638617k181179j381239K8037K992469L853345l86638n198302l721376
$$ 4110707 472090 -1709089 -3090328 -3062291 -69822 3783523 3396885 -1801417 -5522793
37599e522793K540216N376435K170991p88547J124135L948850K206263k543377
$$ -5522793 -2982577 2393858 4564849 3776302 4900437 8849287 11055550 8512173
37591H512173m670517k570240N73666K221589K787301L063007K334844k87643
$$ 8512173 3841656 1271416 1845082 4066671 6853972 9916979 12251823 11964180
37583A1964180l937250o072326m758159j066715J607377J424323J02292k10721
$$ 11964180 8026930 1954604 -2803555 -3870270 -2262893 -838570 -736278 -946999
37575i46999k36815j409036k309082p73900J729615K026745Q09211J425671L082994
$$ -946999 -1183814 -2592850 -4901932 -5675832 -3946217 -1919472 -1110261 315410 3398404
37566C398404R61141n262510q693839m379533L398330P092620N465807K580433
$$ 3398404 4359545 -902965 -9596804 -13976337 -10578007 -3485387 1980420 4560853
37558D560853L47393k189445l790794j643990K529806K973600j373784l861418
$$ 4560853 4908246 2718801 -1071993 -2715983 -186177 2787423 1413639 -2447779
37550b447779M35850O320040M918039l287243q060429l065466N577908P709781
$$ -2447779 -2011929 4308111 9226150 5938907 -2121522 -5186988 390920 8100701
37542H100701K174943l395168l882408k005656j788276k166627j90639K958719
$$ 8100701 10275644 6880476 2998068 992412 -795864 -2962491 -3153130 -194411
37534a94411L287098K4813l270690l702378k380261j941599k487378j462377K467292
$$ -194411 3092687 3117500 -153190 -3855568 -6235829 -8177428 -10664806 -12127183 -9659891
37525i659891O356200N287393j354640p443144o426545N63081O080249N793197
$$ -9659891 -3303691 1983702 629062 -6814082 -13240627 -12677546 -6597297 -804100
37517h04100K601382M98590q87994k953136l727376j105353K520234L387846K087495
$$ -804100 1797282 2295872 1407878 -1545258 -5272634 -6377987 -3857753 -469907 1617588
37508A617588J731467K125294N76507k420578l223677q01184J851475K406752
$$ 1617588 3349055 5474349 6050856 3630278 406601 -394583 1456892 3863644
37500C863644J513077J40145j588052k439775p19933K277404K876433Q0082l004454
$$ 3863644 5376721 5516866 3928814 1489039 769106 3046510 5922943 6003025 2998571
37491B998571l640272k387708p50158J046441K792420L516405L114672K531586
$$ 2998571 -641701 -3029409 -3779567 -2733126 59294 3575699 6690371 9221957
37483I221957J738898k9896j796763j612715k33711n55212k517849k418332R90606
$$ 9221957 10960855 10930959 9134196 7521481 7287770 6732558 4214709 1796377 2786983
37474B786983L472571J110041l728446n369377k064810K511686L952203J206304
$$ 2786983 6259554 7369595 3641149 -1728228 -3793038 -1281352 2670851 3877155
37466C877155l084720m753443j729288L127323M283121J99840l947217k412707
$$ 3877155 792435 -3961008 -5690296 -2562973 1720148 1919988 -2027229 -4439936
37458d439936L605639P334312M790535j035688m733930m546907k452003k01688
$$ -4439936 -834297 6500015 11290550 10254862 5520932 974025 -1477978 -1679666
37450a679666K087870L762426K875488q88388m278591l783694k69481K059896
$$ -1679666 408204 4170630 7046118 6157730 1879139 -1904555 -2174036 -114140
37442a14140J290074k15207m0567Q31181K74890j555379k892654k740856j088370
$$ -114140 1175934 960727 920160 1751341 2026231 470852 -2421802 -5162658 -6251028
37433f251028J487305L160927K047032n82569j049743J085459J668575j175796
$$ -6251028 -4763723 -1602796 444236 -138333 -1188076 -102617 1565958 390162
37425C90162k877188P07219N815562N642834L48173l691951l386766j735986j428537
$$ 390162 -2487026 -1779807 4035755 9678589 10026762 6334811 2948045 1212059 -216478
37416b16478j395556m25691P01961J575791K498735K132779j002907m568430m424795
$$ -216478 -1612034 -2037725 -1335764 240027 2738762 4871541 3868634 -699796 -5124591
37407e124591q32190J891067J913886J183032L21795j926980l770712j477492
$$ -5124591 -5956781 -4065714 -2151828 -968796 -647001 -2573981 -6344693 -7822185
37399g822185L179909L526201j429519m049639L27805N495974L684166k573337
$$ -7822185 -4642276 -1116075 -2545594 -6595233 -6267428 -771454 2912712 339375
37391C39375m596300k74551M199355L990119R41853j048473j283186j470172k329306
$$ 339375 -4256925 -4531476 -332121 3657998 4599851 3551378 2268192 798020 -1531286
37382a531286k517061n18420K610732L256201k77369m130319k986463K287305
$$ -1531286 -4048347 -4566767 -1956035 1300166 1022797 -3107522 -6093985 -3806680
37374c806680N213927K617744j641939l247429k666012j537818Q07152L784661
$$ -3806680 1407247 4024991 2383052 -864377 -3530389 -5068207 -4261055 -476394
37366d76394L675399k77775k603265M51417M114113K305024k184958k009472K740941
$$ -476394 3199005 2921230 317965 769382 4883495 7188519 5003561 2994089 5735030
37357E735030M857645J601300j961657k126381j670135l407199m924176l220257
$$ 5735030 10592675 12193975 10232318 8105937 6435802 3028603 -1895573 -5115830
37349e115830J28916J971235K066090J405635m93837l219319l571784n8746L222329
$$ -5115830 -4986914 -3015679 -949589 456046 -37791 -3257110 -6828894 -6887640 -3665311
37340c665311J660827k603640l389514L09166L171778K179893P81679K119503
$$ -3665311 -2004484 -4608124 -7997638 -7688472 -4516694 -2336801 -1555122 564381
37332E64381L364467R80731k500311k496935l98970j078687l749297k736260K197278
$$ 564381 3928848 4909579 2409268 -87667 -486637 -1565324 -5314621 -8050881 -5853603
37323e853603M317639J222980m41507L644430P043750K725306m575332n344157
$$ -5853603 -1535964 -312984 -754491 2889939 9933689 12658995 8083663 2739506
37315B739506m50743J126260k189047k620310K514701N501391J131643m612770
$$ 2739506 2288763 3415023 1225976 -1394334 1120367 6621758 7753401 3140631
37307C140631m359586k69932J246260j22072m12771O22426L71786k99277J703693
$$ 3140631 -1218955 -1488887 -242627 -364699 -777470 -155044 216742 -82535 1621158
37298A621158M988121M220296j868371p526017o737404l67549N130032N111640
$$ 1621158 6609279 10829575 8961204 1435187 -5302217 -5669766 -539734 4571906
37290D571906J433741p26278J57772N28223j906406l940781k294352J58706q59307
$$ 4571906 6005647 5279369 5437141 5965364 4058958 118177 -2176175 -2017469 -2876776
37281b876776k544521J160301P947763Q278624M1084o814852m539026J485061
$$ -2876776 -5421297 -4260996 3686767 11965391 12006475 5191623 652597 2137658
37273B137658K077723k031544l292003J83507K963252J285998k735382n353180
$$ 2137658 4215381 2183837 -1108166 -924659 2038593 3324591 589209 -4763971
37265d763971m932140j942090J368180K185852N14546m11720Q25005J309269r67252
$$ -4763971 -9696111 -11638201 -10270021 -8084169 -7569623 -7981343 -7156338 -5847069 -6814321
37256f814321k819920n88939L804708N656127M053834J698504P6964j316688k306468
$$ -6814321 -9634241 -10223180 -6418472 -762345 3291489 4989993 5066957 3750269 1443801
37247A443801j969956m56469J272702K382989J823797o91113k698028j328586
$$ 1443801 -526155 -982624 290078 2673067 4496864 3805751 1107723 -220863
37239b20863J688304J702978j383880k791868j232525q81590k731079j791112
$$ -220863 1467441 3170419 1786539 -1005329 -2237854 -3119444 -5850523 -7641635
37231g641635L089289M746962j036043p233368n736682N89536L808691L159814
$$ -7641635 -4552346 194616 -841427 -8074795 -13811477 -13221941 -9413250 -6253436
37223f253436L003933L428705J817766J1435J106419K214361r89209n238220l866737
$$ -6253436 -3249503 179202 1996968 2008403 3114822 5329183 4339974 -898246 -4764983
37214d764983K106286N478105L755964O82938j332185k623895k078398P73344
$$ -4764983 -2658697 2819408 6575372 7258310 5926125 3302230 1223832 1997176
37206A997176J639056k731257p116550m544678K135182M416483J472599l82452
$$ 1997176 3636232 904975 -6211575 -10756253 -8621071 -4204588 -2731989 -3114441
37198c114441M34426r8552j777840k87195L062859K359703j782105k545185J058549
$$ -3114441 -2680015 -2778567 -4556407 -4843602 -1780743 578960 -1203145 -3748330 -2689781
37189b689781K946544J461886J270260K719924P38103l788537l371478K362576
$$ -2689781 256763 1718649 2988909 5708833 6446936 2658399 -713079 1649497
37181A649497M145359j590560o284439l352534K010911L054316J557663J307933
$$ 1649497 5794856 4204296 -2080143 -5432677 -3421766 -367450 1190213 2498146
37173B498146O09751j984859k680757K17679J507967k067603n385202l399687
$$ 2498146 3107897 1123038 -1557719 -1340040 167927 -1899676 -7284878 -10684565
37165a0684565R61145L118663L952901M927953L470934q51458k848618l28086
$$ -10684565 -9723420 -6604757 -2651856 2276097 5747031 4895573 2046955 1718869
37157A718869J304382j030434j870932K309182N185453J372612l215766j244817
$$ 1718869 3023251 1992817 121885 2431067 7616520 8989132 5773366 4528549
37149D528549L253473K238283k572303m006639k163127j904249k112829J317070
$$ 4528549 7782022 10020305 7448002 3441363 1278236 -626013 -2738842 -1421772
37141a421772N142061K775265l423715m761128r9085L056316J017032k045828
$$ -1421772 3720289 6495554 3071839 -1689289 -1788374 1267942 2284974 239146
37133B39146k686242k014770n10836K808678N414424L108255k368407m596364
$$ 239146 -2447096 -4461866 -4972702 -2164024 3250400 6358655 3990248 -606116
37125f06116k064503J23167j195005l300173l135789j206696Q97015K255627J824757
$$ -606116 -2670619 -2547452 -3742457 -7042630 -10178419 -11385115 -10488100 -8232473 -6407716
37116f407716j00621o92201J243564K371378O15622J3755L690286O367780J985429
$$ -6407716 -6508337 -7200538 -5956974 -3585596 -2969974 -2956219 734067 7101847 9087276
37107I087276n073481o025959j988996j237908l938853k058429N015467P706131
$$ 9087276 4013795 -2012164 -4001160 -5239068 -9177921 -11236350 -6220883 1485248
37099A485248K181643l008301j136375K669786J689726j691617k562131k427022
$$ 1485248 3666891 658590 -477785 2192001 3881727 2190110 -372021 -2799043
37091b799043l881916l439638J968175O897318M481030k243347m494497p36051
$$ -2799043 -6680959 -10120597 -8152422 -1255104 3225926 982579 -3511918 -4247969
37083d247969K510403J553226m72766p30133q67327k246279k356471J075340N631278
$$ -4247969 -1737566 -184340 -657106 -1387239 -2254566 -4500845 -6857316 -5781976 -150698
37074a50698O793105L569177p25393k914814l274811l671011l909504k195032
$$ -150698 6642407 10211584 9486191 6571377 3296566 -374445 -4283949 -6478981
37066f478981J004757K647878J825632J353776K410949J587838k824132n724653
$$ -6478981 -5474224 -2826346 -1000714 353062 2764011 4351849 1527717 -4196936
37058d196936k238115L539078M221398J069357J265448M438155K645847m822051
$$ -4196936 -6435051 -2895973 1325425 2394782 3660230 8098385 10744232 5922181
37050E922181q103311k558168K973954N15022m210344k261589L301539L611728
$$ 5922181 -2181130 -4739298 -1765344 -1250322 -5460666 -7722255 -4420716 -808988
37042h08988l26085k94695L718325L320766k934208n918941o71682N392613M042909
$$ -808988 -1135073 -1429768 2288557 5609323 2675115 -3243826 -3915508 1477105 5520014
37033E520014j892524m326241j977260o7716j194580k704576k102212j94057J246166
$$ 5520014 3627490 -698751 -2676011 -2743727 -3938307 -6642883 -8745095 -8939152 -7692986
37024g692986J560898P41243n79055n63404K047900N246698N108463Q35320l420852
$$ -7692986 -6132088 -5390845 -5969900 -6533304 -4485404 761294 5869757 6705077 3284225
37015C284225l473628o05185K83508k180867l651790n57103M123244M919327J911983
$$ 3284225 -189403 -794588 -511080 -2691947 -6343737 -6900840 -2777596 2141731 4053714
37006D053714J38382J310475J542556j111808k444954Q71474M668038K992798
$$ 4053714 4192096 5502571 7045127 5933319 3488365 4359839 9027877 12020675
36998A2020675k563209n141351k622938N89624J205644M44337n21329k446067
$$ 12020675 9457466 4316115 1693177 2282801 3488445 3932782 3411453 965386
36990I65386m031569k036244K377319L186079j389947m854735j793280L792583
$$ 965386 -3066183 -5102427 -2725108 460971 -928976 -5783711 -7576991 -3784408
36982c784408M914555K052197O31640J240950l5384k955540k791496Q72650K538095
$$ -3784408 1130147 3182344 3813984 5054934 5019550 2064010 -727486 145164 2683259
36973B683259j78508k715101j404355J192028K089419K800967M126839K097120
$$ 2683259 2504751 -210350 -1614705 -422677 1666742 4467709 8594548 10691668
36965A0691668m893505r891548n704434L669942P586711L192825k198792k764052
$$ 10691668 5798163 -4093385 -9797819 -6127877 1458834 4651659 2452867 -311185
36957c11185o44545K39086k08949j069072k753056l881461j300186L814635N194522
$$ -311185 -955730 -716644 -925593 -1994665 -4747721 -8629182 -9929368 -6114733 -920211
36948i20211N54119l514165n12711O043536P370979J787292l543340k882288J166909
$$ -920211 -366092 -3880257 -4392968 1650568 9021547 10808839 7265499 4383211 5550120
36939E550120K339277j080148m894444m721506j321131P45414m54738j385086
$$ 5550120 7889397 6809249 1914805 -2806701 -4127832 -3382418 -3837156 -5222242
36931e222242J290992M492047K672969k891221m760509m26163L548629J547619
$$ -5222242 -3931250 560797 3233766 342545 -4417964 -4844127 -1295498 252121
36923B52121k766172k749324J302063L969354L025659M74120k127133m119734
$$ 252121 -2514051 -5263375 -3961312 8042 3033701 3507821 1380688 -2739046
36915b739046l684375l92212K133403R46607j062481J14524K297953P68125k830635
$$ -2739046 -6423421 -6815633 -4682230 -3735623 -4798104 -4683580 -2385627 -1617502 -4448137
36906d448137k499161J911651L978108Q57551k800564k670033k33941J555763
$$ -4448137 -6947298 -5035647 -1057539 -199988 -3000552 -5670585 -5904526 -4348763
36898d348763K481869K676537J089761j389532j880649n24690q12745l019487
$$ -4348763 -1866894 809643 1899404 509872 -1370777 -1895467 -2708212 -5727699
36890e727699k663856J727157M772973K180899k127259j814645K260467L650956
$$ -5727699 -8391555 -6664398 -1891425 289474 -1837785 -3652430 -1391963 2258993
36882B258993q4521m460348m739246j596484R79283J038305K78747Q78968K176807
$$ 2258993 2174472 -2285876 -7025122 -8621606 -7642323 -6604018 -6325271 -5446303 -3269496
36873c269496J825624m1683l71926J795526K931130M77886k345856j464359J112783
$$ -3269496 -1443872 -1485555 -1857481 -61955 2869175 3347061 1001205 -463154 649629
36864F49629Q51531j097281k48369K045754J92383m650093m535003J976992N925878
$$ 649629 1501160 403879 155510 2201264 2393647 -2256446 -6791449 -4814457 1111421
36855A111421J784472l639821k335874K645614L708426J141394L10153J038642
$$ 1111421 2895893 -743928 -3079802 -434188 3274238 4415632 4725785 5764427
36847E764427r23675m503993m457161q84113P45428r07307j249488J621903L568215
$$ 5764427 4840752 336759 -4120402 -5004515 -4259087 -5166394 -6415882 -4793979 -1225764
36838a225764J600117j495778k110882o99166N79336J230287J322575K11000j731390
$$ -1225764 374353 -1121425 -3232307 -3931473 -3352137 -2121850 -799275 -588275 -2319665
36829b319665k617207j676245k64316M68489O74345L01149p92476q54371K440425
$$ -2319665 -4936872 -6613117 -6877433 -6408944 -5734599 -5433450 -6225926 -7080297 -4639872
36820d639872P561976Q980211L435813n390816j0286815p852467j509875K307438
$$ -4639872 2922104 11902315 15338128 9947312 -339503 -8191970 -9701845 -7394407
36812g394407N96784l262090l312773J886956P180836O895205J587510l113885
$$ -7394407 -6797623 -10059713 -13372486 -11485530 -4304694 2590511 4178021 1064136
36804A064136l325756k97262K538172L512221L155747K156284Q4512l367948o102511
$$ 1064136 -2261620 -2558882 -20710 3491511 6647258 8803542 8888054 5520106 -582405
36795e82405m545311J118587M676757J075114n194019m879162K334567O311185
$$ -582405 -5127716 -4009129 667628 1742742 -3451277 -8330439 -5995872 315313
36787C15313J525049m320637k471690L334633L897400k50748r52588K905489L745976
$$ 315313 1840362 -2480275 -4951965 -1617332 2280068 2029320 1076732 3982221 7728197
36778G728197j345757n671668l879224M23060J559837k59654j578775j122241
$$ 7728197 6382440 710772 -3168452 -2745392 -1185555 -1445209 -3023984 -4146225
36770d146225O74471L276351M637762K246104k380109m378855k451864o21235
$$ -4146225 -3471754 -195403 4442359 6688463 4308354 -70501 -2522365 -3143600
36762c143600j368149j936510J77136K769780K778917O17287j708011l037265
$$ -3143600 -4511749 -6448259 -6271123 -3501343 -722426 -105139 -1813150 -4850415
36754d850415j957792K300878O271256M721048j255172m263242j233746K128232
$$ -4850415 -6808207 -4507329 1763927 6484975 5229803 966561 -267185 1861047
36746A861047P55800k509274l389651l178259l612642j259755N706771J0584258
$$ 1861047 2616847 107573 -3282078 -6460337 -10072979 -11332734 -5625963 4958295
36738D958295O526733j909559m462458n4851K959653M21211k757301k090885K25456
$$ 4958295 11485028 9575469 5113011 5058160 8017813 8439024 5681723 3590838 3816294
36729C816294P12130k84180j324478k488575l132742j618669R15458Q47373k111303
$$ 3816294 4528424 4244244 2919766 431191 -2701551 -4320220 -3404762 -2557389 -4668692
36720d668692l517584n69753L726784M704831J432191l382806o105755m041166
$$ -4668692 -8186276 -8756029 -5029245 -324414 1107777 -2275029 -8380784 -12421950
36712a2421950K229699P629489P073891J936967j499292o59286N56347j098701
$$ -12421950 -10192251 -2562762 4511129 6448096 4948804 4289518 4845865 3747164
36704C747164l105655j991711P31081J189560p90905j965220p88333Q62329Q46539
$$ 3747164 641509 -1350202 -619121 570439 -220466 -2185686 -2974019 -2111690 -1265151
36695a265151m52792q05805J141657L900952M317214J446977j757965k264789
$$ -1265151 -1717943 -2523748 -1382091 2518861 6836075 8283052 6525087 4260298
36687D260298j154965j397359k668891k113714K20354J013958p62441k141832
$$ 4260298 3105333 1707974 -960917 -3074631 -2854277 -1840319 -2602760 -4744592
36679d744592j140075N01137R77832J103914J720492J905537J307545Q92356K20774
$$ -4744592 -5884667 -5383530 -4405698 -3301784 -1581292 324245 1631790 2524146 2744920
36670B744920k111600m286593k452714K155531L031895j598768m566014k05822
$$ 2744920 633320 -3653273 -6105987 -3950456 -918561 -2517329 -7083343 -7289165
36662g289165O455317P079124K162995j343062j452264k145199m212429l398535
$$ -7289165 -833848 6245276 8408271 7065209 5612945 3467746 -744683 -4143218
36654d143218J193867M079984J564310k495756k508557J033669L053793J041206
$$ -4143218 -2949351 1130633 2694943 199187 -2309370 -1275701 1778092 2819298
36646B819298k362813l233626q20065K126809K904486K085485K106753K906981
$$ 2819298 456485 -2777141 -3597206 -1470397 1434089 3519574 5626327 8533308
36638H533308J671490j968069l932327j654477J232684K42715k648060k196344
$$ 8533308 10204798 8236729 4304402 2649925 3882609 4125324 1477264 -719080
36630g19080J374397K793171M64753j306538K88824K507756K162070L8385j816474
$$ -719080 655317 3448488 3913241 2606703 2895527 5403283 7565353 7603738 5787264
36621E787264l061210l302531j349123J619533J957396j007118l111710j572344
$$ 5787264 2726054 -576477 -1925600 -306067 1651329 644211 -2467499 -4039843
36613d039843N73083n14940l187078k928308Q59937M578935N717441M914470L351670
$$ -4039843 -3466760 -3981700 -7168778 -10097086 -9237149 -4658214 1059227 5973697 9325367
36604I325367J271491p57339j539083q41632O1710j75841j658230l305657l829394
$$ 9325367 10596858 9839519 8300436 7458804 7520514 7344673 5686443 2380786 -1448608
36595a448608k879787j325445p7474R43594K008637K622873K576465K846329L694602
$$ -1448608 -4328395 -5653840 -5731314 -4787720 -2779083 -156210 2420255 5266584 8961186
36586H961186L131181l01074m330674n442887l649593j682638m67793R76422K101136
$$ 8961186 12092367 11791293 7460619 2017732 -1631861 -3314499 -3782292 -2805870 -704734
36577g04734J423254j87711j048685k269259m850689n029383O37203O900085N318499
$$ -704734 718520 530809 -517876 -2787135 -7637824 -12667207 -12030004 -5129919 188580
36568A88580j791642l174925L531208P176933J163993n409646k692543M032939
$$ 188580 -1603062 -4777987 -1246779 5930154 7094147 1684501 -1008042 3024897
36560C024897L910863j997937m622217k612551j814189k613472j74625M396582
$$ 3024897 6935760 4937823 315606 -2296945 -4111134 -6724606 -6899231 -2502649
36552b502649M830611J063645j018642p08718k325359m264496l63082O719712
$$ -2502649 2327962 3391607 2372965 1664247 -661112 -4925608 -5288690 1431022
36544A431022O367226k595340q051973l191501L190123J875415k607031j978505
$$ 1431022 7798248 5202908 -2849065 -6040566 -2850443 -975028 -3582059 -5560564
36536e560564J250545n4488l954246l142107J997247M601837L051894J882949
$$ -5560564 -4310019 -4364507 -8318753 -11460860 -9463613 -4861776 -1809882 73067
36528G3067K473477J662481r18038k110867j693334k256456k743976M24154N266645
$$ 73067 2546544 4209025 3290987 1180120 -513214 -2769670 -5513646 -5089492 177153
36519A77153N012462j132920n243906k014737L373883L264191j328369l118356
$$ 177153 5189615 4056695 -1187211 -3201948 171935 3436126 2107757 -1010599
36511a010599L98075L977545K739299j327677k936599r25983Q71602l01772k274577
$$ -1010599 -612524 3365021 6104320 4776643 1840044 914061 1785663 1483891 -790686
36502g90686j738753M50275R21230l74898j15231K236924K767915m48670l504230
$$ -790686 -2529439 -2079164 -1157934 -1532832 -1648063 588861 3356776 2908106 -596124
36493e96124k463076N08658Q63369j176461j790913j62952R29407M38602L15749
$$ -596124 -3059200 -2550542 -1687173 -2863634 -4654547 -4817499 -3888092 -3449490 -3133741
36484c133741J261077J396066L2353p66724L96855K087855K521473J951048J395381
$$ -3133741 -1872664 -476598 -444245 -1210969 -814114 1273741 3795214 5746262 7141643
36475G141643Q00575l21419j523460j548109N21617M006143O083380L717307k482115
$$ 7141643 7942218 7620799 6097339 4549230 5070847 9076990 15160370 18877677 16395562
36466A6395562p484501o854661j852533K230613K083329j002148l579652l160363
$$ 16395562 8911061 2056400 203867 2434480 4517809 3515661 -63991 -3224354
36458c224354L14344M171309M922737K144768o82515p88323L11593J9826r34361
$$ -3224354 -2910010 1261299 6184036 8328804 7646289 6857966 7169559 7189385 6255024
36449F255024n62013N4648j272047k963930j579144J896528K625054o92431l607637
$$ 6255024 5693011 5747659 4475612 1511682 -67462 1829066 4454120 3761689 154052
36440A54052k377600J267641L318641K277318n37263k794261k499427m7618J153435
$$ 154052 -2223548 -955907 2362734 4640052 4102789 1308528 -1190899 -1238517 -85082
36431h5082q81820k584074L41323M755644L193280m089999p676929k674386L569902
$$ -85082 -966902 -3550976 -3209653 1545991 4739271 649272 -7027657 -9702043 -6132141
36422f132141K759944j803180j384518L954115O031880J789734k667561k042894
$$ -6132141 -3372197 -5175377 -6559895 -2605780 3426100 5215834 2548273 505379
36414E05379J273977K405654N58366k055654l655874l104727k51347K239049R99899
$$ 505379 1779356 4185010 4743376 2687722 -968152 -4072879 -4324226 -2085177 -1085278
36405a085278k537226k818434J588224M862016K259060k601255l216073L29320
$$ -1085278 -3622504 -6440938 -4852714 9302 2268362 -332893 -3548966 -3219646
36397c219646K673167J764576K36721q13477l010293n075133k493972M713569
$$ -3219646 -546479 1218097 1454818 641341 -2368952 -7444085 -9938057 -5224488
36389e224488R468700O610376L2401l329400k836236k480092k980216j709126
$$ -5224488 4244212 10854588 10886989 7557589 4721353 2241261 -738955 -2448081
36381b448081R06420J334537m98385n33503K299789L752691J092834k601359l513430
$$ -2448081 -1541661 -207124 -705509 -1239012 1060777 4813468 5906302 3304943 -208487
36372b08487k106903m30203J252089K186661J56277l471435k712399L803671P448641
$$ -208487 -2315390 -2745593 -1493504 693157 849434 -2622001 -5334400 -1530729 5917912
36363E917912P81999r424300r656189P63816P783942K700628n620553m485967
$$ 5917912 6699911 -2724389 -12380578 -11616762 -3832820 -1132192 -6752745 -11238712
36355a1238712M188272P777336J646653n250833l950250K925276O449352L403599
$$ -11238712 -7050440 726896 2373549 -2877284 -6827534 -3902258 2547094 5950693
36347E950693j583754l826541l758291l695687l162496k47241L915946N431676
$$ 5950693 4366939 540398 -3217893 -6913580 -10076076 -10323317 -6407371 -975695
36339i75695K915616k85704o27133J081465J713070O45509j15720L62999Q79941
$$ -975695 1939921 1654217 1027084 2108549 3821619 4467128 4351408 4714407 5594348
36330E594348M20348p91812k273526l182091j852667K045925N444608M839109
$$ 5594348 6014696 5222884 2949358 -232733 -2085400 -39475 5405133 10244242
36322A0244242J042764j982964k668149k666532k345674K4545L557921L963689
$$ 10244242 11287006 9304042 6635893 3969361 1623687 1648232 5206153 9169842
36314I169842r4192l884302l032515K99382J372963K07853L99773K208050J887700
$$ 9169842 9075650 5191348 2158833 2458215 3831178 4039031 4438804 6646854 8534554
36305H534554j850449n161699m445116j167472Q53492P22397L70421M31242n96035
$$ 8534554 6684105 1522406 -2922710 -4090182 -3236690 -2514293 -2143872 -1712630 -2308665
36296b308665k702029k930797L66610L925565L393819j27099j283427J436056
$$ -2308665 -5010694 -7941491 -7574881 -3649316 -255497 -382596 -1666023 -229967
$$ [...]
##END NTUPLES=NMR SPECTRUM
##END=
