##TITLE=31Pdec_SR151_k TFA
 DMSO-d6, 24 sc
 21.2.2023
##JCAMPDX= 6.0         $$ Bruker NMR JCAMP-DX V2.0
##DATA TYPE= NMR SPECTRUM
##DATA CLASS= NTUPLES
##ORIGIN= UXNMR, Bruker Analytische Messtechnik GmbH
##OWNER= root
$$ XWIN-NMR		Version 3.5
$$ Tue Feb 21 17:03:59 2023 Russian Standard Time (UT+4h)  she@DPX200
##.OBSERVE FREQUENCY= 81.013821
##.OBSERVE NUCLEUS= ^31P
##.ACQUISITION MODE= SIMULTANEOUS
##.ACQUISITION SCHEME= undefined
##.AVERAGES= 24
##.DIGITISER RES= 16
##SPECTROMETER/DATA SYSTEM= spect
##.PULSE SEQUENCE= zgpg30
##.SOLVENT NAME= CDCl3
##.SHIFT REFERENCE= (INTERNAL, CDCl3, 0, 248.564)
##AUDIT TRAIL= $$ (NUMBER, WHEN, WHO, WHERE, WHAT)
$$ ##TITLE= Audit trail, XWIN-NMR		Version 3.5
$$ ##JCAMPDX= 5.01
$$ ##ORIGIN= Bruker BioSpin GmbH
$$ ##OWNER= she
$$ F:/spectra/data/she/nmr/P31/1/pdata/1/auditp.txt
$$ ##AUDIT TRAIL=  $$ (NUMBER, WHEN, WHO, WHERE, WHAT)
(   1,<2023-02-21 17:00:32.59 +0400>,<she>,<DPX200>,
      <created by zg, POWCHK disabled, PULCHK disabled
       configuration hash MD5:
       00 E9 B6 7A A2 85 ED C7 34 08 36 98 17 FE 4E 26
       data hash MD5: 32K
       43 FE 26 88 D3 DC 9B EE 70 42 15 4F DC C7 B8 49>)
(   2,<2023-02-21 17:01:11.10 +0400>,<she>,<DPX200>,
      <Start of raw data processing
       efp BC_mod = 2 LB = 1 FT_mod = 6 PKNL = 1 PHC0 = -11030.23 PHC1 = 174.0102 SI = 64K 
       data hash MD5: 64K
       0B 48 FD 20 77 1A 86 0B 60 31 82 5D 3C B2 FB 7C>)
(   3,<2023-02-21 17:01:36.37 +0400>,<she>,<DPX200>,
      <pk PHC0 = -34.82756 PHC1 = 91.2 
       data hash MD5: 64K
       0E 4D 2B B2 96 FC A7 3B 3F 80 44 AB F7 20 6E 77>)
(   4,<2023-02-21 17:01:47.57 +0400>,<she>,<DPX200>,
      <abs ABSG = 5 
       data hash MD5: 64K
       9A 20 F4 28 27 59 3C BC 2D A5 68 30 72 FB 1F F1>)
$$ ##END=
$$ 
$$ hash MD5
$$ E6 92 04 A8 CD 28 A2 A9 B6 E8 48 2E B1 2C F2 46
##$RELAX= 
##$RELAX= 
##$RELAX= 
##$RELAX= 
##$RELAX= 
##$RELAX= 
##$RELAX= 
##$RELAX= 
##$RELAX= 
$$ Bruker specific parameters
$$ --------------------------
##$DU= <F:/spectra>
##$EXPNO= 1
##$NAME= <P31>
##$PROCNO= 1
##$TYPE= <nmr>
##$USER= <she>
##$AMP= (0..31)
100 100 100 100 100 100 100 100 100 100 100 100 100 100 100 100 100 100 
100 100 100 100 100 100 100 100 100 100 100 100 100 100 
##$AQSEQ= 0
##$AQ_mod= 1
##$AUNM= <au_zg>
##$AUTOPOS= <>
##$BF1= 81.014009
##$BF2= 200.13
##$BF3= 200.13
##$BF4= 200.13
##$BF5= 200.13
##$BF6= 200.13
##$BF7= 200.13
##$BF8= 200.13
##$BYTORDA= 1
##$CFDGTYP= 0
##$CFRGTYP= 5
##$CHEMSTR= <none>
##$CNST= (0..31)
1 1 145 1 1 1 1 1 1 1 1 1 1 1 1 1 1 1 1 1 1 1 1 1 1 1 1 1 1 1 1 1 
##$CPDPRG= <waltz16>
##$CPDPRG1= <>
##$CPDPRG2= <waltz16>
##$CPDPRG3= <>
##$CPDPRG4= <mlev>
##$CPDPRG5= <mlev>
##$CPDPRG6= <mlev>
##$CPDPRG7= <mlev>
##$CPDPRG8= <mlev>
##$CPDPRGB= <>
##$CPDPRGT= <>
##$D= (0..31)
0 1 0 0 0 0 0 0 0 0 0 0.03 2e-05 3e-06 0 0 0 0 0 0 0 0 0 0 0 0 0 0 0 0 
0 0 
##$DATE= 1676984431
##$DBL= (0..7)
120 120 120 11 120 120 24 19 
##$DBP= (0..7)
150 150 150 150 150 150 150 150 
##$DBP07= 0
##$DBPNAM0= <>
##$DBPNAM1= <>
$$ [...]
##$SUBNAM3= <"">
##$SUBNAM4= <"">
##$SUBNAM5= <"">
##$SUBNAM6= <"">
##$SUBNAM7= <"">
##$SUBNAM8= <"">
##$SUBNAM9= <"">
##$SW= 501.771253377433
##$SWIBOX= (0..15)
0 1 3 0 0 0 0 0 0 0 0 0 0 0 0 0 
##$SW_h= 40650.406504065
##$TD= 32768
##$TD0= 1
##$TE= 0
##$TE2= 300
##$TE3= 300
##$TEG= 300
##$TL= (0..7)
0 120 53 12 22 120 120 120 
##$TP= (0..7)
150 150 150 150 150 150 150 150 
##$TP07= 0
##$TPNAME0= <>
##$TPNAME1= <>
##$TPNAME2= <>
##$TPNAME3= <>
##$TPNAME4= <>
##$TPNAME5= <>
##$TPNAME6= <>
##$TPNAME7= <>
##$TPOAL= (0..7)
0.5 0.5 0.5 0.5 0.5 0.5 0.5 0.5 
##$TPOFFS= (0..7)
0 0 0 0 0 0 0 0 
##$TUNHIN= 0
##$TUNHOUT= 0
##$TUNXOUT= 0
##$USERA1= <user>
##$USERA2= <user>
##$USERA3= <user>
##$USERA4= <user>
##$USERA5= <user>
##$V9= 5
##$VALIST= <valist>
##$VCLIST= <CCCCCCCCCCCCCCC>
##$VD= 0
##$VDLIST= <DDDDDDDDDDDDDDD>
##$VPLIST= <PPPPPPPPPPPPPPP>
##$VTLIST= <TTTTTTTTTTTTTTT>
##$WBST= 1024
##$WBSW= 4
##$XGAIN= (0..3)
0 0 0 0 
##$XL= 0
##$YL= 0
##$YMAX_a= 2058
##$YMIN_a= -2590
##$ZGOPTNS= <>
##$ZL1= 120
##$ZL2= 120
##$ZL3= 120
##$ZL4= 120
##$ABSF1= 248.5645
##$ABSF2= -253.2056
##$ABSG= 5
##$ABSL= 3
##$ALPHA= 0
##$AQORDER= 0
##$ASSFAC= 0
##$ASSFACI= 0
##$ASSFACX= 0
##$ASSWID= 0
##$AUNMP= <proc_1d>
##$AZFE= 0.1
##$AZFW= 0.5
##$BCFW= 0
##$BC_mod= 2
##$BYTORDP= 0
##$COROFFS= 0
##$CY= -3
##$DATMOD= 1
##$DC= 0
##$DFILT= <>
##$DTYPP= 0
##$F1P= 0
##$F2P= 0
##$FCOR= 1
##$FTSIZE= 65536
##$FT_mod= 6
##$GAMMA= 0
##$GB= 0
##$INTBC= 1
##$INTSCL= 6.047779e-11
##$ISEN= 30
##$LB= 1
##$LEV0= 0
##$LPBIN= 0
##$MAXI= 10000
##$MC2= 0
##$MEAN= 0
##$ME_mod= 0
##$MI= 50
##$NCOEF= 0
##$NC_proc= -9
##$NLEV= 6
##$NOISF1= 182.463
##$NOISF2= 159.3651
##$NSP= 0
##$NTH_PI= 0
##$NZP= 0
##$OFFSET= 248.5645
##$PC= 4
##$PHC0= -11065.06
##$PHC1= 265.2102
##$PH_mod= 1
##$PKNL= yes
##$PPARMOD= 0
##$PSCAL= 0
##$PSIGN= 0
##$REVERSE= no
##$SF= 81.0140089999694
##$SI= 65536
##$SIGF1= 159.3651
##$SIGF2= -187.1042
##$SINO= 113.3802
##$SIOLD= 16384
##$SREGLST= <1H.CDCl3>
##$SSB= 0
##$STSI= 65536
##$STSR= 0
##$SW_p= 40650.406504065
##$SYMM= 0
##$S_DEV= 0
##$TDeff= 32768
##$TDoff= 0
##$TI= <>
##$TILT= no
##$TM1= 0
##$TM2= 0
##$TOPLEV= 0
##$USERP1= <user>
##$USERP2= <user>
##$USERP3= <user>
##$USERP4= <user>
##$USERP5= <user>
##$WDW= 1
##$XDIM= 65536
##$YMAX_p= 280560593
##$YMIN_p= -48533780
$$ End of Bruker specific parameters
$$ ---------------------------------
##NTUPLES= NMR SPECTRUM
##VAR_NAME=  FREQUENCY,     SPECTRUM/REAL,   SPECTRUM/IMAG
##SYMBOL=    X,             R,               I
##VAR_TYPE=  INDEPENDENT,   DEPENDENT,       DEPENDENT
##VAR_FORM=  AFFN,          ASDF,            ASDF
##VAR_DIM=   65536,         65536,           65536
##UNITS=     HZ,            ARBITRARY UNITS, ARBITRARY UNITS
##FACTOR=    0.620285442955139, 1,           1
##FIRST=     20137.2065510682, 0,            0
##LAST=      -20513.1999529968, 0,           0
##MIN=       -20513.1999529968, -48533780,   0
##MAX=       20137.2065510682, 280560593,    0
$$ Real data points
##PAGE= N=1
##DATA TABLE= (X++(R..R)), XYDATA
$$ [...]
$$ plain form
41600 4959943 6026391 4290424 6258866 16764026 26474786 22805678 9591205 3089762
41592 3089762 8716007 14432479 10229380 2419637 2350459 10141685 17528686 20181024
41584 20181024 18887276 13638810 5640992 1884053 8009648 17717179 18621100 9076163
41576 9076163 71024 -1190465 95022 -1979027 -3298808 1965535 9305349 9256344
41568 9256344 1215902 -6758757 -10036011 -10934101 -10913890 -7954179 -3080862 -1630983 -5145724
41559 -5145724 -8508509 -8170096 -6817762 -6096760 -1419869 9951529 20845323 21644120
41551 21644120 13197609 5423214 4436344 7390318 9211098 8063023 4203649 -379057
41543 -379057 -796088 5882873 13600904 12076551 966667 -7754449 -5650824 581762
$$ packed form
41600D959943J066448j735967J968442J0505160R710760l669108j3214473o501443
41592C089762N626245N716472m203099p809743o9178P791226P387001K652338
41584B0181024j293748n248466p997818l756939O125595R707531R03921r544937
41576I076163r005139j261489J285487k074049j319781N264343P339814m9005
41568I256344q040442p974659l277254q98090K0211K959711M873317J449879l514741
41559e145724l362785L38413J352334P21002M676891J1371398J0893794P98797
41551B1644120q446511p774395r86870K953974J820780j148075l859374m582706
41543c79057m17031O678961P718031j524353j1109884q721116K103625O232586
$$ plain form
41535 581762 -437639 -8000652 -11306426 -5996621 269946 242303 -2407086 586859 9516432
41526 9516432 15914670 13672498 6593331 2933792 4683950 5763478 1392783 -4426610
41518 -4426610 -4170936 2803391 10387712 15714133 22283163 30959982 34867090 28515559
41510 28515559 16801927 8474919 4658499 1132029 -1457508 1067322 6199857 6140717
41502 6140717 786604 -663060 5398618 9997733 5274067 -3058724 -4577262 813611
41494 813611 5226822 5559820 4737436 3187743 -1077156 -4727971 -1324091 7358378 11124705
41485 11124705 5399928 -2457735 -4946539 -5261614 -10384981 -18678474 -21688710 -16236677
41477 -16236677 -8396588 -5470374 -8379486 -12370573 -12191409 -6363619 1430138 5359125
$$ packed form
41535E81762j019401p563013l305774N309805O266567k7643k649389K993945Q929573
41526I516432O398238k242172p079167l659539J750158J079528m370695n819393
41518d426610K55674O974327P584321N326421O569030Q676819L907108o351531
41510B8515559j1713632q327008l816420l526470k589537K524830N132535n9140
41502F140717n354113j449664O061678M599115m723666q332791j518538N390873
41494H13611M413211L32998q22384j549693m264899l650815L403880Q682469L766327
41485A1124705n724777p857663k488804l15075n123367q293493l010236N452033
41477a6236677P840089K926214k909112l991087J79164N827790P793757L928987
$$ plain form
41469 5359125 3568505 514520 1372406 5349297 7013788 3384002 -2961430 -7362825
41461 -7362825 -7163271 -2733519 2883107 5295175 2287963 -3427791 -6809161 -5883036
41453 -5883036 -2681093 764415 4346899 7211479 6365349 228984 -7885189 -11917794
41445 -11917794 -8679938 -939442 4582389 2723298 -4913840 -10275127 -6597102 3610691
41437 3610691 10751519 9336910 4192205 3434341 8066956 12237307 12318925 10972943 11345244
41428 11345244 11534822 7984757 2307578 935009 7415487 17408173 22763017 19577108
41420 19577108 10940020 2431287 -3033189 -5252940 -3846166 1793910 9339835 13068293
41412 13068293 9243370 1683450 -626954 6803457 17718537 20795556 12115921 -45378
$$ packed form
41469E359125j790620l053985Q57886L976891J664491l629786o345432m401395
41461g362825J99554M429752N616626K412068l007212n715754l381370R26125
41453e883036L201943L445508L582484K864580q46130o136365q114173m032605
41445a1917794L237856P740496N521831j859091p637138n361287L678025J0207793
41437C610691P140828j414609n144705p57864M632615M170351Q1618j345982L72301
41428A1345244J89578l550065n677179j372569O480478R992686N354844l185909
41420A9577108q637088q508733n464476k219751J406774N640076P545925L728458
41412A3068293l824923p559920k310404P430411J0915080L077019q679635j2161299
$$ plain form
41404 -45378 -4570993 -62198 4938591 3818799 -237121 -236742 4475190 8157619 6980565
41395 6980565 2773446 -1406898 -4999314 -7979952 -8942680 -7392034 -5514304 -5524159 -6801786
41386 -6801786 -7025608 -4515971 1273371 8987265 13950946 11031062 1595462 -5453527
41378 -5453527 -3427909 3349143 4716502 -2473033 -11341961 -14906249 -13979363 -12979436
41370 -12979436 -11935015 -7086477 1593065 7887651 6286212 -848578 -5940906 -5338485
41362 -5338485 -2371157 -750754 422657 1781666 -1428972 -12541483 -23581490 -21271396
41354 -21271396 -4723474 11208990 14129428 8002111 3711628 3686212 3984757 5125595
41346 5125595 10057401 14656906 11516628 2720342 -1554604 1871207 5306311 3319644
$$ packed form
41404d5378m525615M508795N000789j119792m055920L79M711932L682429j177054
41395F980565m207119m180344l592416k980638r62728J550646J877730r855j277627
41386f801786k23822K509637N789342P713894M963681k919884r435600p048989
41378e453527K025618O777052J367359p189535q868928l564288R26886R99927
41370a2979436J044421M848538Q679542O294586j601439p134790n092328O02421
41362e338485K967328J620403J173411J359009l210638j1112511j1040007K310094
41354b1271396J6547922J5932464K920438o127317m290483k5416K98545J140838
41346E125595M931806M599505l140278q796286m274946L425811L435104j986667
$$ plain form
41338 3319644 -54847 -649824 -1174223 -3594221 -2960027 4125187 11393676 11183996 6460814
41329 6460814 6558357 13146342 17821259 13464510 2386850 -7310690 -9519586 -4051096
41321 -4051096 3967587 8119940 6026507 758584 -3479706 -5329658 -5185530 -3116072
41313 -3116072 -103420 1038187 -1295029 -4777180 -5282015 -743833 7582455 15683557
41305 15683557 18445322 13829003 6089784 1853631 2839964 5956513 9680319 14580968
41297 14580968 17658004 13826778 5067688 335430 2962790 5796187 3160037 -339355
41289 -339355 1175419 4678185 4449919 1979869 1667474 2228088 624898 -655145 998344
41280 998344 696229 -6295047 -13421550 -10290768 1138419 8650703 6936637 2226062
$$ packed form
41338C319644l374491n94977n24399k419998O34194P085214P268489k09680m723182
41329F460814R7543O587985M674917m356749j1077660r697540k208896N468490
41321d051096Q018683M152353k093433n267923m238290j849952J44128K069458
41313c116072L012652J141607k333216l482151n04835M538182Q326288Q101102
41305A5683557K761765m616319p739219m236153R86333L116549L723806M900649
41297A4580968L077036l831226q759090m732258K627360K833397k636150l499392
41289c39355J514774L502766k28266k470050l12395N60614j603190j280043J653489
41280I98344l02115o991276p126503L130782J1429187P512284j714066m710575
$$ plain form
41272 2226062 125110 -745450 -1932010 -1474533 992000 3187779 5383049 9427490
41264 9427490 12357747 8737681 -240208 -7594592 -10425974 -11122156 -9597309 -3823870
41256 -3823870 1836617 -839487 -11342501 -19629414 -19564477 -14353563 -7832380 -160963
41248 -160963 6972370 11432700 17544548 29901008 39696525 32239778 11094256 -2215877
41240 -2215877 886872 3052526 -10412962 -26983799 -26613625 -12749555 -5097062 -9837865
41232 -9837865 -16050033 -17304964 -18096226 -19405143 -15221846 -6323108 -3043111 -9498643
41224 -9498643 -16355847 -14566116 -7421789 -3621282 -5099616 -6912555 -4754602 1440674
41216 1440674 8488500 12021784 9797759 4265256 127153 -671624 230728 836262 737887
$$ packed form
41272B226062k100952q70560j186560M57477K466533K195779K195270M044441
41264I427490K930257l620066q977889p354384k831382o96182J524847N773439
41256c823870N660487k676104j0503014q286913O4937N210914O521183P671417
41248a60963P133333M460330O111848J2356460R795517p456747k1145522j3310133
41240b215877L102749K165654j3465488j6570837L70174J3864070P652493m740803
41232i837865o212168j254931p91262j308917M183297Q898738L279997o455532
41224i498643o857204J789731P144327L800507j478334j812939K157953O195276
41216A440674P047826L533284k224025n532503m138103p98777R02352O05534r8375
$$ plain form
41207 737887 1081220 4257955 11417284 18586873 18748041 10505462 1189596 -1658636 1650101
41198 1650101 5916820 7436022 4593600 -2199101 -7552446 -4523133 4662467 8654868
41190 8654868 3098658 -1822160 2754316 10119111 9543593 3453200 598988 -708610
41182 -708610 -7865015 -17304795 -18396798 -11862162 -8599073 -10460158 -7942754 1399336
41174 1399336 7757456 5829189 2316790 1973754 33937 -5301487 -5948917 2458692
41166 2458692 11017696 10091186 2438395 -3924520 -7451289 -9733965 -8412165 -1974525
41158 -1974525 4759356 7839431 10901871 17182194 21055849 16119384 6609647 1762444
41150 1762444 2478317 2527944 564859 1762250 7496099 11229248 6945764 -2939430 -10530908
$$ packed form
41207G37887L43333L176735P159329P169589J61168q242579r315866k848232L308737
41198A650101M266719J519202k842422o792701n353345L029313R185600L992401
41190H654868n556210m920818M576476P364795n75518o090393k854212j307598
41182g08610p156405r439780j092003O534636L263089j861085K517404R342090
41174A399336O358120j928267l512399l43036j939817n335424o47430Q407609
41166B458692Q559004r26510p652791o362915l526769k282676J321800O437640
41158a974525O733881L080075L062440O280323L873655m936465r509737m847203
41150A762444P15873M9627j963085J197391N733849L733149m283484r885194p591478
$$ plain form
41141 -10530908 -11608015 -10360247 -14109536 -22824389 -26897015 -19309618 -6826090 -1749878
41133 -1749878 -4444614 -4112891 2724344 6825071 3194155 773645 7432442 16257936
41125 16257936 16946697 11979689 9949033 9818015 4775843 -2552147 -2253065 6343843
41117 6343843 12069096 7144131 -4062380 -12704112 -14294792 -9241916 -1673446 1588084
41109 1588084 -2791348 -9255011 -9920139 -5677080 -4007280 -6566315 -6929509 -1487035
41101 -1487035 5189285 8090307 8303563 8879993 9275541 6988295 1489352 -5363628 -10498088
41092 -10498088 -10942641 -6615489 -1336342 1532784 2862930 4228225 3710530 -2576
41084 -2576 -2446746 1424381 9058762 13781413 14280540 13673998 11697472 6347358 1312671
$$ packed form
41141a0530908j077107J247768l749289q714853m072626P587397J2483528N076212
41133a749878k694736L31723O837235M100727l630916k420510O658797Q825494
41125A6257936O88761m967008k030656j31018n042172p327990K99082Q596908
41117F343843N725253m924965j1206511q641732j590680N052876P568470L261530
41109A588084m379432o463663o65128M243059J669800k559035l63194N442474
41101a487035O676320K901022K13256N76430L95548k287246n498943o852980n134460
41092a0498088m44553M327152N279147K869126J330146J365295n17695l713106
41084b576k444170L871127P634381M722651M99127o06542j976526n350114n034687
$$ plain form
41075 1312671 1826644 4026028 -347612 -8037949 -5528374 10516092 26217714 29264205
41067 29264205 23320243 16946951 9726302 -695568 -7522298 -3392000 5831445 8295067
41059 8295067 3847016 2747868 8526333 13841075 13809521 12538959 13951596 15355654
41051 15355654 13748173 11105934 9529790 7176244 2910503 -33913 1031338 3607162
41043 3607162 3725241 999429 -2853742 -7030868 -10172102 -9375814 -4307942 500474
41035 500474 1125698 -438674 -234851 915285 -472999 -3267912 -2575786 1616562 2718682
41026 2718682 -2648416 -8061157 -5496159 2628933 5734115 -598961 -8528425 -8583467
41018 -8583467 -1330105 5965116 10396653 14534638 17955559 15603726 6752548 -1157695
$$ packed form
41075A312671N13973K199384m373640p690337K509575J6044466J5701622L046491
41067B9264205n943962o373292p220649j0421870o826730M130298R223445K463622
41059H295067m448051j099148N778465N314742l1554j270562J412637J404058
41051A5355654j607481k642239j576144k353546m265741k944416J065251K575824
41043C607162J18079k725812l853171m177126l141234P96288N067872M808416
41035E00474O25224j564372K03823J150136j388284k794913O92126M192348J102120
41026B718682n367098n412741K564998Q125092L105182o333076p929464n5042
41018h583467P253362P295221M431537M137985L420921k351833q851178p910243
$$ plain form
41010 -1157695 -1682172 3017324 8253584 14649071 22927854 26030696 16731241 1385981
41002 1385981 -5323045 -946270 998862 -7319297 -13972016 -4251284 16180559 27028762
40994 27028762 19150870 3703946 -3904602 453048 10892785 19402842 20312229 14255336
40986 14255336 9706228 13754402 20227757 15608441 -761234 -12568537 -8399178 1877785
40978 1877785 1624982 -9068658 -15939244 -12635645 -7513119 -7898929 -9348155 -5230815
40970 -5230815 1342774 1870387 -5269117 -12781688 -13781387 -9368995 -6453010 -9754899
40962 -9754899 -16851995 -21229940 -19578870 -14377436 -9083913 -3744873 2693619 8469177
40954 8469177 10539551 8627271 5377917 3884155 6377069 12549465 17615042 16130278
$$ packed form
41010a157695n24477M699496N236260O395487Q278783L102842r299455j5345260
41002A385981o709026M376775J945132q318159o652719R720732K0431843J0848203
40994B7028762p877892j5446924p608548M357650J0439737Q510057R09387o056893
40986A4255336m549108M048174O473355m619316j6369675j1807303M169359J0276963
40978A877785k52803j0693640o870586L303599N122526l85810j449226M117340
40970e230815O573589N27613p139504p512571r99699M412392K915985l301889
40962i754899p097096m377945J651070N201434N293523N339040O438492N775558
40954H469177K070374j912280l249354j493762K492914O172396N065577j484764
$$ plain form
40946 16130278 10025384 7595510 11289071 13222952 7956995 1791746 1254301 476774
40938 476774 -8063081 -16713645 -11826851 3223655 10845533 5496162 316010 4238145
40930 4238145 9327394 7392846 3457892 3727467 4144250 1071445 249694 3709405 702771
40921 702771 -14302811 -26162739 -18429908 246984 7208973 -1951138 -10505796 -7457168
40913 -7457168 952052 6909691 10745460 11932546 6034869 -4523193 -9820149 -7269613
40905 -7269613 -5027513 -6504968 -4460944 3844942 8707801 3321048 -4173922 -3328772
40897 -3328772 3162707 6280299 5035571 3970498 2841213 -728635 -3171171 -19960
40889 -19960 4293672 1912244 -5018465 -6198895 1779366 11044548 14009164 11626027
$$ packed form
40946A6130278o104894k429874L693561J933881n265957o165249n37445p77527
40938D76774q539855q650564M886794J5050506P621878n349371n180152L922135
40930D238145N089249j934548l934954K69575M16783l072805q21751L459711l006634
40921G02771j5005582j1859928P732831J8676892O961989r160111q554658L048628
40913g457168Q409220N957639L835769J187086n897677j0558062n296956K550536
40905g269613K242100j477455K044024Q305886M862859n386753p494970Q45150
40897c328772O491479L117592j244728j065073j129285l569848k442536L151211
40889a9960M313632k381428o930709j180430P978261R265182K964616k383137
$$ plain form
40881 11626027 8314657 5252175 1568737 -2323843 -5335251 -7071226 -7372651 -6555725
40873 -6555725 -6159235 -7114371 -7655785 -5648628 -2135413 410328 2266526 5285142 8472181
40864 8472181 9081154 7954333 9101616 12991102 14576406 9894460 1124672 -7143577
40856 -7143577 -13574899 -18914301 -21139421 -15878580 -2738271 10878268 14738303 5750278
40848 5750278 -7812758 -14263868 -11316175 -8327713 -13812430 -23848337 -27422738 -21667149
40840 -21667149 -15478337 -16740782 -22109452 -23351730 -19085086 -14541554 -12334518 -10016885
40832 -10016885 -6569361 -4985318 -6480225 -7175636 -3557642 2412985 6686250 8506102
40824 8506102 9332150 9580691 10156959 13933421 20692890 23426696 16194305 4157833
$$ packed form
40881A1626027l311370l062482l683438l892580l011408j735975l01425Q16926
40873f555725L96490r55136n41414K007157L513215K545741J856198L018616L187039
40864H472181O08973j126821J147283L889486J585304m681946q769788q268249
40856g143577o431322n339402k225120N260841J3140309J3616539L860035q988025
40848E750278j3563036o451110K947693K988462n484717j0035907l574401N755589
40840b1667149O188812j262445n368670j242278M266644M543532K207036K317633
40832a0016885L447524J584043j494907o95411L617994N970627M273265J819852
40824H506102Q26048K48541N76268L776462O759469K733806p232391j2036472
$$ plain form
40816 4157833 -1714546 209124 967307 -3337596 -4407332 4149382 14103383 12786238
40808 12786238 670587 -10780370 -15734233 -18201426 -20296336 -17080814 -6309565 5158679
40800 5158679 9691314 7994889 5350755 3510930 1358690 -73337 933820 2016201
40792 2016201 -1011548 -6949618 -8878089 -2826349 5988735 7978300 -484015 -13166874
40784 -13166874 -20593505 -19500287 -14921315 -13450290 -16001525 -17900115 -14917255 -7783851
40776 -7783851 -802086 3085083 5064958 7620298 9394308 5756138 -3536703 -10746481
40768 -10746481 -9201766 -3453257 -3058302 -7252194 -5823352 2708072 5637098 -4592107
40760 -4592107 -16807371 -17480118 -11427119 -12260228 -18515866 -15956588 -2000283 8783551
$$ packed form
40816D157833n872379J923670P58183m304903j069736Q556714R954001j317145
40808A2786238j2115651j1450957m953863k467193k094910L215522J0771249J1468244
40800E158679M532635j696425k644134j839825k152240j432027J007157J082381
40792B016201l027749n938070j928471O051740Q815084J989565q462315j2682859
40784a3166874p426631J093218M578972J471025k551235j898590K982860P133404
40776g783851O981765L887169J979875K555340J774010l638170r292841p209778
40768a0746481J544715N748509L94955m193892J428842Q531424K929026j0229205
40760d592107j2215264o72747O052999q33109o255638K559278J3956305J0783834
$$ plain form
40752 8783551 5710290 -6231834 -18810530 -29960421 -35620453 -27203328 -6083456 11516056
40744 11516056 13752751 7163224 2707859 -679667 -7288662 -10670058 -3811148 4421798
40736 4421798 -13596 -12965865 -16370568 -5428510 4765612 2321717 -6628584 -11366930
40728 -11366930 -11766027 -12461339 -12112819 -7642634 -2679552 -3006494 -7016827 -7754857 -2641473
40719 -2641473 4027616 6866849 3817908 -3486095 -10194521 -10689512 -4179465 2977456
40711 2977456 3545767 -2383220 -7766232 -6743520 -144812 7104398 11722852 13877072
40703 13877072 14488944 13145239 9706419 6232199 4842400 4278837 1506035 -3339912
40695 -3339912 -6964739 -7881283 -6888229 -2367969 8122362 19203270 18967601 4945642
$$ packed form
40752H783551l073261j1942124j2578696j1149891n660032Q417125K1119872J7599512
40744A1516056K236695o589527m455365l387526o608995l381396O858910Q232946
40736D421798m435394j2952269l404703J0942058J0194122k443895q950301m738346
40728a1366930l99097o95312L48520M470185M963082l26942m010333p38030N113384
40719b641473O669089K839233l048941p304003o708426m94991O510047P156921
40711B977456N68311n928987n383012J022712O598708P249210M618454K154220
40703A3877072O11872j343705l438820l474220j389799n63563k772802m845947
40695c339912l624827r16544R93054M520260J0490331J1080908k35669j4021959
$$ plain form
40687 4945642 -8861795 -9713204 -4364896 -7817998 -18212651 -18094105 -1600861 14798278
40679 14798278 14713403 2808915 -4993216 -2962560 2583381 6443485 8897219 9613504
40671 9613504 6630927 1472670 -1504608 -1392371 -1286216 -2238710 -1096887 4624488 12672423
40662 12672423 17917933 17171573 12227757 8243996 7751863 6930533 1068332 -6939521
40654 -6939521 -9223142 -5144130 -3910044 -11450202 -21303123 -23773535 -18235457 -10175174
40646 -10175174 -1786765 6608102 10459336 5661733 -3092079 -7458347 -7259005 -8489814
40638 -8489814 -11223564 -9497996 -3202619 243125 -2220059 -5320666 -5703017 -6582619
40630 -6582619 -8989076 -8134504 -3170834 -1225239 -5807354 -9902432 -7426254 -3060743
$$ packed form
40687D945642j3807437q51409N348308l453102j0394653J18546J6493244J6399139
40679A4798278q4875j1904488p802131K030656N545941L860104K453734P16285
40671I613504k982577n158257k977278J12237J06155r52494J141823N721375Q047935
40662A2672423N245510p46360m943816l983761m92133q21330n862201q007853
40654f939521k283621M079012J234086p540158r852921k470412N538078Q060283
40646a0175174Q388409Q394867L851234m797603q753812m366268J99342j230809
40638h489814k733750J725568O295377L445744k463184l100607l82351q79602
40630f582619k406457Q54572M963670J945595m582115m095078K476178M365511
$$ plain form
40622 -3060743 -2383047 -317324 9758358 21278701 21328529 9888676 492215 1517030
40614 1517030 7181414 8753973 5565107 1909952 238613 718082 2284824 1881552
40606 1881552 -2623039 -7352700 -5345291 3800011 11935229 11695730 3734205 -6221453
40598 -6221453 -13034827 -14099974 -10298821 -5991627 -4122020 -1947643 3386699 7151499
40590 7151499 3212547 -2869002 2047193 18653121 30469871 25172747 10776398 2356858
40582 2356858 1026905 -3354137 -13912276 -22534812 -22283033 -14841840 -6022400 -1192676
40574 -1192676 -4352425 -14421042 -22512246 -19550836 -7112300 4583691 9007473 8274378
40566 8274378 6833597 6548347 7851658 9617638 7800939 227954 -7457179 -7509015 -2081892
$$ packed form
40622c060743O77696K065723J0075682J1520343M9828j1439853r396461J024815
40614A517030N664384J572559l188866l655155j671339M79469J566742m03272
40606A881552m504591m729661K007409R145302Q135218k39499p961525r955658
40598f221453o813374j065147L801153M307194J869607K174377N334342L764800
40590G151499l938952o081549M916195J6605928J1816750n297124j4396349q419540
40582B356858j329953m381042j0558139q622536K51779P441193Q819440M829724
40574a192676l159749j0068617q091204K961410J2438536J1695991M423782p33095
40566H274378j440781k85250J303311J765980j816699p572985p685133n1836N427123
$$ plain form
40557 -2081892 -1577954 -8928355 -13730536 -6648715 7177444 15529486 15334371 14112385
40549 14112385 16999006 19808780 16797322 9802487 5240800 4091253 101894 -10394583
40541 -10394583 -21033707 -22219645 -13463986 -3412079 2028145 4933449 7678365 8139640
40533 8139640 6355746 7584378 12406276 11998062 2270732 -4860117 3340002 19128375
40525 19128375 22880283 11247017 1027632 3175749 8908492 7530312 3469976 5863454
40517 5863454 12187338 13504677 8791825 3547634 -619500 -5117583 -6969612 -1930059
40509 -1930059 6974931 12229757 11855599 9741996 7660586 4031049 -452238 -2916186
40501 -2916186 -3732645 -5576821 -7193195 -4293125 2788428 8177633 8461717 6478818
$$ packed form
40557b081892N03938p350401m802181P081821J3826159Q352042j95115j221986
40549A4112385K886621K809774l011458o994835m561687j149547l989359j0496477
40541a0394583j0639124j185938Q755659J0051907N440224K905304K744916M61275
40533H139640j783894J228632M821898m08214r727330p130849Q200119J5788373
40525A9128375L751908j1633266j0219385K148117N732743j378180m060336K393478
40517E863454O323884J317339m712852n244191m167134m498083j852029N039553
40509a930059Q904990N254826l74158k113603k081410l629537m483287k463948
40501b916186q16459j844176j616374K900070P081553N389205K84084j982899
$$ plain form
40493 6478818 5608228 5273866 4616798 6169875 11783237 17325960 16135261 7934664 487772
40484 487772 268463 4142955 4171443 -435266 -1964912 3300949 7850573 4131211 -2143139
40475 -2143139 890635 12650959 19204818 12691568 1598742 -2714807 -735269 518103
40467 518103 104439 1887734 5023741 4484991 -242334 -4001684 -3388826 89196 4482343
40458 4482343 10363988 17977277 24129263 23787310 15238467 3918644 -851553 4066104
40450 4066104 10548678 9005158 1748301 -428442 5313031 9929978 7116800 2032452
40442 2032452 622417 -518966 -6522819 -13956448 -16105160 -12935486 -8538766 -3979813
40434 -3979813 247660 338051 -4395610 -6572604 -713025 6706389 6210049 47478 -1810350
$$ packed form
40493F478818q70590l34362o57068J553077N613362N542723j190699q200597p446892
40484D87772k19309L874492K8488m606709j529646N265861M549624l719362o274350
40475b143139L033774J1760324O553859o513250j1092826m313549J979538J253372
40467E18103m13664J783295L136007n38750m727325l759350O12858L478022M393147
40458D482343N881645P613289O151986l41953q548843j1319823m770197M917657
40450D066104O482574j543520p256857k176743N741473M616947k813178n084348
40442B032452j410035j141383o003853p433629k148712L169674M396720M558953
40434c979813M227473R0391m733661k176994N859579P419414m96340o162571j857828
$$ plain form
40425 -1810350 2713831 6185044 4087176 -247205 -2484414 -1503029 2163971 5616723
40417 5616723 3711906 -3548420 -7376014 -1448757 7402722 8433434 2566740 -1196316
40409 -1196316 -805697 -1085424 -1547796 3272178 12272383 18167771 18990238 18710603 18039825
40400 18039825 15804019 16747733 24561928 29611163 19609247 1833964 -3187639 8084743
40392 8084743 17356689 14258400 10557916 15982854 19858848 10514275 -3703147 -9131587
40384 -9131587 -9249099 -14544276 -20039933 -12642370 4149323 11930132 3324262 -9742596
40376 -9742596 -15228056 -14740261 -14974747 -16687205 -16836583 -14120633 -8739287 -1986916 2197838
40367 2197838 462730 -4064419 -4207206 1774486 7774760 8210858 4721364 2720233
$$ packed form
40425a810350M524181L471213k097868m334381k237209R81385L667000L452752
40417E616723j904817p260326l827594N927257Q851479J030712n866694l763056
40409a196316L90619k79727m62372M819974R000205N895388Q22467k79635o70778
40400A8039825k235806R43714P814195N049235j0001916j7775283n021603J1272382
40392H084743R271946l098289l700484N424938L875994r344573j4217422n428440
40384i131587j17512n295177n495657P397563J6791693P780809q605870j3066858
40376i742596n485460M87795k34486j712458j49378K715950N381346O752371M184754
40367B197838j735108m527149j42787N981692O000274M36098l489494k001131
$$ plain form
40359 2720233 4037147 4993871 1300740 -5795891 -9502473 -5460907 1803036 4573372
40351 4573372 2888658 3342334 7069575 7620358 2896603 -723197 -578613 -3243888 -10691353
40342 -10691353 -12161106 -820406 11261257 9102142 -1265449 -1421259 10627533 18355951
40334 18355951 13795024 8366275 11883805 17560993 16450910 12656925 13125328 13453148
40326 13453148 6553007 -2458609 -3385782 1898880 2668350 -2675139 -5010424 -1134837
40318 -1134837 901067 -3551148 -7262668 -3445813 2609248 2223411 -2687285 -3098289
40310 -3098289 3257981 9990776 12311677 11298304 8499740 4083758 1002220 3376927
40302 3376927 8890929 10002805 5257458 1929982 3791003 4279861 -2206427 -9683127
$$ packed form
40359B720233J316914R56724l693131p096631l706582M041566P263943K770336
40351D573372j684714M53676L727241N50783m723755l619800J44584k665275p447465
40342a0691353j469753J1340700J2081663k159115j0367591j55810J2048792P728418
40334A8355951m560927n428749L517530N677188j110083l793985M68403L27820
40326A3453148o900141r011616r27173N284662P69470n343489k335285L875587
40318a134837K035904m452215l711520L816855O055061l85837m910696m11004
40310c098289O356270O732795K320901j013373k798564m415982l081538K374707
40302C376927N514002J111876m745347l327476J861021M88858o486288p476700
$$ plain form
40294 -9683127 -9599509 -4976464 -5663341 -12404157 -15779132 -10639419 -2419292 2218620 3407123
40285 3407123 4749608 7733477 10979108 11025731 4606233 -5514143 -9940084 -4408127
40277 -4408127 1593113 -2950946 -13268473 -15709176 -9894431 -9027508 -16765773 -20110922
40269 -20110922 -10927390 877735 4253133 3181943 5317745 7051241 2898245 -726179
40261 -726179 4085132 10470606 6805601 -2209074 -966168 12385242 22542415 19528949
40253 19528949 10634928 6799671 8878236 11616983 11633890 7086358 -2673184 -12998689
40245 -12998689 -16096032 -10867744 -5093846 -5142923 -8940946 -11420473 -11190874 -8920895
40237 -8920895 -4379595 1368651 4738985 3895214 1733142 2542171 7717374 15473005
$$ packed form
40294i683127Q3618M623045o86877o740816l374975N139713Q220127M637912J188503
40285C407123J342485K983869L245631M6623o419498j0120376m425941N531957
40277d408127O001240m544059j0317527k440703N814745Q66923p738265l345149
40269b0110922R183532J1805125L375398j071190K135802J733496m152996l624424
40261g26179M811311O385474l665005r014675J242906J3351410J0157173l013466
40253A9528949q894021l835257K078565K738747J6907m547532r759542j0325505
40245a2998689l097343N228288N773898m9077l798023k479527K29599K269979
40237h920895M541300N748246L370334q43771k162072Q09029N175203P755631
$$ plain form
40229 15473005 22229759 24126845 20394456 15676829 15937631 21586889 27157114 27443125
40221 27443125 21389202 11240694 1619511 -1599015 3963223 13372603 18867082 18051435
40213 18051435 14658025 12390325 11981067 13351456 16054120 17484051 14506866 7165852
40205 7165852 -1913311 -10948228 -18965181 -23778280 -23359079 -18332984 -11054567 -4323201
40197 -4323201 -2172065 -6880171 -12491579 -8322648 5760298 15213562 9801440 -1074935
40189 -1074935 -2738006 2433444 1539069 -4763785 -2416620 11585157 22495027 20006789
40181 20006789 11748724 8340934 8793726 8274664 7699059 6942950 243287 -11917631
40173 -11917631 -17336593 -9680765 -1607499 -7254148 -19627321 -20206327 -6167770 7100051
$$ packed form
40229A5473005O756754J897086l732389m717627K60802N649258N570225K86011
40221B7443125o053923j0148508r621183l218526N562238R409380N494479q15647
40213A8051435l393410k267700m09258J370389K702664J429931k977185p341014
40205G165852r079163r034917q016953m813099M19201N026095P278417O731366
40197d323201K151136m708106n611408M168931J4082946R453264n412122j0876375
40189a074935j663071N171450q94375o302854K347165J4001777J0909870k488238
40181B0006789q258065l407790M52792n19062n75605p56109o699663j2160918
40173a1917631n418962P655828Q073266n646649j2373173n79006J4038557J3267821
$$ plain form
40165 7100051 8812116 3717868 -370290 -2556050 -3176217 528372 7998718 12741013
40157 12741013 10864238 6273036 3915084 3392884 2286672 551536 -1253697 -3152523
40149 -3152523 -2675941 3999576 14823357 21270941 18892318 13393828 11558500 10996113
40141 10996113 5275971 -4035574 -8032912 -2812640 5406650 9008267 7845710 7020030
40133 7020030 9260140 12401807 13066800 10926321 9347218 11618311 15995835 16380325
40125 16380325 10294738 3737527 3275504 5103524 -392609 -12448529 -17888281 -10070893
40117 -10070893 -265600 -944043 -5663057 784057 16027909 20501502 6374095 -9900983
40109 -9900983 -11188841 -2025816 3448071 4640117 11113031 22609933 28227005 24101269
$$ packed form
40165G100051J712065n094248m088158k185760o20167L704589P470346M742295
40157A2741013j876775m591202k357952n22200j106212j735136j805233j898826
40149c152523M76582O675517J0823781O447584k378623n498490j835328n62387
40141A0996113n720142r311545l997338N220272Q219290L601617j162557q25680
40133G020030K240110L141667O64993k140479j579103K271093M377524L84490
40125A6380325o085587o557211m62023J828020n496133j2055920n439752P817388
40117a0070893R805293o78443m719014O447114J5243852M473593j4127407j6275078
40109i900983j287858R163025N473887J192046O472914J1496902N617072m125736
$$ plain form
40101 24101269 17777241 13580853 6508702 -5391087 -13605440 -10314079 831181 11079677
40093 11079677 17531503 21669124 22099491 15971314 5557004 -2617328 -5182977 -4590631
40085 -4590631 -4129902 -3215345 1081171 8714652 14308281 11720529 1414115 -8857133
40077 -8857133 -12223390 -9170145 -3998026 1232593 5132980 3495354 -5746978 -16056530
40069 -16056530 -18188040 -11968952 -5042412 -558872 5099277 11567068 11829707 4539787
40061 4539787 -254110 5431660 15018990 16033897 6894022 -2569957 -4773868 -1198219
40053 -1198219 3730248 8879279 14829101 20112578 21575076 17928765 12406484 10960249
40045 10960249 15770639 20847995 17571299 5613118 -5171590 -5463328 3910265 14364234
$$ packed form
40101B4101269o324028m196388p072151j1899789q214353L291361J1145260J0248496
40093A1079677O451826M137621M30367o128177j0414310q174332k565649N92346
40085d590631M60729R14557M296516P633481N593629k587752j0306414j0271248
40077h857133l366257L053245N172119N230619L900387j637626r242332j0309552
40069a6056530k131510O219088O926540M483540N658149O467791K62639p289920
40061D539787m793897N685770R587330J014907r139875r463979k203911L575649
40053a198219M928467N149031N949822N283477J462498l646311n522281j446235
40045A0960249M810390N077356l276696j1958181j0784708k91738R373593J0453969
$$ plain form
40037 14364234 18145610 13340786 4549491 530960 6854058 18437713 23695407 18658643
40029 18658643 12079558 13139943 19523323 22793596 20928079 18970451 20131079 22893068
40021 22893068 25522042 27302670 25894099 19254656 10563737 6251381 8208044 11934593
40013 11934593 13284408 13478106 16232051 22520043 29112183 30615783 23322055 9530172
40005 9530172 -2141828 -3649542 4613299 14768220 20188011 20788334 19448916 16610511
39997 16610511 11011406 4465224 2712910 9649267 21238794 27493053 22479318 11645099
39989 11645099 6736381 13089261 24289755 30170813 27421704 20498200 14434006 9935009
39981 9935009 5203245 14222 -3158422 -1533660 4904205 12816575 18040922 18464506
$$ packed form
40037A4364234L781376m804824q791295m018531O323098J1583655N257694n036764
40029A8658643o579085J060385O383380L270273j865517j957628J160628K761989
40021B2893068K628974J780628j408571o639443q690919m312356J956663L726549
40013A1934593J349815J93698K753945O287992O592140J503600p293728j3791883
40005I530172j1672000j507714Q262841J0154921N419791O00323j339418k838405
39997A6610511n599105o546182j752314O936357J1589527O254259n013735j0834219
39989A1645099m908718O352880J1200494N881058k749109o923504o064194m498997
39981I935009m731764n189023l172644J624762O437865P912370N224347M23584
$$ plain form
39973 18464506 14679752 9443326 7251174 11996169 22317606 30610807 29860489 21283560
39965 21283560 12922529 11311063 16559923 23982006 27583318 23860491 15987964 12377172
39957 12377172 16624129 21026561 15737604 2402723 -8326116 -11561277 -12033282 -13136987
39949 -13136987 -11724980 -6298012 -1297832 760200 3294734 7446837 8138035 3813613
39941 3813613 1945554 7685764 14228420 12940545 7449382 8384616 17649105 26720792
39933 26720792 28575562 23735621 16212042 10241169 9163458 11119930 8302272 -2650323
39925 -2650323 -12336445 -9010411 4315836 12287410 7021902 -3086143 -6186134 -1094669
39917 -1094669 4322858 3196944 -4756925 -13481035 -14559164 -4837417 8650758 15102312
$$ packed form
39973A8464506l784754n236426k192152M744995J0321437Q293201p50318q576929
39965B1283560q361031j611466N248860P422083L601312l722827p872527l610792
39957A2377172M246957M402432n288957j3334881j0728839l235161m72005j103705
39949a3136987J412007N426968N000180K058032K534534M152103O91198m324422
39941C813613j868059N740210O542656j287875n491163R35234R264489R071687
39933B6720792J854770m839941p523579n970873j077711J956472k817658j0952595
39925b650323r686122L326034J3326247P971574n265508j0108045l099991N091465
39917a094669N417527j125914p953869q724110j078129R721747J3488175O451554
$$ plain form
39909 15102312 12067144 7303314 8134966 13494090 17579211 16954245 12296683 6773097
39901 6773097 4362335 6794508 10941852 11963746 9657846 8687156 11968443 17096161
39893 17096161 20318767 21323706 23019093 28249021 36624101 43237272 42509829 36051810
39885 36051810 33690580 41695605 52604712 53949157 46145407 42950784 52174088 64576569
39877 64576569 66828879 58622756 50205375 47424971 46863965 44254856 40572870 38485446
39869 38485446 37598872 35565792 31515834 26657077 22675221 20612381 20705861 22559061
39861 22559061 25284928 27470250 27652240 26088820 25959001 30828452 39965873 48050165
39853 48050165 51348569 52802265 58431012 69161291 79133461 82708492 80073384 73964669
$$ packed form
39909A5102312l035168m763830Q31652N359124M085121o24966m657562n523586
39901F773097k410762K432173M147344J021894k305900r70690L281287N127718
39893A7096161L222606J004939J695387N229928Q375080O613171p27443o458019
39885C6051810k361230Q005025J0909107J344445p803750l194623R223304J2402481
39877F4576569K252310q206123q417381k780404n61006k609109l681986k087424
39869C8485446q86574k033080m049958m858757l981856k062840R3480J853200
39861B2559061K725867K185322J81990j563420j29819M869451R137421Q084292
39853D8050165L298404J453696N628747J0730279R972170L575031k635108o108715
$$ plain form
39845 73964669 63984611 48712418 32665925 25555529 31874315 44516557 51796075 48686676
39837 48686676 38764455 28138659 21385899 21059437 26220026 32155206 35319676 37054308
39829 37054308 38651741 36159275 26795451 17819191 19624273 30113332 36118407 32486537
39821 32486537 29196129 35003585 44506430 48831014 50069478 55246213 62392147 63618643
39813 63618643 58669262 54911541 54939169 53556972 47681639 41461528 39827833 42319626
39805 42319626 44507006 41997520 33581660 23752002 20190900 24888311 30484864 29925013
39797 29925013 26120076 26136569 29625447 30818855 29342037 30064090 32973924 32055928 25037791
39788 25037791 16578363 10838785 8082404 9185732 15434677 22325614 22076837 15455196
$$ packed form
39845G3964669r980058j5272193j6046493p110396O318786J2642242P279518l109399
39837D8686676r922221j0625796o752760l26462N160589N935180L164470J734632
39829C7054308J597433k492466r363824q976260J805082J0489059O005075l631870
39821C2486537l290408N807456R502845M324584J238464N176735P145934J226496
39813F3618643m949381l757721K7628j382197n875333o220111j633695K491793
39805D2319626K187380k509486q415860r829658l561102M697411N596553n59851
39797B9925013l804937J6493L488878J193408j476818P22053K909834r17996p018137
39788B5037791q459428n739578k756381J103328O248945O890937k48777o621641
$$ plain form
39780 15455196 13155286 20879080 30088184 29632835 21248633 16220524 19175738 22612144
39772 22612144 18634007 10777650 10162421 20963240 33783003 36387160 29215778 25237041
39764 25237041 33466466 48061270 56886593 55817800 49880550 44699367 42754778 44811000
39756 44811000 48847604 49825814 45617026 39986654 34951346 25949105 12053942 4274800
39748 4274800 11921202 24887066 23659564 6518408 -7311256 -3826388 9814903 19681334
39740 19681334 22742331 23639821 24359280 24886944 26481354 27669682 23777743 15920728
39732 15920728 12966045 18599619 24147419 21234081 14266564 12232381 14483033 13924066
39724 13924066 9743660 7361387 8200384 8358626 6419720 4794420 3449757 -749378
$$ packed form
39780A5455196k299910P723794R209104m55349q384202n028109K955214L436406
39772B2612144l978137p856357o15229J0800819J2819763K604157p171382l978737
39764B5237041Q229425J4594804Q825323j068793n937250n181183j944589K056222
39756D4811000M036604R78210m208788n630372n035308r002241j3895163p779142
39748D274800P646402J2965864j227502j7141156j3829664L484868J3641291R866431
39740A9681334L060997Q97490P19459N27664J594410J188328l891939p857015
39732A5920728k954683N633574N547800k913338o967517k034183K250652n58967
39724A3924066m180406k382273Q38997J58242j938906j625300j344663m199135
$$ plain form
39716 -749378 -7581065 -11918879 -10063791 -3840276 2395589 5690157 5047538 1256352
39708 1256352 -2519006 -2003243 4319313 12378308 14874040 8669412 251047 613770
39700 613770 12471330 26022263 30878987 27959662 24226734 20634404 13924248 6740436
39692 6740436 4995981 6687928 5257682 3668838 11178716 24287400 27037098 16359675
39684 16359675 10894397 23932767 41828918 43565920 30774352 21660610 22166286 21019558
39676 21019558 11255076 73855 -4427886 -2975284 1407474 8553634 15933122 17062884
39668 17062884 9516865 -1119502 -7865876 -8538342 -4946980 -1068179 -2006491 -9334962
39660 -9334962 -17499718 -19942328 -17826453 -16884764 -17094329 -12995209 -4195058 2286291
$$ packed form
39716g49378o831687m337814J855088O223515O235865L294568o42619l791186
39708A256352l775358N15763O322556Q058995K495732o204628q418365L62723
39700F13770J1857560J3550933M856724k919325l732928l592330o710156p183812
39692F740436j744455J691947j430246j588844P509878J3108684K749698j0677423
39684A6359675n465278J3038370J7896151J737002j2791568r113742N05676j146728
39676B1019558r764482j1181221m501741J452602M382758P146160P379488J129762
39668A7062884p546019j0636367o746374o72466L591362L878801r38312p328471
39660i334962q164756k442610K115875R41689k09565M099120Q800151O481349
$$ plain form
39652 2286291 1789294 -2394599 -4933021 -4136627 -336671 5333098 8521031 4037218
39644 4037218 -6105975 -11821541 -6137023 5355437 9580994 -212522 -17171019 -27150598
39636 -27150598 -22488607 -9559360 -1108355 -1669282 -4996672 -6187480 -8199520 -12016002
39628 -12016002 -9710424 3107776 14891215 10930405 -4677408 -13118803 -6406095 4363434
39620 4363434 7737665 5532883 3679234 1866864 -1330549 -3142265 -2964378 -5045856
39612 -5045856 -8616269 -4798953 9209296 22208336 24190024 20797626 22161755 25341231
39604 25341231 20884294 11227646 7762162 11601386 11947439 4619675 -1511070 94482
39596 94482 4392031 6165154 9302435 17120689 22681696 18028229 6870843 -1021376
$$ packed form
39652B286291m96997m183893k538422P96394L799956N669769L187933m483813
39644D037218j0143193n715566N684518J1492460M225557r793516j6958497r979579
39636b7150598M661991J2929247Q451005n60927l327390j190808k012040l816482
39628a2016002K305578J2818200J1783439l960810j5607813q441395O712708J0769529
39620D363434L374231k204782j853649j812370l197413j811716J77887k081478
39612e045856l570413L817316J4008249J2999040J981688l392398J364129L179476
39604B5341231m456937r656648l465484L839224L46053p327764o130745J605552
39596I4482M297549J773123L137281P818254N561007m653467j1157386p892219
$$ plain form
39588 -1021376 -3561028 -5378503 -6546928 -2503523 5403293 9193521 6078634 2616815
39580 2616815 3628645 4327637 -1218196 -9275639 -10845582 -4402197 2127878 2077321 -2167178
39571 -2167178 -3355080 1748597 9160092 11759900 5797749 -5513729 -14325950 -14643237
39563 -14643237 -6767252 4193930 12635674 15071907 11425379 6052980 5301659 10818739
39555 10818739 16574318 15920872 10593380 8544528 12962069 18223789 18331439 14974681
39547 14974681 14003037 16817026 19250486 17869472 13594327 8839058 4505755 1589233
39539 1589233 3167576 11172553 21293025 24964215 18827883 9527613 5510020 6156072
39531 6156072 4346179 -1152127 -3377541 658782 3497039 -1478386 -8729646 -8485421
$$ packed form
39588a021376k539652j817475j168425M043405P906816L790228l114887l461819
39580B616815J011830O98992n545833q057443j569943O443385O530075n0557m244499
39571b167178j187902N103677P411495K599808n962151j1311478q812221l17287
39563a4643237P875985J0961182Q441744K436233l646528n372399p51321N517080
39555A0818739N755579o53446n327492k048852M417541N261720J07650l356758
39547A4974681r71644K813989K433460j381014m275145m755269m333303k916522
39539A589233J578343Q004977J0120472L671190o136332r300270m017593O46052
39531F156072j809893n498306k225414M036323K838257m975425p251260K44225
$$ plain form
39523 -8485421 -1798625 1470500 -1868726 -4171157 671563 8552209 11430342 6795025
39515 6795025 -1109583 -5235304 -428314 11103682 19224098 16169714 6790932 2178896
39507 2178896 4289962 5573867 3821752 6336840 15914112 23535625 21707981 16371101
39499 16371101 17241058 22610627 22756480 14869655 6134850 3069977 4368195 4498393
39491 4498393 170724 -6999645 -12112292 -11842314 -8193990 -5462982 -4180588 -2015717
39483 -2015717 430069 868209 1670512 6839721 12311438 9321609 -393129 -4169497
39475 -4169497 2325454 7550454 3030101 -2357213 2330640 11042959 10424434 1284237
39467 1284237 -3954155 -1150471 1989019 513201 -2083286 -2538684 -1422400 2011844
$$ packed form
39523h485421O686796L269125l339226k302431M842720P880646K878133m635317
39515F795025p904608m125721M806990J1531996Q120416l054384r378782m612036
39507B178896K111066J283905j752115K515088R577272P621513j827644n336880
39499A6371101Q69957N369569J45853p886825q734805l064873J298218J30198
39491D498393m327669p170369n112647K69978L648324K731008J282394K164871
39483b015717K445786M38140Q02303N169209N471717k989829r714738l776368
39475d169497O494951N225000m520353n387314M687853Q712319o18525r140197
39467A284237n238392K803684L139490j475818k596487m55398J116284L434244
$$ plain form
39459 2011844 8875128 14449261 11936185 2557257 -6167782 -11477858 -16152019 -19109401
39451 -19109401 -14857501 -3271460 8496818 15250501 17879178 17816428 14463158 8814635
39443 8814635 3461461 -1029691 -4296524 -2706618 5340656 12704881 10268580 -551667
39435 -551667 -9602938 -10915884 -6358744 1090786 8703450 10779549 4160412 -4125231
39427 -4125231 -4598019 582945 1783198 -1396651 8203 7627881 12132546 8718224
39419 8718224 3958747 3657194 5002030 4696196 4571812 5273472 4086756 2432996 5741944
39410 5741944 12844325 15858861 13802602 15217213 23288027 29706737 28264349 23540121
39402 23540121 20744466 17827542 13419068 11752678 13481667 12175717 6136864 2874487
$$ packed form
39459B011844O863284N574133k513076r378928q725039n310076m674161k957382
39451a9109401M251900J1586041J1768278O753683K628677o2750l353270n648523
39443H814635n353174m491152l266833J589906Q047274P364225k436301j0820247
39435e51667r051271j312946M557140P449530P612664K076099o619137q285643
39427d125231m72788N180964J200253l179849J404854P619678M504665l414322
39419H718224m759477l01553J344836l05834j24384P01660j186716j653760L308948
39410E741944P102381L014536k056259J414611Q070814O418710j442388m724228
39402B3540121k795655k916924m408474j666390J728989j305950o038853l262377
$$ plain form
39394 2874487 5685309 7652409 5967513 9132540 20719521 28927716 23739481 12977509
39386 12977509 9088578 10738315 10567697 10648711 15357771 18229464 12317581 6117537
39378 6117537 11797034 23235356 24005025 13867055 8788091 15365797 23231348 24313049
39370 24313049 22531010 20867910 14649886 3232451 -4846619 -4155810 1156070 7384766
39362 7384766 16333098 25907071 27621835 19562933 10999118 7795294 4126369 -4028877
39354 -4028877 -8544039 -2442497 6093005 5305066 -1431522 -1929250 3947727 4513981 -2519166
39345 -2519166 -3652740 10115736 27791568 31955259 21365956 10440974 8857775 11573106
39337 11573106 10616034 7727247 9235544 13982716 14814301 10744935 9162228 13951794
$$ packed form
39394B874487K810822J967100j684896L165027J1586981Q208195n188235j0761972
39386A2977509l888931J649737j70618Q1014M709060K871693n911883o200044
39378F117537N679497J1438322P69669j0137970n078964O577706P865551J081701
39370B4313049j782039j663100o218024j1417435q079070O90809N311880O228696
39362G384766Q948332R573973J714764q058902q563815l203824l668925q155246
39354d028877m515162O101542Q535502p87939o736588m97728N876977N66254p033147
39345b519166j133574J3768476J7675832M163691j0589303j0924982j583199K715331
39337A1573106r57072k888787J508297M747172Q31585m069366j582707M789566
$$ plain form
39329 13951794 18864674 17066013 11433178 9482541 12203539 14683433 15341541 17279209
39321 17279209 21079380 23326219 23237207 24288013 27002564 25998254 18110774 9198724
39313 9198724 7782393 13625307 17461439 12665314 3645773 350662 5958941 13073196
39305 13073196 12949497 5921193 -39484 254295 4072905 6271739 5797232 4952452 5729507
39296 5729507 9439905 16988643 26208538 30887080 25907820 12903924 -1031739 -9336426
39288 -9336426 -9759669 -4508013 1492834 4369876 4953906 6918643 10842468 13618420
39280 13618420 14820458 18771247 27281773 34769347 34780856 28222500 21325755 18398898
39272 18398898 19930256 24153013 26533170 21760373 11125873 4047148 6660560 12602567
$$ packed form
39329A3951794M912880j798661n632835j950637K720998K479894O58108J937668
39321A7279209L800171K246839q9012J050806K714551j004310p887480q912050
39313I198724j416331N842914L836132m796125r019541l295111N608279P114255
39305A3073196j23699p028304n960677K93779L818610K198834m74507q44780P77055
39296E729507L710398P548738R219895M678542m979260j3003896j3935663q304687
39288i336426m23243N251656O000847K877042N84030J964737L923825K775952
39280A3618420J202038L950789Q510526P487574J1509o558356o896745k926857
39272A8398898J531358M222757K380157m772797j0634500p078725K613412N942007
$$ plain form
39264 12602567 11698490 4622317 1142549 5578343 12411846 16569334 20067351 26182661
39256 26182661 33081188 36140208 32938162 24610661 15594997 12107544 16504331 22708652
39248 22708652 22007500 14623050 10814763 17950937 29914522 32739052 20020897 875728
39240 875728 -8085938 826251 18316019 28125493 24595424 16523806 13535917 15226892
39232 15226892 17031474 19475127 24505253 27983332 24872317 19211882 19736754 26392863
39224 26392863 30179091 27167420 24198568 28053260 35771787 39264491 35234323 27908317
39216 27908317 24444497 28068605 33492750 31140289 19654010 10637247 14683321 26384789
39208 26384789 32183028 30391973 31516679 38402174 39817539 29117970 17321217 18524176
$$ packed form
39264A2602567r04077p076173l479768M435794O833503M157488L498017O115310
39256B6182661O898527L059020l202046q327501r015664l487453M396787O204321
39248B2708652p01152p384450l808287P136174J1963585K824530j2718155j9145169
39240H75728q961666Q912189J7489768R809474l530069q071618k987889J690975
39232A5226892J804582K443653N030126L478079l111015n660435N24872O656109
39224B6392863L786228l011671k968852L854692P718527L492704m030168p326006
39216B7908317l463820L624108N424145k352461j1486279r016763M046074J1701468
39208B6384789N798239j791055J124706O885495J415365j0699569j1796753J202959
$$ plain form
39200 18524176 30254205 38271579 36485020 32660811 35787247 45644078 55731884 61049121
39192 61049121 60803452 55960137 46698216 33940154 23544431 24858369 40047200 57099502
39184 57099502 60707912 50276351 39815076 39314398 45085983 50921044 58284673 69052746
39176 69052746 77156306 76601185 71990726 72051492 77066861 81686365 86175492 94256253
39168 94256253 101748386 99271577 88142988 83016202 93819678 112720386 124831164
39161 124831164 126529737 127002525 134874817 149570613 165157221 177683486 187822532
39154 187822532 199389437 216145041 237828948 258640764 271762324 276378246 278071793
39147 278071793 280560593 279203296 266006051 240422353 211596426 189548138 177829120
$$ packed form
39200A8524176J1730029Q017374j786559l824209L126436R856831J0087806N317237
39192F1049121k45669m843315r261921j2758062j0395723J313938J5188831J7052302
39184E7099502L608410j0431561j0461275n00678N771585N835061P363629J0768073
39176F9052746Q103560n55121m610459O0766N015369M619504M489127Q080761
39168I4256253P492133k476809j1128589n126786J0803476J8900708J2110778
39161A24831164J698573M72788P872292J4695796J5586608J2526265J0139046
39154A87822532J1566905J6755604K1683907K0811816J3121560M615922J693547
39147B78071793K488800j357297j3197245k5583698k8825927k2048288j1719018
$$ plain form
39140 177829120 175405900 180040476 186156478 184789486 172619890 158795816 155843264 164589898
39132 164589898 174838543 180474529 185790167 195501252 207242471 217760100 228308526
39125 228308526 237883531 238205438 223769450 202636920 188690192 185243410 184099292 179344918
39117 179344918 173660149 170638049 169037248 166965053 165317112 164737514 165038122 169563381
39109 169563381 183071580 201866124 213769478 214109581 215062154 230491678 256095767
39102 256095767 274824715 279673355 279247945 279818483 274863433 258515639 238521906 225969952
39094 225969952 219012353 207755830 191599617 180309246 178341550 178738691 174862777 169527791
39086 169527791 168854134 173632911 180707462 188243331 196271674 205012280 214196132 221491871
$$ packed form
39140A77829120k423220M634576O116002j366992j2169596j3824074k952552Q746634
39132A64589898J0248645N635986N315638R711085J1741219J0517629J0548426
39125B28308526R575005L21907j4435988k1132530j3946728l446782j144118m754374
39117A79344918n684769l022100j600801k072195j647941n79598L00608M525259
39109A69563381J3508199J8794544J1903354L40103R52573J5429524K5604089
39102B56095767J8728948M848640m25410N70538m955050j6347794j9993733j2551954
39094B25969952o957599j1256523j6156213j1290371j967696L97141l875914n334986
39086A69527791o73657M778777P074551P535869Q028343Q740606R183852P295739
$$ plain form
39078 221491871 222437869 215733468 206070862 195998139 179200420 151368381 123598818
39071 123598818 110972210 109427655 101301335 85215241 79364234 88295598 90021193 71021484
39063 71021484 52005212 56550899 71647602 67298887 44221372 30956555 37571031
39056 37571031 44166083 38372868 33408708 39285248 43572749 35347649 25621662 27166479
39048 27166479 32683659 30986726 29101185 38546603 51691629 52486265 42940275 38725334
39040 38725334 42817581 43051822 35057394 29512035 33704331 40745348 42045749 39340121
39032 39340121 39011269 42561599 47469717 51816502 54477226 54858399 54653541 56376098
39024 56376098 58953788 58152752 52312578 44692968 39251278 36408305 34032529 31603947
$$ packed form
39078B21491871R45998o704401r662606j0072723j6797719k7832039k7769563
39071A23598818j2626608j544555q126320j6086094n851007Q931364J725595j8999709
39063G1021484j9016272M545687J5096703m348715k3077515j3264817O614476
39056C7571031O595052n793215m964160N876540M287501q225100r725987J544817
39048B7166479N517180j696933j885541R445418J3145026P94636r545990m214941
39040C8725334M092247K34241p994428n545359M192296P041017J300401k705628
39032C9340121l28852L550330M908118M346785K660724L81173k04858J722557
39024E6376098K577690q01036n840174p619610n441690k842973k375776k428582
$$ plain form
39016 31603947 32406614 40096418 51931220 58271588 53032608 42235066 35952907 34095790
39008 34095790 29329989 22966922 25207952 36607501 42872950 35347785 24702285 24743380
39000 24743380 33124091 39292055 42131636 46215117 47611482 38603136 23330094 14775218
38992 14775218 17210723 23550400 28737657 33445394 35099810 28492604 17470115 14042259
38984 14042259 21732653 29442243 26531485 16333181 9852061 11679070 16728279 17824181
38976 17824181 13614872 10004711 13218703 20159677 19507451 6407415 -8625660 -11890230
38968 -11890230 -3495965 5461830 8926458 9794577 10260805 8444759 4416834 739080
38960 739080 -2868437 -7407563 -8529797 -1835328 6869910 7043049 -747761 -5134861
$$ packed form
39016C1603947Q02667P689804J1834802O340368n238980j0797542o282159j857117
39008C4095790m765801o363067K241030J1399549O265449p525165j0645500M1095
39000B4743380Q380711O167964K839581M083481J396365r008346j5273042q554876
38992A4775218K435505O339677N187257M707737J654416o607206j1022489l427856
38984A4042259P690394P709590k910758j0198304o481120J827009N049209J095902
38976A7824181m209309l610161L213992O940974o52226j3100036j5033075l264570
38968a1890230Q394265Q957795L464628Q68119M66228j816046m027925l677754
38960G39080l607517m539126j122234O694469Q705238J73139p790810m387100
$$ plain form
38952 -5134861 -1303745 2745196 -147890 -6466689 -9401714 -7357099 -1722986 5784943
38944 5784943 10477612 7121304 -2030725 -8663923 -9617336 -9052248 -8541449 -4516718 2325756
38935 2325756 5243438 2627440 1388614 5043248 7476381 3006042 -5740986 -13893150
38927 -13893150 -19680621 -20355168 -12463355 -198923 6632914 7208165 11035847 19797169
38919 19797169 20961176 7565962 -8427795 -13362120 -11350416 -14077854 -20525445 -20946870
38911 -20946870 -14607990 -9492301 -8178722 -6718069 -4878126 -5906600 -8085943 -6988688
38903 -6988688 -4268555 -4737306 -7191693 -7448113 -7322852 -10761059 -14596937 -13988723 -13450810
38894 -13450810 -20133490 -28905174 -28017032 -18585761 -13586161 -16362519 -15680743 -6237421
$$ packed form
38952e134861L831116M048941k893086o318799k935025K044615N634113P507929
38944E784943M692669l356308r152029o633198r53413N65088N10799M024731O842474
38935B325756K917682k615998j238826L654634K433133m470339q747028q152164
38927a3893150n787471o74547P891813J2264432O831837N75251L827682Q761322
38919A9797169J164007j3395214j5993757m934325K011704k727438o447591m21425
38911b0946870O338880N115689J313579J460653J839943j028474k179343J097255
38903f988688K720133m68751k454387k56420J25261l438207l835878O08214N37913
38894a3450810o682680q771684Q88142R431271M999600k776358O81776R443322
$$ plain form
38886 -6237421 1032881 -3452668 -12881038 -16062237 -14330284 -15720241 -19518001 -17994492
38878 -17994492 -9940790 -2329965 511120 1271780 2945773 4247228 3207602 1036097
38870 1036097 621991 3355092 8386891 13838800 18111068 20165519 18867059 13484039
38862 13484039 5988204 799025 -518322 -2415938 -9243669 -17470856 -19330610 -13873706
38854 -13873706 -8363840 -7590925 -7949172 -4811354 -341282 84692 -4343531 -9429264
38846 -9429264 -10918965 -7155328 760084 8831446 12282194 10051511 5508031 1566336
38838 1566336 -2272231 -6860950 -10764932 -12491300 -12176939 -9424501 -3299483 3451657
38830 3451657 4858391 -38827 -3810113 -343727 5733564 5423267 -1159183 -4606047
$$ packed form
38886f237421P270302m485549r428370l181199J731953j389957l797760J523509
38878a7994492Q053702P610825K841085P60660J673993J301455j039626k171505
38870A036097m14106K733101N031799N451909M272268K054451j298460n383020
38862A3484039p495835n189179j317347j897616o827731q227187j859754N456904
38854a3873706N509866P72915l58247L137818M470072M25974m428223n085733
38846i429264j489701L763637P915412Q071362L450748k230683m543480l941695
38838A566336l838567m588719l903982j726368L14361K752438O125018O751140
38830C451657J406734m897218l771286L466386O077291l10297o582450l446864
$$ plain form
38822 -4606047 761791 10460174 17769847 21605832 23133323 20094480 10302144 -1762265
38814 -1762265 -7944603 -6170473 -2329997 -1390575 -1575887 -222597 -713414 -7754007 -17652613
38805 -17652613 -20177362 -11552253 -123258 3794792 -401534 -5212847 -4750325 662846
38797 662846 6608091 7911809 2852533 -2965577 -1191963 7010008 9241170 -1035282
38789 -1035282 -12115971 -9327602 1920392 2574034 -11069991 -20953635 -14726877 -4097187
38781 -4097187 -5631802 -15745155 -18693003 -11556188 -5909460 -7818621 -10834477 -9231046
38773 -9231046 -5256082 -868604 5932797 12296864 8856863 -6101257 -18748804 -14516208
38765 -14516208 3273399 17051413 15437356 3785898 -5258079 -6351667 -4845139 -8180258
$$ packed form
38822d606047N367838R698383P309673L835985J527491l038843r792336j2064409
38814a762265o182338J774130L840476R39422j85312J353290m90817p040593r898606
38805a7652613k524749Q625109J1428995L918050m196326m811313M62522N413171
38797F62846N945245J303718n059276n818110J773614Q201971K231162j0276452
38789a035282j1080689K788369J1247994O53642j3644025r883644O226758J0629690
38781d097187j534615j0113353k947848P136815N646728j909161l015856J603431
38773i231046L974964M387478O801401O364067l440001j4958120j2647547M232596
38765a4516208J7789607J3778014j614057j1651458r043977j093588J506528l335119
$$ plain form
38757 -8180258 -16129636 -20642120 -15973067 -7065953 -4197119 -9527083 -13952385 -9232165
38749 -9232165 1639865 9780038 11897311 11232929 9926800 7159424 4688745 7452106
38741 7452106 15744823 21521970 17060170 5337321 -2819241 -2110232 934225 -2646647
38733 -2646647 -11774738 -16977137 -13831095 -8784934 -8729138 -10280811 -5816980 2969127
38725 2969127 6287168 1462175 -2382726 1036107 4369168 -1771348 -12341042 -13276296
38717 -13276296 -1620522 9932156 10132893 2013826 -4834235 -7130646 -7388490 -5972855
38709 -5972855 -808414 6776839 11638927 10373402 4040007 -4015251 -10287161 -12278423
38701 -12278423 -10819245 -10500460 -14625376 -20157998 -20747669 -14576478 -6216603 -670168
$$ packed form
38757h180258p949378m512484M669053Q907114K868834n329964m425302M720220
38749i232165J0872030Q140173K117273o64382j306129k767376k470679K763361
38741G452106Q292717N777147m461800j1722849q156562P09009L044457l580872
38733b646647r128091n202399L146042N046161N5796j551673M463831Q786107
38725B969127L318041m824993l844901L418833L333061o140516j0569694r35254
38717a3276296J1655774J1552678K00737q119067o848061k296411k57844J415635
38709e972855N164441P585253M862088j265525o333395q055258o271910j991262
38701a2278423J459178L18785m124916n532622n89671O171191Q359875N546435
$$ plain form
38693 -670168 1419962 2167471 2930609 3533350 3146902 1179405 -1569134 -3062326 -3035530
38684 -3035530 -4638423 -9959106 -14814397 -12555625 -3652982 3416622 2898026 -1225673
38676 -1225673 -2069072 671136 2711167 3342490 5712464 10372550 14408632 16798199
38668 16798199 18859492 18791578 12275326 1161103 -4704180 497207 9033890 8608503
38660 8608503 -1365885 -9641530 -9281711 -6302996 -8962367 -14797612 -14693603 -7017611
38652 -7017611 -657149 -3136570 -11102707 -15504183 -13100343 -9279014 -10192537 -14929934
38644 -14929934 -16711975 -11358980 -3329772 -1329263 -6874096 -9969045 -387576 17517897
38636 17517897 27113734 18820032 1850385 -7592389 -5415979 -974276 -2450499 -8591807
$$ packed form
38693f70168K090130P47509P63138O02741l86448j967497k748539j493192K6796
38684c035530j602893n320683m855291K258772Q902643P069604n18596m123699
38676a225673q43399K740208K040031O31323K369974M660086M036082K389567
38668A6798199K061293o7914o516252j1114223n865283N201387Q536683m25387
38660H608503r974388q275645L59819K978715k659371n835245J04009P675992
38652g017611O360462k479421p966137m401476K403840L821329r13523m737397
38644a4929934j782041N352995Q029208K000509n544833l094949R581469J7905473
38636A7517897R595837q293702j6969647r442774K176410M441703j476223o141308
$$ plain form
38628 -8591807 -14438040 -17432009 -16245702 -10686619 -5561434 -7818456 -15846314 -18195994
38620 -18195994 -8541680 4006503 6800897 1131037 -1227198 3667630 7348185 3285916
38612 3285916 -4032804 -7812328 -8604724 -10139278 -11653349 -10485324 -8436498 -9524014
38604 -9524014 -13267901 -15121832 -12599884 -7171435 -954893 5159121 10643696 14985085
38596 14985085 17390263 15606956 7686285 -2971137 -8101912 -4172075 1752201 951147
38588 951147 -4829973 -6867016 -3555346 -2755395 -8710570 -14736022 -13127682 -5962816
38580 -5962816 -202147 3498659 9929103 18857728 22536011 15370125 1427308 -10328638
38572 -10328638 -15437507 -15618871 -12652093 -4761230 8881506 22273836 25399719 14619995
$$ packed form
38628h591807n846233k993969J186307N559083N125185k257022q027858k349680
38620a8195994R654314J2548183K794394n669860k358235M894828L680555m062269
38612C285916p318720l779524p92396j534554j514071J168025K048826j087516
38604i524014l743887j853931K521948N428449O216542O114014N484575M341389
38596A4985085K405178j783307p920671j0657422n130775L929837N924276q01054
38588I51147n781120k037043L311670P99951n955175o025452J608340P164866
38580e962816N760669L700806O430444Q928625L678283p165886j3942817j1755946
38572a0328638n108869j81364K966778P890863J3642736J3392330L125883j0779724
$$ plain form
38564 14619995 -2127558 -12892403 -12896205 -5935845 2565467 8978186 9417864 1369203
38556 1369203 -10605531 -16766632 -13352329 -7047189 -4593793 -3281192 2490891 9816402
38548 9816402 10608199 4462147 -395074 254944 987627 -3572697 -10321365 -13238937 -12060670
38539 -12060670 -10134623 -7425368 -1801912 4294435 4675929 -2065653 -9289285 -9640909
38531 -9640909 -2965722 5149057 10674111 14073352 16331418 15157288 7324848 -5965847
38523 -5965847 -18184713 -22685273 -18189769 -9376099 -3377837 -5128976 -13210012 -19457913
38515 -19457913 -16034792 -5046842 2102959 -1807919 -10158048 -11043229 -3011153 4262254
38507 4262254 4418253 2032297 3574154 7552036 8389711 5590971 3364698 3158820 1863880
$$ packed form
38564A4619995j6747553j0764845l802O960360Q501312O412719M39678q048661
38556A369203j1974734o161101L414303O305140K453396J312601N772083P325511
38548I816402P91797o146052m857221O50018P32683m560324o748668k917572J178267
38539a2060670J926047K709255N623456O096347L81494o741582p223632l51624
38531i640909O675187Q114779N525054L399241K258066j174130p832440j3290695
38523e965847j2218866m500560M495504Q813670N998262j751139q081036o247901
38515a9457913L423121J0987950P149801l910878q350129q85181Q032076P273407
38507D262254J55999k385956J541857L977882Q37675k798740k226273k05878j294940
$$ plain form
38498 1863880 -2480633 -7117451 -8172427 -6091337 -5810015 -10745173 -16910033 -15590194
38490 -15590194 -4415963 6630199 5420250 -6638411 -15389393 -11697360 -1636577
38483 -1636577 4250058 4678720 4629780 4682114 1989374 -1149539 860375 6460491 7083943
38474 7083943 148049 -5597087 -2174643 5608491 6159464 -3396411 -13577428 -14703921
38466 -14703921 -8056853 -2451305 -2397582 -3807242 -1837286 1253396 -151993 -5486431
38458 -5486431 -7605523 -2740781 4192792 6855773 5837356 5859055 7614480 7114952 2214709
38449 2214709 -4036162 -6669989 -3281179 4379790 11873095 15861546 16838675 16454340
38441 16454340 13112356 4751616 -4065116 -4801111 2785792 8408318 5683276 1063285
$$ packed form
38498A863880m344513m636818j054976K081090K81322m935158o164860J319839
38490a5590194J1174231J1046162j209949j2058661q750982L692033J0060783
38483a636577N886635M28662m8940N2334k692740l138913K009914N600116O23452
38474G083943o935894n745136L422444P783134N50973r555875j0181017j126493
38466a4703921O647068N605548N3723j409660J969956L090682j405389n334438
38458e486431k119092M864742O933573K662981j018417K1699J755425m99528m900243
38449B214709o250871k633827L388810P660969P493305L988451R77129l84335
38441A6454340l341984q360740q816732p35995P586903N622526k725042m619991
$$ plain form
38433 1063285 1877333 3369725 -2815343 -13408855 -18093344 -15256684 -11354213 -7460158
38425 -7460158 505852 9275734 10023043 4022166 2571672 7886087 7900049 -3974801
38417 -3974801 -16620960 -16773114 -6468761 3310876 7420175 6769098 2314426 -2455347
38409 -2455347 -817077 6554379 7817134 -3913585 -18394582 -22571671 -19212267 -18731897
38401 -18731897 -19564705 -12452804 -658172 1309849 -9867255 -20800840 -21970064 -19675620
38393 -19675620 -21441690 -21990651 -12838677 2431865 11891906 10098157 2289522 -3414370
38385 -3414370 -3071212 1038993 1572309 -7467075 -21778289 -27765828 -17106973 2013465
38377 2013465 12852837 8413740 -1911478 -4003748 5430302 16025247 15628359 3799846
$$ packed form
38433A063285Q14048J492392o185068j0593512m684489K836660L902471L894055
38425g460158P966010Q769882P47309o000877j450494N314415J3962j1874850
38417c974801j2646159j52154J0304353R779637M109299o51077m454672m769773
38409b455347J638270P371456J262755j1730719j4480997m177089L359404M80370
38401a8731897q32808P111901J1794632J968021j1177104j0933585j169224K294444
38393a9675620j766070n48961R151974J5270542R460041j793749p808635n703892
38385c414370L43158M110205N33316r039384j4311214n987539J0658855J9120438
38377B013465J0839372m439097j0325218k092270R434050J0594945l96888j1828513
$$ plain form
38369 3799846 -8019156 -9924996 -4144220 -82999 -2229746 -7335337 -11038147 -11607011
38361 -11607011 -8552563 -3632652 -2202632 -6692039 -9547008 -1292246 13602695 18856260
38353 18856260 7843206 -6783140 -10614782 -5464732 -1812751 -1380290 1768396 7425759
38345 7425759 8431063 2733055 -3969365 -8057789 -11022731 -11369920 -3366950 12004397
38337 12004397 23027123 20331514 8896985 1224932 2109241 5723079 5385146 551698
38329 551698 -5139992 -7851033 -5111395 2661539 10862487 13436321 8486939 123197
38321 123197 -6021234 -8440945 -10595840 -16396574 -24811218 -29333544 -24274382 -11983492
38313 -11983492 -1755550 -166416 -4533392 -7922609 -8088366 -7799891 -8243425 -7515042
$$ packed form
38369C799846j1819002j905840N780776M061221k146747n105591l702810n68864
38361a1607011L054448M919911J430020m489407k854969Q254762J4894941N253565
38353A8856260j1013054j4626346l831642N150050L651981M32461L148686N657363
38345G425759J005304n698008o702420m088424k964942l47189Q002970J5371347
38337A2004397J1022726k695609j1434529p672053Q84309L613838l37933m833448
38329E51698n691690k711041K739638P772934Q200948K573834m949382q363742
38321A23197o144431k419711k154895n800734q414644m522326N059162J2290890
38313a1983492J0227942J589134m366976l389217j65757K88475m43534P28383
$$ plain form
38305 -7515042 -5767970 -6086482 -8279254 -7309506 -1444268 3119897 1090065 -2527920
38297 -2527920 968914 9905231 12883805 4390857 -7754865 -13431554 -12326827 -10696291
38289 -10696291 -10896429 -9552552 -3769099 5136301 12683943 13535720 5658982 -4890105
38281 -4890105 -7293083 1324370 10091233 7183397 -4486964 -11627850 -8886591 -3952678
38273 -3952678 -3466272 -3208414 3114649 12635956 17462996 15531511 10505482 3574888
38265 3574888 -7118279 -18732255 -22317815 -12676042 3543257 12976718 8348014 -5083099
38257 -5083099 -15170136 -13986135 -3822997 6492368 10106304 6679465 -147504 -7132515
38249 -7132515 -12157912 -12918374 -8237276 -1171509 1697116 -3808908 -14505150 -22176548
$$ packed form
38305g515042J747072l18512k192772R69748N865238M564165k029832l617985
38297b527920L496834Q936317K978574q492948j2145722n676689J104727J630536
38289a0696291k00138J343877N783453Q905400P547642Q51777p876738j0549087
38281d890105k402978Q617453Q766863k907836j1670361p140886K741259M933913
38273c952678M86406K57858O323063R521307M827040j931485n026029o930594
38265C574888j0693167j1613976l585560R641773J6219299R433461m628704j3431113
38257e083099j0087037J184001J0163138J0315365L613936l426839o826969o985011
38249g132515n025397p60462M681098P065767K868625n506024j0696242p671398
$$ plain form
38241 -22176548 -21350051 -14164371 -7131036 -3862543 -2311461 829581 4920087 6216195
38233 6216195 3076748 -1989010 -6116594 -9940630 -15607520 -21549624 -22067563 -14057619
38225 -14057619 -2846921 1899214 -2795170 -8901780 -6724743 3026376 10117772 7526788
38217 7526788 -734649 -5756564 -3752359 2702904 9984476 15516239 16087249 9309067
38209 9309067 -1678056 -8229330 -3885491 8115527 16461804 11880525 -3938125 -19666218
38201 -19666218 -24774669 -17988960 -5396125 6741450 14230194 13109312 2333306 -11267550
38193 -11267550 -17462333 -14446406 -10115754 -9070996 -6267651 1325536 5539313 -1086400
38185 -1086400 -10565315 -8707817 3679832 11402474 6759639 -1550468 -3905751 -2175622
$$ packed form
38241b2176548Q26497P185680P033335L268493J551082L141042M090506J296108
38233F216195l139447n065758m127584l824036n666890n942104n17939Q009944
38225a4057619J1210698M746135m694384o106610K177037R751119P091396k590984
38217G526788q261437n021915K004205O455263P281572N531763N71010o778182
38209I309067j0987123o551274M343839J2001018Q346277m581279j5818650j5728093
38201a9666218n108451O785709J2592835J2137575P488744j120882j0776006j3600856
38193a1267550o194783L015927M330652J044758K803345P593187M213777o625713
38185a086400r478915J857498J2387649P722642m642835q310107k355283J730129
$$ plain form
38177 -2175622 -1504895 -220557 4623782 9503025 10162563 9400107 11660925 14480461 12525545
38168 12525545 6441601 856067 -3084216 -6453241 -7105499 -2920035 1815125 859726
38160 859726 -4381285 -6957326 -5231067 -4184549 -5934734 -6696453 -4562422 -2937776
38152 -2937776 -3446488 -1784950 5388741 13909951 16320653 9887418 -1859353 -12512842
38144 -12512842 -16013844 -10611053 -2427342 -1355284 -9907194 -19175759 -19614157 -13162979
38136 -13162979 -10197848 -16046093 -25412994 -30101774 -27683422 -21062674 -13110669 -4796284
38128 -4796284 2603809 6437335 5029585 226229 -3818248 -4784391 -3979770 -3020658 -267919
38119 -267919 6669368 15188045 18193555 12266308 2693073 -2329793 -983221 1302485
$$ packed form
38177b175622O70727J284338M844339M879243O59538p62456K260818K819536j954916
38168A2525545o083944n585534l940283l369025o52258M185464M735160r55399
38160H59726n241011k576041J726259J046518j750185p61719K134031J624646
38152b937776n08712J661538P173691Q521210K410702o433235j1746771j0653489
38144a2512842l501002N402791Q183711J072058q551910r268565m38398O451178
38136a3162979K965131n848245r366901m688780K418352O620748P952005Q314385
38128d796284P400093L833526j407750m803356m044477r66143Q04621R59112K752739
38119b67919O937287Q518677L005510n927247r573235n022866J346572K285706
$$ plain form
38111 1302485 -692729 -6224585 -10065379 -7927412 -728590 5490845 5266856 525895
38103 525895 -976695 3555888 6566557 761747 -7986461 -6584800 6431480 17111730
38095 17111730 14526358 4803074 1039046 6017941 12506240 15688895 16315061 14005028
38087 14005028 6649055 -3399773 -10017839 -10843070 -8073129 -2415908 6515256 14115937
38079 14115937 13640804 6449952 1148867 774000 -206644 -3473897 -1810587 7850273
38071 7850273 15796875 12215217 1735093 -3229028 1108673 7990284 10738183 8168790
38063 8168790 2881596 410672 6082865 16828973 21311348 14704250 6862989 7564220
38055 7564220 10995852 6239309 -3295518 -5268370 536743 2551138 -1666779 -1330653
$$ packed form
38111A302485j995214n531856l840794K137967P198822O219435k23989m740961
38103E25895j502590M532583L010669n804810q748208J401661J3016280J0680250
38095A7111730k585372r723284l764028M978895O488299L182655O26166k310033
38087A4005028p355973j0048828o618066q25231K769941N657221Q931164P600681
38079A4115937m75133p190852n301085l74867r80644l267253J663310R660860
38071G850273P946602l581658j0480124m964121M337701O881611K747899k569393
38063H168790n287194k470924N672193J0746108M482375o607098p841261P01231
38055G564220L431632m756543r534827j972852N805113K014395m217917L36126
$$ plain form
38047 -1330653 7636418 14018887 9062821 77467 -1585421 3703827 7883131 7159140
38039 7159140 2781500 -3721054 -9799335 -11726974 -9917979 -8967580 -9191508 -5416637
38031 -5416637 1974052 3411695 -6293399 -17998130 -18733370 -6951377 8069788 16664059
38023 16664059 14139039 2209558 -9720522 -10951096 -2209096 4285729 1654708 -2877010
38015 -2877010 -1344813 2404074 1685243 -88826 4227121 12068432 14209871 7764789
38007 7764789 -1631494 -6935881 -3189694 10133990 24073829 25082543 12410036 1939140
37999 1939140 3962700 7490145 -1235306 -14953618 -16372415 -5430980 2870064 3755246
37991 3755246 6408309 13141525 14235177 6715232 913834 2899265 5262773 1621379
$$ packed form
38047a330653Q967071O382469m956066q985354j662888N289248M179304p23991
38039G159140m377640o502554o078281j927639J808995R50399k23928L774871
38031e416637P390689J437643r705094j1704731p35240J1781993J5021165Q594271
38023A6664059k525020j1929481j1930080j230574Q742000O494825k631021m531718
38015b877010J532197L748887p18831j774069M315947P841311K141439o445082
38007G764789r396283n304387L746187J3323684J3939839J008714j2672507j0470896
37999A939140K023560L527445q725451j3718312j418797J0941435Q301044Q85182
37991C755246K653063O733216J093652p519945n801398J985431K363508l641394
$$ plain form
37983 1621379 -2806689 -1926456 1041156 676412 -2640193 -7112264 -12963592 -17235777
37975 -17235777 -14588702 -7353498 -4904869 -9011729 -10599558 -5729089 -2936309 -8129376
37967 -8129376 -13815480 -11671805 -5388201 -1952647 83457 3793463 4597809 -1040911
37959 -1040911 -5678506 -1817967 3847937 254652 -8854689 -9662732 17316 7807291
37951 7807291 6157856 1768439 2550082 6114860 6168368 2317391 -1527904 -2774418 -172985
37942 -172985 6637242 13839090 14499116 7290691 372851 1865884 9231015 13216470
37934 13216470 10616212 7067595 6811525 6252372 1394555 -3583370 -1849877 4373585
37926 4373585 5702352 -250413 -5180199 -3850249 -2706316 -8116690 -13851404 -10117775
$$ packed form
37983A621379m428068Q80233K967612l64744l316605m472071n851328m272185
37975a7235777K647075P235204K448629m106860j587829M870469K792780n193067
37967h129376n686104K143675O283604L435554K036104L710006Q04346n638720
37959a040911m637595L860539N665904l593285r109341q08043R680048P789975
37951G807291j649435m389417P81643L564778N3508l850977l845295j246514K601433
37942a72985O810227P201848O60026p208425o917840J493033P365131L985455
37934A3216470k600258l548617k56070n59153m857817m977925J733493O223462
37926D373585J328767n952765m929786J329950J143933n410374n734714L733629
$$ plain form
37918 -10117775 209387 5771518 4230081 3478546 6338420 6968857 3964008 3937516
37910 3937516 8172846 8212354 715688 -4872637 -1372562 3581926 -402833 -9839256
37902 -9839256 -13203443 -8205067 -3363863 -5170592 -11455974 -15444059 -10939909 3134853
37894 3134853 18566142 22865154 13503289 1688391 -3101531 -4907447 -10415171 -14535460
37886 -14535460 -7937034 6134758 14461828 11347442 3447241 -1593854 -2357157 -772014
37878 -772014 -335154 -5596592 -15444862 -19588831 -11000834 805059 -9316 -13215898
37870 -13215898 -22288063 -17582731 -7862989 -5273795 -9436782 -11828801 -8003386 -218967
37862 -218967 6148948 5116082 -4942918 -15563594 -13970339 1247591 15964339 16339080
$$ packed form
37918a0117775J0327162N562131j541437p51535K859874O30437l004849k6492
37910C937516M235330L9508p496666n588325L500075M954488l984759r436423
37902i839256l364187M998376M841204j806729o285382l988085M504150J4074762
37894C134853J5431289M299012r361865j1814898m789922j805916n507724m120289
37886a4535460O598426J4071792Q327070l114386p900201n041095p63303J585143
37878g72014M36860n261438r848270m143969Q587997J1805893q14375j3206582
37870a3215898r072165M705332R719742K589194m162987k392019L825415P784419
37862b18967O367915j032866j0059000j0620676J593255J5217930J4716748L74741
$$ plain form
37854 16339080 3881014 -9101577 -13738305 -9560917 -214377 9525653 14958443 15213017
37846 15213017 14748378 17008078 17897351 10209336 -5406181 -18387432 -19410618 -11070258
37838 -11070258 -4350975 -5258050 -8865979 -8121036 -4134170 -2836422 -4337700 -3195203
37830 -3195203 921088 1587453 -2891559 -5344707 -1757744 1557849 -371725 -1312997
37822 -1312997 4840525 10767693 5928146 -5510321 -10470101 -7264949 -5625270 -7667579
37814 -7667579 -4432128 6133573 12332179 5520390 -7634901 -15654095 -15652673 -11034566
37806 -11034566 -4762246 -557591 -2825015 -9627078 -12369249 -7172744 -121377 2558282
37798 2558282 2301756 2283704 1311039 -1813888 -4816097 -6952906 -10614345 -14753739 -14716852
$$ packed form
37854A6339080j2458066j2982591m636728M177388R346540R740030N432790K54574
37846A5213017m64639K259700Q89273p688015j5615517j2981251j023186Q340360
37838a1070258O719283r07075l607929P44943L986866J297748j501278J142497
37830c195203M116291O66365m479012k453148L586963L315593j929574r41272
37822a312997O153522N927168m839547j1438467m959780L205152J639679k042309
37814g667579L235451J0565701O198606o811789j3155291q019194J422M618107
37806a1034566O272320M204655k267424o802063k742171N196505P051367K679659
37798B558282k56526j8052r72665l124927l002209k136809l661439m139394L6887
$$ plain form
37789 -14716852 -11624923 -12423112 -16926053 -15847177 -6901977 -771644 -3765282 -7081591
37781 -7081591 -3005855 580564 -5593690 -14270392 -12615683 -2854533 3164581 3312231
37773 3312231 3456781 2072765 -6505944 -16954292 -18262451 -12381375 -10419708 -11345031
37765 -11345031 -3502341 11049436 14203413 110676 -13149914 -10069095 631075
37758 631075 3044253 -1574859 -2519820 -708384 -4770674 -12104627 -11343337 -2772162 -529038
37749 -529038 -11171265 -22561515 -20223343 -6463345 3738047 1462492 -7845273 -13323805
37741 -13323805 -10680848 -3994161 1174626 3081070 2310329 -1366525 -7628482 -12912798
37733 -12912798 -13132015 -8914974 -4528764 -1750351 1034426 3626064 3188240 -38352
$$ packed form
37789a4716852L091929p98189m502941J078876Q945200O130333k993638l316309
37781g081591M075736L586419o174254q676702J654709R761150O019114J47650
37773C312231J44550j384016q578709j0448348j308159N881076J961667r25323
37765a1345031P842690J4551777L153977j4092737j3260590L080819J0700170
37758F31075K413178m619112r44961J811436m062290p333953P61290Q571175K243124
37749e29038j0642227j1390250K338172J3759998J0201392k275555r307765n478532
37741a3323805K642957O686687N168787J906444p70741l676854o261957n284316
37733a2912798k19217M217041M386210K778413K784777K591638m37824l226592
$$ plain form
37725 -38352 -1454495 1230034 4914355 7033016 9213948 11939218 11442194 6576350 3208805
37716 3208805 5534259 7558633 863389 -11829059 -18979172 -15560333 -8524019 -5856956
37708 -5856956 -6665983 -4700506 2612278 11151405 13909204 7374836 -3615682 -8600787
37700 -8600787 -2783405 5835802 5699266 -3064636 -9316439 -7024423 -2800887 -4596579
37692 -4596579 -10306141 -12489633 -8708318 -1884652 4706503 7280219 1397661 -11010196
37684 -11010196 -18546921 -12633145 -525191 2755234 -5600597 -13856819 -13920773 -11303184
37676 -11303184 -13225770 -16539829 -14190430 -6783346 -392298 2426788 2845272 1315723
37668 1315723 -453523 2606376 11489942 17375855 12011332 975371 -3266116 105890
$$ packed form
37725c8352j416143K684529L684321K118661K180932K725270m97024m865844l367545
37716C208805K325454K024374o695244j2692448p150113L418839P036314K667063
37708e856956q09027J965477P312784Q539127K757799o534368j0990518m985105
37700h600787N817382Q619207j36536q763902o251803K292016M223536j795692
37692d596579n709562k183492L781315O823666O591155K573716n882558j2407857
37684a1010196p536725N913776J2107954L280425q355831q256222o3954K617589
37676a1303184j922586l314059K349399P407084O391048K819086M18484j529549
37668A315723j769246L059899Q883566N885913n364523j1035961m241487L372006
$$ plain form
37660 105890 31914 -7479105 -12648305 -8600501 -3300746 -6989445 -16155053 -19296603 -13221326
37651 -13221326 -4401051 2555085 8725106 14345899 16602933 14891935 12555530 12190329
37643 12190329 12868305 12047381 7411571 -1759656 -11780458 -15324551 -9199082 621698
37635 621698 5973960 6070418 5356490 5044524 3351586 1669193 2671016 3623829 122963
37626 122963 -3931857 188078 11145971 16506262 10735262 4480694 9162321 20270006
37618 20270006 24558673 18429098 9954773 5654819 4380309 3624144 3611019 3936648 2817245
37609 2817245 1508822 3777961 8637871 8919675 926412 -8236792 -7900693 2840010
37601 2840010 13574781 15069586 9550743 5920001 7098449 6761638 -406436 -9591587
$$ packed form
37660A05890p3976p511019n169200M047804N299755l688699r165608l141550O075277
37651a3221326Q820275O956136O170021N620793K257034j710998k336405l65201
37643A2190329O77976q20924m635810r171227j0020802l544093O125469R820780
37635F21698N352262R6458p13928l11966j692938j682393J001823R52813l500866
37626A22963m054820M119935J0957893N360291n771000o254568M681627J1107685
37618B0270006M288667o129575q474325m299954j274510p56165j3125L25629j119403
37609B817245j308423K269139M859910K81804p993263r163204L36099J0740703
37601B840010J0734771J494805n518843l630742J178448l36811p168074r185151
$$ plain form
37593 -9591587 -11113040 -3221032 5067596 4824337 -2646514 -8469934 -6818325 -649261
37585 -649261 2605136 -192079 -4023976 -1536649 7344276 14396103 13354096 7501389
37577 7501389 3440150 1534278 -1200969 -2440896 2019583 7890022 6604637 684745
37569 684745 2184632 11929048 14056502 -605661 -18622577 -23110222 -17530157 -15472516
37561 -15472516 -16214277 -9543345 427323 -1631998 -14724728 -19228906 -7953530 1573391
37553 1573391 -3621153 -9820782 438540 18669305 23277616 12276220 2404074 717816
37545 717816 -1670451 -7885878 -8178537 737992 7320336 4137845 180743 4570481
37537 4570481 10783531 8719091 2306892 1932450 6349896 5860929 -512418 -4530851
$$ packed form
37593i591587j521453P892008Q288628k43259p470851n823420J651609O169064
37585f49261L254397k797215l831897K487327Q880925P051827j042007n852707
37577G501389m061239j905872k735247j239927M460479N870439j285385n919892
37569F84745J499887R744416K127454j4662163j8016916m487645N580065K057641
37561a5472516p41761O670932R970668k059321j3092730m504178J1275376R526921
37553A573391n194544o199629J0259322J8230765M608311j1001396r872146j686258
37545G17816k388267o215427k92659Q916529O582344l182491l957102M389738
37537D570481O213050k064440o412199l74442M417446m88967o373347m018433
$$ plain form
37529 -4530851 -3794619 -4192925 -6732939 -4753784 2452923 5009046 -2670785 -11894002
37521 -11894002 -11903175 -4630665 993315 3764731 9502488 18141889 21352611 14302220
37513 14302220 2539565 -5416326 -7318345 -6458760 -5737980 -5727696 -6417242 -7866748 -9690934
37504 -9690934 -11545079 -13611587 -15361777 -14419164 -8575451 128239 4834875 314091
37496 314091 -9278521 -12611797 -4494628 5978617 6355273 -1798593 -4864147 2348106
37488 2348106 8507347 4037226 -2465360 2960596 16718535 21301457 10479743 -2684082
37480 -2684082 -5307748 -147682 2970335 795139 -4221986 -9689993 -11697164 -5226416
37472 -5226416 7006978 13395909 8523904 2333663 5809719 14492820 16660045 12041355
$$ packed form
37529d530851P36232l98306k540014J979155P206707K556123p679831r223217
37521a1894002r173P272510N623980K771416N737757Q639401L210722p050391
37513A4302220j1762655p955891j902019Q59585P20780J0284o89546j449506j824186
37504i690934j854145k066508j750190R42613N843713Q703690M706636m520784
37496C14091r592612l333276Q117169J0473245L76656q153866l065554P212253
37488B348106O159241m470121o502586N425956J3757939M582922j0821714j3163825
37480b684082k623666N160066L118017k175196n017125n468007k007171O470748
37472e226416J2233394O388931m872005o190241L476056Q683101K167225m618690
$$ plain form
37464 12041355 9849619 11639576 9960976 3868217 2136656 8137427 13491690 11473574
37456 11473574 6503588 4735079 4278492 1527476 -336018 3003262 7814619 6247472
37448 6247472 -3075484 -13594453 -17785083 -12553169 -1515983 5197201 -1081318 -15450035
37440 -15450035 -21196083 -9622072 7294802 11414064 1092418 -9342569 -9727832 -3690836
37432 -3690836 1507056 4697060 7329465 7985718 5223846 1633353 887774 2823394
37424 2823394 4027458 2109288 -1771461 -3626661 -4386 7943602 14534553 15328122
37416 15328122 11318387 5621124 -864265 -7010751 -8600654 -4134958 -902470 -7233767
37408 -7233767 -19101909 -22961714 -13589105 -777724 5076725 6014414 9684025 16309151
$$ packed form
37464A2041355k191736J789957j678600o092759j731561O000771N354263k018116
37456A1473574m969986j768509m56587k751016j863494L339280M811357j567147
37448F247472r322956j0518969m190630N231914J1037186O713184o278519j4368717
37440a5450035n746048J1574011J6916874M119262j0321646j0434987l85263O036996
37432c690836N197892L190004K632405O56253k761872l590493p45579J935620
37424B823394J204064j918170l880749j855200L622275P947988O590951P93569
37416A5328122m009735n697263o485389o146486j589903M465696L232488o331297
37408g233767j1868142l859805R372609J2811381N854449R37689L669611O625126
$$ plain form
37400 16309151 19972418 18770504 15831721 11998989 5048403 -3278570 -5900877 1018347
37392 1018347 11337463 13725324 3105403 -13110625 -20755282 -12751853 2279673 8220551
37384 8220551 -140038 -10677812 -9288720 2247660 9777221 6137692 -796021 -1042479
37376 -1042479 3684929 4147835 -2554183 -9482678 -9476146 -3083366 4162796 8222872 7967112
37367 7967112 3418497 -3532956 -8132688 -6958540 -3472651 -5052610 -12815895 -18618893
37359 -18618893 -15189120 -5278449 3610906 9751797 15800660 19327421 13795239 381501
37351 381501 -9739296 -9237909 -4234050 -4802610 -11173773 -15668485 -14599219 -11212526
37343 -11212526 -8451761 -5423500 -1206700 3013267 6334118 8832221 9493736 6721487
$$ packed form
37400A6309151L663267j201914k938783l832732o950586q326973k622307O919224
37392A018347J0319116K387861j0619921j6216028p644657Q003429J5031526N940878
37384H220551q360589j0537774J389092J1536380P529561l639529o933713k46458
37376a042479M727408M62906o702018o928495O532O392780P246162M060076k55760
37367G967112m548615o951453m599732J174148L485889j579959p763285n802998
37359a8618893L429773R910671Q889355O140891O048863L526761n532182j3413738
37351C81501j0120797N01387N003859n68560o371163m494712J069266L386693
37343a1212526K760765L028261M216800M219967L320851K498103O61515k772249
$$ plain form
37335 6721487 1163420 -4537652 -8490149 -9903689 -8199240 -4694566 -3341887 -5999784
37327 -5999784 -8545068 -5894400 583108 5313019 6530540 6260301 3516337 -4857388
37319 -4857388 -15404182 -18012828 -8811180 2663896 4427620 -3447186 -10580173 -10533833
37311 -10533833 -7767602 -9585081 -15134599 -15789610 -6612759 5365149 8154416 399564
37303 399564 -5303059 1412433 13895810 16862985 6896129 -4248618 -6761919 -3731678
37295 -3731678 -2374368 -3468538 -4681621 -6783446 -9894959 -9551858 -3959874 -541071
37287 -541071 -6915151 -18077238 -21218384 -12857739 -3158376 -1712637 -5911297 -6877014
37279 -6877014 -2316571 1328658 -1319596 -6316834 -4559074 5661471 13653251 8238567
$$ packed form
37335F721487n558067n701072l952497j413540J704449L504674J352679k657897
37327e999784k545284K650668O477508M729911J217521k70239k743964q373725
37319d857388j0546794k608646R201648J1475076J763724p874806p132987M6340
37311a0533833K766231j817479n549518o55011R176851J1977908K789267p754852
37303C99564n702623O715492J2483377K967175r966856j1144747k513301L030241
37295c731678J357310j094170j213083k101825l111513L43101N591984L418803
37287e41071o374080j1162087l141146Q360645R699363J445739m198660r65717
37279f877014M560443L645229k648254m997238J757760J0220545P991780n414684
$$ plain form
37271 8238567 -6520650 -14046365 -5415936 10002134 17853740 15774669 11031810 7824503
37263 7824503 5825804 6917094 12886957 18144959 15277500 8089999 8685996 19535923
37255 19535923 28587395 26144304 17275146 11813128 10306677 7382952 2768239 305174
37247 305174 -300675 -2244221 -3847677 -110110 7748266 11482269 6623295 -1354084
37239 -1354084 -4609971 -2872772 -2194489 -5548097 -8276309 -3718345 8306082 20252251
37231 20252251 24276362 19712070 12217003 6842435 4263749 3228987 3307325 4136909
37223 4136909 4719074 4899338 5235123 4507092 766863 -3577653 -2379717 4713719 7848659
37214 7848659 -1220708 -15159873 -17418743 -3979123 9481122 7037018 -7180553 -15516360
$$ packed form
37271H238567j4759217p525715Q630429J5418070P851606k079071m742859l207307
37263G824503j998699J091290N969863N258002k867459p187501N95997J0849927
37255A9535923R051472k443091q869158n462018j506451k923725m614713k463065
37247C05174o05849j943546j603456L737567P858376L734003m858974p977379
37239a354084l255887J737199O78283l353608k728212M557964J2024427J1946169
37231B0252251M024111m564292p495067n374568k578686j034762P8338Q29584
37223D136909N82165J80264L35785p28031l740229m344516J197936P093436L134940
37214G848659r069367j3939165k258870J3439620J3460245k444104j4217571q335807
$$ plain form
37206 -15516360 -10023514 81392 4441524 5346281 10417412 18630115 21923620 18026026
37198 18026026 13454474 13558123 16615646 19046587 19565866 15870992 4747431 -9777482
37190 -9777482 -15290925 -5284694 10088768 15681694 10634239 7000138 10736968 14538661
37182 14538661 11352504 5160211 3493539 6578648 9586880 10219364 8368435 2777056
37174 2777056 -5709524 -10794810 -7237894 837363 4289601 1178743 -1263273 2230460
37166 2230460 7425159 7217880 2131821 -293912 3954065 9521552 8787213 2753324
37158 2753324 677264 8022960 19022192 24328926 22369537 18152985 13958673 8592537
37150 8592537 4714492 7649089 14671915 14454254 2278078 -11553172 -15044696 -10281890
$$ packed form
37206a5516360N492846J0104906M360132R04757N071131Q212703L293505l897594
37198A8026026m571552J03649L057523K430941N19279l694874j1123561j4524913
37190i777482n513443J0006231J5373462N592926n047455l634101L736830L801693
37182A4538661l186157o192293j666672L085109L008232O32484j850929n591379
37174B777056q486580n085286L556916Q075257L452238l110858k442016L493733
37166B230460N194699k07279n086059k425733M247977N567487p34339o033889
37158B753324k076060P345696J0999232N306734j959389m216552m194312n366136
37150H592537l878045K934597P022826k17661j2176176j3831250l491524M762806
$$ plain form
37142 -10281890 -8191805 -12146155 -15915063 -15896595 -15808151 -17974226 -17909659 -11272172 -1576954
37133 -1576954 2842019 -1848097 -10457969 -13564150 -7498639 495987 67550 -8379163
37125 -8379163 -12651559 -4834403 7400394 11448708 6469343 1131716 -1426304 -5838597
37117 -5838597 -12695068 -15549299 -11787332 -6866749 -4644228 -2525014 -179138 -3781959
37109 -3781959 -15241838 -24922968 -22902946 -12115510 -2781036 1695006 5211748 8831103
37101 8831103 9188953 6249469 4618937 6276222 8360301 9116913 10087565 10993028 8372951
37092 8372951 2138965 -1390638 2937161 11248958 14325296 8317774 -1106363 -5529903
37084 -5529903 -2917333 896383 -552421 -6702616 -10878542 -8675586 -2910325 1267316
$$ packed form
37142a0281890K090085l954350l768908J8468Q8444k166075O4567O637487R695218
37133a576954M418973m690116q609872l106181O065511P994626m28437q446713
37125h379163m272396P817156J2234797M048314m979365n337627k558020m412293
37117e838597o856471k854231L761967M920583K222521K119214K345876l602821
37109c781959j1459879r681130K020022J0787436R334474M476042L516742L619355
37101H831103L57850k939484j630532J657285K084079P56612R70652R05463k620077
37092H372951o233986l529603M327799Q311797L076338o007522r424137m423540
37084e529903K612570L813716j448804o150195m175926K202956N765261M177641
$$ plain form
37076 1267316 3363006 6188199 9444367 9705063 6992738 6204384 9914167 14154543
37068 14154543 14537356 12743720 12386856 11240242 3822583 -8494606 -16303805 -13556948
37060 -13556948 -5413480 -1128317 -2665575 -4941969 -5040324 -5373036 -7542745 -8551103
37052 -8551103 -5555501 -714974 1809342 1530965 1355672 2915884 5106371 6890536
37044 6890536 8776146 10584027 9574348 2883008 -7659991 -14623459 -11502088 -922069
37036 -922069 6635893 4931780 -133842 701321 5998557 6028046 -667610 -2773417 7069672
37027 7069672 19503411 20599586 11286837 5001834 8499060 15089940 17423576 17450973
37019 17450973 20092409 24020517 23971697 18868727 13550507 13494057 19508389 26708768 28520575
$$ packed form
37076A267316K095690K825193L256168K60696k712325p88354L709783M240376
37068A4154543L82813j793636l56864j146614p417659j2317189p809199K746857
37060a3556948Q143468M285163j537258k276394r8355l32712k169709j008358
37052h551103K995602M840527K524316k78377j75293J560212K190487J784165
37044F890536J885610J807881j009679o691340j0542999o963468L121371J0580019
37036i22069P557962j704113n065622Q35163N297236K9489o695656k105807R843089
37027G069672J2433739J096175r312749o285003L497226O590880K333636K7397
37019A7450973K641436L928108m8820n102970n318220n6450O014332P200379J811807
$$ plain form
37010 28520575 22960749 14358955 7822140 4323655 3071913 4602114 7620190 7463391
37002 7463391 3527487 3282835 10889962 16763134 9561970 -4805871 -9843996 -3195557
36994 -3195557 984716 -3384461 -4753844 4051871 11319836 5882494 -3140887 -1062759
36986 -1062759 8849496 13365021 12699606 17288972 25577443 24789427 14187855 8886179
36978 8886179 16390729 25821486 26781114 24073561 25044614 25416601 19280669 13668918 20086238
36969 20086238 36492385 49779062 54084631 55665332 59365540 60529054 53924521 43219360
36961 43219360 36002858 33207375 29055169 20487816 11550902 6858386 4606607 -48765
36953 -48765 -6246935 -6893217 2134363 16295048 27887633 33747221 35240673 34436656
$$ packed form
37010B8520575n559826q601794o536815l498485j251742J530201L018076j56799
37002G463391l935904k44652P607127N873172p201164j4367841n038125O648439
36994c195557M180273m369177j369383Q805715P267965n437342r023381K078128
36986a062759R912255M515525o65415M589366Q288471p88016j0601572n301676
36978H886179P504550R430757R59628k707553R71053L71987o135932n611751O417320
36969B0086238J6406147J3286677M305569J580701L700208J163514o604533j0705161
36961D3219360p216502k795483m152206q567353q936914m692516k251779m655372
36953d8765o198170o46282R027580J4160685J1592585N859588J493452q04017
$$ plain form
36945 34436656 33362326 33383247 32018389 24691356 13580351 9069091 16124436 24811839
36937 24811839 22977154 13715117 9556192 12670051 13987628 11323845 13423280 22440259
36929 22440259 26930140 19753891 10659988 11105395 16287219 13913889 4091678 -2082737
36921 -2082737 -568007 875650 -3868281 -10566630 -11472479 -4775193 4499536 9420569
36913 9420569 6864972 831770 -1500873 889477 1197170 -4432932 -9787047 -7674228
36905 -7674228 -961725 2739177 3181308 5807003 10976152 14019412 14384040 15533442
36897 15533442 16581724 13376179 7669734 5438954 5646635 1252146 -7059754 -9745176
36889 -9745176 -4482059 -1334675 -5920064 -9460110 -4622419 -129733 -6827987 -17341669
$$ packed form
36945C4436656j074330K0921j364858p327033j1111005m511260P055345Q687403
36937B4811839j834685r262037m158925L113859J317577k663783K099435R016979
36929B2440259M489881p176249r093903M45407N181824k373330r822211o174415
36921b082737J514730J443657m743931o698349r05849O697286R274729M921033
36913I420569k555597o033202k332643K390350L07693n630102n354115K112819
36905g674228O712503L700902M42131K625695N169149L043260L64628J149402
36897A5533442J048282l205545n706445k230780K07681m394489q311900k685422
36889i745176N263117L147384m585389l540046M837691M492686o698254j0513682
$$ plain form
36881 -17341669 -15119469 -121724 10688358 9155067 6427176 12514826 19402225 14400531
36873 14400531 854046 -6426346 -2083940 4615169 4726777 -19120 -3558333 -4113657
36865 -4113657 -2689057 1241194 7608610 12523995 11824218 6526201 1282576 -1531440
36857 -1531440 -2878141 -3057620 -685464 3498598 5153138 837124 -7425130 -13540651
36849 -13540651 -12578663 -4373720 6160555 11392475 6196647 -6351700 -15489406 -12252632
36841 -12252632 551997 9825972 5132492 -10502678 -23575805 -23080307 -9449696 8333187
36833 8333187 21611605 26738967 23747928 14901808 5478217 2079319 6771199 14300800
36825 14300800 17833729 16192713 12706997 8971004 4514224 1721821 4617636 11050450
$$ packed form
36881a7341669K222200J4997745J0810082j533291k727891O087650O887399n001694
36873A4400531j3546485p280392M342406O699109J11608m745897l539213n55324
36865d113657J424600L930251O367416M915385o99777n298017n243625k814016
36857a531440j346701j79479K372156M184062J654540m316014q262254o115521
36849a3540651R61988Q204943J0534275N231920n195828j2548347r137706L236774
36841a2252632J2804629R273975m693480j5635170j3073127M95498J3630611J7782883
36833H333187J3278418N127362k991039q846120r423591l398898M691880P529601
36825A4300800L532929j641016l485716l735993m456780k792403K895815O432814
$$ plain form
36817 11050450 12429835 5188383 -2835122 -2944557 1848754 2126419 -2582360 -2810356
36809 -2810356 5454710 13205710 10903610 2081168 -2291376 395215 1857914 -3719945
36801 -3719945 -10559150 -8803426 2630381 14802651 19176508 15870238 11214954 9853955
36793 9853955 10949629 10940800 7963393 3156056 -1222970 -3898899 -4792196 -4068693 -2237179
36784 -2237179 -1411152 -4602899 -11639646 -16917630 -14906845 -8399623 -6747654 -13254605
36776 -13254605 -18953992 -14132159 -2582645 3045656 -1076930 -5675456 -3452618 543959
36768 543959 -1292189 -6485113 -7301578 -3453530 -1270778 -2133117 -303450 7007776 14519192
36759 14519192 15958531 11139510 3921996 -2679546 -7269090 -9306579 -9519722 -8858101
$$ packed form
36817A1050450J379385p241452q023505j09435M793311K77665m708779k27996
36809b810356Q265066P751000k302100q822442m372544K686591J462699n577859
36801c719945o839205J755724J1433807J2172270M373857l306270m655284j360999
36793I853955J095674q829k977407m807337m379026k675929q93297P23503J831514
36784b237179Q26027l191747p036747n277984K010785O507222J651969o506951
36776a3254605n699387M821833J1549514N628301m122586m598526K222838L996577
36768E43959j836148n192924q16465L848048K182752q62339J829667P311226P511416
36759A4519192J439339m819021p217514o601542m589544k037489k13143O61621
$$ plain form
36751 -8858101 -6487707 -1557194 3191306 3645916 853495 853133 6148372 11318064 9697748
36742 9697748 1522270 -6847439 -9407432 -4692127 3613333 8616944 5916469 -856297
36734 -856297 -3440343 504855 4564907 3877361 3208209 9860227 22188172 30935013
36726 30935013 29993957 20730678 7809715 -3291777 -6311482 841607 10593163 11955345
36718 11955345 3912611 -3607571 -3975839 -2128045 -5076285 -11089465 -14127018 -13563183
36710 -13563183 -12414128 -9950895 -4215312 585951 -1762896 -8414702 -9840201 -4628406
36702 -4628406 -2305553 -7722363 -12153704 -6743544 2881834 4487212 -2990884 -8896252
$$ packed form
36751h858101K370394M930513M748500M54610k792421l62N295239N169692j620316
36742I697748q175478q369709k559993M715305Q305460N003611k700475o772766
36734h56297k584046L945198M060052o87546o69152O652018J2327945Q746841
36726C0935013r41056r263279j2920963j1101492l019705P153089R751556J362182
36718A1955345q042734p520182l68268J847794k948240o013180l037553N63835
36710a3563183J149055K463233N735583M801263k348847o651806j425499N211795
36702d628406K322853n416810m431341N410160R625378J605378p478096n905368
$$ [...]
##END NTUPLES=NMR SPECTRUM
##END=
