##TITLE=31Pdec_MeAcBF
 , 48 sc
 10.2.2021
##JCAMPDX= 6.0         $$ Bruker NMR JCAMP-DX V2.0
##DATA TYPE= NMR SPECTRUM
##DATA CLASS= NTUPLES
##ORIGIN= UXNMR, Bruker Analytische Messtechnik GmbH
##OWNER= root
$$ XWIN-NMR		Version 3.5
$$ Wed Feb 10 13:50:07 2021 Russian Standard Time (UT+4h)  she@DPX200
##.OBSERVE FREQUENCY= 81.013821
##.OBSERVE NUCLEUS= ^31P
##.ACQUISITION MODE= SIMULTANEOUS
##.ACQUISITION SCHEME= undefined
##.AVERAGES= 48
##.DIGITISER RES= 16
##SPECTROMETER/DATA SYSTEM= spect
##.PULSE SEQUENCE= zgpg30
##.SOLVENT NAME= CDCl3
##.SHIFT REFERENCE= (INTERNAL, CDCl3, 0, 298.009)
##AUDIT TRAIL= $$ (NUMBER, WHEN, WHO, WHERE, WHAT)
$$ ##TITLE= Audit trail, XWIN-NMR		Version 3.5
$$ ##JCAMPDX= 5.01
$$ ##ORIGIN= Bruker BioSpin GmbH
$$ ##OWNER= she
$$ F:/spectra/data/she/nmr/P31/1/pdata/1/auditp.txt
$$ ##AUDIT TRAIL=  $$ (NUMBER, WHEN, WHO, WHERE, WHAT)
(   1,<2021-02-10 13:48:43.67 +0400>,<she>,<DPX200>,
      <continue with go, POWCHK disabled, PULCHK disabled
       configuration hash MD5:
       00 E9 B6 7A A2 85 ED C7 34 08 36 98 17 FE 4E 26
       data hash MD5: 32K
       28 C3 0A 50 1F F1 42 1B 42 28 27 3D 4D 44 15 9E>)
(   2,<2021-02-10 13:48:56.98 +0400>,<she>,<DPX200>,
      <Start of raw data processing
       efp BC_mod = 2 LB = 1 FT_mod = 6 PKNL = 1 PHC0 = -1916.645 PHC1 = 99.2023 SI = 64K 
       data hash MD5: 64K
       23 60 D1 05 60 3C 7B DC 30 75 5B 75 13 7E 20 B7>)
(   3,<2021-02-10 13:49:16.43 +0400>,<she>,<DPX200>,
      <pk PHC0 = -6.006768 PHC1 = 13.2 
       data hash MD5: 64K
       1A 1A BC 38 B1 FF 69 1B B6 F7 41 1A 41 19 B2 03>)
$$ ##END=
$$ 
$$ hash MD5
$$ 29 12 99 CC 53 8B 5E C7 EF 1F 13 08 35 BB 87 56
##$RELAX= 
##$RELAX= 
##$RELAX= 
##$RELAX= 
##$RELAX= 
##$RELAX= 
##$RELAX= 
##$RELAX= 
$$ Bruker specific parameters
$$ --------------------------
##$DU= <F:/spectra>
##$EXPNO= 1
##$NAME= <P31>
##$PROCNO= 1
##$TYPE= <nmr>
##$USER= <she>
##$AMP= (0..31)
100 100 100 100 100 100 100 100 100 100 100 100 100 100 100 100 100 100 
100 100 100 100 100 100 100 100 100 100 100 100 100 100 
##$AQSEQ= 0
##$AQ_mod= 1
##$AUNM= <au_zg>
##$AUTOPOS= <>
##$BF1= 81.014009
##$BF2= 200.13
##$BF3= 200.13
##$BF4= 200.13
##$BF5= 200.13
##$BF6= 200.13
##$BF7= 200.13
##$BF8= 200.13
##$BYTORDA= 1
##$CFDGTYP= 0
##$CFRGTYP= 5
##$CHEMSTR= <none>
##$CNST= (0..31)
1 1 145 1 1 1 1 1 1 1 1 1 1 1 1 1 1 1 1 1 1 1 1 1 1 1 1 1 1 1 1 1 
##$CPDPRG= <waltz16>
##$CPDPRG1= <>
##$CPDPRG2= <waltz16>
##$CPDPRG3= <>
##$CPDPRG4= <mlev>
##$CPDPRG5= <mlev>
##$CPDPRG6= <mlev>
##$CPDPRG7= <mlev>
##$CPDPRG8= <mlev>
##$CPDPRGB= <>
##$CPDPRGT= <>
##$D= (0..31)
0 1 0 0 0 0 0 0 0 0 0 0.03 2e-05 3e-06 0 0 0 0 0 0 0 0 0 0 0 0 0 0 0 0 
0 0 
##$DATE= 1612950446
##$DBL= (0..7)
120 120 120 11 120 120 24 19 
##$DBP= (0..7)
150 150 150 150 150 150 150 150 
##$DBP07= 0
##$DBPNAM0= <>
##$DBPNAM1= <>
##$DBPNAM2= <>
##$DBPNAM3= <>
##$DBPNAM4= <>
##$DBPNAM5= <>
##$DBPNAM6= <>
##$DBPNAM7= <>
##$DBPOAL= (0..7)
0.5 0.5 0.5 0.5 0.5 0.5 0.5 0.5 
##$DBPOFFS= (0..7)
0 0 0 0 0 0 0 0 
$$ [...]
##$SUBNAM2= <"">
##$SUBNAM3= <"">
##$SUBNAM4= <"">
##$SUBNAM5= <"">
##$SUBNAM6= <"">
##$SUBNAM7= <"">
##$SUBNAM8= <"">
##$SUBNAM9= <"">
##$SW= 600.660478495614
##$SWIBOX= (0..15)
0 1 3 0 0 0 0 0 0 0 0 0 0 0 0 0 
##$SW_h= 48661.800486618
##$TD= 32768
##$TD0= 1
##$TE= 0
##$TE2= 300
##$TE3= 300
##$TEG= 300
##$TL= (0..7)
0 120 53 12 22 120 120 120 
##$TP= (0..7)
150 150 150 150 150 150 150 150 
##$TP07= 0
##$TPNAME0= <>
##$TPNAME1= <>
##$TPNAME2= <>
##$TPNAME3= <>
##$TPNAME4= <>
##$TPNAME5= <>
##$TPNAME6= <>
##$TPNAME7= <>
##$TPOAL= (0..7)
0.5 0.5 0.5 0.5 0.5 0.5 0.5 0.5 
##$TPOFFS= (0..7)
0 0 0 0 0 0 0 0 
##$TUNHIN= 0
##$TUNHOUT= 0
##$TUNXOUT= 0
##$USERA1= <user>
##$USERA2= <user>
##$USERA3= <user>
##$USERA4= <user>
##$USERA5= <user>
##$V9= 5
##$VALIST= <valist>
##$VCLIST= <CCCCCCCCCCCCCCC>
##$VD= 0
##$VDLIST= <DDDDDDDDDDDDDDD>
##$VPLIST= <PPPPPPPPPPPPPPP>
##$VTLIST= <TTTTTTTTTTTTTTT>
##$WBST= 1024
##$WBSW= 4
##$XGAIN= (0..3)
0 0 0 0 
##$XL= 0
##$YL= 0
##$YMAX_a= 10801
##$YMIN_a= -11740
##$ZGOPTNS= <>
##$ZL1= 120
##$ZL2= 120
##$ZL3= 120
##$ZL4= 120
##$ABSF1= 0
##$ABSF2= 0
##$ABSG= 0
##$ABSL= 0
##$ALPHA= 0
##$AQORDER= 0
##$ASSFAC= 0
##$ASSFACI= 0
##$ASSFACX= 0
##$ASSWID= 0
##$AUNMP= <proc_1d>
##$AZFE= 0.1
##$AZFW= 0.5
##$BCFW= 0
##$BC_mod= 2
##$BYTORDP= 0
##$COROFFS= 0
##$CY= -3
##$DATMOD= 1
##$DC= 0
##$DFILT= <>
##$DTYPP= 0
##$F1P= 0
##$F2P= 0
##$FCOR= 1
##$FTSIZE= 65536
##$FT_mod= 6
##$GAMMA= 0
##$GB= 0
##$INTBC= 1
##$INTSCL= 5.30512e-09
##$ISEN= 30
##$LB= 1
##$LEV0= 0
##$LPBIN= 0
##$MAXI= 10000
##$MC2= 0
##$MEAN= 0
##$ME_mod= 0
##$MI= 50
##$NCOEF= 0
##$NC_proc= -6
##$NLEV= 6
##$NOISF1= 182.463
##$NOISF2= 159.3651
##$NSP= 0
##$NTH_PI= 0
##$NZP= 0
##$OFFSET= 298.0089
##$PC= 4
##$PHC0= -1922.652
##$PHC1= 112.4023
##$PH_mod= 1
##$PKNL= yes
##$PPARMOD= 0
##$PSCAL= 0
##$PSIGN= 0
##$REVERSE= no
##$SF= 81.014009
##$SI= 65536
##$SIGF1= 159.3651
##$SIGF2= -187.1042
##$SINO= 113.3802
##$SIOLD= 16384
##$SREGLST= <1H.CDCl3>
##$SSB= 0
##$STSI= 65536
##$STSR= 0
##$SW_p= 48661.800486618
##$SYMM= 0
##$S_DEV= 0
##$TDeff= 32768
##$TDoff= 0
##$TI= <>
##$TILT= no
##$TM1= 0
##$TM2= 0
##$TOPLEV= 0
##$USERP1= <user>
##$USERP2= <user>
##$USERP3= <user>
##$USERP4= <user>
##$USERP5= <user>
##$WDW= 1
##$XDIM= 65536
##$YMAX_p= 445502839
##$YMIN_p= -18337592
$$ End of Bruker specific parameters
$$ ---------------------------------
##NTUPLES= NMR SPECTRUM
##VAR_NAME=  FREQUENCY,     SPECTRUM/REAL,   SPECTRUM/IMAG
##SYMBOL=    X,             R,               I
##VAR_TYPE=  INDEPENDENT,   DEPENDENT,       DEPENDENT
##VAR_FORM=  AFFN,          ASDF,            ASDF
##VAR_DIM=   65536,         65536,           65536
##UNITS=     HZ,            ARBITRARY UNITS, ARBITRARY UNITS
##FACTOR=    0.742531479157977, 1,           1
##FIRST=     24142.8966085939, 0,            0
##LAST=      -24518.9038780241, 0,           0
##MIN=       -24518.9038780241, -18337592,   0
##MAX=       24142.8966085939, 445502839,    0
$$ Real data points
##PAGE= N=1
##DATA TABLE= (X++(R..R)), XYDATA
$$ [...]
37118e486941K527528L533555j68670l496852k577185J425874M443829L525916
$$ -5486941 -2959413 574142 405472 -3091380 -5668565 -4242691 201138 3727054
37110C727054k81715k493467k99708L174735K714320j205670k858361m9228K779214
$$ 3727054 3445339 951872 652164 3826899 6541219 5335549 2477188 2427960 5207174
37101E207174K096854M26713O33646L69037k896845n579698k856451K669403L590046
$$ 5207174 7304028 7730741 8364387 8733424 5836579 256881 -2599570 69833 3659879
37092C659879j700357o755074n913716o08136M196497N776909M321443J153068
$$ 3659879 1959522 -4795552 -10709268 -11317404 -7120907 -1343998 2977445 4130513
37084D130513j648887j982576l1451J298224l19715l562625m865541k711792N23107
$$ 4130513 2481626 499050 467599 1765823 1446108 -2116517 -6982058 -9693850 -9170743
37075i170743J629062Q00897J139353L520402M521245J694320j614341q57000
$$ -9170743 -7541681 -6740784 -5601431 -2081029 2440216 4134536 2520195 1663195
37067A663195J941562P43225m237689n651447m93647M465269L000897r93692l64578
$$ 1663195 3604757 4347982 110293 -5541154 -6034801 -1569532 1431365 437673 73095
37058G3095L631293L995575k70916k912220o20037K403679J469135k216716m215033
$$ 73095 3704388 7699963 7429047 4516827 3896790 6300469 7769604 5552888 1337855
37049A337855k611177M73350J367020j415586m849128m201433M90815L601850
$$ 1337855 -1273322 -799972 567048 -848538 -5697666 -9899099 -9408284 -5806434
37041e806434J904697n24644P22339K835714J053237k242891j248212K699512
$$ -5806434 -3901737 -4426381 -3704042 -868328 184909 -2057982 -3306194 -606682
37033f06682K733563j905451m436501j747543J172189K72684j590535r55848M99701
$$ -606682 2126881 221430 -4215071 -5962614 -4790425 -4517741 -6108276 -7064124 -6564423
37024f564423K90844j68465J040657K554657K537680J573819M45938j184176k282406
$$ -6564423 -6273579 -6442044 -5401387 -2846730 -309050 1264769 1710707 526531 -1755875
37015a755875r45957J354909R74700j455010j603726N05368J66389k530227j347682
$$ -1755875 -2701832 -1346923 -372223 -1827233 -3430959 -2925591 -2759202 -5289429 -6637111
37006f637111M574962O919321J325479m469047k848842J454778L42910l409323
$$ -6637111 -2062149 4857172 6182651 1713604 -1135238 319540 662450 -2746873
36998b746873j633033M282890N480425N16250k880037p52476K258220K043039
$$ -2746873 -4379906 -97016 5383409 5899659 3019622 2267146 4525366 6568405
36990F568405L26085q11315k237585l728848l017787n81847J67989j367199k197461
$$ 6568405 6894490 6083175 3845590 116742 -2901045 -3482892 -3314903 -4682102 -6879563
36981f879563j184625r94J270537L721669N118698K321773j963975k078342Q23717
$$ -6879563 -8064188 -8065182 -6794645 -3072976 2045722 4367495 2403520 325178 1148895
36972A148895Q9024m412657m891071R63438M722891L97338n644104m607399J709086
$$ 1148895 1237919 -3174738 -8065809 -7102371 -2379480 -1982142 -7626246 -12233645 -10524559
36963a0524559N286699M085307K147382J126787o75765k824493l024458j798646
$$ -10524559 -5237860 -1152553 994829 2121616 1445851 -1378642 -4403100 -6201746
36955f201746j331493q37860J657422M150371K801713j306002k961870n66096
$$ -6201746 -7533239 -8371099 -6713677 -2563306 238407 -1067595 -4029465 -4595561
36947d595561J918507J532886K34715O55706J716263P78619k104537m222009l522419
$$ -4595561 -2677054 -1144168 -909453 -253747 1462516 2241135 136598 -4085411 -7607830
36938g607830o61312J892760K378846J475711J150842J715990J300604j015210
$$ -7607830 -8269142 -6376382 -3997536 -2521825 -1370983 345007 1645611 630401
36930F30401l039057j915793K068699N412661M836423M18573m069353m248031
$$ 630401 -2408656 -4324449 -2255750 3156911 7993334 8411907 4342554 94523
36922I4523P7777L792570K298526k308429m144357j978506r4880m04467L93844
$$ 94523 172300 3964870 6263396 3954967 -189390 -2167896 -2262776 -2667243 -2273399
36913b273399L566684M380205l06814n503836m666254P26927L934571K756233
$$ -2273399 1293285 5673490 5366676 -137160 -4803414 -4076487 -141916 2614317
36905B614317O77641j53992j057517k279026j846934L08579J426889J13622j719365
$$ 2614317 3291958 3137966 2080449 -198577 -2045511 -1736932 -310043 -196421 -1915786
36896a915786j789387O5543K400569L246598J360188j787223k664730k82083J935199
$$ -1915786 -3705173 -3639630 -1239061 2007537 3367725 1580502 -1084228 -1366311 568888
36887E68888J178012n41780k02634J230619J335071O95545N89497o00884l737028
$$ 568888 1746900 1205120 1002486 2233105 3568176 4263721 4853218 4252334 515306
36878E15306m961826j208539L337722K847780p60166j293618J209953J617157
$$ 515306 -4446520 -5655059 -2317337 530443 -229723 -1523341 -313388 1303769
36870A303769l36234j57408K029244J556778j224407j149899J223039l34497n311280
$$ 1303769 967535 810127 2839371 4396149 3171742 2021843 3244882 2910385 -2400895
36861b400895n243157J517574N158750J40023n196588k241198M192237M728183
$$ -2400895 -7644052 -6126478 -967728 -827705 -6024293 -8265491 -4073254 654929
36853F54929J54117k368867j683528j451233j309054J218893L538769J767483
$$ 654929 809046 -1559821 -3243349 -4694582 -6003636 -4784743 -1245974 521509
36845E21509j266994m19032K263002J232333j993704j460662J791537R86880l974463
$$ 521509 -745485 -1164517 1098485 2330818 337114 -1123548 667989 1654869 -2319594
36836b319594n406573n48915L868015K525170j004983j263866J165452K696081
$$ -2319594 -7726167 -8275082 -4407067 -1881897 -2886880 -4150746 -2985294 -289213
36828b89213K663122K377272J828733M85448j024495j961611k256154j584523
$$ -289213 2373909 4751181 6579914 7065362 6040867 4079256 1823102 238579
36820B38579J22884J364827Q35700j09435L41957R09068o66315l248567l995027
$$ 238579 361463 1726290 2561990 2452555 2794512 3703580 3037265 -211302 -4206329
36811d206329l103813k634630k007540O63986M057758N225109M270156K804136
$$ -4206329 -7310142 -9944772 -11952312 -11288326 -7230568 -2005459 2264697 5068833
36803E068833O9891l929756m576071R02127O020723K903075m523927n355534J140915
$$ 5068833 5138724 1208968 -3367103 -2464976 3555747 6458822 1934895 -3420639 -2279724
36794b279724M563289M91833l401468j434041J571323P90144l19910J558549K465320
$$ -2279724 2283565 2775398 -626070 -2060111 -488788 301356 -18554 1539995 4005315
36785D005315p23287l578135k414878j190576l056664l193993K085183O935962
$$ 4005315 3282028 -296107 -2710985 -3901561 -6958225 -10152218 -8067035 -1131073
36777a131073N268379J092246N08259O18495l389023o837407k818850M445419
$$ -1131073 4137306 5229552 5737811 6356306 2967283 -3870124 -6688974 -2243555
36769b243555N568650J236329o95558K11269j675356m645610j689718M679254
$$ -2243555 3325095 4561424 3865866 4077135 2401779 -2243831 -3933549 745705
36761G45705M165615l289226n616631J670985P650271L614061l834344m767843
$$ 745705 4911320 1622094 -3994537 -2323552 5326719 8940780 5106436 338593
36753C38593o23525J454739O29641K20675M4647j113142p03208K653765M348204
$$ 338593 -284932 1169807 1799448 2020123 2064770 951628 248420 2902185 7250389
36744G250389Q24395l337922k453163P87762N47671j585352L8428L961126L223758
$$ 7250389 8074784 4736862 2283699 3071461 3619132 2033780 2072208 6033334 9257092
36735I257092k437308n061069p49393M214164K800590k886137n305970j809686
$$ 9257092 6819784 1758715 1009322 5223486 8024076 5137939 -168031 -1977717
36727a977717K676652K387161k437759n990944l574666K914482P151173N723646
$$ -1977717 698935 3086096 648337 -5342607 -8917273 -6002791 1148382 6872028
36719F872028J291063j885976k697491k185500r35029K49941j75440j715168j190644
$$ 6872028 8163091 6277115 3579624 1394124 459095 709036 533596 -1181572 -2372216
36710b372216K210664M141110J129660l231907k954760J193470K709606o92849
$$ -2372216 -161552 3979558 5109218 1877311 -1077449 116021 2825627 2132778
36702B132778l708821j609123K739659L064429j560721n462682l697519J685573
$$ 2132778 -1576043 -3185166 -445507 2618922 1058201 -4404481 -8102000 -6416427
36694f416427M262803J583171j649014n26195K523039J564450k748644l420212
$$ -6416427 -2153624 -570453 -2219467 -2745662 -222623 1341827 -1406817 -4827029
36686d827029J438377M798331K028250j334027P76569M193860J834522l375276
$$ -4827029 -3388652 1409679 3437929 2103902 2880471 7074331 8908853 5533577
36678E533577l176610J438763J736362l338144n127947m05283L149332N87597
$$ 5533577 2356967 3795730 5532092 2193948 -2933999 -3339282 -189950 397647
36670C97647k210230k3320K226429o55298l463627O29231P187832O834808J04690
$$ 397647 -1812583 -1835903 390526 -264772 -3728399 -3099168 4088664 10923472 11028162
36661A1028162m402410l882039k962838l000015l56353M209384M488081p61643
$$ 11028162 6625752 2743713 -219125 -3219140 -3575493 633891 5121972 4360329
36653D360329n011203m126461j468992k38893J297750L553629K564038k241277
$$ 4360329 -650874 -4777335 -6246327 -6485220 -5187470 -1633841 930197 -1311080
36645a311080m565002r44430K867108J334881j571292J37677L587592K466873
$$ -1311080 -5876082 -6820512 -3953404 -2618523 -4189815 -4052138 -464546 2002327
36637B002327j172479m81619L553548L602063q22149k560479j25467o43008o214689
$$ 2002327 829848 348229 3901777 7503840 6681691 4121212 3995745 3352737 -2861952
36628b861952q217351j243814O619712N597865q54433k336390K204333M664462
$$ -2861952 -11079303 -12323117 -5703405 -105540 -959973 -3296363 -1092030 3572432
36620C572432J860174r00948m22675j80982k105222k276640J322994L776687R30464
$$ 3572432 5432606 4531658 4108983 3928001 1822779 -453861 869133 4645820 5576284
36611E576284l293126k931130N90968J190715j999607l748735j241179K186147
$$ 5576284 2283158 -647972 -57004 1133711 -865896 -4614631 -5855810 -3669663
36603c669663K801514J365638M32727L00410k6738k59095M19353J472747J829849
$$ -3669663 -868149 497489 930216 1230626 1203888 944793 1364146 2836893 4666742
36594D666742J507060Q86866l97750k177186k649800p81850J210697N28312j581927
$$ 4666742 6173802 7060668 6662918 4485732 1835932 1054082 2264779 2793091 1211164
36585A211164j245784J616927K293298j324058m280328j451814L869675L818707
$$ 1211164 -34620 1582307 3875605 2551547 -1728781 -3180595 689080 4507787
36577D507787k268126o020834j820118M932099N178003j689670p695785o615069
$$ 4507787 2239661 -3781173 -5601291 -669192 4508811 2819141 -4876644 -11491713
36569a1491713k30643N212832N373786Q09975l581600k525323L595224P597071
$$ -11491713 -11722356 -6509524 -1135738 -325763 -3907363 -6432686 -2837462 4759609
36561D759609L683044m252726o892581j825324L622843L050146r62959k318176
$$ 4759609 8442653 4189927 -2702654 -4527978 -905135 2145011 1182052 -1136124
36553a136124k24403J590134J200410m17063k394178l791373k140621L329309
$$ -1136124 -1360527 229607 1430017 1012954 -1381224 -5172597 -7313218 -3983909
36545c983909Q091828O658485L35651l882970k623838J62348N1182j740826j696986
$$ -3983909 4107919 10766404 11102055 7219085 4595247 4757595 4808777 3067951 1370965
36536A370965k0564K71531j363300k004352M49452M161234N154281J602482l785546
$$ 1370965 1350401 1621932 258632 -1745720 -1296268 2864966 8019247 9621729 5836183
36527E836183n878805k447880K852926M315109R84190k412359j864354J047503
$$ 5836183 -42622 -2490502 362424 4677533 5661723 3249364 1385010 2432513
36519B432513K171200N38622j202194r55898M69954Q36546j196400m734291o584743
$$ 2432513 4603713 5142335 3940141 2984243 3454197 4290743 3094343 -1639948 -8224691
36510h224691l702990K740958P081283N204580j17767k658523q33294J054994
$$ -8224691 -11927681 -9186723 -2105440 3099140 2981373 322850 -510444 544550
36502E44550p9779j732377n20544K074941K159831j74096r66251J124273K339204
$$ 544550 464771 -1267606 -1788150 286791 2446622 2272526 1306275 2430548 4769752
36493D769752m68531m536096m573399j75941L520374K923702M77725K03348J429018
$$ 4769752 4301221 -234875 -4808274 -4984215 -1463841 1459861 1937586 2140934 3569952
36484C569952M90209k457413k853941R67131M170559K075143k788678m421615
$$ 3569952 4060161 1602748 -1251193 -284062 3886497 5961640 3172962 -1248653
36476a248653k120755m67026j207413q69875K248426M250876J902397j764498
$$ -1248653 -3369408 -3836434 -5043847 -5913722 -3665296 585580 2487977 723479
36468G23479k252253n71854o00135k011879j415818P70278O02062k096920k667618
$$ 723479 -1528774 -2100628 -2700763 -4712642 -6128460 -5358182 -4756120 -6853040 -9520658
36459i520658O70717L492900K078446j131846k192238j504441j124218L9078L532133
$$ -9520658 -8849941 -5357041 -3278595 -4410441 -6602679 -8107120 -9231338 -9192260 -5660127
36450e660127O546196N038243K00130l156953l658480l703805l458077m59288
$$ -5660127 886069 5924312 6124442 2967489 -690991 -4394796 -7852873 -8312161
36442h312161M112927M929222O28529k948261j080499K842231K978328K0181p72140
$$ -8312161 -4199234 729988 1358517 -1589744 -2670243 171988 3150316 3170497 2398357
36433B398357J603555K696856k2048l534907l974024j229437K258169M287326
$$ 2398357 4001912 6698768 6676720 3141813 -832211 -2061648 196521 4483847
36425D483847L494357N8364l075348k521764O87110J612916j365783l197822O90263
$$ 4483847 7978204 8036568 4961220 2439456 3126566 4739482 3373699 175877 866140
36416H66140O597935O648586k30486o556985o415857k439130j03385N49682K783999
$$ 866140 7464075 14112661 13882175 7325190 909333 -1529797 -1633182 -1083500 1700499
36407A700499N343468L012362m430283r513111o395863R55902L975785O48439
$$ 1700499 7043967 10056329 5626046 -3887065 -10282928 -9327026 -5351241 -4702802
36399d702802l013983j904014K278694M843686M023315J325785j200632k046643
$$ -4702802 -7716785 -9620799 -7342105 -2498419 1524896 2850681 1650049 -396594
36391c96594o54879J388011J342071q64302j821634M13501K824941J680136j653559
$$ -396594 -1051473 336538 1678609 814307 -1007327 -593826 2231115 3911251 2257692
36382B257692k730769p79826N94847n77883j934203j096433P66224J367986O09888
$$ 2257692 -473077 -1252903 -658056 -1235939 -3170142 -4266575 -3500351 -2132365 -1522477
36373a522477l18496r60536j021512K69052K489007L407646J735834r13978k199090
$$ -1522477 -1840973 -2801509 -3823021 -3553969 -1064962 2342684 4078518 3164540 965450
36364I65450j701700l17287J095637J290939p41277l236123k583217J210181L309559
$$ 965450 -736250 -1053537 42100 1333039 591762 -2644361 -5227578 -4017397 -707838
36355g07838J108414j302688J41974K216545q7486l879354k156442L870964N248220
$$ -707838 400576 -902112 -760138 1456407 1368921 -2510433 -4666875 -795911 4452309
36346D452309o65767n614278l320367J509109K279318R01347K015099L231291
$$ 4452309 3786542 -1827736 -5148103 -3638994 -1359676 -458329 1556770 4788061
36338D788061q8823m637543l315437K555674M656205Q33353k358579j154777M07555
$$ 4788061 4699238 61695 -3253742 -698068 3958137 4791490 2432911 1278134 1685689
36329A685689o19039p24797K460411M527676J463598l254641m212478k161391
$$ 1685689 1066650 341853 2802264 7329940 8793538 5538897 1326419 -834972
36321h34972j090492r97453O00979K631872J811799j300808k737107j084427J147973
$$ -834972 -1925464 -2922917 -2321938 309934 2121733 820925 -1916182 -3000609 -1852636
36312a852636J801518J235930M88522M9132J02506O6647r87201k000313m27892
$$ -1852636 -51118 1184812 1673334 1722466 1824972 1891619 904418 -1095895 -1523787
36303a523787K991921L450518p65390m103493j350419L936046M381579k18187
$$ -1523787 1468134 4918652 4153262 49769 -1300650 2635396 7016975 6798788
36295F798788l359126k017450L61509R24978Q72467J024212J7246j659524j313660
$$ 6798788 3439662 1422212 1783721 2708699 3581166 4605378 4622624 2963100 1649440
36286A649440P69466J042006r11712j135394J624223L126862N65200k826751l137458
$$ 1649440 2418906 3460912 2549200 1413806 3038029 6164891 6730091 3903340 765882
36277G65882j168767N61359J779273K358742P36494k302036k762970J50513J555611
$$ 765882 -402885 158474 1937747 4296489 5032983 2730947 -32023 118490 1674101
36268A674101j203621l343556m65905L448801K385057j577182k076639O35126
$$ 1674101 470480 -2873076 -3338981 109820 2494877 917695 -1158944 -523818
36260e23818J098855o46553R64268N746794N730202k343625j0209213q804098
$$ -523818 575037 -71516 892752 6639546 12369748 10026123 -183090 -8987188
36252h987188m06042N380475M220216K22428j609726j006762m51509j181459k200652
$$ -8987188 -9393230 -4012755 207461 429889 -1179837 -2186599 -2638108 -3819567 -6020219
36243f020219j681077J039791M160763M670176J776203j694939k382618j35281
$$ -6020219 -7701296 -6661505 -2500742 2169434 3945637 2250698 -131920 -267201
36235b67201K420372L239968K318229K77395k581142n278799n782223l064139
$$ -267201 2153171 5393139 7711368 7988763 5407621 128822 -5653401 -8717540
36227h717540R94207L248924K913864K044970K013040J489379o57001k528821
$$ -8717540 -7723333 -4474409 -1560545 484425 2497465 3986844 3329843 801022
36219H01022j878152r0339n8877j071522j29412J928081J031351k326399k124743
$$ 801022 -1077130 -1167469 -1226346 -2297868 -2427280 -499199 532152 -1794247 -3918990
36210c918990L270840O443575J501285n844710n896612P70731M873689K751159
$$ -3918990 -648150 5795425 7296710 1452000 -4444612 -3673881 1199808 3950967
36202C950967L13982J827830L347592O86257l102409l045325j19669J245427K28985
$$ 3950967 4264949 6092779 9440371 10126628 7024219 3978894 3859225 5104652 5333637
36193E333637n06825K21474J383275K283460K275375l80960n622209q921521n742927
$$ 5333637 4826812 5048286 6431561 8715021 10990396 10609436 4987227 -3934294 -9677221
36184i677221J640341N761080L051246k048543l370894n80874J749539R59343
$$ -9677221 -8036880 -2275800 775446 -1273097 -4643991 -5224865 -3475326 -2515983
36176b515983o57475M3671K090660J584630k421509n624127l675295J846495N329873
$$ -2515983 -3173458 -3129787 -1039127 545503 -1876006 -7500133 -11175428 -9328933 -3999060
36167c999060M482317K510521K272916J915174j120559m535740l675272J164901
$$ -3999060 483257 2993778 5266694 7181868 6061309 1525569 -2149703 -984802
36159i84802M010141R34902m487291n656212j214060L732852M344196J490756
$$ -984802 3025339 3960241 -527050 -6183262 -7397322 -3664470 679726 2170482
36151B170482n61919m7983R05791K55978j099624j345727p05668p02865j590870
$$ 2170482 1608563 1560580 2466371 2722349 1622725 276998 -428670 -1131535 -2722405
36142b722405k314338k397782k101798j078324J265448M047144N248258M015015
$$ -2722405 -5036743 -7434525 -9536323 -10614647 -9349199 -5302055 -53797 3961218
36134C961218J293301j735847m246126m918215k663530J220201L583459L071623
$$ 3961218 5254519 3518672 -727454 -5645669 -8309199 -7088998 -3505539 -433916
36126d33916J578659J080382Q66694m38210j692786o06840K120345K713783o18120
$$ -433916 1144743 2225125 3091819 2653609 960823 353983 2474328 5188111 4569991
36117D569991m470084m026385P12333M695798M012805O0775l418584m922875m637128
$$ 4569991 99907 -3926478 -3214145 1481653 5494458 5555233 2136649 -2786226 -7423354
36108g423354j843892L231315O483920L853048j894954l673087j92276K422349
$$ -7423354 -9267246 -6035931 447989 4301037 2406083 -1267004 -1459280 963069
36100I63069R63978j6738K367822K696089l102824q043449l574858N539962O874791
$$ 963069 1927047 1910309 4278131 6974220 3871396 -4172053 -7746911 -2206949 4667842
36091D667842q37420o075913k468889L076260L247201O28922K8256j47819k315582
$$ 4667842 3830422 -2245491 -4714380 -1638120 1609081 2238003 2266259 2118440 -197142
36082a97142l203363l5063L005432J558539j175823n99218P70495j113593k676746
$$ -197142 -3400505 -3435568 -430136 1128403 -47420 -646638 123857 -989736 -3666482
36073c666482J460182O960891M535180m784744r426695l675540M780075O562439
$$ -3666482 -2206300 4754591 9289771 4505027 -4921668 -8597208 -3817133 2745306
36065B745306K257826j564409k038286j091224o02962o88053j055084j429427
$$ 2745306 5003132 3438723 1400437 309213 -293749 -981802 -2036886 -3466313
36057c466313j549934j640478j674719n09465K205821M152895L271970J467751
$$ -3466313 -5016247 -6656725 -8331444 -8840909 -6635088 -2482193 789777 2257528
36049B257528J653450K214847o69523n577994o517458k051217K011962J246250
$$ 2257528 3910978 6125825 5456302 -121692 -6639150 -8690367 -6678405 -5432155
36041e432155j375114j188691J089839J946587J174650J096143J912953J818553
$$ -5432155 -6807269 -7995960 -6906121 -4959534 -3784884 -2688741 -775788 1042765
36033A042765N49851m18499n59283p03858j219741j508314r33289N87123K117749
$$ 1042765 1592616 1174117 614834 -89024 -1308765 -2817079 -3750368 -3163245 -1045496
36024a045496J764981j062414l533290k216096J744816L626748J943614K43398
$$ -1045496 719485 -342929 -3876219 -6092315 -4347499 -720751 1222863 1466261
36016A466261Q00390J188728l96876j256012O18058J914290n75992l716274k892877
$$ 1466261 2266651 3455379 3058503 1802491 2420549 4334839 3758847 42573 -2850304
36007b850304j3068n8216j875750p0627M533533M651111j598800o436175l721977
$$ -2850304 -2863372 -2921588 -4797338 -4867965 -334432 4316679 2717879 -3718296 -7440273
35998g440273K013207K861966j070149l336925j045606K710640M659437M332450
$$ -7440273 -5427066 -2565100 -3635249 -6972174 -8017780 -5307140 -647703 3684747
35990C684747J985274j745784m266218l305912q17448n98937k029367p70830L504488
$$ 3684747 5670021 3924237 -341981 -3647893 -4465341 -5064278 -7093645 -7864475 -4359987
35981d359987N208373J123536l877055l290470J865046M852701K664084q56550
$$ -4359987 848386 1971922 -1905133 -5195603 -3330557 1522144 4186228 3329678
35973C329678j320876P29738J951167J113306q787L47624J428359Q16080k135779
$$ 3329678 2008802 2738540 4689707 5803013 5794226 6141850 7570209 8386289 6250510
35964F250510m335109k190484K839114M722036P71986l807706k727568K347733
$$ 6250510 1915401 -275083 2564031 7286067 8058053 4250347 1522779 3870512
35956C870512M277985Q02083l092562l407035j984007j413515n68187J704501
$$ 3870512 8148497 8950580 5858018 2450983 466976 -946539 -1514726 189775
35948A89775L018272J358843j041056j505329j301291k300310k578691q867K674331
$$ 189775 3208047 4566890 3525834 2020505 719214 -1581096 -4159787 -4168654 -1494323
35939a494323J723135j007811j109178N12695n71514l496086k520831K875496
$$ -1494323 228812 -778999 -1888177 -1375482 -1946996 -5443082 -7963913 -5088417
35931e088417N843752K750926j015467k1676K450731L92455m493469n188008l66721
$$ -5088417 755335 3506261 2490794 2469118 4919849 5312304 818835 -4369173 -4735894
35922d735894L578315J920003k299206l294736l7732L555656L980457J616521
$$ -4735894 -1157579 762424 -1536782 -4831518 -4869250 -1313594 2666863 4283384
35914D283384o37642r68421m30930r85209k268650j859836Q09293K919255K287091
$$ 4283384 3645742 2677321 2246391 1261182 -1007468 -2867304 -2058011 861244 3148335
35905C148335R93888K226668M622613L393137k442021p369946n909732L49461
$$ 3148335 4142223 6368891 10991504 14384641 11942620 4572674 -1337058 -987597
35897i87597M705930L360106r25044l104830j660757O92164Q06509j457794l246978
$$ -987597 3718333 7078439 6153395 3048565 1387808 2079972 2886481 1428687 -1818291
35888a818291j831554J909196L521660l7793n508100n949674M36579O869715O204882
$$ -1818291 -3649845 -1740649 1781011 1743218 -3764882 -9714556 -9277977 -2408262 3796620
35879C796620L52616k736254l28105K253706O73794k303276k448038p69172l85768
$$ 3796620 4149236 1412982 1084877 3338583 4012377 1709101 -738937 -1508109 -1893877
35870a893877n22621J313992L588244K455848j800306m779628m086322j470540
$$ -1893877 -2416498 -1102506 2485738 4941586 3141280 -1638348 -5724670 -7195210
35862g195210Q09468K064730J963761P15733O235O49483N77937j347602j754760
$$ -7195210 -6385742 -4321012 -2357251 -1641518 -1635283 -985800 -407863 -1755465 -3510225
35853c510225K038402N483190K255773m801231o174751J59820N377076L064890
$$ -3510225 -1471823 4011367 6267140 1465909 -4708842 -4549022 828054 3892944
35845C892944k167786l355671j151757J75222N88190J989220K734359O05819k166203
$$ 3892944 1725158 -1630513 -2782270 -2607048 -2018858 -29638 2704721 3310540 1144337
35836A144337k383459j325450j684857k318986j193900j65504j238017j378507
$$ 1144337 -1239122 -2564572 -4249429 -6568415 -7762315 -7927819 -9165836 -10544343
35828a0544343K698533P437330O872106J967526j360990j755863k592819l855992
$$ -10544343 -7845810 -408480 6463626 8431152 7070162 5314299 2721480 -1134512
35820a134512j897742K415735L203102j080533m614735k857113J492271L447123
$$ -1134512 -3032254 -616519 2586583 1506050 -3108685 -5965798 -4473527 -1026404
35812a026404J748005j954313n392623n780155k120238J741660J244141j439652
$$ -1026404 721601 -1232712 -6625335 -12405490 -14525728 -12784068 -11539927 -12979579
35804a2979579q6583M989076O436597J660758k948043k687862j129018j486313
$$ -12979579 -13066162 -8077086 -1640489 20269 -2927774 -5615636 -6744654 -8230967
35796h230967o11N363876P567830Q47596p635073o863858J143989M518411k9178
$$ -8230967 -8231578 -2867702 4700128 5547724 -2087349 -8951207 -7807218 -3288807 -3317985
35787c317985l266374J008896P002121P033074K112294k197923l873926l519490
$$ -3317985 -6584359 -5575463 1426658 8459732 10572026 8374103 4500177 980687
35779I80687p02659L662736N263634J739805k737256k760697P04408K330682K58334
$$ 980687 278028 3940764 9204398 10944203 8206947 5446250 6150658 8481340 8739674
35770H739674k468031l336093l057778k802955k153029m50817J993981M275705
$$ 8739674 6271643 2935550 -122228 -2925183 -5078212 -5529029 -3535048 740657
35762G40657M949781K473048k318113n090689k291517L621074O222020K903393
$$ 740657 5690438 8163486 5845373 754684 -1536833 2084241 8306261 11209654
35754A1209654k168653l815320j861554K40157N16261j86764p39113j122110j397661
$$ 11209654 9041001 5225681 3364127 3604284 4120545 3933781 3194668 2072558 674897
35745F74897j094210J1944J457193K487038K243625O3303l265721m999460k964766
$$ 674897 -419313 -407369 1049824 3536862 5780487 5843790 2578069 -2421391 -5386157
35736e386157J129040K762958Q8398l222999k477883J602300L539223N61109l276413
$$ -5386157 -4257117 -1494159 -1405761 -4628760 -7106643 -5504343 -1965120 -1404011 -4680424
35727d680424k375002K733682N950447L649871q54790k114084N54614L132933
$$ -4680424 -7055426 -4321744 1628703 5278574 4423784 2309700 2864314 5997247
35719E997247K521694l81638k845641l263909j710359N52035J581405L13361j871852
$$ 5997247 8518941 8137303 5291662 2027753 317394 869429 2450834 2764195 892343
35710H92343k497045j221362j42543n25651j204575r86060m64190j41565J108038
$$ 892343 -1604702 -2826064 -2968607 -3494258 -4698833 -5684893 -6149083 -6290648 -5182610
35701e182610L807996N891876N155371K361884k41493k193762m249426n762329
$$ -5182610 -1374614 4517262 9672633 12034517 11793024 9599262 5349836 -412493
35693d12493n345706l360844j184078J164574L953736N327832L323389k60930
$$ -412493 -5758199 -9119043 -10303121 -9138547 -5184811 143021 3466410 3205480
35685C205480j593678k35494P82054J64146m28267n50371j767145l389536k264107
$$ 3205480 1611802 1376308 2158362 2322508 1894241 1343870 -423275 -3812811 -6076918
35676f076918J480657L268955J012287j450908p54209P90811M1264j317617m12835
$$ -6076918 -4596261 -1327306 -315019 -1765927 -2520136 -1729325 -1688061 -3005678 -3418513
35667c418513J306732J071481J66J95371j78180l088430m748843m27557O520898
$$ -3418513 -2111781 -1040300 -1040134 -844763 -1022943 -4111373 -8860216 -9287773 -2766875
35658b766875P855987K459305k150545j210652J474446J230343n67675p18067
$$ -2766875 5089112 7548417 5397872 4187220 5661666 6892009 6324334 5606267
35650E606267j9590p27740j905180j276405P18111J910917J592215L28633j546653
$$ 5606267 5586677 4858937 2953757 1677352 2395463 4306380 5898595 6227228 4680575
35641D680575l241129l103398p50008J884878K877115K238059R66683M8166M99581
$$ 4680575 1439446 -1663952 -2413960 -529082 2348033 4586092 5552775 5600941 6100522
35632F100522K010735J828331j741605n120915l228926K285970M000904o66064
$$ 6100522 8111257 9939588 8197983 3077068 -151858 2134112 6135016 5468952
35624E468952n518338m848470r65482J240450J853447L127952L664487J191621
$$ 5468952 -49386 -4897856 -5863338 -4622888 -2769441 358511 4022998 5214619
35616E214619k006319k212426n43593o33635k021514j443438P25686J058811n94288
$$ 5214619 3208300 995874 452281 -181354 -2202868 -3646306 -2920620 -1861809 -2456097
35607b456097r18263P63396J386804l28347j852829j127271J018845L215595M703400
$$ -2456097 -3374360 -2610964 -1224160 -1552507 -3405336 -4532607 -3513762 -298167 4405233
35598D405233M058834O17224k826993k852397r16886j380067l795227k785258
$$ 4405233 8464067 9081291 6254298 3401901 2485015 1104948 -2690279 -5475537
35590e475537K776912O240444K356783m488366n848411m30804M956499M826830
$$ -5475537 -2698625 3541819 5898602 1410236 -4438175 -4868979 87520 4914350
35582D914350J179306o69528M71845Q13257k190048n253874l380647K180290M241091
$$ 4914350 6093656 5424128 5895973 6709230 4519182 -734692 -4115339 -1935049 2306042
35573B306042k00795m554794j781001M559780N008060j563210o197506l249671
$$ 2306042 2105247 -2449547 -4230548 329232 5337292 3774082 -2423424 -5673095
35565e673095K253328L743341K466340K578819K627554j189551o448656o450163
$$ -5673095 -3419767 323574 2789914 5368733 7996287 6806736 358080 -6092083
35557f092083k84849N064270L862700j408118m011139j200348L389914M574057
$$ -6092083 -6376932 -1312662 2550038 1141920 -2869219 -4069567 -679653 3894404
35549C894404J537038j539578j010835J178091K81610l711727n171422j019238
$$ 3894404 5431442 3891864 2881029 4059120 4340730 629003 -4542419 -5561657
35541e561657M108066M154179M5805k423728j202395K19468q81136k726806k357825
$$ -5561657 -1453591 2700588 2746393 322665 -879730 -660262 -1541398 -4268204 -6626029
35532f626029N27599L975450N725567M263353N0174l850141m264507j459835J269771
$$ -6626029 -6098430 -2122980 3602587 7865940 7916114 4065973 -198534 -1658369 -388598
35523c88598J555219l6627j699172k281738j467233L13462J955057K719823K924235
$$ -388598 1166621 1129994 -569178 -2850916 -4318149 -4004687 -2049630 670193 3594428
35514C594428K781911J625434n19917k048418k101181k076669k782168k218794
$$ 3594428 6376339 8001773 7481856 5433438 3332257 1255588 -1526580 -3745374
35506c745374Q52770L306430J655314j897789k206268P97092K148992P9759j508802
$$ -3745374 -2892604 413826 2069140 171351 -2034917 -1237825 911167 990926 -517876
35497e17876j15650J463291P89394N3829J203661J531049j335345l845184j352236
$$ -517876 -633526 829765 1619159 1672988 2876649 4407698 3072353 -772831 -2125067
35488b125067L875761N199091J274514k270605j294070J505769J347765k024496
$$ -2125067 1750694 6949785 8224299 5953694 4659624 6165393 7513158 5488662
35480E488662m755744m012249q27907J475073Q04252j499859k086149L38423L210191
$$ 5488662 732918 -3279331 -4107238 -2632165 -1827913 -3327772 -5413921 -5075498 -1865307
35471a865307L399420J189071o65587q50904l78052k05867k42470m42541p88113
$$ -1865307 1534113 2723184 2057597 1206693 828641 622774 380304 -62237 -850350
35462h50350m24255J102913K143194Q40196j623275k341753r96898J56296M24278
$$ -850350 -1274605 -171692 1971502 2811698 1188423 -1153330 -2150228 -1993932 -1569654
35453a569654J120526J681779j01081k758799j303533M427694O914270J296014
$$ -1569654 -449128 1232651 1131570 -1627229 -2930762 1496932 8411202 9707216
35445I707216n935759n313549J476451M047249p93771m703850j585990L165056
$$ 9707216 3771457 -1542092 -65641 3981608 3187837 -1516013 -3102003 63053
35437F3053K455631q66609Q2224L653420K359746l799689o413782k050949K423525
$$ 63053 2518684 1652075 1734299 5387719 7747465 3947776 -2466006 -4516955 -2093430
35428b093430J187023j839135q54056J814575N74836k999693k620558J845972
$$ -2093430 -906407 -2745542 -3599598 -1785023 -1210187 -4209880 -6830438 -4984466
35420d984466L983941J398212p72505J267936M066430L035292o45713k972976
$$ -4984466 -1000525 397687 -374818 893118 4959548 7994840 7349127 4376151
35412D376151l042249k187461l90025K334919L324523L35353m082132n159248
$$ 4376151 1333902 -853559 -1243584 1091335 4415858 4751211 669079 -4490169
35404d490169k157963J286885K409728J637075J84732j292112j715854m46712
$$ -4490169 -6648132 -5361247 -2951519 -1314444 -1129712 -2421824 -4137678 -4584390
35396d584390P06690o04879l098670k830342R90451M432465M333067K277063J332143
$$ -4584390 -3877700 -4482579 -7581249 -10411591 -9421140 -4988675 -655608 1621455 2953598
35387B953598J602127J390426O13426L07823J10059j005693k147290j302811J262207
$$ 2953598 4555725 5946151 6559577 6867400 6977459 5971766 3824476 2521665 3783872
35378C783872K685873J182338j649165l011170k222433r07825o16785j274751
$$ 3783872 6469745 7652083 6002918 2991748 769315 -138510 -755295 -2030046
35370b030046j776976j232231M48190K349099K651644M8223l937647n104796j049453
$$ -2030046 -3807022 -5039253 -4591063 -2241964 409680 457903 -3479744 -8584540 -9633993
35361i633993M817814O302895K126301k163955j531659K123605L565510J770118
$$ -9633993 -4816179 1486716 3613017 1449062 -82597 2041008 5606518 7376636
35353G376636J7048j15576l46816j450925j828940j088734j039056j895631j339854
$$ 7376636 7393684 7278108 6931292 5480367 3651427 2562693 1523637 -371994 -1711848
35344a711848J010598J985164q5509k227147j382718J095201K413913K633932
$$ -1711848 -701250 1283914 1198405 -1028742 -2411460 -1316259 1097654 3731586
35336C731586K594855P15847l704830o450549k941756M209501P379184L657533
$$ 3731586 6326441 7042288 3337458 -3113091 -6054847 -1845346 5533838 9191371
35328I191371k259246n222840m989364l435301j090865J428469K289225J241106
$$ 9191371 6932125 1709285 -3280079 -6715380 -7806245 -6377776 -4088551 -2847445
35320b847445O80246J697475J886277m45368k650783j507032J505360K293091
$$ -2847445 -2167199 -469724 1416553 971185 -1679598 -3186630 -1681270 611821
35312F11821L07924j088181j10174J137947M60327j269995j957844j140149K65051
$$ 611821 919745 -168436 -278610 859337 1319664 49669 -1908175 -3048324 -2783273
35303b783273J414316J645860O72294k86668O99909L000640K983108r16276m585183
$$ -2783273 -1368957 276903 949197 662529 1362438 4363078 7346186 6429910 1844727
35294A844727l126875J673210L169406m75590l371458q66431L298915K941689
$$ 1844727 -1282148 391062 3560468 3084878 -286580 -1153011 2145904 5087593
35286E087593j126607l188869k003905j629061l239521k948770O16921K929101
$$ 5087593 3960986 772117 -1231788 -2860849 -6100370 -9049140 -8432219 -5503118
35278e503118R18831j639184k63421L038757L475944J066730n42589m74068o43337
$$ -5503118 -4584287 -6223471 -6486892 -3448135 27809 1094539 551950 77882 -565455
35269e65455r39809L86586K156317J080513k578056m483111k165698J896020L851510
$$ -565455 -1505264 -1118678 1037639 2118152 -459904 -4943015 -7108713 -5212693 -1361183
35260a361183K459368p63086l009238k011771J402384L387995J899472k86669
$$ -1361183 1098185 335099 -2674139 -4685910 -3283526 104469 2003941 1717272
35252A717272j54804N57454q17420j805178J418626N884502M735263j817586n953336
$$ 1717272 1562468 2119922 1302502 -502676 915950 6800452 11535715 9718129 3764793
35243C764793l855109l39412M10360R96718L690683M387603m26676o105984n843738
$$ 3764793 -90316 -429728 -19368 977350 4668033 9055636 8628960 2522976 -3320762
35234c320762o53607K942066K622254J481186J172496O7907j934278k337311p98713
$$ -3320762 -3974369 -1032303 1589951 3071137 4243633 4311540 2377262 39951 -758762
35225g58762n04889l017535m978148k343981L691681P429272N435494P86112j048985
$$ -758762 -1263651 -4281186 -9259334 -11603315 -7911634 -482362 4953132 5739244 4690259
35216D690259L87063M27226k780126m723189k078690Q76976q96294l976002k021539
$$ 4690259 5077322 5504548 2724422 -1998767 -4077457 -3200481 -4096775 -8072777 -10094316
35207a0094316K339163J288803l517289k062483O471350J0123624L037732m649685
$$ -10094316 -7755153 -6466350 -9983639 -12046122 -5574772 4548852 7586584 2936899
35199B936899l360660J292883L95315k470389K25325M268666Q93674o245978o223545
$$ 2936899 -423761 869122 1264437 -1205952 -980627 3288039 4181713 -2064265 -8287810
35190h287810N27000L532528N14315m67278K894674L545826m98729j957336J973134
$$ -8287810 -7760810 -4228282 -3713967 -4181245 -1286571 2259255 1760526 -196810 1776324
35181A776324M322275J216128j510897M95603K948080K068130Q47602J004650
$$ 1776324 6098599 7314727 5803830 6299433 9247513 11315643 12163245 13167895
35173A3167895j299738o103250o109877Q82768N698904J464869n323280n541235
$$ 13167895 11868157 5764907 -344970 537798 6236702 7701571 2378291 -3162944
35165c162944j026522J286330J319015K563771L259942M70301k338535j061802
$$ -3162944 -4189466 -2903136 -1584121 979650 4239592 4709893 2371358 1309556
35157A309556O79288j792558m214716k46209O013693N535767m95372k625294J036497
$$ 1309556 1988844 196286 -4018430 -4264639 1749054 7284821 6789449 4164155 5200652
35148E200652K534523j727285n417725l429081O69122J808557O76260K33622P75360
$$ 5200652 7735175 6007890 590165 -2838916 -2169794 -361237 315023 548645 1324005
35139A324005J573094K836466L690498K135487j408061m061971m670787m397612
$$ 1324005 2897099 5733565 9424063 11559550 10151489 6089518 1418731 -2978881
35131b978881l238341k20341K979415L195542P61183r89197j102997j411931j887226
$$ -2978881 -6217222 -6437563 -3458148 -262606 498577 -490620 -1593617 -3005548 -4892774
35122d892774n73525J872755K690825K246705L564950O207574N919845J362228
$$ -4892774 -5466299 -3593544 -902719 1343986 4908936 11116510 17036355 18398583
35114A8398583l608681n378717l991896p37452L036044M357347Q59024m702665
$$ 18398583 14789902 9411185 5419289 4681837 7717881 12075228 12934252 8231587
35106H231587o763354m204175p22952J719636M203571N682184L145334j914777
$$ 8231587 1468233 -2735942 -3458894 -1739258 2464313 8146497 11291831 9377054
35098I377054l686789n87933K310715J361472j003832j769350j588094j181969
$$ 9377054 5690265 5102332 7413047 8774519 7770687 6001337 4413243 3231274
35090C231274O67825K938636J950072k113672m037622j781033J86904j041282
$$ 3231274 3899099 6837735 8787807 6674135 2636513 855480 1042384 1102
35082A102j791966J058948M114389L468976J153724M96024K21562j569321k583198
$$ 1102 -1790864 -731916 3382473 6851449 8005173 8501197 8722759 7153438 4570240
35073D570240j070242m48257l112129m408013K59190O419632O330349P60650k910601
$$ 4570240 3499998 3051741 -60388 -4468401 -4209211 2210421 8540770 9301420 6390819
35064F390819k302973j630150k650917k231833L92688J306998j274527l797539
$$ 6390819 4087846 2457696 -193221 -2425054 -2032366 -725368 -1999895 -5797434
35056e797434l028791j23019K701360N063263O129938L668156k026605o343995
$$ -5797434 -8826225 -8949244 -6247884 -1184621 4945317 8613473 6586868 242873
35048B42873n192081O4114M269696L905737j16864l871821l878264r9261M019367
$$ 242873 -4949208 -4885094 -615398 3290339 3173475 -698346 -4576610 -4675871 -656504
35039f56504M996657K677311k21553j202771o0572J286390O08650j989267l381817
$$ -656504 4340153 7017464 6795911 5593140 5532568 6818958 7427608 5438341 2056524
35030B056524j174170K229329K202385j431369m000602k885851o08490J70733
$$ 2056524 882354 3111683 5314068 3882699 -117903 -3003754 -3612244 -3441511
35022c441511J42063J21662p38223j407193R42330M803758M513357j73185j928950
$$ -3441511 -3299448 -3177786 -3916009 -5323202 -4380872 422886 4936243 4763058 2834108
35013B834108K028800L817861k091928p890684m233254L795872M508394j342100
$$ 2834108 4862908 8680769 6588841 -1301843 -5535097 -1739225 2769169 1427069
35005A427069k841576J977343L651224j314915m569971r92892K946371J341531
$$ 1427069 -1414507 562836 4214060 2899145 -1670826 -2663718 282653 1624184
34997A624184j470509N8845L017093K418096q9125p25965n88788j761155k068493
$$ 1624184 153675 212520 3229613 5647709 5558584 4832619 4243831 2482676 414183
34988D14183J68600J499944n52385k133380o204J685051j301130m571349k052610
$$ 414183 582783 2082727 1530342 -603038 -609242 1075809 -225321 -4796670 -6849280
34979f849280K631305J421813m014428l903210L663780Q573656L596282m975113
$$ -6849280 -4217975 -2796162 -6810590 -10713800 -7050020 1523636 5119918 144805
34971A44805o746000j425414K635798J136309j408664J10841L618481L431614
$$ 144805 -6601195 -8026609 -5390811 -4254502 -5663166 -5552325 -1933844 1497770
34963A497770q47929l436418r09584K581419J634049k124465k908901p5687J502469
$$ 1497770 649841 -2786577 -3696161 -1114742 519307 -1605158 -4514059 -4589746 -3087277
34954c087277J53653j83017K222639L343556P03940j939348j277400j30095j575792
$$ -3087277 -2933624 -3116641 -894002 2449554 3153494 1214146 -63254 -193349 -1769141
34945a769141k682493M4518L482803K786326j09657N7432K581325K364650q57093
$$ -1769141 -4451634 -4407116 -924313 1862013 1752356 1809788 4391113 6755763 5898670
34936E898670k451040j470956j778110m035307l812219N15144M268367L429292
$$ 5898670 3447630 1976674 198564 -3836743 -7648962 -7133818 -2865451 563841
34928E63841L7487j933547j815542q94750M37344J700504J536189P3695m80225
$$ 563841 601328 -1332219 -3147761 -4042511 -3605167 -1904663 -368474 -294779 -775004
34919g75004O97113J514691L99838j214012j321553m0977J446511K600155L034153
$$ -775004 -77891 1436800 1836638 622626 -698927 -739904 706607 3306762 6340915
34910F340915K256350Q41378J13725P3986n39864j797701k198719j098770L37946
$$ 6340915 8597265 9438643 9552368 9626354 9086490 7288789 5090070 3991300 4329246
34901D329246P31095n70765l447793n924816m583551R12556N306689L894907j67226
$$ 4329246 5060341 4489576 1041783 -4883033 -9466584 -8554028 -3247339 647568 480342
34892D80342K859M229204N174522O1130m457856k323292L012911M238867L28832
$$ 480342 483201 4712405 9886927 9948057 5490201 3166909 6179820 10418687 10747519
34883A0747519l842076m900061l272400k72891K748537L762833K202848M83084
$$ 10747519 6905443 2005382 -1267018 -1539909 1208628 4971461 7174309 7657393
34875G657393M10821l5027k953238n572708l447983K273696N236570J969393l893629
$$ 7657393 8068214 8033187 5079949 -492759 -3940742 -1667046 3569524 5538917 1645288
34866A645288o369266l529142J712743N208746N002452K341687N3778l20809L60956
$$ 1645288 -4723978 -8253120 -6540377 -1331631 3670821 6012508 6066286 5745477 6106433
34857F106433N29152l96065k196348m131483m521169k032093J834791L759665
$$ 6106433 6635585 6239520 4043172 -88311 -4609480 -6641573 -4806782 -1047117
34849a047117K976536J962067J776586L41034k707626l620657l80882K884510
$$ -1047117 1929419 3891486 5668072 6009106 3301480 -319177 -700059 2184451
34841B184451J771528j347578j324965J375012K283966J075131J372210L101169
$$ 2184451 3955979 2608401 1283436 2658448 4942414 6017545 7389755 10490924
34833A0490924K179401j435020k420157J171304M323991L089114K71183m70901
$$ 10490924 12670325 11235305 8815148 9986452 14310443 17399557 17670740 17199839
34825A7199839o74516k783455m619339l331744j085048j339998k480808q88299
$$ 17199839 16525323 13741868 9122529 5790785 4705737 3365739 884931 -3368
34817c368J955845J612281j360224j932141J007237K889773J094110j232482q70069
$$ -3368 1952477 3564758 2204534 272393 1279630 4169403 5263513 4031031 3160962
34808C160962P22887Q09004l26446j041872j207507j065766J0855J504519J262382
$$ 3160962 3883849 4692853 4366407 3324535 2117028 1051262 1062117 2566636 3829018
34799C829018q76981j890147l05729J063353P097q68086J198111L282685Q85889
$$ 3829018 2952037 1061890 756161 1819514 1826611 958525 2156636 5439321 6325210
34790F325210l900032m311961J061672N902580N031346N84731k651238l473062
$$ 6325210 2425178 -1886783 -825111 5077469 10108815 10693546 8042308 4569246
34782D569246l035451j373936J250549K393547N64072j647842j128604O99383
$$ 4569246 1533795 159859 1410408 3803955 4368027 2720185 1591581 2290964
34774B290964J59887k380860k634463J059550N048082N342651K444753l20266
$$ 2290964 2450851 69991 -2564472 -1504922 3543160 8885811 11330564 11010298
34766A1010298j303127j605370k514138l324794k142660J189877L627375J969405
$$ 11010298 9707171 8101801 5587663 2262869 120209 1310086 4937461 6906866
34758F906866k334867l908553n86282K919741J599852k028397j440525L553487
$$ 6906866 4571999 663446 77164 2996905 4596757 2568360 1127835 4681322
34750D681322N717196Q09507o092766p432046k492899L250829N297434L490185
$$ 4681322 10398518 11208025 5115259 -2316787 -4809686 -1558857 3738577 7228762
34742G228762K38786j786578j487004o73831j874890l817711k422121J993062
$$ 7228762 7467548 5680970 4193966 3520135 1645245 -2172466 -4594587 -2601525
34734b601525L214651j401097m831337Q9680Q640082R668149J671755n245395
$$ -2601525 613126 -787971 -5619308 -5529628 3110454 12778603 14450358 9204963
34726I204963m276839n1807J044715L89094J742667L196708J301786j579639j313894
$$ 9204963 4928124 4876317 5921032 6310126 8052793 11249501 12551287 10971648 9657754
34717I657754K9818k139161n576093l864019K153258M266778k89394m171955j441444
$$ 9657754 9687572 7548411 1972318 -1891701 261557 4528335 4238941 66986 -1374458
34708a374458L583523L996811Q78710p6615J642368J810676n42455k256113k286472
$$ -1374458 2209065 6205876 7084586 7007971 8650339 10461015 9918560 7662447 5375975
34699E375975k610200k877565k73551M196649N141724Q49610l146466j803596
$$ 5375975 2765775 -111790 -385341 3811308 8953032 9802642 6656176 4852580
34691D852580K285074L357875Q97494q33899K85820K228022K926984K390002P74864
$$ 4852580 7137654 10495529 11393023 10559124 10844944 13072966 15999950 18389952 19164816
34682A9164816k017449m330169l565870o9741K452953J719513j44728J3763J822230
$$ 19164816 17147367 12817198 9251328 9181587 11634540 13354053 13209325 13223088 15045318
34673A5045318K248613Q7817k494259k962105j438833q2178k22542j039062j120552
$$ 15045318 17293931 17381748 14887489 11925384 10486551 10404373 10181831 9142769 8022217
34664H022217n63190p26233k014792k842034j383114J952475M249973K549304
$$ 8022217 7459027 6732794 4718002 1875968 492854 2445329 6695302 9244606
34656I244606k817888p117985n009279K788904Q134960M234182m716189p444586
$$ 9244606 6426718 -691267 -5700546 -2911642 5223318 9457500 4741311 -2703275
34648b703275m07492O927004N252047j534111k896680K383965N372883J478904
$$ -2703275 -3110767 3816237 9068284 7534173 4637493 7021458 12394341 13873245
34640A3873245l154027k214892J598779K497337O43857l04016l14646j563069
$$ 13873245 10719218 8504326 10103105 12600442 13244299 12940283 12625637 11062568
34632A1062568k739878r61651K076632J786427j760499l414952p39771K621979
$$ 11062568 8322690 7361039 9437671 11224098 9463599 6048647 5308876 7930855
34624G930855K745604M57870j320958j841100j794773r05680J104088K571598
$$ 7930855 10676459 11134329 9813371 7972271 6177498 5271818 6375906 8947504
34616H947504J380914j849251l622863j034742M841099R159960P605044J152708
$$ 8947504 10328418 8479167 4856304 3821562 8662661 17822621 25427665 26580373
34608B6580373m312203m256127l58121K394714K096049Q88781N62864N85363N48341
$$ 26580373 22268170 18012043 17653922 20048636 22144685 23033466 23596330 24181693 24730034
34599B4730034J151392K000257J603797N34430J268670L525289L480358l7068
$$ 24730034 25881426 27881683 29485480 30019910 31288580 34813869 38294227 38257159
34591C8257159k291139P78321N729156O148680K276745N90221L811365P001131
$$ 38257159 35966020 36744341 42473497 48622177 50898922 51489143 55300508 62301639
34583F2301639N604133K491357L178652P203292R053684O657889M234175N825911
$$ 62301639 67905772 70397129 73575781 80779073 89832757 96490646 100724821 106550732
34575A06550732R862883J2247219J1951124J0602473Q547831N348207L669428
$$ 106550732 116413615 128660834 140611958 151214431 159762262 165110469 168779897
34568A68779897P940158J7283487K3716855K1007583J3078173R475544J3463994
$$ 168779897 176720055 194003542 217720397 238727980 251806153 261281697 274745691
34561B74745691J9029987J9930778J7111548J5277757J5958775J7048740J6841153
$$ 274745691 293775678 313706456 330818004 346095761 362054536 379103276 395944429
34554C95944429J5356164J2911968R911065P116754M262459j88379n938811r533304
$$ 395944429 411300593 424212561 434123626 441240380 445502839 445314460 439375649 429842345
34546D29842345q983033p852503j1020616j7545571k1870249k1580572j9573195
$$ 429842345 420859312 413006809 401986193 384440622 362570373 340989801 321416606
34539C21416606j8535978j8128023j8448968k1048918k4367497k3214337j6188485
$$ 321416606 302880628 284752605 266303637 245254719 220887222 197672885 181484400
34532A81484400r411587q825067j2272473j3759454j2516137j2341081j3815381
$$ 181484400 172072813 163247746 150975273 137215819 124699682 112358601 98543220
34525I8543220j3217283r134204m903747l542989m308454n172798n306243m523630
$$ 98543220 85325937 76191733 71287986 67744997 63436543 58263745 52957502 48433872
34517D8433872l329047l492483n395306n612993j390499L371755K230448l773804
$$ 48433872 45104825 41612342 36217036 30604043 29213544 32585299 34815747 31041943
34509C1041943o761190l739472m66191j175576k164696M2579J586815j396502
$$ 31041943 24280753 20541281 20075090 18899514 16734818 16777397 18364212 16967710
34501A6967710m616824k352038K469301L020579j58428j049831J198539K035348
$$ 16967710 12350886 9998848 12468149 15488728 15330300 14280469 15479008 17514356
34493A7514356L35992r11073j643556l983148n353770j459607M182020L591494
$$ 17514356 17850348 16939275 15295719 11312571 5958801 4499194 8681214 12272708
34485A2272708k192989l672804J245760L475831j388764n240238j619571L314960
$$ 12272708 10079719 6406915 7652675 11128506 9739742 4499504 2879933 6194893
34477F194893J978429k255258k957703k083795l395096k687144L774624Q233047
$$ 6194893 8173322 5918064 2960361 876566 -2518530 -5205674 -1431050 6801997
34469F801997K176521p295334o410488L245543P015442M98980n250850l428177
$$ 6801997 8978518 1683184 -4727304 -1481761 5533681 6032661 781811 -2646366
34461b646366n75628j674801j139841M292635O958159J531712m169603j657522
$$ -2646366 -3221994 -4896795 -6036636 -1744001 5214158 6745870 2576267 918745
34453I18745M049182L332765k255538m191622j474148J50968l34720O68223K155175
$$ 918745 4967927 8300692 6045154 1853532 379384 530352 195632 863855 3019030
34444C019030j79925m465313m259670L98166K685345M32765r10843J570084L425385
$$ 3019030 2839105 -1626208 -5885878 -5487712 -2802367 -2369602 -3280445 -1710361 1715024
34435A715024J127814j874116j262307J345524J658275q82677l221948k805102
$$ 1715024 2842838 968722 -293585 1051939 2710214 1827537 -1394411 -4199513
34427d199513L81495L881612M274409R80724j826167l26521K884907K279726j850499
$$ -4199513 -3818018 63594 4338003 5318727 3492560 3166039 6050946 8330672 6480173
34418F480173l708586j144312J604661J328042j24743p91778j406572j371739
$$ 6480173 2771587 1627275 3231936 4559978 4435235 3643457 2236885 865146
34410H65146J501934M856317K711169l998712n828664R14165O429865J641580
$$ 865146 2367080 7223397 9934566 5935854 107190 1021355 7451220 9092800
34402I092800p008004o987136J166281N662219K087411j861244q00926Q13275
$$ 9092800 2084796 -4902340 -3736059 1926160 4013571 2152327 1351401 2164676
34394B164676j145796k906610o24130K182503J028476j729573j528097O29489
$$ 2164676 1018880 -1887730 -2511860 -329357 699119 -1030454 -2558551 -1929062
34386a929062R52261k00378P0055J282533O71133j611561l064994l005034k073182
$$ -1929062 -976801 -1177179 -1107124 175409 846542 -765019 -3830013 -6835047 -8908229
34377h908229L66807M030035N180192J320882l458754l309984O74566K557197
$$ -8908229 -8541422 -4511387 668805 1989687 -1469067 -4779051 -4104485 -1547288
34369a547288J222509R48942K350335P39450m358427n966155l02328N981918N097832
$$ -1547288 -324779 624163 2974498 3713948 -644479 -6610634 -6912962 -931044 4166788
34360D166788m14837k333500N87354K174281k97227k409229p73904J581226P07164
$$ 4166788 3751951 1418451 2005805 4180086 3882859 1473630 699726 2280952 2988116
34351B988116j967576k123857J289798N127588N893883K896733j302652k871908
$$ 2988116 1020540 -1103317 186481 5314069 11207952 14104685 12802033 9930125
34343I930125o42018J733973j71344n058059o610462j958423L952396M843676
$$ 9930125 9288107 11022080 10850736 5792677 -817785 -2776208 1176188 6019864
34335F019864J045675k268793k572744j741105j362478m97721J433656K908721
$$ 6019864 7065539 4796746 2224002 482897 -879581 -1377302 56354 2965075
34327B965075K576056R78124p99705k156149k152776m4066K576559K669783K4422
$$ 2965075 5541131 6519255 5719550 3563401 1410625 1366559 3943118 6612901 6637323
34318F637323j835956o62040J126331L94843j668788j707051J63184O83586j026173
$$ 6637323 4801367 4139327 5265658 5660501 3991713 2284662 2447846 3131432 2105259
34309B105259k189125j183573K143m32508r59301N15613L053336M128240L078614
$$ 2105259 -83866 -1267439 -1265296 -1697804 -2657105 -2141492 911844 5040084 8118698
34300H118698J103071p68608j785794j022056J053400J852650j87946k884115
$$ 8118698 9221769 8453161 6667367 5645311 6698711 8551361 8363415 5479300
34292E479300l130746j343691l68821r27613j265986p38513l68309o6718J158524
$$ 5479300 2348554 1004863 636042 -291571 -1557557 -2296070 -2664379 -2731097 -1572573
34283a572573K207703R96581j093312l14592K855563L190126j049119m465461
$$ -1572573 635130 1631711 538399 223807 3079370 6269496 5220377 754916
34275G54916k603220J212719J894282R52839K416428L879412l5802o455729n882513
$$ 754916 -1848304 -635585 1258697 2211536 4627964 8507376 8471574 2015845 -3866668
34266c866668K971370Q854282L386444o378901p864234n89144M643624K260538
$$ -3866668 -895298 7958984 11345428 4966527 -2897707 -3486851 1156773 3417311
34258C417311j469028J06464L962351L414116j193181l834019k293400l13522
$$ 3417311 1948283 2054747 6017098 9431214 8238033 4404014 2110614 1797092
34250A797092o54694j435596o08257M80671K97783K15624J398704J585210j261294
$$ 1797092 1142398 -293198 -901455 -420784 -123001 92623 1491327 3076537 1815243
34241A815243m237673k908330J561097L441129P99295j898148q02966K155473
$$ 1815243 -2422430 -5330760 -3769663 -328534 470761 -1427387 -2230353 -74880
34233g4880L367604K843541K329371J336086j219062l551047l007360l78998J123950
$$ -74880 3292724 6136265 8465636 9801722 8582660 5031613 2024253 1645255 2769205
34224B769205M53884o63115j056771j225417j461289j335357q38199j21592J222074
$$ 2769205 3223089 2559974 1503203 277786 -1183503 -2518860 -3357059 -3478651 -2256577
34215b256577K772960K379537r93888m599617m686338j194167K590577M058279
$$ -2256577 516383 2895920 1902032 -2697585 -7383923 -8578090 -5987513 -1929234
34207a929234K829888q5457k188695o56457L262220L581989k406950q059795n212443
$$ -1929234 900654 815197 -1373498 -2029955 1232265 4814254 2407304 -5652491 -10864934
34198a0864934L455437P003207J467264m835416l541153K794825N916801L185350
$$ -10864934 -7409497 -406290 1060974 -3774442 -7315595 -4520770 1396031 4581381
34190D581381r50835k006838K7522K012776J071778k484295m850406k917138J301002
$$ 4581381 3630546 1623708 1651230 3664006 4735784 2251489 -2598917 -5516055 -4215053
34181d215053K993112J031616j260819j575543p42762N53611K478136L259768
$$ -4215053 -1221941 -190325 -1451144 -3026687 -3769449 -3215838 -737702 2522066
34173B522066R03954j996710j053072J912804P51169m028047m627407R56167M463677
$$ 2522066 3426020 1429310 376238 2289042 3040211 -987836 -5615243 -4659076 -195399
34164a95399Q18522l136138l20731M462965K942146k724852m293712r08875J647970
$$ -195399 623123 -2513015 -2833746 1629219 4571365 1846513 -2447199 -3356074 -1708104
34155a708104J689456J924441J734058j234324l781397j038459L866332L613952
$$ -1708104 -18648 1905793 3639851 2405527 -1375870 -2414329 1452003 5065955
34147E065955r95707k472414L25835J183245j140666p02376L627839M903875K22316
$$ 5065955 4070248 1597834 1923669 3106914 1966248 1263872 4891711 9795586 10017902
34138A0017902l967094k881403m84550r04882j515687K72669J494956L16127L77951
$$ 10017902 6050808 3169405 2684855 1779973 264286 536955 2031911 2348038 2725989
34129B725989K871713K330448l219381o030659m85673O180283M291638l082854
$$ 2725989 5597702 7928150 4708769 -1321890 -1807563 4372720 8664358 5581504
34121E581504n545559j689617P17661j397689k965835j054344R17658O31639N84659
$$ 5581504 35945 -1653672 -936011 -2333700 -5299535 -6353879 -5436221 -4804582 -4219923
34112d219923K265439L069344J281812r83719j740190j746044j702417o70506
$$ -4219923 -1954484 1114860 2396672 1412953 -327237 -2073281 -3775698 -4446204
34104d446204J364307K543401J825573K41434q04997n51087R62864J759534r31870
$$ -4446204 -3081897 -538496 1287077 1528511 723514 172427 1135291 2894825 1962955
34095A962955n618103n790514J343245Q577649P278349j00590l402928L47822
$$ 1962955 -3655148 -9445662 -8102417 475232 7753581 7652991 4250063 4597885
34087D597885L618767P90599m169999n289613k977432r00488K47153J665051K898560
$$ 4597885 8216652 9007251 4837252 -452361 -3429793 -4330281 -4083128 -2418077 480483
34078D80483L002906K530001J869277L29020j435068j326859L20008M13910j794989
$$ 480483 3483389 6013390 7882667 8211687 6776619 5449760 5769768 6183678 4388689
34069D388689l225737k199802q72952o78402j08938Q67936m27243l380769k728947
$$ 4388689 1162952 -1036850 -1909802 -2588204 -2697142 -1829206 -2256449 -5637218 -8366165
34060h366165K783360O305665K754367k738092k799282O16783N63172k602540
$$ -8366165 -5582805 722860 3477227 739135 -2060147 -1443364 -880192 -3482732
34052c482732k431126J569592K606381j692482m846379j647987M222258O371698
$$ -3482732 -5913858 -4344266 -1737885 -3430367 -8276746 -9924733 -5702475 669223
34044F69223M095020P70712j839463l635145l568682r66863K136094L035663J848122
$$ 669223 4764243 5534955 3695492 60347 -3508335 -4475198 -2339104 696559 2544681
34035B544681Q97330J323852J838775O45476j975096l156371o09659L187422K593239
$$ 2544681 3442011 4765863 6604638 7250114 5275018 2118647 1508988 4696410 7289649
34026G289649l173783o905258k679341M656095N665881K16006k904832k81001
$$ 7289649 4115866 -2789392 -5468733 -812638 4853243 5069249 2164417 1883416
34018A883416J604554j197779k880398J158494M783050R71550n307308m285485
$$ 1883416 3487970 2290191 -590207 568287 5351337 6322887 1015579 -3269906
34010c269906K354744L628488k987472p053367j291733P132518P095870q60946
$$ -3269906 -915162 2713326 -274146 -7327513 -8619246 -1486728 5609142 4748196
34002D748196o106870k536101M409946N758091R3534n618947n194288o01965J596674
$$ 4748196 -1358674 -3894775 515171 6273262 6366796 747849 -4446439 -5048404 -3451730
33993c451730k92287j200454K254195O096779N105840P28715j826019j563821
$$ -3451730 -3744017 -4944471 -2690276 3406503 8512343 9241058 7415039 5851218
33985E851218j357125j666733o12126P96735k55980k407367j551011J505978J450455
$$ 5851218 4494093 2827360 2215234 3011969 2755989 348622 -1202389 303589 1754044
33976A754044k398826m128907n71490L774658M145561K059698R46548L89740j280010
$$ 1754044 -644782 -4773689 -5345179 -1570521 2575040 4634738 5581286 5971026 4691016
33967D691016k866956k704228j844198j695263j575909r48100n76987K25289L058849
$$ 4691016 1824060 -880168 -2724366 -4419629 -5995538 -6943638 -7520625 -7295336 -4236487
33958d236487N650584L434317j950884k811736K462317N299030L64379m966847
$$ -4236487 1414097 4848414 2897530 85794 2548111 7847141 8211520 3244673
33950C244673k238065M136845M248280j277310l489903k85019J733062m23301
$$ 3244673 1006608 5143453 9391733 8114423 4624520 4339501 6072563 5649262
33942E649262k441912j900304j586447k223250o22726K891968L314991k75943
$$ 5649262 3207350 1307046 -279401 -2502651 -3125377 -233409 3081582 2805639
33934B805639k202147O50249L876307K967128k95762k125020k157401j545655
$$ 2805639 603492 1253741 5130048 8097176 7801414 5676394 3518993 1973338
33926A973338l52027M60275j062991l609348k808320J998342N696107M385165
$$ 1973338 1621311 2081586 1018595 -2590753 -5399073 -3400731 2295376 6680541
33918F680541J14312l310618m689263l737223j2296M158149M487072Q89315j731625
$$ 6680541 6794853 3484235 -1205028 -4942251 -4954547 -796398 3690674 4579989 2848364
33909B848364q79887L77516l14900q93101j47752p57273l556511m511993j433175
$$ 2848364 1968477 2345993 2031093 1137992 990240 232967 -3323544 -7835537 -9268712
33900i268712J735561J580519P51057K152115L060726N45313k209925j145322
$$ -9268712 -7533151 -5952632 -5201575 -3049460 11266 556579 -1653346 -2798668
33892b798668J311966N55627k001002j624580J472969L009530J903147P05810
$$ -2798668 -1486702 -931075 -2932077 -4556657 -3083688 -74158 1828989 2534799
33884B534799K26587p78833j726982r83222N48077Q33163J83598m17920j955991
$$ 2534799 2761386 1982553 255571 -727651 -179574 653589 837187 419267 -1536724
33875a536724m266587l601294J607908N964075M120544n74351j301425J183333
$$ -1536724 -5803311 -9404605 -7796697 -1832622 2287922 1713571 412146 1595479
33867A595479P02528k926681l457112Q03264M100591K730776j67302j254051j487243
$$ 1595479 2298007 -628674 -4085786 -3282522 818069 3548845 3381543 2127492 640249
33858F40249j754054n72942J284835J93771l347052l379369K049149N961350K107505
$$ 640249 -1113805 -1686747 -401912 -208141 -3555193 -6934562 -4885413 1075937 3183442
33849C183442n003848n760735J236338P296442M933640l228276q091146m536804
$$ 3183442 -1820406 -7581141 -6344803 951639 5885279 2657003 -5434143 -9970947
33841i970947L216473O759668L269331j709991k201307L30101M06792k348970
$$ -9970947 -6754474 5194 3274525 1564534 -636773 -306672 100120 -2248850
33833b248850k829095J013565M730628M042448L85410k387044l160106l032524
$$ -2248850 -5077945 -4064380 666248 4708696 5094106 2707062 -453044 -3485568
33825c485568k494493j368742L18935K539295M442195L505269j255762n417042
$$ -3485568 -5980061 -7348803 -7029868 -4490573 -48378 3456891 2201129 -3215913
33817c215913l112525M217463Q074097L896942l091487n831942m403467l148886
$$ -3215913 -6328438 -2110975 5963122 9860064 6768577 936635 -3466832 -6615718
33809f615718k977592j521975J515478L936111M708066M318985K646069k56500
$$ -6615718 -9593310 -11115285 -9599807 -5663696 -955630 3363355 6009424 5752924
33801E752924k480701k435744j422235j258502j126116N0304K42234k438681m846474
$$ 5752924 3272223 836479 -585756 -1844258 -2970374 -2920070 -2677836 -5116517 -9962991
33792i962991k363983L183690M853114P33542k817353n59628L935072L950190
$$ -9962991 -12326974 -9143284 -4290170 -3556628 -6373981 -6933609 -2998537 951653
33784I51653n30863l549457k063020Q53214J673553Q52126L38108K15674j66194
$$ 951653 420790 -3128667 -5191687 -4338473 -2664920 -1812794 -1474686 -1259012 -1425206
33775a425206k89132J19846k19739j743050k098768O80940M342184M764848J534326
$$ -1425206 -1714338 -1594492 -1814231 -3557281 -5656049 -4975109 -632925 4131923 5666249
33766E666249j792121k658908j742138l27079J270181K253527J459231m17317
$$ 5666249 3874128 1215220 -526918 -853997 416184 2669711 4128942 3711625
33758C711625j520758j958501k928524k847080J057360O527470O988119O30525
$$ 3711625 2190867 232366 -2696158 -5543238 -4485878 2041592 9029711 9660236
33750I660236o143905p029534k917440J830515M824285M311629j267470p968082
$$ 9660236 3516331 -3513203 -6430643 -4600128 224157 4535786 3268316 -4699766
33742d699766p284283J675408P786132L238574l734747j598320N250435L397454
$$ -4699766 -11984049 -10308641 -2522509 716065 -3018682 -4617002 633433 4030887
33734D030887o690441j0174659j395124P272613N144211j562570k136229J837246
$$ 4030887 -2659554 -12834213 -14229337 -6956724 -1812513 -3375083 -5511312 -3674066
33726c674066J988259k030784l695878j428685J70884q33963j346160P20808L823263
$$ -3674066 -1685807 -3716591 -7412469 -8841154 -8670270 -9504233 -10850393 -10129585 -6306322
33717f306322O008694O355671L786612j575781o296095o415748k435693J042397
$$ -6306322 -297628 6058043 9844655 8268874 1972779 -4442969 -6878662 -5836265
33709e836265Q08834j459627j407182K743615P166358N976704q28702n496539
$$ -5836265 -5027431 -6487058 -7894240 -5150625 2015733 7992437 7163735 1667196
33701A667196k162623M203220M304515j733357m882155j562372J532481m35413
$$ 1667196 -495427 3707793 8012308 6278951 1396796 -165576 1366905 931492
33693I31492k465112J016882O345734O524629J598428l018691m405828k988029
$$ 931492 -1533620 -516738 5828996 12353625 13952053 10933362 6527534 3539505
33685C539505M18827L417900K005750l413292o309670l110427R24585K32828k105675
$$ 3539505 3958332 7376232 9381982 5968690 -340980 -3451407 -2526822 -2293994 -4399669
33676d399669n51722K926792K887112K68868j47232J013501l66391k971084j808015
$$ -4399669 -4951391 -2024599 862513 1131381 984149 1997650 1631259 -1339825 -3147840
33667c147840K276135L313569J20074k434936k088752j517773j711447n00035
$$ -3147840 -871705 2441864 2561938 127002 -1961750 -3479523 -5190970 -5691005
33659e691005J542796R80819j546464j271626K300475L805572R39703j565326
$$ -5691005 -4148209 -3167390 -4713854 -5985480 -3685005 120567 1060270 -505056
33651e05056K43202L438789L304327R6073k490729k424825n45139Q91979k25998
$$ -505056 -261854 3176935 6481262 6577335 4086606 1661781 1116642 2008621 1782623
33642A782623l316738m277388m85449M175153L738182j031507l596956j323336
$$ 1782623 -1534115 -5811503 -6296952 -2121799 1616383 584876 -3012080 -4335416
33634d335416J759254K495447K563204L276911K705222N28166o7232J480375O05011
$$ -4335416 -2576162 -80715 2482489 5759400 8464622 8992788 8925556 10405931 11010942
33625A1010942m686786q458561m398059M323990Q127365K998954m905531p077237
$$ 11010942 6324156 -2134405 -6532464 -2208474 5918891 8917845 4012314 -3064923
33617c064923k248509L224336L616398N18971m27976J674481J774069k286159
$$ -3064923 -5313432 -2089096 1527302 2046273 1618297 3292778 5066847 2780688
33609B780688n236478k828256N23939r31209l854685j366086M126972M119765
$$ 2780688 -2455790 -5284046 -4760107 -5691316 -9546001 -10912087 -6785115 -2665350
33601b665350j006409j782424M046273O791852N67330p066159p295871k530273
$$ -2665350 -3671759 -5454183 -1407910 5383942 5951272 -1114887 -8410758 -10941031
33593a0941031M64309J648275L772983M306136L22405l688357j930257K572563
$$ -10941031 -10476722 -8828447 -5055464 -749328 -426923 -4115280 -6045537 -3472974
33585c472974K672935j040461j840622J572040L760446K201221K10008j47195
$$ -3472974 -800039 -1840500 -3681122 -2109082 1651364 3852585 4062593 3915398
33577C915398q27665k407616k263224J63967J482355m34402l296770l828619j315760
$$ 3915398 3087733 680117 -1583107 -1419140 63215 -371187 -3667957 -7496576 -8812336
33568h812336K699249N450033M123685p78867m058450j444142M219446O330804
$$ -8812336 -6113087 -663054 3460631 2681764 -1376686 -2820828 1398618 7729422
33560G729422L196744j000039l118885l940480m113663k389043R20959K928261
$$ 7729422 10926166 9926127 6807242 2866762 -1246901 -3635944 -2714985 213276
33552B13276K059429r5065j445027j156181Q85869L128528J961082l450004p230223
$$ 213276 2272705 2177640 732613 -423568 462301 3590829 5551911 2101907 -5128316
33543e128316l388167M357519O303646Q42941l155683m41444K656839n24119n392135
$$ -5128316 -8516483 -4158964 2144682 2987623 -168060 -609504 2047335 1523216 -3868919
33534c868919l481147L668294O833195L006263j569681k051101q16907j053790
$$ -3868919 -7350066 -3681772 3151423 6157686 4588005 2536904 1719997 666207
33526F66207j257073P13079K882520K044922j456075m546554n005600k578253
$$ 666207 -590866 122213 3004733 5049655 3593580 -952974 -5958574 -8536827
33518h536827J170690K822064r5034m578501l964968L004247Q544023N488717
$$ -8536827 -7366137 -4544073 -4639107 -9217608 -13182576 -10178329 -1634306 3854411
33510C854411k220935m370190J313992O197833L241517l544279n699534k023515
$$ 3854411 1633476 -2736714 -1422722 4775111 8016628 4472349 -1227185 -3250700
33502c250700J320820M54647j652034p82667K318518L529055J334635j224089
$$ -3250700 -1929880 -1475233 -3127267 -3909934 -1591416 1937639 3272274 2048185
33494B048185r04250J031224M09841l352302n057090o49979N658269N878819k80144
$$ 2048185 1143935 2175159 2585000 -767302 -5824392 -6474371 -816102 5062717 4782573
33485D782573m152846m67480M849691L722839k052951m295812j010282J914832
$$ 4782573 629727 162247 5011938 8734777 6681826 2386014 1375732 3290564
33477C290564P56099j619425k233479k152722k169301m28124K802166L461917
$$ 3290564 4046663 2427238 193759 -1958963 -4128264 -4556388 -1754222 1707695
33469A707695K65315j990157K87767L368279K196948j289723j632741R11071J062683
$$ 1707695 1973010 -17147 270620 3638899 5835847 4546124 2913383 3824454 4887137
33460D887137k262750l831214m98645L557803K881227j466402l661288j201233
$$ 4887137 2624387 -1206827 -1705472 1852331 4733558 3267156 -394132 -1595365
33452a595365K100259J628018j839405l277167j56348M163968M812147J408534
$$ -1595365 504894 2132912 293507 -2983660 -3140008 1023960 5836107 7244641
33444G244641k327407l704781k982672q70408K265316M328899K502367k151971
$$ 7244641 4917234 1212453 -1770219 -2640627 -375311 3953588 6455955 4303984
33436D303984m471206j643845K933514M353045K117263p63869j965174q88373
$$ 4303984 -167222 -1811067 1122447 5475492 7592755 6828886 4863712 3975339
33428C975339J842050L612090J377656l573764n688093k806348J82877p39294
$$ 3975339 5817389 9429479 10807135 7233371 1545278 -1261070 -1078193 -1817487
33420a817487j621592K648560Q130048O505508j420907n696463j785737L206603
$$ -1817487 -3439079 -790519 7339529 13845037 12424130 6727667 4941930 8148533
33412H148533K004322k606855l924584j750199m65495p07522L00007K147520J586340
$$ 8148533 10152855 7546000 3621416 1871217 1405722 698200 998207 3145727 4732067
33403D732067q90555r32716K180087L433442j72016m331276l482760J025838L171888
$$ 4732067 3841512 2908796 5088883 8522325 8350309 4019033 536273 1562111 4733999
33394D733999J090291r74301K92969K634855K432634K21769q90326k90985l2666
$$ 4733999 5824290 4849989 5142958 7777813 10210447 10432216 9541890 9250905 9218239
33385I218239p55143p81864M21957R08605m27749j556177j80076K540814L152517
$$ 9218239 8463096 7681232 8103189 9011794 8584045 7027868 6847792 9388606 12541123
33376A2541123L45624l382913m718518l156346j017007j95415N8779J265287K489590
$$ 12541123 12886747 9503834 4785316 1628970 611963 416548 475327 1740614 4230204
33367D230204J281247j842289k906425l60631J659586o37380m079087k830972
$$ 4230204 5511451 3669162 762737 402106 2061692 1424312 -2654775 -5485747
33359e485747K304652M862963K732039N41872P90035k44424m348580n971010o30856
$$ -5485747 -3181095 1681868 4413907 4955779 5745814 5501390 1152810 -4818200 -5449056
33350e449056O407922O765428J090721k622065j328508j33985k712238n391287
$$ -5449056 958866 7724294 8815015 6192950 4864442 4730457 2018219 -3373068
33342c373068l487605J331054L599072J408186j894245k409155L4841K375522
$$ -3373068 -6860673 -5529619 -1930547 -522361 -2416606 -4825761 -4790920 -2415398
33334b415398K201903N53600K34302J648983K214371N92650r58635k87566R78234
$$ -2415398 -213495 340105 574407 2223390 4437761 5030411 4071776 3784210 4762444
33325D762444J85977j795670k036978k96005J081758J203667J136936Q66145o51886
$$ 4762444 4948421 3152751 1115773 819768 1901526 3105193 4242129 5108274 4456388
33316D456388k344913j526805J762611M098813L351592J177470l36434j721889
$$ 4456388 2111475 584670 2347281 6446094 9797686 10975156 10638722 8916833
33308H916833l979535n625504m437857j221076O03852n45973k144346q96642K591868
$$ 8916833 4937298 -688206 -5126063 -6347139 -5743287 -6289260 -8433606 -9330248 -6738380
33299f738380M394564K714626L71670J82957L33596k168885n127925l411475K356937
$$ -6738380 -2343816 370810 742480 925437 1259033 -909852 -6037777 -9449252 -7092315
33290g092315N197002J847412k187993j192998K225661K062332j546976l440189
$$ -7092315 -1895313 -47901 -2235894 -3428892 -1203231 859101 -687875 -4128064
33282d128064j646913J140974K870411L681978L134109P97676j042829K7958J839600
$$ -4128064 -5774977 -4634003 -1763592 1918386 5052495 5850171 4807342 4835300 6674900
33273F674900K43586l851038m942539q83770M073455N101372K034441j985250
$$ 6674900 6918486 3067448 -1875091 -2758861 1314594 6415966 8450407 6465157
33265F465157l977119k737287K85576J653059j03567j919117l56373K932598L427932
$$ 6465157 2488038 -249249 36327 1689386 1585819 -333298 -689671 2242927 5670859
33256E670859L41273k859361l704568k673276p28543J230386J382706o91473j963323
$$ 5670859 6012132 3152771 -551797 -3225073 -3953616 -2723230 -1340524 -2031997 -3995320
33247c995320k11805J614428R1264j970308K57645M484541L838618j900258n374098
$$ -3995320 -4207125 -2592697 -2501433 -4471741 -4214096 270445 4109063 2208805 -3165293
33238c165293k821425J224368K095798R51826L57017J39203L0361R26462J680594
$$ -3165293 -5986718 -4762350 -2666552 -1714726 -1357709 -1218506 -1188145 -261683 1418911
33229A418911M2307k144258q44404K296447J396590l028482l451861J995000N352635
$$ 1418911 1461218 -683040 -1527444 769003 2165593 -862889 -4314750 -2319750 3032885
33220C032885J595129l393423l259909j081627j846603k827673K43247L880577
$$ 3032885 4628014 1234591 -2025318 -3106945 -4953548 -7781221 -7537974 -3657397
33212c657397K746828l19843N12303L029697R05535m243804m908741n37600J643511
$$ -3657397 -910569 -1230412 -718109 2311588 3217123 -1026681 -5935422 -6473022 -4829511
33203d829511j022557k880599l39472K528408J825089L2138M30432J146080o49615
$$ -4829511 -5852068 -8732667 -9072139 -6543731 -4718642 -4686504 -4256072 -3109992 -3759607
33194c759607k842552j556485K229338L783599J430213j555741k043554q41724
$$ -3759607 -6602159 -8158644 -5929306 -2145707 -715494 -2271235 -4314789 -5156513
33186e156513o5832P54633L081721M980109K455050l678875o691497l027010J633790
$$ -5156513 -5222345 -4467712 -1385991 3594118 6049168 2370293 -4321204 -7348214 -5714424
33177e714424P53078k271252M22251O908690O937379j207500o314990j335196
$$ -5714424 -4961346 -7232598 -6810347 98343 7035722 5828222 -486768 -1821964
33169a821964N325057L087853m527541o428041j048984L310105K254997l30194
$$ -1821964 3503093 6590946 2063405 -4364636 -5413620 -2103515 151482 -178712
33161a78712p95547k23734q0255J7102j80551j042884o03690K479464M805251
$$ -178712 -974259 -1197993 -1278248 -1261146 -1441697 -2484581 -3088271 -608807 4196444
33152D196444K366726k584926m339351k018084N37860J599650K235605J695629
$$ 4196444 6563170 3978244 -361107 -2379191 -1841331 -241681 1993924 3689553
33144C689553j301666l766706j727088K489192L231764R68267R99703L121422
$$ 3689553 2387887 -1378819 -3105907 -616715 2615049 3583316 4583019 7704441
33136G704441J482010m020688n534776J83646N462131L033997l167548m542116
$$ 7704441 9186451 5165763 -369013 -185367 5276764 8310761 5143213 601097
33128F01097j94099L493980K692129k21754j638979q78388N41798R70880j77839
$$ 601097 406998 3900978 6593107 6371353 4732374 3853986 4395784 5366664 5188825
33119E188825j925012k629260j806764l58082Q22120J349115J086040P17287J412260
$$ 5188825 3263813 634553 -1172211 -1530293 -708173 640942 1726982 2444269 3856529
33110C856529K402674J036869k485871l502244K80562L645973R31665m546955
$$ 3856529 6259203 7296072 4810201 1307957 1588519 5234492 6166157 1619202
33102A619202m896483K35936L601034J992286j67624J24667k1036k317309l256973
$$ 1619202 -3277281 -3041345 559689 2551975 2384351 2509018 2487982 170673 -3086300
33093c086300p43716J620935Q07797o04496M15993K151639K010909J091891J058402
$$ -3086300 -3830016 -2209081 -1401284 -2005780 -1589787 561852 2572761 3664652 4723054
33084D723054O60109r58174j576459j82465J72592k333480m161687j858989J919160
$$ 4723054 5383163 4424989 2848530 2666065 2838657 505177 -3656510 -5515499 -3596339
33075c596339K377275k91493k156110j627956k00811R93081J698175J242565j50491
$$ -3596339 -1219064 -1510557 -3666667 -5294623 -5495434 -4502353 -2804178 -1561613 -1712104
33066a712104m28871J276014K689253J861112K14988l39907o06406j607594j764326
$$ -1712104 -2140975 -864961 1824292 3685404 3900392 3560485 2954079 1346485 -417841
33057d17841J23164J665919L37499j923317j345130J811148L553572J670996j816243
$$ -417841 -294677 1371242 1708741 -214576 -1559706 251442 3805014 5476010 3659767
33048C659767l395694j575438J718059K550489p26445m460895l714535N09533
$$ 3659767 264073 -1311365 406694 2957183 2230738 -2230157 -5944692 -5435159
33040e435159K126351q51536k976733J15316M666468M414246l46604l907303l083030
$$ -5435159 -3308808 -4160344 -7137077 -7021761 -2355293 2058953 1712349 -2194954 -5277984
33031e277984J11962K281474J857801l87884j808304k69359K616554K987163M02097
$$ -5277984 -5166022 -2884548 -1026747 -1414631 -3222935 -3492294 -875740 2111423 2513520
33022B513520j423032o82349J38391l60941R0413K098216K233746o11037k170161
$$ 2513520 1090488 408139 546530 185589 276002 2374218 4607964 3996927 1826766
33013A826766j50474J257083r84641k767243l64530K202836M18334k003016k6517
$$ 1826766 1676292 2933375 1948734 -818509 -1183039 1019797 1438131 -564885 -591402
33004e91402K419734r98173o313041m395714L316316O057370Q02555l449869o18647
$$ -591402 1828332 830159 -5482882 -9878596 -6562280 -504910 297645 -3152224 -3770871
32995c770871L860375L295795l84848j976834j219779o85716o97365n81949q10243
$$ -3770871 89504 3385299 3000451 1023617 -196162 -881878 -1579243 -2161192 -2971435
32986b971435q21545J179264L983861L516420n76635l272977j491611J704681
$$ -2971435 -3792980 -2613716 1370145 4886565 4309930 1036953 -454658 1250023
32978A250023K645594J953396J316942K19366j265003j087980M90059l4023l138086
$$ 1250023 3895617 5849013 7165955 7385321 6120318 5032338 5522397 5488374 2350288
32969B350288m151959q20930K309925J327506m67459J224767L555607J207614
$$ 2350288 -1801671 -2622601 -312676 1014830 547371 1772138 5327745 6535359
32961F535359l894047m680826L69408N097238M508824N04901k192278j725959
$$ 6535359 2641312 -2039514 -1670106 3427132 7935956 8440857 6248579 4522620
32953D522620N14337K175959J467120j507979m208125l954895j037910J633121
$$ 4522620 5036957 7212916 8680036 7172057 2963932 -990963 -2028873 -395752
32945c95752J775921l93881k952187l796198k004332J267304L672620L884488
$$ -395752 1380169 986288 -1965899 -5762097 -7766429 -6499125 -2826505 1057983
32937A057983K180589q02782l939787m530476o24604M760084N453539J66644m715920
$$ 1057983 3238572 2435790 -1503997 -6034473 -6659077 -1898993 3554546 3721190 -994730
32928i94730l142767K755654O053902L802554j087768m690529n028067j709239
$$ -994730 -4137497 -1381843 4672059 8474613 7386845 2696316 -2331751 -4040990
32920d040990L453104O194879L742189j284677l790497k391104J50295J625292
$$ -4040990 -587886 5606993 9349182 8064505 4274008 1882904 2033199 3658491
32912C658491K044168J307739q73370k686640j591066J506533K868140J283259
$$ 3658491 5702659 7010398 6137028 3450388 1859322 3365855 6233995 7517254
32904G517254o53112j312978k203926l927352l960246j047988J559011O42459
$$ 7517254 6864142 5551164 3347238 -580114 -4540360 -5588348 -4029337 -3386878
32896c386878j667188r48482K607847M432118K373886o55745j524752q57066o13280
$$ -3386878 -5054066 -6002548 -3394701 1037417 3411303 2755558 1230806 373740 -239540
32887b39540o09559K16565J066185M88893p62443p27368M27381O92379k31992
$$ -239540 -849099 -632534 433651 922544 160101 -567267 -139886 552493 320501
32878C20501m15266P16382J015129q71016k982325k806758o74566J415332K603071
$$ 320501 -94765 621617 1636746 765730 -2216595 -5023353 -5697919 -4282587 -1679516
32869a679516K850315J621917p49687k000998q64476M75769k56050j336062k583
$$ -1679516 1170799 2792716 2043029 42031 -822445 -346676 -602726 -1938788 -1941371
32860a941371K049731R59358k136855j835176K776212N723637K826022k222738
$$ -1941371 108360 1067718 -1069137 -2904313 -128101 5595536 8421558 6198820
32852F198820l730177j780472j79025Q7128Q32015K080877J820183l63350k572384
$$ 6198820 2468643 688171 509146 596274 1428289 3509166 5329349 4965999 2393615
32843B393615k986668q56943L399646O831430M906927k761566r387747p839527
$$ 2393615 -593053 -1449996 1949650 8781080 13688007 10926441 1538694 -6300833
32835f300833J24625N463682K951471k971050m582328l25613M106656L177882
$$ -6300833 -6176208 -712526 2238945 -732105 -5314433 -5640046 -1533390 1644492
32827A644492j652789l629389L93001M808429K356503m715241o428258M90867
$$ 1644492 -8297 -3637686 -3244685 1563744 3920247 -794994 -7223252 -6732385
32819f732385O851612M217819k634855l795622L64551J498413j769903k357774
$$ -6732385 119227 4337046 1702191 -2093431 -1728880 -230467 -2000370 -4358144
32811d358144J560193K772787j740493m380711L97232N915517L585859l335535
$$ -4358144 -2797951 -25164 -1765657 -6146368 -5749136 166381 3752240 416705
32803D16705n184594o97121K805068J867852N67421J634952J870316j501494n680758
$$ 416705 -4767889 -5465010 -2659942 -792090 -224669 1410283 3280599 1779105 -3901653
32794c901653o167385k241555L159026O444495N519230J416306j924281j773120
$$ -3901653 -10069038 -12310593 -9151567 -2707072 2812158 4228464 2304183 531063
32786E31063q8763m07040k381700k836699j269060j43145j09226O00660J861601
$$ 531063 442300 35260 -2346440 -5183139 -6452199 -6595344 -6704570 -6103910 -4242309
32777d242309J368273o36300j004532O76022P48538k197087m050866j064012M450542
$$ -4242309 -2874036 -3510336 -4514868 -3838846 -3090308 -5287395 -9338261 -10402273 -5951731
32768e951731P284237N600551J475565k440308m347379l448594r40066P15575
$$ -5951731 1332506 6933057 8408622 5968314 1620935 -1827659 -2767725 -2052150
32760b052150Q66010J032153J417652J37861k736838l873506j472454J844733
$$ -2052150 -1186140 -153987 1263665 1401526 -1335312 -5208818 -6681272 -4836539
32752d836539L075019K589838J848954Q83793J62921J046152K197083K10647l644929
$$ -4836539 -1761520 828318 2677272 3561065 3723986 4770138 6967221 7177868 3532939
32743C532939l149931K611036N376757j24952o748788n504821L22478J441400
$$ 3532939 383008 2994044 8370801 8245849 1497061 -4007760 -3685282 -2243882
32735b243882j564933k77083N744465P636295K371809k597354k275083p54525
$$ -2243882 -3808815 -4085898 1658567 9294862 11666671 9069317 6794234 6039709
32727F039709j438286j101373J605562J518280l480377p107419m953828j657563
$$ 6039709 4601423 3500050 5105612 6623892 3143515 -3963904 -8917732 -10575295
32719a0575295j386854J5869N501362Q126538J945624n627871l927242L721684
$$ -10575295 -11962149 -11946280 -6444918 1681620 3627244 -2000627 -5927869 -2206185
32711b206185N305858n06056l430465N56286L425219m05640n217217m207280M37040
$$ -2206185 3099673 2593617 -836848 -280562 3144657 2739017 -2478200 -6685480 -6248440
32702f248440K995369K852698K342722J228986j406513l371976k068664J272565
$$ -6248440 -3253071 -400373 1942349 3171335 1764822 -1607154 -3675818 -2403253
32694b403253L442452L520449K753234J840113N15149j217130k781352l334577
$$ -2403253 1039199 4559648 7312882 9152995 9668144 8451014 5669662 2335085
32686B335085k254574k62824O79897j9614m81984L38194M53594j361396k339242
$$ 2335085 80511 -182313 497584 477970 -4014 334180 787774 -573622 -2912864
32677b912864k07592J825356l04158m093288l654531J007993M152316L071850
$$ -2912864 -3120456 -1295100 -1599258 -5692546 -9347077 -8339084 -4186768 -1114918
32669a114918N71178q37873j050242O30949M010873M531591j074428o696288l703298
$$ -1114918 -543740 -1381613 -2431855 -1800906 2209967 6741558 5667130 -1029158 -4732456
32660d732456M347231M986636l494472q075119j254584P228193O483058Q42212
$$ -4732456 -385225 4601411 1106939 -6968180 -8222764 -994571 5488487 6330699
32652F330699m0987K081053l95040n341292m364668J533136K893376k237781n229076
$$ 6330699 6289712 8370765 7975725 2634433 -1730235 -197099 2696277 458496 -4770580
32643d770580j156935M160575M254641P42513j426471r57405P24620K299240J998565
$$ -4770580 -5927515 -1766940 2487701 3230214 1803743 846338 1570958 3870198 5868763
32634E868763j366628n105696m659738k74251K687552J379720j057994j172188
$$ 5868763 4502135 -603561 -5263299 -5537550 -2849998 -1470278 -2528272 -3700460
32626c700460J65325Q23185J001946J275359M61381j841850l134523j061662K906814
$$ -3700460 -3535135 -2711950 -1710004 -434645 26736 -1815114 -4949637 -6011299 -3104485
32617c104485M782230K308611k830176o254598m558927R37150M782860L515709
$$ -3104485 1677745 3986356 1156180 -5098418 -9657345 -8720195 -3937335 -421626
32609d21626Q6198l07985K448361L721247J256699j932356k345091l08332J501279
$$ -421626 -335428 -643413 1804948 5526195 6782894 4850538 2505447 2197115 3698394
32600C698394J378086l66443j931221j556272O0918N6929j949688j825492K941527
$$ 3698394 5076480 4710037 2778816 1222544 1283462 1340391 -609297 -2434789 506738
32591E06738P470716N123803k361542o539446m142869q18994j498890l446319
$$ 506738 7977454 13101257 10739715 4200269 57400 -761594 -2260484 -5706803
32583e706803k053412J778701M147421M125372L104963J139027j951314l903403
$$ -5706803 -7760215 -5981514 -1834093 2291279 5396242 6535269 4583955 680552
32575F80552k444192P16477J773227K00057p72887P67748K379984N95155l725015
$$ 680552 -1763640 -1047163 726064 926121 153234 920982 3300966 3896121 171106
32566A71106n211918m63488O251488O934165M88920m669293j914305L845774L525601
$$ 171106 -5040812 -5504300 747188 7681353 8170273 3500980 1586675 5432449 8958050
32557H958050k169521m279784k83940K137003j796752o163578m368815O44402
$$ 8958050 6788529 2508745 2224805 4361808 2565056 -3598522 -7967337 -7322935
32549g322935K375645R05120K41913L78850p36631j061690K079853N117136K694097
$$ -7322935 -4947290 -4042170 -3800257 -3421407 -4158038 -5219728 -3139875 1977261 4671358
32540D671358k699576l634349M46088K682410N71589l94743K759648M600698L73089
$$ 4671358 1971782 -1662567 -1216479 1465931 2037520 1642777 4402425 9003123 9376212
32531I376212n630274o401143k210265J506247K837208L928937M813340K886598
$$ 9376212 3745938 -2655205 -4865470 -3359223 -522015 3406922 8220262 11106860
32523A1106860j477426m013714k540018n9429k13489k335519k967749p41016K134563
$$ 11106860 9629434 5615720 3075702 3016273 2802784 467265 -2500484 -3241500 -1106937
32514a106937K917040J683528J027915K329177L224988N65891m132965n176006
$$ -1106937 1810103 3493631 4521546 6850723 10075711 10641602 6508637 1332631
32506A332631m32069M430329L114209k046538l191398J264712M215045J078961
$$ 1332631 900562 5330891 8445100 6398562 3207164 4471876 8686921 9765882
32498I765882k869064r21465M174950M288280j542073n776665l665820P82536
$$ 9765882 6896818 5975353 10150303 14438583 12896510 7119845 3454025 4236561
32490D236561K021343M77280l86888j84513p92037k153264k663233k117047j272061
$$ 4236561 6257904 6735184 6348296 6163783 5371746 3218482 555249 -1561798 -2833859
32481b833859O9173J903409K556656J080733m56951O5316J128673L6326k262500
$$ -2833859 -2764686 -861277 1695379 2776112 2319161 2384477 3513150 3549476 1286976
32472A286976k429650j06892J621785J030483l26263o96635j57801P06974J461782
$$ 1286976 -1142674 -1249566 372219 1402702 1076439 379804 222003 928977 2390759
32463B390759J026550j131741l059639k345696J6302P99766m94901j191595r5862
$$ 2390759 3417309 2285568 -774071 -3119767 -3103465 -2303699 -2798600 -3990195 -4086057
32454d086057J038519J249680J792296K806890K299354j27930k009668j941315
$$ -4086057 -3047538 -1797858 -5562 2801328 5100682 4972752 2963084 1021769
32446A021769j270456n26213J662246M128939K475981l758693p713415l781448
$$ 1021769 -248687 -774900 887346 5016285 7492266 3733573 -3979842 -7761290
32438g761290L746941O044778J565629l168356l412611r75069Q97747J809718
$$ -7761290 -4014349 2030429 3596058 427702 -2984909 -3959978 -3062231 -1252513
32430a252513K175073J582378P57711J173797J499789j169084n154372m639253
$$ -1252513 922560 2504938 3262649 4436446 5936235 4767151 -387221 -5026474
32422e026474J000588M201246L49477l741192J00537P113886N501363m556990
$$ -5026474 -4025886 175360 524837 -3216355 -3115818 3998068 9499431 4942441
32414D942441r475086k717363M957104K628077l726177k119061N049635N481921
$$ 4942441 -4532645 -7250008 -2292904 335173 -3391004 -5510065 -460430 5021491
32406E021491j528656l642293L256554P713502K101178m593650k340038L340032
$$ 5021491 3492835 -149458 3107096 10820598 12921776 8328126 5988088 9328120
32398I328120K050029l213711k191364L944467M669019j380078m335328k16603
$$ 9328120 11378149 8164438 5973074 9917541 14586560 13206482 8871154 8654551
32390H654551L188294M62222l253362k646301o38585j178641k287397j683632
$$ 8654551 11842845 12305067 9051705 6405404 5766819 4588178 2300781 617149
32382F17149j710284l354147k552688K114804N040969K646502o6336J614432L519725
$$ 617149 -1093135 -4447282 -6999970 -4885166 155803 2802305 2735969 4350401 7870126
32373G870126M63523l453409j331290M269868N052416K57928l020748j562396
$$ 7870126 8333649 4880240 3548950 7818818 12871234 13129162 10108414 8546018
32365H546018N62449J38018j390306k715964m352319m909511k169316J462885
$$ 8546018 9108467 9246485 7856179 5140215 787896 -4121615 -6290931 -4828046
32357d828046J002991k715745l315355Q72831L635479Q70142k582005n43426M921939
$$ -4828046 -3825055 -6540800 -9856155 -8983324 -5347845 -4477703 -7059708 -7603134 -2681195
32348b681195O884951L563744m51324j798231k014952k864878k257572K288401
$$ -2681195 4203756 7767500 7316176 5517945 3502993 638115 -1619457 668944
32340F68944Q016904Q488366J725651n972725p092076k285152J079692n57012
$$ 668944 8685848 17174214 18899865 12927140 5835064 3549912 4629604 4072592
32332D072592k751331j028324K085400J959520j92261K89799L361490M397592
$$ 4072592 1321261 292937 2378337 4337857 4145596 4435395 7796885 12194477
32324A2194477J950068k16244L33932J124660l18243k054132j183409Q98147J72916
$$ 12194477 14144545 13928301 14262233 15386893 15068650 13014518 11831109 12729256 12902172
32315A2902172l738512o036412k685669L701620O286105K550762k286550k491325
$$ 12902172 9163660 3127248 441579 4143199 10429304 12980066 10693516 8202191
32307H202191K13009R4995k846386k813494J584181M047544N32854l958871l352295
$$ 8202191 8415200 8510195 5663809 2850315 4434496 8482040 9014894 5056023 1703728
32298A703728J06173L93657k416293l369158j038709J605627K923114L384423
$$ 1703728 1809901 2203558 -212735 -3581893 -4620602 -3014975 -91861 3292562
32290C292562K244024j013920l494521k510837m08042k61059M11255M692629P850114
$$ 3292562 5536586 4522666 1028145 -1482692 -1890734 -2151793 -1740538 2952091 10802205
32281A0802205K836166o918710j0093391l762656K664544K217576o05694J23672
$$ 10802205 13638371 6719661 -3373730 -7136386 -4471842 -2254266 -2859960 -2736288
32273b736288J746015m84143l892203k972445J030696K448788M12927q38494N39673
$$ -2736288 -990273 -1474416 -5366619 -8339064 -7308368 -4859580 -4446653 -5285147 -4745474
32264d745474J988350J660789P45472L44634k16036j224922j455926j25363J676955
$$ -4745474 -2757124 -1096335 -350863 -6229 -222265 -1447187 -2903113 -3028476 -1351521
32255a351521K262021J215606m36015j579288k074656k096228r51686J784863
$$ -1351521 910500 2126106 1690091 110803 -1963853 -4060081 -5011767 -3226904
32247c226904L904251K219779k061324l173526J203734N536912M273765L35578
$$ -3226904 677347 2897126 835802 -2337724 -1133990 4402922 8676687 9012265
32239I012265j84120J405760r37779o248528o680940m37928M357297J825128l390062
$$ 9012265 8828145 10233905 9296126 3047598 -3633342 -4071270 286027 2111155 -1278907
32230a278907m199034q49114K134620L276025L375141J878942j013620k210769
$$ -1278907 -5477941 -6327055 -4192435 -916410 2458731 4337673 3324053 1113284
32222A113284k31644J347630p77384l872647l095205J218966M368128L676278
$$ 1113284 881640 2229270 1451886 -2420761 -5515966 -4297000 71128 3747406
32214C747406O03126k075334k463967m54864J533069O51543k060563k248659J221937
$$ 3747406 4350532 2275198 -188769 -643633 889436 1540979 -519584 -2768243 -1546306
32205a546306L731671J298176l690013n847413l288174J589912N364114N725457
$$ -1546306 2185365 3483541 -206472 -6053885 -9342059 -7752147 -2388033 3337424
32197C337424K800904l15283q69179n45294k665180n661263m746258l16781K017517
$$ 3337424 6138328 5823045 4953866 4408572 1743392 -3917871 -8664129 -8980910 -6963393
32188f963393R91842J601482N065771N332013k17150m892938l187231N69641N18221
$$ -6963393 -5971551 -4370069 695702 6027715 5810565 917627 -2269604 -1699963 -1181742
32179a181742j150897l43776K85167k560910m397580l18857M510929K250318l762634
$$ -1181742 -2332639 -2676415 -2391248 -4952158 -9349738 -9668595 -5157666 -2907348 -6669982
32170f669982l688892K761740O246938K895931j318066j725066m79816K80577
$$ -6669982 -10358874 -7597134 -1350196 1545735 227669 -1497397 -1977213 -1696636
32162a696636J687338K988062J516131p52467J110504N271722L894002l944114
$$ -1696636 -9298 2978764 4494895 3742428 4852932 10124654 14018656 10074542
32154A0074542q866304m573507L273559O243404M324784K485150J697152l64242
$$ 10074542 1208238 -3365269 -91710 6151694 10476478 12961628 14658780 14294538
32146A4294538l171709l768653j932370o16959j615027l355700k946993N42207
$$ 14294538 11122829 7354176 5421806 4804847 3189820 -165880 -3112873 -2570666
32138b570666M458782M647696L81936l959890m125548j198841J084805J892394
$$ -2570666 1888116 6535812 6917748 2957858 -1167690 -2366531 -1281726 610668
32130F10668K330864J387059k036636m811762l077556J043279K141157R7448l70952
$$ 610668 2941532 4328591 2291955 -2519807 -5597363 -4554084 -2412927 -2315479 -2686431
32121b686431J664053K006432q10871k912137j592888J246630L144174L267063
$$ -2686431 -1022378 984054 173183 -2738954 -4331842 -3085212 58962 3326025
32113C326025M41255n136082q392854m316556L482790O321599K789869l10671
$$ 3326025 3767280 -1368802 -9761656 -14078212 -10595422 -4273823 -1483954 -1794625
32105a794625J80876K5713k666370l427768l22722K065699J229883P64941K063083
$$ -1794625 -1613749 -1588036 -4254406 -7682174 -8004896 -5939197 -4709314 -3944373 -1881290
32096a881290R65121k948390l173164K195217N296630J389130k620112l17089
$$ -1881290 -916169 -3864559 -7037723 -4842506 454124 1843254 -776858 -1093947
32088a093947K891180K1106m451243k785919J884473J621100j668118m01005L725024
$$ -1093947 1797233 1818339 -2632904 -5418823 -3534350 -1913250 -3581368 -3982373 -257349
32079b57349K323255l851073m963538J418604O182510L297915k183144l928725
$$ -257349 2065906 -1785167 -6748705 -5330101 852409 4150324 1967180 -1961545
32071a961545k675955j090238J384139M404579M541971J303140p32984N50904
$$ -1961545 -4637500 -5727738 -4343599 60980 4602951 5906091 5173107 5724011
32063E724011J025564k137307m894292k957364Q31128J017762j941612k998966
$$ 5724011 6749575 4612268 -282024 -3239388 -2408260 -1390498 -3332110 -6331076
32055f331076n36001J790801R87417j219745j247399J405886L504232K238421
$$ -6331076 -6867077 -5076276 -4088859 -5308604 -6556003 -5150117 -1645885 592536
32047E92536r91095k338218q39179N41811N3218m9841J795577K626445j94219
$$ 592536 -398559 -2736777 -3575956 -3034145 -2980927 -3030768 -1235191 1391254 1197035
32038A197035l424358k422127J096222J683190r06212j921848k57296J66832j528830
$$ 1197035 -2227323 -4649450 -3553228 -1870038 -2776250 -4698098 -4955394 -4788562 -6317392
32029f317392r23706L449348O122740K798620k707599m030566r99233J647751
$$ -6317392 -7241098 -3791750 2330990 5129610 2422011 -1608555 -2607788 -960037
32021i60037J719483J318546K164734K799218Q92452l278318o196233m397531
$$ -960037 759446 2077992 4242726 7041944 7934396 4656078 -1540155 -5937686
32013e937686Q13219L386317j89505n003056l310077M322106Q662113M019291
$$ -5937686 -5124467 -1738150 -1927655 -6930711 -10240788 -5918682 2743431 6762722
32005F762722m189618o926550k604460K892204M475849K333117n51788k120129
$$ 6762722 2573104 -4353446 -6957906 -4065702 410147 2743264 2191476 71347
31997G1347k435554k633347k779967j206399K568375N140163K627134l185699
$$ 71347 -2364207 -4997554 -7777521 -8983920 -6415545 -1275382 1351752 -1833947
31989a833947n919086k833136J784509L054369J561192O77051J242220J842289
$$ -1833947 -7753033 -10586169 -8801660 -5747291 -4186099 -3509048 -2266828 -424539
31981d24539J847217J314310k73459k791700m557907m331423k547593L30079L992609
$$ -424539 1422678 2736988 2463529 -328171 -4886078 -9217501 -11765094 -11435015 -7442406
$$ [...]
##END NTUPLES=NMR SPECTRUM
##END=
