##TITLE=31Pdec_DE-58tub_Ac
 
 24 sc
 7.5.2024
##JCAMPDX= 6.0         $$ Bruker NMR JCAMP-DX V2.0
##DATA TYPE= NMR SPECTRUM
##DATA CLASS= NTUPLES
##ORIGIN= UXNMR, Bruker Analytische Messtechnik GmbH
##OWNER= root
$$ XWIN-NMR		Version 3.5
$$ Tue May  7 15:28:23 2024 Russian Standard Time (UT+4h)  she@DPX200
##.OBSERVE FREQUENCY= 81.013821
##.OBSERVE NUCLEUS= ^31P
##.ACQUISITION MODE= SIMULTANEOUS
##.ACQUISITION SCHEME= undefined
##.AVERAGES= 24
##.DIGITISER RES= 16
##SPECTROMETER/DATA SYSTEM= spect
##.PULSE SEQUENCE= zgpg30
##.SOLVENT NAME= CDCl3
##.SHIFT REFERENCE= (INTERNAL, CDCl3, 0, 248.564)
##AUDIT TRAIL= $$ (NUMBER, WHEN, WHO, WHERE, WHAT)
$$ ##TITLE= Audit trail, XWIN-NMR		Version 3.5
$$ ##JCAMPDX= 5.01
$$ ##ORIGIN= Bruker BioSpin GmbH
$$ ##OWNER= she
$$ F:/spectra/data/she/nmr/P31/1/pdata/1/auditp.txt
$$ ##AUDIT TRAIL=  $$ (NUMBER, WHEN, WHO, WHERE, WHAT)
(   1,<2024-05-07 15:25:35.89 +0400>,<she>,<DPX200>,
      <created by zg, POWCHK disabled, PULCHK disabled
       configuration hash MD5:
       00 E9 B6 7A A2 85 ED C7 34 08 36 98 17 FE 4E 26
       data hash MD5: 32K
       85 AA F9 13 D4 66 70 A5 7A EC BB D7 05 21 51 31>)
(   2,<2024-05-07 15:25:38.37 +0400>,<she>,<DPX200>,
      <Start of raw data processing
       efp BC_mod = 2 LB = 10 FT_mod = 6 PKNL = 1 PHC0 = -13253.86 PHC1 = 132.0835 SI = 64K 
       data hash MD5: 64K
       FB 49 C0 B8 1B A5 3F 1E 56 5E F7 73 6A 11 70 C1>)
(   3,<2024-05-07 15:25:53.67 +0400>,<she>,<DPX200>,
      <pk PHC0 = 6.794693 PHC1 = 0 
       data hash MD5: 64K
       23 88 DE B1 31 EE FF CF 58 C8 71 06 04 F6 40 B8>)
$$ ##END=
$$ 
$$ hash MD5
$$ E9 8B DE 53 25 D0 66 13 FD C7 AD FF 88 CA E3 CB
##$RELAX= 
##$RELAX= 
##$RELAX= 
##$RELAX= 
##$RELAX= 
##$RELAX= 
##$RELAX= 
##$RELAX= 
##$RELAX= 
$$ Bruker specific parameters
$$ --------------------------
##$DU= <F:/spectra>
##$EXPNO= 1
##$NAME= <P31>
##$PROCNO= 1
##$TYPE= <nmr>
##$USER= <she>
##$AMP= (0..31)
100 100 100 100 100 100 100 100 100 100 100 100 100 100 100 100 100 100 
100 100 100 100 100 100 100 100 100 100 100 100 100 100 
##$AQSEQ= 0
##$AQ_mod= 1
##$AUNM= <au_zg>
##$AUTOPOS= <>
##$BF1= 81.014009
##$BF2= 200.13
##$BF3= 200.13
##$BF4= 200.13
##$BF5= 200.13
##$BF6= 200.13
##$BF7= 200.13
##$BF8= 200.13
##$BYTORDA= 1
##$CFDGTYP= 0
##$CFRGTYP= 5
##$CHEMSTR= <none>
##$CNST= (0..31)
1 1 145 1 1 1 1 1 1 1 1 1 1 1 1 1 1 1 1 1 1 1 1 1 1 1 1 1 1 1 1 1 
##$CPDPRG= <waltz16>
##$CPDPRG1= <>
##$CPDPRG2= <waltz16>
##$CPDPRG3= <>
##$CPDPRG4= <mlev>
##$CPDPRG5= <mlev>
##$CPDPRG6= <mlev>
##$CPDPRG7= <mlev>
##$CPDPRG8= <mlev>
##$CPDPRGB= <>
##$CPDPRGT= <>
##$D= (0..31)
0 1 0 0 0 0 0 0 0 0 0 0.03 2e-05 3e-06 0 0 0 0 0 0 0 0 0 0 0 0 0 0 0 0 
0 0 
##$DATE= 1715081135
##$DBL= (0..7)
120 120 120 11 120 120 24 19 
##$DBP= (0..7)
150 150 150 150 150 150 150 150 
##$DBP07= 0
##$DBPNAM0= <>
##$DBPNAM1= <>
##$DBPNAM2= <>
##$DBPNAM3= <>
##$DBPNAM4= <>
##$DBPNAM5= <>
##$DBPNAM6= <>
##$DBPNAM7= <>
##$DBPOAL= (0..7)
0.5 0.5 0.5 0.5 0.5 0.5 0.5 0.5 
##$DBPOFFS= (0..7)
$$ [...]
##$SUBNAM2= <"">
##$SUBNAM3= <"">
##$SUBNAM4= <"">
##$SUBNAM5= <"">
##$SUBNAM6= <"">
##$SUBNAM7= <"">
##$SUBNAM8= <"">
##$SUBNAM9= <"">
##$SW= 501.771253377433
##$SWIBOX= (0..15)
0 1 3 0 0 0 0 0 0 0 0 0 0 0 0 0 
##$SW_h= 40650.406504065
##$TD= 32768
##$TD0= 1
##$TE= 0
##$TE2= 300
##$TE3= 300
##$TEG= 300
##$TL= (0..7)
0 120 53 12 22 120 120 120 
##$TP= (0..7)
150 150 150 150 150 150 150 150 
##$TP07= 0
##$TPNAME0= <>
##$TPNAME1= <>
##$TPNAME2= <>
##$TPNAME3= <>
##$TPNAME4= <>
##$TPNAME5= <>
##$TPNAME6= <>
##$TPNAME7= <>
##$TPOAL= (0..7)
0.5 0.5 0.5 0.5 0.5 0.5 0.5 0.5 
##$TPOFFS= (0..7)
0 0 0 0 0 0 0 0 
##$TUNHIN= 0
##$TUNHOUT= 0
##$TUNXOUT= 0
##$USERA1= <user>
##$USERA2= <user>
##$USERA3= <user>
##$USERA4= <user>
##$USERA5= <user>
##$V9= 5
##$VALIST= <valist>
##$VCLIST= <CCCCCCCCCCCCCCC>
##$VD= 0
##$VDLIST= <DDDDDDDDDDDDDDD>
##$VPLIST= <PPPPPPPPPPPPPPP>
##$VTLIST= <TTTTTTTTTTTTTTT>
##$WBST= 1024
##$WBSW= 4
##$XGAIN= (0..3)
0 0 0 0 
##$XL= 0
##$YL= 0
##$YMAX_a= 3149
##$YMIN_a= -2209
##$ZGOPTNS= <>
##$ZL1= 120
##$ZL2= 120
##$ZL3= 120
##$ZL4= 120
##$ABSF1= 0
##$ABSF2= 0
##$ABSG= 0
##$ABSL= 0
##$ALPHA= 0
##$AQORDER= 0
##$ASSFAC= 0
##$ASSFACI= 0
##$ASSFACX= 0
##$ASSWID= 0
##$AUNMP= <proc_1d>
##$AZFE= 0.1
##$AZFW= 0.5
##$BCFW= 0
##$BC_mod= 2
##$BYTORDP= 0
##$COROFFS= 0
##$CY= -3
##$DATMOD= 1
##$DC= 0
##$DFILT= <>
##$DTYPP= 0
##$F1P= 0
##$F2P= 0
##$FCOR= 1
##$FTSIZE= 65536
##$FT_mod= 6
##$GAMMA= 0
##$GB= 0
##$INTBC= 1
##$INTSCL= 6.047779e-11
##$ISEN= 30
##$LB= 10
##$LEV0= 0
##$LPBIN= 0
##$MAXI= 10000
##$MC2= 0
##$MEAN= 0
##$ME_mod= 0
##$MI= 50
##$NCOEF= 0
##$NC_proc= -9
##$NLEV= 6
##$NOISF1= 182.463
##$NOISF2= 159.3651
##$NSP= 0
##$NTH_PI= 0
##$NZP= 0
##$OFFSET= 248.5645
##$PC= 4
##$PHC0= -13247.07
##$PHC1= 132.0835
##$PH_mod= 1
##$PKNL= yes
##$PPARMOD= 0
##$PSCAL= 0
##$PSIGN= 0
##$REVERSE= no
##$SF= 81.0140089999694
##$SI= 65536
##$SIGF1= 159.3651
##$SIGF2= -187.1042
##$SINO= 113.3802
##$SIOLD= 16384
##$SREGLST= <1H.CDCl3>
##$SSB= 0
##$STSI= 65536
##$STSR= 0
##$SW_p= 40650.406504065
##$SYMM= 0
##$S_DEV= 0
##$TDeff= 32768
##$TDoff= 0
##$TI= <>
##$TILT= no
##$TM1= 0
##$TM2= 0
##$TOPLEV= 0
##$USERP1= <user>
##$USERP2= <user>
##$USERP3= <user>
##$USERP4= <user>
##$USERP5= <user>
##$WDW= 1
##$XDIM= 65536
##$YMAX_p= 305814957
##$YMIN_p= -15419778
$$ End of Bruker specific parameters
$$ ---------------------------------
##NTUPLES= NMR SPECTRUM
##VAR_NAME=  FREQUENCY,     SPECTRUM/REAL,   SPECTRUM/IMAG
##SYMBOL=    X,             R,               I
##VAR_TYPE=  INDEPENDENT,   DEPENDENT,       DEPENDENT
##VAR_FORM=  AFFN,          ASDF,            ASDF
##VAR_DIM=   65536,         65536,           65536
##UNITS=     HZ,            ARBITRARY UNITS, ARBITRARY UNITS
##FACTOR=    0.620285442955139, 1,           1
##FIRST=     20137.2065510682, 0,            0
##LAST=      -20513.1999529968, 0,           0
##MIN=       -20513.1999529968, -15419778,   0
##MAX=       20137.2065510682, 305814957,    0
$$ Real data points
##PAGE= N=1
##DATA TABLE= (X++(R..R)), XYDATA
$$ [...]
58111G69256L41037M45597N22559N55963N37197M67882L60074K32658J04579j1645
58101D325157j12239j99550k77073l45463m00964m36135m42300m12812l45639
58092A352982k43968j15287K9134J73631K98320L82733M12521L85050L09921K04726
58082C189763Q9885j4534r0835j26767j19510p7717j9337L4045O3507N7592J4684
58071C000776n7553j45884k36915l21104l93154m49750m87821n05129n02140m83013
58061e81687m54584m23826l94727l66013l31401k82664k13680j22624j1439J15845
58051c066800K54040L96734N36079O62726P65692Q32648Q51658Q14944P23086
58042B770807N86977M25560K59878J06416k6953j40573k39200l27377m06285m73062
$$ plain form
58111 769256 1110293 1555890 2078449 2634412 3171609 3639491 3999565 4232223 4336802 4325157
58101 4325157 4212918 4013368 3736295 3390832 2989868 2553733 2111433 1698621 1352982
58092 1352982 1109014 993727 1022861 1196492 1494812 1877545 2290066 2675116 2985037 3189763
58082 3189763 3279648 3265114 3174279 3047512 2928002 2850285 2830948 2864993 2928500 2986092 3000776
58071 3000776 2943223 2797339 2560424 2239320 1846166 1396416 908595 403466 -98674 -581687
58061 -581687 -1036271 -1460097 -1854824 -2220837 -2552238 -2834902 -3048582 -3171206 -3182645 -3066800
58051 -3066800 -2812760 -2416026 -1879947 -1217221 -451529 381119 1232777 2047721 2770807
58042 2770807 3357784 3783344 4043222 4149638 4122685 3982112 3742912 3415535 3009250 2536188
58032B536188n22186n48134n48018n22869m76988m16306l47322k77227k13823
58023a336685j64155j32384j18564j18623j24663j25491j08874o6254K224Q6090
58013b207379J68051K31051K65112K70285K54083K25324J89261J47948J04540
58004c51724O6365M3042M1366O1607R7648J39719J77442K02145K08763J97456
57994H83829J74360J50626J39177J49838J85027K38708K99505L56361M03429M41772
57984C422632M77540N17949N66976O22287O74647P10593P17850O91081O34456
57975I036011N59206M77722L98115L22090K45881J62044O1290o4513k17351l88313
57965A0592182n57284o99145p93668q33241q23970p79969p14822o35451n41997
$$ plain form
58032 2536188 2014002 1465868 917850 394981 -82007 -498313 -845635 -1122862 -1336685
58023 -1336685 -1500840 -1633224 -1751788 -1870411 -1995074 -2120565 -2229439 -2295693 -2293469 -2207379
58013 -2207379 -2039328 -1808277 -1543165 -1272880 -1018797 -793473 -604212 -456264 -351724
58004 -351724 -285359 -242317 -200951 -139344 -41696 98023 275465 477610 686373 883829
57994 883829 1058189 1208815 1347992 1497830 1682857 1921565 2221070 2577431 2980860 3422632
57984 3422632 3900172 4418121 4985097 5607384 6282031 6992624 7710474 8401555 9036011
57975 9036011 9595217 10072939 10471054 10793144 11039025 11201069 11262359 11197846 10980495 10592182
57965 10592182 10034898 9335753 8542085 7708844 6884874 6104905 5390083 4754632 4212635
57956D212635m33042l11825j88772p9188J460M1965L8854j118o1030j18314j53038
57945B948587j55753j30523r1877n8269m5449o1873j06553j69463k35172k89192
57935A604463l24347l43316l55899l73349m03583m49135n07109n70171o28319
57926b350765o71232o90226o79334o36088n62736m66825l59439k51117j48296
57917f816058n3247L2828J07024J65175K04554K25599K31175K25210K12798K01230
57907e263712J99526K15747K53760L11295L79612M44547M89425N00007M69617
57898b000176M01435L06426J98453Q9823j0190r3688j51792j74810j56325r8829
57888a689673j6341O8881J33996J63159J51095J02023K5825o5931j62748k56455
$$ plain form
57956 4212635 3779593 3467768 3278996 3199808 3201268 3243233 3282087 3280969 3219939 3101625 2948587
57945 2948587 2792834 2662311 2570434 2512165 2466716 2404843 2298290 2128827 1893655 1604463
57935 1604463 1280116 936800 580901 207552 -196031 -645166 -1152275 -1722446 -2350765
57926 -2350765 -3021997 -3712223 -4391557 -5027645 -5590381 -6057206 -6416645 -6667762 -6816058
57917 -6816058 -6869305 -6836477 -6729453 -6564278 -6359724 -6134125 -5902950 -5677740 -5464942 -5263712
57907 -5263712 -5064186 -4848439 -4594679 -4283384 -3903772 -3459225 -2969800 -2469793 -2000176
57898 -2000176 -1598741 -1292315 -1093862 -1004039 -1014229 -1107917 -1259709 -1434519 -1590844 -1689673
57888 -1689673 -1706014 -1637133 -1503137 -1339978 -1188883 -1086860 -1061035 -1126966 -1289714 -1546169
57878a546169l41278m12739m65980m94866m93287m58172l91787l01343j96701
57869e102322q8618J1400R0989J38375J45410J10689M1065m9429j43117k23127
57859e068685k76443k94862k75210k20045j37815m0872N8252J49773K27588K88978
57849e589341L33899L63679L79462L81875L72227L53467L29578L04813K84313
57840b486028K74441K79781K97631L15328L14491K80264K09382J12433R997p4526
57830d66806j22105j23099p9209k403Q8707J74248K38718K74855K84278K74935
57820E42119K56730K37352K20057K03953J85907J62583J31836R3677N0769P949
57810B092932k9340n6762p1704p2659n8204k6626K3268R0255J68767K48628L17316
$$ plain form
57878 -1546169 -1887447 -2300186 -2766166 -3261032 -3754319 -4212491 -4604278 -4905621 -5102322
57869 -5102322 -5190940 -5179540 -5088551 -4950176 -4804766 -4694077 -4653012 -4702441 -4845558 -5068685
57859 -5068685 -5345128 -5639990 -5915200 -6135245 -6273060 -6313932 -6255680 -6105907 -5878319 -5589341
57849 -5589341 -5255442 -4891763 -4512301 -4130426 -3758199 -3404732 -3075154 -2770341 -2486028
57840 -2486028 -2211587 -1931806 -1634175 -1318847 -1004356 -724092 -514710 -402277 -392280 -466806
57830 -466806 -588911 -712010 -791219 -793622 -704915 -530667 -291949 -17094 267184 542119
57820 542119 798849 1036201 1256258 1460211 1646118 1808701 1940537 2034214 2084983 2092932
57810 2092932 2063592 2006830 1935126 1862467 1804263 1777637 1800905 1891160 2059927 2308555 2625871
57799B625871L63824L81931L71324L36761K86485K30799J80773J46600J35543
57790E059911J50036J86690K36643K87401L25977L42552L33278L00950K53208
57781G476646J98928J44144Q9472L0870l6379j13385j96223k77274l46462l91125
57771F579212l96870l52027k54194j14161M6008J99753L24184M05971M42746M39951
57761G320573M05688L47065K69545J78031P7902k4407j20922k02361k59995k88876
57751G702243k90492k73057k48844k29366k20279k18659k14694j97201j59608
57742E650043j02526l2247M2428J12195J67801K00946K06390J83983J38591P7619
57732F645223P967o5423j38568k06022k59308k88308k85806k52576j99339j43782
$$ plain form
57799 2625871 2989695 3371626 3742950 4079711 4366196 4596995 4777768 4924368 5059911
57790 5059911 5209947 5396637 5633280 5920681 6246658 6589210 6922488 7223438 7476646
57781 7476646 7675574 7819718 7909190 7940060 7903681 7790296 7594073 7316799 6970337 6579212
57771 6579212 6182342 5830315 5576121 5461960 5507968 5707721 6031905 6437876 6880622 7320573
57761 7320573 7726261 8073326 8342871 8520902 8598804 8574397 8453475 8251114 7991119 7702243
57751 7702243 7411751 7138694 6889850 6660484 6440205 6221546 6006852 5809651 5650043
57742 5650043 5547517 5515270 5557698 5669893 5837694 6038640 6245030 6429013 6567604 6645223
57732 6645223 6653190 6587767 6449199 6243177 5983869 5695561 5409755 5157179 4957840 4814058
57722D814058j04059r2386j11572j55437k12517k71663l27268l81072m38612n02059
57712B217413n64830o12881o32517o19221n81420n37151n06298n02725n29650
57703b869280n79477o37273o85902p10885p03826o63783n96023n08549m08215
57694h363213k98681j80921n5256P6316K08523L32837M39965N23868N84705O28227
57684f103630O61773O89560P10423P19433P12186O88662O53986O16128N82857
57675f8622N60015N50941N55749N70508N87757N99235N99611N88716N70651N50264
57665E664825N29286N04546M69127M15507L38810K38774J20050q893j37690k56302
57655G878040l57201m36943m96329n38644n66791n81361n81151n65737n37902
$$ plain form
57722 4814058 4709999 4617613 4506041 4350604 4138087 3866424 3539156 3158084 2719472 2217413
57712 2217413 1652583 1039702 407185 -212036 -793456 -1330607 -1836905 -2339630 -2869280
57703 -2869280 -3448757 -4086030 -4771932 -5482817 -6186643 -6850426 -7446449 -7954998 -8363213
57694 -8363213 -8661894 -8842815 -8898071 -8821755 -8613232 -8280395 -7840430 -7316562 -6731857 -6103630
57684 -6103630 -5441857 -4752297 -4041874 -3322441 -2610255 -1921593 -1267607 -651479 -68622
57675 -68622 491393 1042334 1598083 2168591 2756348 3355583 3955194 4543910 5114561 5664825
57665 5664825 6194111 6698657 7167784 7583291 7922101 8160875 8280925 8272032 8134342 7878040
57655 7878040 7520839 7083896 6587567 6048923 5482132 4900771 4319620 3753883 3215981
57646C215981n03824m70638m42955m20792m00456l77617l50483l21455k96852
57637c69091k84766k91124l15330l48600l77346l90168l83794l63963l41045l23525
57627c788752l13239l04954k90308k63642k26088j85662j53872j41114j52936
57618e820567j87854k36656k83508l09375k97533k39216j36498j034J50134K99254
57608g062853M31448N36911O11225O53551O63791O41342N86799N04979M06309
57599b026498L05165K16213J50622J13534J03570J14858J40749J76961K21785
57590d83041K73349L26792L74510M09429M27804M28744M11911L77169L27074K68734
57580C142475K11955J64896J31010J08619R1740P1315L8118j2451p6772j44478
$$ plain form
57646 3215981 2712157 2241519 1798564 1377772 977316 599699 249216 -72239 -369091
57637 -369091 -653857 -944981 -1260311 -1608911 -1986257 -2376425 -2760219 -3124182 -3465227 -3788752
57627 -3788752 -4101991 -4406945 -4697253 -4960895 -5186983 -5372645 -5526517 -5667631 -5820567
57618 -5820567 -6008421 -6245077 -6528585 -6837960 -7135493 -7374709 -7511207 -7512241 -7362107 -7062853
57608 -7062853 -6631405 -6094494 -5483269 -4829718 -4165927 -3524585 -2937786 -2432807 -2026498
57599 -2026498 -1721333 -1505120 -1354498 -1240964 -1137394 -1022536 -881787 -704826 -483041
57590 -483041 -209692 117100 491610 901039 1328843 1757587 2169498 2546667 2873741 3142475
57580 3142475 3354430 3519326 3650336 3758955 3850695 3922010 3960128 3947677 3870905 3726427
57570C726427k04770k52683k89923l19426l38473l36698l01433k26435j17350
57561A339236R703J34595K40241L16839L62102L78038L66518L27022K58554J64262
57551C897110N4908n1724j35396j79696j77092j30464n0443M9267J55329K55361
57541C687160L37346L90394M07295L87055L35498K63579J84275J09187M5780l994
57531F143575m3381p9142j19124j69751k33884l09328l88391m59138n08646n27265
57521C305525n11465m63325l87449k88458j71234m2735Q7692K10479L18253M06010
57511B463293M69542N04622N08032M79026M19632L34178K29213J13726j572j06110
57501E413582j91419k52274k87107k98251k91947k77711k66522k67405k83048
$$ plain form
57570 3726427 3521657 3268974 2979051 2659625 2321152 1984454 1683021 1456586 1339236
57561 1339236 1348939 1483534 1723775 2040614 2402716 2780754 3147272 3474294 3732848 3897110
57551 3897110 3952018 3900294 3764898 3585202 3408110 3277646 3227203 3276470 3431799 3687160
57541 3687160 4024506 4414900 4822195 5209250 5544748 5808327 5992602 6101789 6147569 6143575
57531 6143575 6100194 6021052 5901928 5732177 5498293 5188965 4800574 4341436 3832790 3305525
57521 3305525 2794060 2330735 1943286 1654828 1483594 1440859 1528551 1739030 2057283 2463293
57511 2463293 2932835 3437457 3945489 4424515 4844147 5178325 5407538 5521264 5519692 5413582
57501 5413582 5222163 4969889 4682782 4384531 4092584 3814873 3548351 3280946 2997898
57492B997898l06991l25336l23008k90573k27290j39908m0139N7599J39143J95125
57482A736520K24607K34112K31760K20690J96819J52327Q2202j0637j14678k14180
57472B739542k96184l56030l97842m29855m58361m85052n09320n32476n59439
57463a285017n96222o45466p03518p60998q06068q28427q21912p84843p18717
57454g951188o26875n14093l86705k52278j18573P730J22199K23647L14004L95888
57444h786244M68358N24024N51009N39508M88598M08336L16084K30186J65139
57435e095002J29671J26338J50849J91652K32024K55928K55379K34466K06777
57426c311918J87640J86473K03851K33781K68141K99944L24274L37696L37537
$$ plain form
57492 2997898 2690907 2365571 2042563 1751990 1524700 1384792 1344653 1402252 1541395 1736520
57482 1736520 1961127 2195239 2426999 2647689 2844508 2996835 3079037 3068400 2953722 2739542
57472 2739542 2443358 2087328 1689486 1259631 801270 316218 -193102 -725578 -1285017
57463 -1285017 -1881239 -2526705 -3230223 -3991221 -4797289 -5625716 -6447628 -7232471 -7951188
57454 -7951188 -8578063 -9092156 -9478861 -9731139 -9849712 -9841982 -9719783 -9496136 -9182132 -8786244
57444 -8786244 -8317886 -7793862 -7242853 -6703345 -6214747 -5806411 -5490327 -5260141 -5095002
57435 -5095002 -4965331 -4838993 -4688144 -4496492 -4264468 -4008540 -3753161 -3518695 -3311918
57426 -3311918 -3124278 -2937805 -2733954 -2500173 -2232032 -1932088 -1607814 -1270118 -932581
57417i32581L22056K91818K51365K09584J77452J63803J71283J94625K22066K39202
57407A310673K33683J98792J34481M5905n8587j68090k68478l42710l74126l51890
57397C59653k75288j54225o277J47259K84665L86889M41025M43089L98233L18342
57387B343365K18967J16762K6495m2996r1665j26684j56824j87265k18964k51912
57377A629279k88465l33811l93481m69184n54965o35958o91488p01609o53557
57368c093239n45061l84098j86642K6149K30832M04624N28420N89993N86907N27617
57358a314498M29346L13136J98502R9986K5828k2449n0295o9183r3021j32291
57348f14939j88675k53456l10883l44441l42368k99915k18654j05107K9746J70871
$$ plain form
57417 -932581 -610525 -318707 -67342 142242 319694 483497 654780 849405 1071471 1310673
57407 1310673 1544356 1743148 1877629 1923534 1864947 1696857 1428379 1085669 711543 359653
57397 359653 84365 -69860 -76137 71122 355787 742676 1183701 1626790 2025023 2343365
57387 2343365 2562332 2679094 2705589 2662593 2570928 2444244 2287420 2100155 1881191 1629279
57377 1629279 1340814 1007003 613522 144338 -410627 -1046585 -1738073 -2439682 -3093239
57368 -3093239 -3638300 -4022398 -4209040 -4182891 -3952059 -3547435 -3019015 -2429022 -1842115 -1314498
57358 -1314498 -885152 -572016 -373514 -273528 -247700 -270149 -320444 -389627 -482648 -614939
57348 -614939 -803614 -1057070 -1367953 -1712394 -2054762 -2354677 -2573331 -2678438 -2648692 -2477821
57338b477821L01347M06476M77682N13954N20742N07445M83807M55494M20901
57329A610027L72332L01812K07296R4544k6068j44375k53520l50301m33903n04430
57319H73414n62102o06526o34699o38218o03449n18009l81407k11882m2919Q9393
57309c236404J60399J64602J14471L2941n5566j31577j83347k07271k07160j91930
57299c740842j71354j51752j34790j19873j07090r7225q9000p6859n2349r106
57289d750240N1567J18433J73556J99824J88680J43733P8631J1017m3977p7655
57279c906431q8225p9009n6583k9938r696n758k3545o1341j11122j62497k06859
57268d741004k39194k57412k60873k49480k23810j85990j40829r5827n8848l3821
$$ plain form
57338 -2477821 -2176474 -1769998 -1292316 -778362 -257620 249825 733632 1189126 1610027
57329 1610027 1982359 2284171 2491467 2586011 2559943 2415568 2162048 1811747 1377844 873414
57319 873414 311312 -295214 -929913 -1568131 -2171580 -2689589 -3070996 -3282878 -3325797 -3236404
57309 -3236404 -3076005 -2911403 -2796932 -2763991 -2819557 -2951134 -3134481 -3341752 -3548912 -3740842
57299 -3740842 -3912196 -4063948 -4198738 -4318611 -4425701 -4522926 -4611926 -4688785 -4741134 -4750240
57289 -4750240 -4698673 -4580240 -4406684 -4206860 -4018180 -3874447 -3795816 -3784799 -3828776 -3906431
57279 -3906431 -3994656 -4073665 -4130248 -4160186 -4169882 -4175640 -4199185 -4260526 -4371648 -4534145 -4741004
57268 -4741004 -4980198 -5237610 -5498483 -5747963 -5971773 -6157763 -6298592 -6394419 -6453267 -6487088
57258f487088j7443j29K8436P2573J27375J80774K18868K30885K11538J61018
57248e273193Q3959j1551j14731k13417k96835l59777m05693m45119m88480n37724
57238h062561n83340o09384o02216n56470m75967l71740k59161j53429o3174J4113
57228a1723329R0029J76847K79023L90783M99902N93062O59285O91647O88576
57219g654175O54436N98295N31162M63039M00793L46981L00058K56276K12550
57210c890585J68534J27113R3697P4960P7085J03804J55353K28839L19005M18160
57200b124035N15825N99515O57102O79754O64573O16138N45778M67231L89865
57191C011746L13369K27584J18030k5318j99666l85508n50825o63172p03495o73026
$$ plain form
57258 -6487088 -6504531 -6504660 -6476224 -6403651 -6276276 -6095502 -5876634 -5645749 -5434211 -5273193
57248 -5273193 -5189234 -5200785 -5315516 -5528933 -5825768 -6185545 -6591238 -7036357 -7524837 -8062561
57238 -8062561 -8645901 -9255285 -9857501 -10413971 -10889938 -11261678 -11520839 -11674268 -11737442 -11723329
57228 -11723329 -11633300 -11456453 -11177430 -10786647 -10286745 -9693683 -9034398 -8342751 -7654175
57219 -7654175 -6999739 -6401444 -5870282 -5407243 -5006450 -4659469 -4359411 -4103135 -3890585
57210 -3890585 -3722051 -3594938 -3501241 -3426281 -3349196 -3245392 -3090039 -2861200 -2542195 -2124035
57200 -2124035 -1608210 -1008695 -351593 328161 992734 1608872 2154650 2621881 3011746
57191 3011746 3325115 3552699 3670729 3645411 3445745 3060237 2509412 1846240 1142745 469719
57181D69719n89586m77862l61061k57347j78791j29746j04871q9818o6923k4663
57171a810949L4337R2792J27857J24851Q6596L2004j4656l6394l0600p760J5679
57160a386243K5238J2984k2088p5707j39756k03407k55451k87953k98874k91259
57150b922516k69539k36352j92635j40517q5772l7319l984Q777q0k8296p1647
57139c979880j23876j75886k16442k35416k28069j97210j51945j04050o3613l4613
57129e511000j1373K1167Q0982J78469L08969M53974N89791O97001P64833P90035
57119a637152P73835P20733O40027N47542M63761M07008L84846L89608M01530
57110C091738L97712L61648K88810J86887P1857l8011j28183j92220k32996k60152
$$ plain form
57181 469719 -119867 -597729 -958790 -1216137 -1394928 -1524674 -1629545 -1719363 -1786286 -1810949
57171 -1810949 -1776612 -1683820 -1555963 -1431112 -1344516 -1312512 -1327168 -1363562 -1394162 -1401922 -1386243
57160 -1386243 -1361005 -1348021 -1370109 -1445816 -1585572 -1788979 -2044430 -2332383 -2631257 -2922516
57150 -2922516 -3192055 -3428407 -3621042 -3761559 -3847331 -3884650 -3888634 -3879857 -3879937 -3908233 -3979880
57139 -3979880 -4103756 -4279642 -4496084 -4731500 -4959569 -5156779 -5308724 -5412774 -5476387 -5511000
57129 -5511000 -5522373 -5501206 -5420224 -5241755 -4932786 -4478812 -3889021 -3192020 -2427187 -1637152
57119 -1637152 -863317 -142584 497443 1044985 1508746 1915754 2300600 2690208 3091738
57110 3091738 3489450 3851098 4139908 4326795 4398652 4360641 4232458 4040238 3807242 3547090
57100C547090k85314l18028l64428m27483n06274n93828o75897p32934p45151
57091a102247o98883n92091m36354k53132o5572J08644K58277L74469M47941M71950
57081a486998M48627L92120L24525K66591K29248K11042K01984J90346J68268
57072I45753J34521R4601N8300L4906K7878L2154L5933K5747p785o5876j40796
57061A175336k19352k89357l45336l89676m28763m67222n04236n33959n49014
57052b551579n44101n16888m66189l90344k88354j63138k3821J15001K36566L26437
57042d266410L76800L88876L71489L36063K91267K40948J85978J27290O7306R333
57032a871060m3579q8919j24154j46554j54521j49874j39000j31123j34316j51857
$$ plain form
57100 3547090 3261776 2943748 2579320 2151837 1645563 1051735 375838 -357096 -1102247
57091 -1102247 -1801130 -2393221 -2829575 -3082707 -3148279 -3039635 -2781358 -2406889 -1958948 -1486998
57081 -1486998 -1038371 -646251 -321726 -55135 174113 385155 587139 777485 945753
57072 945753 1080274 1174875 1233175 1268081 1295959 1328113 1364046 1389793 1382008 1316132 1175336
57061 1175336 955984 666627 321291 -68385 -497148 -964370 -1468606 -2002565 -2551579
57052 -2551579 -3095680 -3612568 -4078757 -4469101 -4757455 -4920593 -4944414 -4829413 -4592847 -4266410
57042 -4266410 -3889610 -3500734 -3129245 -2793182 -2501915 -2260967 -2074989 -1947699 -1880393 -1871060
57032 -1871060 -1914639 -2003558 -2127712 -2274266 -2428787 -2578661 -2717661 -2848784 -2983100 -3134957
57022c134957j81268k16148k49103k73861k85778k81631k60113k23286j77305
57013e283450j30620r0325n9148l4711j0405K2791P3031J43031K27269L14143
57003d828394L91984M53771M97414N23542N34824N36937N37883N43675N53397
56994b54967N58587N48844N19791M77171M33713M01422L85242L81946L83440L81199
56984D216388L69654L47864L19179K88585K59009K29092J94228J50200R6858L9373
56974F510430j4034n6631q7232j11134j37424j74304k24826k84968l45225l95287
56964D679365m29056m46207m49121m38424m11894l67970l09949k45819j83016
56955A397909j22863o0324J0102Q7321J61579K19138K49947K52403K32072J96018
$$ plain form
57022 -3134957 -3316225 -3532373 -3781476 -4055337 -4341115 -4622746 -4882859 -5106145 -5283450
57013 -5283450 -5414070 -5504395 -5563543 -5598254 -5608659 -5585868 -5512837 -5369806 -5142537 -4828394
57003 -4828394 -4436410 -3982639 -3485225 -2961683 -2426859 -1889922 -1352039 -808364 -254967
56994 -254967 303620 852464 1372255 1849426 2283139 2684561 3069803 3451749 3835189 4216388
56984 4216388 4586042 4933906 5253085 5541670 5800679 6029771 6223999 6374199 6471057 6510430
56974 6510430 6496396 6439765 6352533 6241399 6103975 5929671 5704845 5419877 5074652 4679365
56964 4679365 4250309 3804102 3354981 2916557 2504663 2136693 1826744 1580925 1397909
56955 1397909 1275046 1214722 1224824 1312145 1473724 1692862 1942809 2195212 2427284 2623302
56945B623302J47719Q6880J4150o3658j32683j76602j83783j52842r3904k4999
56935B043580L4631P0739P6415N0375n971q9763j95802l15074m34114n36034o03512
56924I5470o23255n90209n09460l94779k64175j34081j4684R1496J87540K78286
56914a877851L66633M51064N25057N79009O04118N95790N54789M86457L99417
56905B684483L04060K10604J27667O2418K1061P265J8871M6750P8454J04449J22120
56894C788202J35064J49145J68209J91414K12857K23248K12521J72185R7189j1987
56884E338047j47372k93401m30174n39156o08428o34954o23496n83332n24375
56875I53359m54272l77649k97353k15736j34260n2338L1989J18556K01491K69374
$$ plain form
56945 2623302 2771021 2857901 2872051 2808393 2675710 2499108 2315325 2162483 2068579 2043580
56935 2043580 2078211 2148950 2225365 2275740 2269769 2180006 1984204 1669130 1235016 698982 95470
56924 95470 -527785 -1117994 -1627454 -2022233 -2286408 -2420489 -2435173 -2343677 -2156137 -1877851
56914 -1877851 -1511218 -1060154 -535097 43912 648030 1243820 1798609 2285066 2684483
56905 2684483 2988543 3199147 3326814 3389232 3410293 3417558 3436429 3483179 3561633 3666082 3788202
56894 3788202 3923266 4072411 4240620 4432034 4644891 4868139 5080660 5252845 5350034 5338047
56884 5338047 5190675 4897274 4467100 3927944 3319516 2684562 2061066 1477734 953359
56875 953359 499087 121438 -175915 -391651 -525911 -578249 -546260 -427704 -226213 43161
56865D3161L09979L16433K90599K41433J79670J12536M1945l3412j14795k01604
56855A185945k90873l76496m48327m93473n00852m66622l96492l03260k01521
56846b291971j03234j6492N3365J02718J30022J36481J25503J01454O9565L7281
56836a655308J5040J4657M5693J11706K08132L22759M38981N40588O15781O58618
56826A316647O68093O46125N95992N22197M31627L34148K40316J56504Q1175N987
56816D998811p8392j75596k80048l78309m54551m97125n02575m75210m23900l59195
56806A373910k91894k31593j84172j49446j21140q9894m8064N940O6121J21500
56796D51268J62083J85171J98315K16757K56082L23875M15111N13760N98835O50977
$$ plain form
56865 43161 353140 669573 960172 1201605 1381275 1493811 1535756 1502344 1387549 1185945
56855 1185945 895072 518576 70249 -423224 -924076 -1390698 -1787190 -2090450 -2291971
56846 -2291971 -2395205 -2411697 -2358332 -2255614 -2125592 -1989111 -1863608 -1762154 -1692589 -1655308
56836 -1655308 -1640268 -1625611 -1579918 -1468212 -1260080 -937321 -498340 42248 658029 1316647
56826 1316647 1984740 2630865 3226857 3749054 4180681 4514829 4755145 4911649 4992824 4998811
56816 4998811 4920419 4744823 4464775 4086466 3631915 3134790 2632215 2157005 1733105 1373910
56806 1373910 1082016 850423 666251 516805 395665 305771 257707 263647 329768 451268
56796 451268 613351 798522 996837 1213594 1469676 1793551 2208662 2722422 3321257 3972234
56786C972234O57126O13171N24921M06482K75753J48848L6507n6095j27134j75545
56776F276268j99425j95831j61911r7086n467J02841K13004L09175L78881M15952
56766G036401M21323M01855L67123L24496K74963K13174J32551L2129p9372j84264
56756H940379k60729k90012k63464j86058p4090N1554J72355K76027L56977M14528
56746I137467M50107M64347M55623M21080L59612K75023J77276Q0728k06n5933
56736A1765124q4543r1711q8708q9833j09403j57833k37672l41795m55607n62560
56726I545459o50028p12233p49186p63514p58096p35777o99950o54388o02223
56717C220064n45282m84276m18858l46675k62421j59061l2370J13666K64767M00200
$$ plain form
56786 3972234 4629360 5242531 5767452 6173934 6449687 6598535 6635042 6578947 6451813 6276268
56776 6276268 6076843 5881012 5719101 5622015 5616548 5719389 5932393 6241568 6620449 7036401
56766 7036401 7457724 7859579 8226702 8551198 8826161 9039335 9171886 9204015 9124643 8940379
56756 8940379 8679650 8389638 8126174 7940116 7866026 7917580 8089935 8365962 8722939 9137467
56746 9137467 9587574 10051921 10507544 10928624 11288236 11563259 11740535 11821263 11821057 11765124
56736 11765124 11680581 11588870 11500162 11410329 11300926 11143093 10905421 10563626 10108019 9545459
56726 9545459 8895431 8183198 7434012 6670498 5912402 5176625 4476675 3822287 3220064
56717 3220064 2674782 2190506 1771648 1424973 1162552 1003491 971121 1084787 1349554 1749754
56707A749754N00453N54010N59969N26641M68120M00286L36975K87310K54816
56698E638334K37812K30068K21552J99994J53672P4976l5985j69092l05386m22810
56688E823135n04192n42542n40692n07257m53035l89526l27866k76712k39906
56679B041407k15740j98243j79432j51628j09503n1920J6782Q6676J44254J76831
56669A559484J77910J50241J04088N1621J549m2582q0597j13027j39384j57004
56659A512299j60021j39637q7367o53J12317K31819L30769L82376L68521K85966
56649B836389J48070j8482j80579l07004l76194l81517l32068k48339j54676p2107
56639I13493j4100J4341J4976o917m5873r7870j59689k27358k95455l57594m07140
$$ plain form
56707 1749754 2250207 2804217 3364186 3890827 4358947 4759233 5096208 5383518 5638334
56698 5638334 5876146 6106214 6327766 6527760 6681432 6756408 6720423 6551331 6245945 5823135
56688 5823135 5318943 4776401 4235709 3728452 3275417 2885891 2558025 2281313 2041407
56679 2041407 1825667 1627424 1447992 1296364 1186861 1134941 1151723 1238399 1382653 1559484
56669 1559484 1737394 1887635 1991723 2043344 2044893 2002311 1921714 1808687 1669303 1512299
56659 1512299 1352278 1212641 1125274 1124621 1236938 1468757 1799526 2181902 2550423 2836389
56649 2836389 2984459 2965977 2785398 2478394 2102200 1720683 1388615 1140276 985600 913493
56639 913493 899393 913734 928710 921793 875920 778050 618361 391003 95548 -262046 -669186
56628f69186m37622m43549m22162l75331l09817k34725j57229p9303K490R4199
56618c032235K00266L19107M39696N41699O01761O04347N50163M55233L41025
56609A021062K23390J07887p211j24775k44425l61802m70183n61990o28926o62046
56599a709019o54326o05673n26608m36316l55062k95674k59259k36656k13518
56590e292111j75967j14777k7532Q1316K02550L25833M43044N48924O38539P04386
56580b665795P36571P26575O71507N75741M49517L06221J59734K2350r6226j88604
56570F97591k49172k75050k68604k39220k01323j68386j46269j30841j12241q3150
56560a176665m4881o925J8650K2697R10m6466j14181j90707k59054l01449l05949
$$ plain form
56628 -669186 -1106808 -1550357 -1972519 -2347850 -2657667 -2892392 -3049621 -3128924 -3126434 -3032235
56618 -3032235 -2831969 -2512862 -2073166 -1531467 -929706 -325359 224804 680037 1021062
56609 1021062 1244452 1352339 1345128 1220353 975928 614126 143943 -418047 -1046973 -1709019
56599 -1709019 -2363345 -2969018 -3495626 -3931942 -4287004 -4582678 -4841937 -5078593 -5292111
56590 -5292111 -5468078 -5582855 -5610387 -5529071 -5326521 -5000688 -4557644 -4008720 -3370181 -2665795
56580 -2665795 -1929224 -1202649 -531142 44599 494116 800337 960071 982421 886195 697591
56570 697591 448419 173369 -95235 -334455 -535778 -704164 -850433 -981274 -1093515 -1176665
56560 -1176665 -1221546 -1228471 -1209821 -1187124 -1186214 -1232680 -1346861 -1537568 -1796622 -2098071 -2404020
56549b404020k71290k07483j32171o4495j8759k12m343j9612l2474l2964j8717
56538c206540M529K6453L7737L4424J8804k712k2580l4148l2687j6411J2431M7827
56526c132873Q2863J13936J42926J75226K15082K61909L09788L49644L72146L70108
56516g39245L40256K84508K10594J31200O1053J2811o215M971M1704R4638J51290
56505E87565J99008K28475K35236K18743J81356J29072P2098K2274j1956k9190
56495A832681l4945l8852n1006p7722j17260j58264j83521j77729j34534n9088
56485G99760L3849J24004J90469K17051J97050J35268M5796n3161j44552k15718
56475A329816k59654k75149k66095k39880k05335j70879j42765j22810j06576
$$ plain form
56549 -2404020 -2675310 -2882793 -3014964 -3079459 -3098218 -3098430 -3102773 -3122385 -3154859 -3187823 -3206540
56538 -3206540 -3202011 -3175558 -3137821 -3103397 -3084593 -3087305 -3109885 -3144033 -3176720 -3193131 -3180700 -3132873
56526 -3132873 -3050010 -2936074 -2793148 -2617922 -2402840 -2140931 -1831143 -1481499 -1109353 -739245
56516 -739245 -398989 -114481 96113 227313 288366 301177 294962 299933 341637 436275 587565
56505 587565 786573 1015048 1250284 1469027 1650383 1779455 1851553 1873827 1861871 1832681
56495 1832681 1797736 1758884 1707878 1630156 1512896 1354632 1171111 993382 858848 799760
56485 799760 833609 957613 1148082 1365133 1562183 1697451 1743247 1690086 1545534 1329816
56475 1329816 1070162 795013 528918 289038 83703 -87176 -229941 -352751 -459327
56466d59327q4146m4672J7572R9690J91303K78653L48640L91342M01646L80632
56456A521333L35740K78352K19239J64191J12340N8010m886p7999j55741k26370
56446B224209k76535k96354k81938k34766j59842o4335M3151J53276K56494L43240
56436A706600M04538M34031M30975M01715L57706L10502K66989K28176J92216
56427D733448J58810J31040J13121J06226J06242J05484R7141P8962N3509K5394
56417E709377j295k2705l3223k5880L080M8771R7063J30529J36981J14826P2769
56406F230293K5414j2216k9264k1725P255M9705R6718J41864J82248K17003K44581
56395G131876K60413K55855K19103J38836J0312j58630l45538n17629o41022o90874
$$ plain form
56466 -459327 -543473 -588145 -570573 -470883 -279580 -927 347713 739055 1140701 1521333
56456 1521333 1857073 2135425 2354664 2518855 2631195 2689205 2684319 2606320 2450579 2224209
56446 2224209 1947674 1651320 1369382 1134616 974774 910439 953590 1106866 1363360 1706600
56436 1706600 2111138 2545169 2976144 3377859 3735565 4046067 4313056 4541232 4733448
56427 4733448 4892258 5023298 5136419 5242645 5348887 5454371 5551512 5630474 5683983 5709377
56417 5709377 5708082 5685377 5652154 5626274 5629354 5678125 5775188 5905717 6042698 6157524 6230293
56406 6230293 6255707 6243491 6214227 6192502 6199757 6249462 6346180 6488044 6670292 6887295 7131876
56395 7131876 7392289 7648144 7867247 8006083 8016395 7857765 7512227 6994598 6353576 5662702
56385E662702o58147n51239l92978k14725m9242P6176J44466J50309R8937M108
56375D270367j14088k32842l32545m02602m43270m62068m67581m64797m53946
56366H96628m32389l97877l51137k95870k35938j72270j02858k6902M9886J13687
56356i55040J47370J39730R2960K2839m8925j04858j37889j51039j52895j52494
56346a300241j55572j62499j67852j61816j33393p4766J4621J26219K44365L51730
56336a419204M35653M91876N23792N37912N38295N23226M86018M19396L20743
56327B857707J94897N3148r0451k22816l33837m16538m66477m81234m60419m06278
56317B27702l24420k23776j14948p848Q9740J71785K33318K71266K86520K84728
$$ plain form
56385 5662702 5004555 4453316 4060338 3845613 3796371 3872547 4017013 4167322 4266259 4270367
56375 4270367 4156279 3923437 3590892 3188290 2745020 2282952 1815371 1350574 896628
56366 896628 464239 66362 -284775 -580645 -816583 -988853 -1091711 -1118613 -1068727 -955040
56356 -955040 -807670 -667940 -574980 -552141 -601066 -705924 -843813 -994852 -1147747 -1300241
56346 -1300241 -1455813 -1618312 -1786164 -1947980 -2081373 -2156139 -2141518 -2015299 -1770934 -1419204
56336 -1419204 -983551 -491675 32117 570029 1108324 1631550 2117568 2536964 2857707
56327 2857707 3052604 3105752 3015301 2792485 2458648 2042110 1575633 1094399 633980 227702
56317 227702 -96718 -320494 -435442 -443290 -353550 -181765 51553 322819 609339 894067
56307H94067K74154K61942K51774K44285K38985K35646K34644K36660K41861K48235
56297C362253K49896K37391K00998J35307M2196o9139j84054k85081l55149l81466
56287B953152l59021k92259j94380q4497J7021R4119J39292J54223J46738J26365
56277B700753J00919P4592M7154J4673k7634q1326j42164k01057k47766k74520
56267A963624k77588k57196k17364j65954j13717p1239m5161l6452m2183n8836
56257F77934q3741j13484j41886j61027j65335j54978j34779j09240p8066l6523
56247e01125J9326Q6986J56807K17304K61865K90860L08008L15822L14617L03913
56237A774383K82268K45576J88028J07526J1055q5414j62588k04947k05929j70135
$$ plain form
56307 894067 1168221 1430163 1681937 1926222 2165207 2400853 2635497 2872157 3114018 3362253
56297 3362253 3612149 3849540 4050538 4185845 4228041 4158902 3974848 3689767 3334618 2953152
56287 2953152 2594131 2301872 2107492 2022995 2040016 2134135 2273427 2427650 2574388 2700753
56277 2700753 2801672 2876264 2923418 2938091 2910457 2829131 2686967 2485910 2238144 1963624
56267 1963624 1686036 1428840 1211476 1045522 931805 860566 815405 778953 736770 677934
56257 677934 594193 480709 338823 177796 12461 -142517 -277296 -386536 -464602 -501125
56247 -501125 -481799 -394813 -238006 -20702 241163 532023 840031 1155853 1470470 1774383
56237 1774383 2056651 2302227 2490255 2597781 2608836 2523422 2360834 2155887 1949958 1779823
56227A779823j11346m5806J5755P1093J21939J66762J97818K04473J79016J20377
56217B699904L4560o6890j69227k57528l20484l53604l59651l45679l18651k82886
56207B59864k40305j91792j37971p9479j7619M5168J05822J61826K11379K52170
56197C69063K80244K90769K80497K49925K03005J44503P7514L736p3665j47730
56187A677861k08939k49516k67465k67040k55082k35636k06564j60627r0154Q074
56177b55088J30803K69204M10889N41872O48621P20118P49343P33774O75449N80752
56167E205737M59420L22448J79767L8946r4842k18232l28910m24831n03628n62731
56157D073144o00156o15130o08016n80253n35395m80799m27544l87027l65666
$$ plain form
56227 1779823 1668477 1622671 1638426 1709519 1831458 1998220 2196038 2400511 2579527 2699904
56217 2699904 2734464 2667574 2498347 2240819 1920335 1566731 1207080 861401 542750 259864
56207 259864 19559 -172233 -310204 -389683 -407302 -362134 -256312 -94486 116893 369063
56197 369063 649307 940076 1220573 1470498 1673503 1818006 1895520 1899256 1825591 1677861
56187 1677861 1468922 1219406 951941 684901 429819 194183 -12381 -173008 -263162 -255088
56177 -255088 -124285 144919 555808 1097680 1746301 2466419 3215762 3949536 4624985 5205737
56167 5205737 5665157 5987605 6167372 6206318 6111476 5893244 5564334 5139503 4635875 4073144
56157 4073144 3472988 2857858 2249842 1669589 1134194 653395 225851 -161176 -526842
56148e26842l61515l64960l62416l40519k89932k09054j06616m79Q8861J47392
56138b326080J73687J78075J75973J80449J98210K29497K69616L10674L44043
56129b65856L64032L71309L73549L82147M06226M47010M95913N38066N59336N52451
56119D224183N18625M64909M00142L31841K64586J99825J37133P6210J8210l4573
56109F601091q0079j17774j48971j76004k00598k22435k39173k48134k48657k43533
56099D675733k38582k40592k54752k83154l24886l76498m31389m78700n04201
56090A542979m94690m44013l56892k48012j36884m1007K9727P5508J05217J31870
56080A63803J66726K14884K74381L38661L99892M50832M85482N00220M95547M76299
$$ plain form
56148 -526842 -888357 -1253317 -1615733 -1956252 -2246184 -2455238 -2561854 -2562333 -2473472 -2326080
56138 -2326080 -2152393 -1974318 -1798345 -1617896 -1419686 -1190189 -920573 -609899 -265856
56129 -265856 98176 469485 843034 1225181 1631407 2078417 2574330 3112396 3671732 4224183
56119 4224183 4742808 5207717 5607859 5939700 6204286 6404111 6541244 6617454 6635664 6601091
56109 6601091 6521012 6403238 6254267 6078263 5877665 5655230 5416057 5167923 4919266 4675733
56099 4675733 4437151 4196559 3941807 3658653 3333767 2957269 2525880 2047180 1542979
56090 1542979 1048289 604276 247384 -628 -137512 -178519 -148792 -73284 31933 163803
56080 163803 330529 545413 819794 1158455 1558347 2009179 2494661 2994881 3490428 3966727
56070C966727M48979M18019L84439L48227L12246K83889K72472K83743L15581
56061G034322L58238L98833M26601M35766M25806M00865L68875L39495L20365
56052A0509166L13298L13078L10173K95881K66570K24655J76542J29619Q9845
56043A2628827O0254M0455K7714J9264J4019J2067J2492J1702L387k0316o7223
56032A2742642j42978k48321l76686n13887o40899p38898p94251q01491p63774
56023G721457o91509n99558n03278m14507l39317k78365k28827j86637j48580
56014D330879j13784q3487n8990l9841k4385j1753k385L775R223J8605L6436O4525
56002D128818J00111J35051J56965J53232J16857N0966l1640j14613j86357k44560
$$ plain form
56070 3966727 4415706 4833725 5218164 5566391 5878637 6162526 6434998 6718741 7034322
56061 7034322 7392560 7791393 8217994 8653760 9079566 9480431 9849306 10188801 10509166
56052 10509166 10822464 11135542 11445715 11741596 12008166 12232821 12409363 12538982 12628827
56043 12628827 12689081 12729536 12757250 12776514 12790533 12802600 12815092 12826794 12830181 12809865 12742642
56032 12742642 12599664 12351343 11974657 11460770 10819871 10080973 9286722 8485231 7721457
56023 7721457 7029948 6430390 5927112 5512605 5173288 4894923 4666096 4479459 4330879
56014 4330879 4217095 4133608 4074618 4034777 4010392 3998639 3996254 4000029 4009252 4027857 4064293 4128818
56002 4128818 4228929 4363980 4520945 4674177 4791034 4842000 4810360 4695747 4509390 4264830
55992D264830k93463l36212l68908l81289l63293l12167k35242j46962o2558P775
55982A772511O1307J01346J33933J65305K01284K47657L09158L86139M70967N47947
55972D397554N98624O09808N79305N16265M36850L57996K92156K44684K14206
55963H247448J94618J77101J51914J10712M9168l1725j26394k26396l21850m02767
55953G821829m60789m90766m91601m66580m23250l71842l21837k78717k43545
55944D272902k15428j94303j81887j80623j91298k10308k28650k34756k20392
55935B415257j85429j37577q7471m2954o135K5851N7505R1008J23505J47054J51316
55924B551930J27812P3946n080r7424j88461k65642l22170l57889l77140l84771
$$ plain form
55992 4264830 3971367 3635155 3266247 2884958 2521665 2209498 1974256 1827294 1764736 1772511
55982 1772511 1833818 1935164 2069097 2234402 2435686 2683343 2992501 3378640 3849607 4397554
55972 4397554 4996178 5605986 6185291 6701556 7138406 7496402 7788558 8033242 8247448
55963 8247448 8442066 8619167 8771081 8881793 8930961 8899236 8772842 8546446 8224596 7821829
55953 7821829 7361040 6870274 6378673 5912093 5488843 5117001 4795164 4516447 4272902
55944 4272902 4057474 3863171 3681284 3500661 3309363 3099055 2870405 2635649 2415257
55935 2415257 2229828 2092251 2004780 1961826 1955691 1981542 2039047 2130055 2253560 2400614 2551930
55924 2551930 2679742 2753688 2748608 2651184 2462723 2197081 1874911 1517022 1139882 755111
55914G55111l82697l69031l39885k92252k26147j45489n7829K7066R9713J53810
55904g77630J88475K08824K24208K43948K72249L05751L36302L57194L67788L72810
55894B099919L77567L83595L87858L85127L71648L48236L21429L01208K95401
55885E271988L03989L17850L23519L10406K74961K19725J50159P3107k870o8304
55875G174530j16290j45952j62168j71300j76875j78549j73697j58640j28561
55866E762498p8078l934R1743K00339L08587M01699M66317M93018M78403M25720
55856H546312L43200K40773J27009P963j11702k26090l26016m00103m39723m44637
55846G316986m24279l92825l61945l36976l18318l04594k93849k82930k67692
$$ plain form
55914 755111 372414 3383 -336502 -628754 -854901 -1000390 -1058219 -1031153 -931440 -777630
55904 -777630 -589155 -380331 -156123 87825 360074 665825 1002127 1359321 1727109 2099919
55894 2099919 2477486 2861081 3248939 3634066 4005714 4353950 4675379 4976587 5271988
55885 5271988 5575977 5893827 6217346 6527752 6802713 7022438 7172597 7245704 7242834 7174530
55875 7174530 7058240 6912288 6750120 6578820 6401945 6223396 6049699 5891059 5762498
55866 5762498 5684420 5680486 5772229 5972568 6281155 6682854 7149171 7642189 8120592 8546312
55856 8546312 8889512 9130285 9257294 9265257 9153555 8927465 8601449 8201346 7761623 7316986
55846 7316986 6892707 6499882 6137937 5800961 5482643 5178049 4884200 4601270 4333578
55837D333578k45201k16030j84326j55111j30317j05978p2728k0343N5896J51002
55827C410442K51101L38460L97248M17285L95455L35965K50079J54843P0059J3906
55817F034843j508K6696R0900J74038K53647L08882L27931L11848K72505K26446
55807H026228J88490J67592J65073J74791J85326J84177J62693J19697O1791j73
55797I435685n6750j04045j43666j79547k15353k54671l02192l63188m41212n36593
55787F838468o46911p67736q91384j004383j086948j117185j079084r69837q01714
55778a526714n97072l79593j67107L0563K09065L65578M96358N96725O62506O91583
55768C81892O84748O45610N79681M93022L91216K79368J63107M9814n0923j28543
$$ plain form
55837 4333578 4088377 3872347 3688021 3532910 3402593 3296615 3223887 3203544 3259440 3410442
55827 3410442 3661543 4000003 4397251 4814536 5209991 5545956 5796035 5950878 6020937 6034843
55817 6034843 6033335 6060031 6150931 6324969 6578616 6887498 7215429 7527277 7799782 8026228
55807 8026228 8214718 8382310 8547383 8722174 8907500 9091677 9254370 9374067 9435858 9435685
55797 9435685 9378935 9274890 9131224 8951677 8736324 8481653 8179461 7816273 7375061 6838468
55787 6838468 6191557 5423821 4532437 3528054 2441106 1323921 244837 -725000 -1526714
55778 -1526714 -2123786 -2503379 -2670486 -2639923 -2430858 -2065280 -1568922 -972197 -309691 381892
55768 381892 1066640 1712250 2291931 2784953 3176169 3455537 3618644 3668458 3617535 3488992
55758C488992j74679j87314j73092j44864j14714q7139n7800j8693L4977J01747
55748B667421J75859K51011L22194L84849M33376M61369M64244M42748M04413
55739F007484L60876L21625K87824K50519J94951J08741j0558j52272k94734m11730
55729F662726m81155m92934m52385l76457k84642j90686j00589j6444N9261J23391
55719D450086J75042K17590K57605L01738L53817M13396M76061N35415N85888
55710G766638O24867O52883O71915O82810O83183O67394O29289N66298M81717
55701A3426994L83246K79178J75690P7008j2689q7948j42465j71026j71910j48527
55691A3607551j09133o4455k4359M674K0085K2277J3506k609k1789m1057o0917
$$ plain form
55758 3488992 3314313 3126999 2953907 2809043 2694329 2607190 2549390 2530697 2565674 2667421
55748 2667421 2843280 3094291 3416485 3801334 4234710 4696079 5160323 5603071 6007484
55739 6007484 6368360 6689985 6977809 7228328 7423279 7532020 7521462 7369190 7074456 6662726
55729 6662726 6181571 5688637 5236252 4859795 4575153 4384467 4283878 4267434 4326695 4450086
55719 4450086 4625128 4842718 5100323 5402061 5755878 6169274 6645335 7180750 7766638
55710 7766638 8391505 9044388 9716303 10399113 11082296 11749690 12378979 12945277 13426994
55701 13426994 13810240 14089418 14265108 14342116 14329427 14241479 14099014 13927988 13756078 13607551
55691 13607551 13498418 13433963 13409604 13414278 13434363 13456640 13470146 13467537 13445748 13404691 13343774
55680A3343774q4997j16096j51820j84290k04457k07085j92587j65732j33547
55671A1903163j03444q1034o7921o0983n3968m0163j4249K7251Q6003J61257K48691
55660A2004603L39917M23588M87773N22205N19719M77252L96756K85485J55149
55651A5612447K0325j03321k01279k63268k86129k74700k39964j95325j52362
55642A3916424j17209q9217o3157l4049j164L1844O0327Q2580J01545J23611J55490
55631A4167025K00492K55716L11557L54439L72394L61002L26135K81314K41111
55622A6871185K15067K05648K09875K21567K32209K31662K10736J65494J00205
55613A8663648K6325m1991r2843j19500j21309j03462p5424m7412k6181j3039
$$ plain form
55680 13343774 13258777 13142681 12990861 12806571 12602114 12395029 12202442 12036710 11903163
55671 11903163 11799719 11718685 11650764 11589781 11535813 11495650 11481401 11508652 11594655 11755912 12004603
55660 12004603 12344520 12768108 13255881 13778086 14297805 14775057 15171813 15457298 15612447
55651 15612447 15632772 15529451 15328172 15064904 14778775 14504075 14264111 14068786 13916424
55642 13916424 13799215 13709998 13646841 13612792 13611628 13643472 13703799 13786379 13887924 14011535 14167025
55631 14167025 14367517 14623233 14934790 15289229 15661623 16022625 16348760 16630074 16871185
55622 16871185 17086252 17291900 17501775 17723342 17955551 18187213 18397949 18563443 18663648
55613 18663648 18689973 18647982 18555139 18435639 18314330 18210868 18135444 18088032 18061851 18048812
55603A8048812n739k379l794j2628l0377n5019q1093j02169j14266j18224j19724
55592A7403400j26973j47258j83918k34908k93321l49347l92813m15471m12286
55583A4847105l81151l21433k33026j17369K0392J70256L18257M48131N42907
55574A5294069N87349N72260M98991L81008K40864J03784r537q8037j30853j43275
55564A7306623j31506j00640n6590q354L2831N6963N8723L9414P321k3939m0009
55553A7140837l2255k478L7560P2124Q9482Q7166P1601N3229M0934L9102M7677
55542A7644979O3784Q3474J03086J19692J30396J31521J19052R0370M5442j3600
55532A8518196q3358j58884k32561k94305l34295l46807l32504k97786k52023
$$ plain form
55603 18048812 18043073 18040694 18036900 18024272 17993895 17938876 17857783 17755614 17641348 17523124 17403400
55592 17403400 17276427 17129169 16945251 16710343 16417022 16067675 15674862 15259391 14847105
55583 14847105 14465954 14144521 13911495 13794126 13814518 13984774 14303031 14751162 15294069
55574 15294069 15881418 16453678 16952669 17333677 17574541 17678325 17668788 17580751 17449898 17306623
55564 17306623 17175117 17074477 17017887 17009533 17042364 17099327 17158050 17197464 17204785 17180846 17140837
55553 17140837 17108582 17106104 17143664 17215788 17305270 17392436 17464037 17517266 17558200 17597302 17644979
55542 17644979 17708763 17792237 17895323 18015015 18145411 18276932 18395984 18486354 18531796 18518196
55532 18518196 18434838 18275954 18043393 17749088 17414793 17067986 16735482 16437696 16185673
55523A6185673k04541j62298j28121r9358o7913k3016M3430J31435K30636L22796
55513A6228723L88108M12687L94204L43362K80467K28526K05630K19214K63659
55504A8964580L21949L71575L93160L78230L31994K69797K09763J65644J42806
55495B1549498J38122J43311J50169J54826J58208J62653J68022J71021J67958
55486B2963788J57636J41396J20884R6451O7972L7008Q098j1605j3481J1640P2568
55475B3652355J75772L21635N00211O89401Q58438R76494J022211R88828Q82947
55466C0068292P19892N19938L06636J05022o2262j79884k42660k54598k25356
55457C0755020j66857r1975j4871M9124Q6060Q8264N9030J3487k6210l9619j5962
$$ plain form
55523 16185673 15981132 15818834 15690713 15591355 15523442 15500426 15543856 15675291 15905927 16228723
55513 16228723 16616831 17029518 17423722 17767084 18047551 18276077 18481707 18700921 18964580
55504 18964580 19286529 19658104 20051264 20429494 20761488 21031285 21241048 21406692 21549498
55495 21549498 21687620 21830931 21981100 22135926 22294134 22456787 22624809 22795830 22963788
55486 22963788 23121424 23262820 23383704 23480155 23548127 23585135 23593233 23581628 23568147 23579787 23652355
55475 23652355 23828127 24149762 24649973 25339374 26197812 27174306 28196517 29185345 30068292
55466 30068292 30788184 31308122 31614758 31719780 31657518 31477634 31234974 30980376 30755020
55457 30755020 30588163 30496188 30481317 30530441 30616501 30704765 30763795 30777282 30751072 30711453 30695491
55446C0695491M2878J25110K14495K95060L53653L81242L74246L36168K78643
55437C3096986K20346J82567J82404K26914L11550M22833N42582O51730P34406
55428C6572318P82566P98835P94739P85104P82669P95704Q27805Q77765R39472
55419D3956977J003250J058961J099301J121604J127886J123961J118264J120410
55411E2730614J139373J181591J249677J342282J454799J580385J711165J839901
55403F4229787J961998K076558K185272K289588K388129K476336K548416K599903
55395H2755987K629047K636585K624847K597400K559491K518511K483788K465854
55387A03271510K475733K524407K621519K772629K975751L219595L485611L753395
$$ plain form
55446 30695491 30738369 30863479 31077974 31373034 31726687 32107929 32482175 32818343 33096986
55437 33096986 33317332 33499899 33682303 33909217 34220767 34643600 35186182 35837912 36572318
55428 36572318 37354884 38153719 38948458 39733562 40516231 41311935 42139740 43017505 43956977
55419 43956977 44960227 46019188 47118489 48240093 49367979 50491940 51610204 52730614
55411 52730614 53869987 55051578 56301255 57643537 59098336 60678721 62389886 64229787
55403 64229787 66191785 68268343 70453615 72743203 75131332 77607668 80156084 82755987
55395 82755987 85385034 88021619 90646466 93243866 95803357 98321868 100805656 103271510
55387 103271510 105747243 108271650 110893169 113665798 116641549 119861144 123346755 127100150
55379A27100150M006582M235991M438954M616098M768151M894725M995703N074027
55371A64130381N137543N198139N268466N358343N472839N612014N771033N939963
55363B07888721O104597O249690O363716O441624O483277O489185O457460O383609
55355B58861879O261265O082017N835358N510778N101302M605976M030104L384102
55347B99672781K681607J936664J160882L63023m48372j261984k063253k836450
55339B99204898l567009m243000m855863n400438n873922o274538o601320o855145
55331B55533663p039761p162071p231810p260293p257449p227982p169298p073227
55323A98111772o930894o738327o500570o232119n952689n680248n426114n195375
$$ plain form
55379 127100150 131106732 135342723 139781677 144397775 149165926 154060651 159056354 164130381
55371 164130381 169267924 174466063 179734529 185092872 190565711 196177725 201948758 207888721
55363 207888721 213993318 220243008 226606724 233048348 239531625 246020810 252478270 258861879
55355 258861879 265123144 271205161 277040519 282551297 287652599 292258575 296288679 299672781
55347 299672781 302354388 304291052 305451934 305814957 305366585 304104601 302041348 299204898
55339 299204898 295637889 291394889 286539026 281138588 275264666 268990128 262388808 255533663
55331 255533663 248493902 241331831 234100021 226839728 219582279 212354297 205184999 198111772
55323 198111772 191180878 184442551 177941981 171709862 165757173 160076925 154650811 149455436
55315A49455436m990359m812230m659329m525952m404641m289961m179049m067901
55307A13526014l947835l806935l636221l435339l213079k983163k759802k556178
55299H7187462k384534k254488k169182k122572k100950k087977k069609k036280
55291F9961870j982384j904906j803089j679838j543821j409815j295667j216796
55283E7125554j181426j188971j231507j296778j371194j442297j500442j539477
55275D6373462j556238j549015j516017j455694j369734j266739j162841j077575
55267C5419609j027418j020762j055529j118530j186803j232992j234720j183318
55259B6359537j086121r61251q29599p09186o12923n47169n09667m88879m67439
$$ plain form
55315 149455436 144465077 139652847 134993518 130467566 126062925 121772964 117593915 113526014
55307 113526014 109578179 105771244 102135023 98699684 95486605 92503442 89743640 87187462
55299 87187462 84802928 82548440 80379258 78256686 76155736 74067759 71998150 69961870
55291 69961870 67979486 66074580 64271491 62591653 61047832 59638017 58342350 57125554
55283 57125554 55944128 54755157 53523650 52226872 50855678 49413381 47912939 46373462
55275 46373462 44817224 43268209 41752192 40296498 38926764 37660025 36497184 35419609
55267 35419609 34392191 33371429 32315900 31197370 30010567 28777575 27542855 26359537
55259 26359537 25273416 24312165 23482566 22773380 22160457 21613288 21103621 20614742 20147303
55250B0147303m29184l65798k79497j81610q8964j9222J5172J3066j3170m2682
55240A8755414n7043n0406l1883j8449k3739n0718r2460j38092j77585k02447
55230A7912592k05231j81949j36610q2658l7889j5943k1007m9227r4019j49466
55220A6938593k09186k63507k99719l06818k81010k27225j55616p6489K702P7501
55210A5199226J45613K06579K61694L12844L59929L98309M18873M11868L72442
55201A8087377L03681K14916J17326K0784o6365j36409j82492k00223j89399j54918
55191A7814278j06717n8698k6490k4087n9850j32762k30789l33382m18195m68651
55181A5954657m77848m47193l82492k91486j84307p4887J9583Q2774J05612R1207
$$ plain form
55250 20147303 19718119 19352321 19072824 18891214 18802250 18783028 18798200 18811266 18798096 18755414
55240 18755414 18698371 18647965 18616082 18597633 18573894 18523176 18430716 18292624 18115039 17912592
55230 17912592 17707361 17525412 17388802 17306144 17268255 17252312 17231305 17182078 17088059 16938593
55220 16938593 16729407 16465900 16166181 15859363 15578353 15351128 15195512 15119023 15121725 15199226
55210 15199226 15344839 15551418 15813112 16125956 16485885 16884194 17303067 17714935 18087377
55201 18087377 18391058 18605974 18723300 18744084 18677719 18541310 18358818 18158595 17969196 17814278
55191 17814278 17707561 17648863 17622373 17598286 17538436 17405674 17174885 16841503 16423308 15954657
55181 15954657 15476809 15029616 14647124 14355638 14171331 14096444 14116027 14198801 14304413 14395620
55171A4395620N4461J5706q034r215Q692L3168M6551L1746k0824j07874k13453
55160A4226544l15781l97207m51105m81587m96963n02457m97476m78247m41995
55151A0163726l88923l21814k45516j67153r5623l9304l339J1300O530j4667m8894
55140H856323r1783j37219j77480k04586k12494j99067j66901j22382p3310k6081
55130G445020J6079N2573Q3014J04997J14609J09859R4257P6966O8311P3284Q7524
55119H326493R8866R3845O5347J6745l9690q8626j18023j23036j06917p9724n5082
55108G990198m5057n4591p8766j05074j19657j13776q7172m7235m809L1377N8971
55097G424409Q2269J07998J39620J74817K08196K36309K59790K80507K97077L03841
$$ plain form
55171 14395620 14450081 14465787 14457753 14448538 14457230 14490398 14536949 14568695 14547871 14439997 14226544
55160 14226544 13910763 13513556 13062451 12580864 12083901 11581444 11083968 10605721 10163726
55151 10163726 9774803 9452989 9207473 9040320 8944697 8905393 8902054 8913354 8919884 8905217 8856323
55140 8856323 8764540 8627321 8449841 8245255 8032761 7833694 7666793 7544411 7471101 7445020
55130 7445020 7461099 7513672 7596686 7701683 7816292 7926151 8020408 8097374 8165685 8238969 8326493
55119 8326493 8425359 8519204 8584551 8601296 8561606 8472980 8354957 8231921 8125004 8045280 7990198
55108 7990198 7945141 7890550 7811784 7706710 7587053 7473277 7386105 7338870 7334061 7365438 7424409
55097 7424409 7506678 7614676 7754296 7929113 8137309 8373618 8633408 8913915 9210992 9514833
55087I514833K94717K68473K31006J93740J70264J73194K11177K85573L88012
55078A1730989N01036O02791O73827P02387O85710O27567N34659M14532K75715
55069A6749213J28729j3918j39301k36057k95245l10419k78641k02852r2882L7913
55059A5346540J78833L24983M73477O15323P29364P82476P36837N63729K60770
55050B0012332j36233n57945r24828j176865j291593j282020j180915j024211
55042A2437722q41827o56332m85406l43493k40291j77422j47280j36817j34464
55033I274390j35286j40761j54027j74627j96793k12157k14497k02629j79652
55024G663961j50102j17952q6488n8452l5022j4608O424L0833N7922Q3747J03852
$$ plain form
55087 9514833 9809550 10078023 10309029 10502769 10673033 10846227 11057404 11342977 11730989
55078 11730989 12232025 12834816 13508643 14211030 14896740 15524307 16058966 16473498 16749213
55069 16749213 16877942 16864024 16724723 16488666 16193421 15883002 15604361 15401509 15308627 15346540
55059 15346540 15525373 15850356 16323833 16939156 17668520 18450996 19187833 19751562 20012332
55050 20012332 19876099 19318154 18393326 17216461 15924868 14642848 13461933 12437722
55042 12437722 11595895 10939563 10454157 10110664 9870373 9692951 9545671 9408854 9274390
55033 9274390 9139104 8998343 8844316 8669689 8472896 8260739 8046242 7843613 7663961
55024 7663961 7513859 7395907 7309419 7250967 7215945 7201337 7207761 7238594 7296516 7380263 7484115
55013G484115J15947J20665J20837J20624J24837J37352J58371J82246J98393
55004H763387J95897J69122J20375N7824r184p3938j33659j88966k42436k95995
54994H362427l47427l88236m05600l88290l33262k48880j52803o5496k382L1322
54984F061373M0380L4692K3733J4060J0028J5078L1333N8099R1625J27227J62383
54973F670011J98071K36831K78751L18514L46008L50549L26121K74323K03139
54964I202318J22243L7829n0064j46808k59999l95348n52459p21628q83740j014828
54954E337516j093995j110533j066190r71907q41713o87685n18498l41418j65235
54945a459658q91J41487K57210L49105M24623M89524N43043N78493N89166N74909
$$ plain form
55013 7484115 7600062 7720727 7841564 7962188 8087025 8224377 8382748 8564994 8763387
55004 8763387 8959284 9128406 9248781 9306605 9297421 9223483 9089824 8900858 8658422 8362427
54994 8362427 8015000 7626764 7221164 6832874 6499612 6250732 6097929 6032433 6030051 6061373
54984 6061373 6101753 6136445 6160178 6174238 6184266 6199344 6230677 6288776 6380401 6507628 6670011
54973 6670011 6868082 7104913 7383664 7702178 8048186 8398735 8724856 8999179 9202318
54964 9202318 9324561 9362390 9312326 9165518 8905519 8510171 7957712 7236084 6352344 5337516
54954 5337516 4243521 3132988 2066798 1094891 253178 -434507 -953005 -1294423 -1459658
54945 -1459658 -1460549 -1319062 -1061852 -712747 -288124 201400 744443 1322936 1912102 2487011
54935B487011N44230N10184M83168M66077M55109M45036M34559M27760M30986
54926F684120M47812M75818N07200N32402N43893N37495N10804M60885L84062
54917A1084491K79025J51139J3903j15197k22674l05410l70558m29376m90135
54908I595208n54904o20442o79949p23646p39616p17407o54055n58710m51550
54899C894929l56168k89348k54779k44421k45615k47992k46074k38376k26246
54890A545910k13518k05622k07480k21755k48927k88340l38262l94474m48637
54881a021105m88070m97887m65777l88172k74430j45498k6577O2441J13408J30155
54871c001512J23247J03109P6020M5194J4912o768r832J2679O0276J24211J90320
$$ plain form
54935 2487011 3031241 3541425 4024593 4490670 4945779 5390815 5825374 6253134 6684120
54926 6684120 7131932 7607750 8114950 8647352 9191245 9728740 10239544 10700429 11084491
54917 11084491 11363516 11514655 11528558 11413361 11190687 10885277 10514719 10085343 9595208
54908 9595208 9040304 8419862 7739913 7016267 6276651 5559244 4905189 4346479 3894929
54899 3894929 3538761 3249413 2994634 2750213 2504598 2256606 2010532 1772156 1545910
54890 1545910 1332392 1126770 919290 697535 448608 160268 -177994 -572468 -1021105
54881 -1021105 -1509175 -2007062 -2472839 -2861011 -3135441 -3280939 -3307516 -3245075 -3131667 -3001512
54871 -3001512 -2878265 -2775156 -2699136 -2653942 -2639030 -2645798 -2655630 -2642951 -2582675 -2458464 -2268144
54860b268144K43701K73130K73747K47764K03623J53941J11927Q6514P8462Q0135
54850e15200P9736O7615M1240O644k4204l8945l0440J017N0287J12313J85084
54839f4853K68662L61745M58620N48195O15422O45246O28435N66743M73853L70420
54829D872488K75570J99682J42376R6273N3928J3652j9296l6743l3651j1553K2554
54818E575280N9458Q9657J03466R1758M8843k4330j19482k23484l21996m02144
54808D877026m53996m72114m57712m19991l74139l35425l12613l05726l09801
54799A435509l20575l36165l53276l62507l48705k97494k03296p2927P7255K27345
54789e54836L58430M54271N02417M96726M39877L42651K19429Q2967n8048j98045
$$ plain form
54860 -2268144 -2024443 -1751313 -1477566 -1229802 -1026179 -872238 -760311 -673797 -595335 -515200
54850 -515200 -435464 -367849 -326609 -319965 -344169 -383114 -413554 -412537 -362250 -249937 -64853
54839 -64853 203809 565554 1024174 1572369 2187791 2833037 3461472 4028215 4502068 4872488
54829 4872488 5148058 5347740 5490116 5586389 5640317 5653969 5634673 5597930 5564279 5552726 5575280
54818 5575280 5634738 5724395 5827861 5919619 5968462 5944132 5824650 5601166 5279170 4877026
54808 4877026 4423030 3950916 3493204 3073213 2699074 2363649 2051036 1745310 1435509
54799 1435509 1114934 778769 425493 62986 -285719 -583213 -786509 -859436 -782181 -554836
54789 -554836 -196406 257865 760282 1257008 1696885 2039536 2258965 2341932 2283884 2085839
54779B085839l31883m52192n47799o04484o09001n54975m47001k99716j32528
54770a893740L6113J91356L21629M17856M73973M88137M63306M06890L29846K44974
54760A480340J64014R4551L8852m252l5785n3903n3736k9781K0536R4141J82338
54749A897315K73691L57748M27036M76508N01998M99693M67338M06183L21850
54740E629360K22974J18210J3884q5829j76811k53855l12351l51451l75365l90959
54730D037807m02968m09974m04020l74716l16291k33594j42734o5322j9917j5986
54720A652285n2740j21155k06326k89333l49694l69538l39070k61125j51620l4221
54710e22537O8615J42866J84338J95150J79614J42423Q8712K4275m4676j12095
$$ plain form
54779 2085839 1753956 1301764 753965 149481 -459520 -1014495 -1461496 -1761212 -1893740
54770 -1893740 -1857627 -1666271 -1344642 -926786 -452813 35324 498630 905520 1235366 1480340
54760 1480340 1644354 1738905 1777757 1773505 1737720 1683817 1630081 1600300 1620836 1714977 1897315
54749 1897315 2171006 2528754 2955790 3432298 3934296 4433989 4901327 5307510 5629360
54740 5629360 5852334 5970544 5984428 5898599 5721788 5467933 5155582 4804131 4428766 4037807
54730 4037807 3634839 3224865 2820845 2446129 2129838 1896244 1753510 1688188 1668271 1652285
54720 1652285 1599545 1478390 1272064 982731 633037 263499 -75571 -336696 -488316 -522537
54710 -522537 -453922 -311056 -126718 68432 248046 390469 479181 503456 458780 346685
54700C46685j73029k24822k67569l03053l32725l56052l70062l70304l53061l18111
54690b722103k70114k17059j66439j22015q3295m7444j1460K6786O8609J14647
54680c429887J64516K16434K67821L17090L65036M13806M63703N10900N49099
54671a61482N74159N87572N95665O05566O21075O40439O56100O56544O30777N73997
54661E980412M91041L94915L01590K24912J74206J54175J65178K02967K58472
54652H347868L18906L70773M03537M11475L92473L45599K70669J70531N3085o9962
54642A1014954j87046k90300l76743m47709n07610n61952o14242o62937p00659
54633F665756p16842p02490o54213n75548m75756l67382k63479j74743j07456
$$ plain form
54700 346685 173656 -51166 -318735 -621788 -954513 -1310565 -1680627 -2050931 -2403992 -2722103
54690 -2722103 -2992217 -3209276 -3375715 -3497730 -3581025 -3628469 -3639929 -3613143 -3544534 -3429887
54680 -3429887 -3265371 -3048937 -2781116 -2464026 -2098990 -1685184 -1221481 -710581 -161482
54671 -161482 412677 1000249 1595914 2201480 2822555 3462994 4119094 4775638 5406415 5980412
54661 5980412 6471453 6866368 7167958 7392870 7567076 7721251 7886429 8089396 8347868
54652 8347868 8666774 9037547 9441084 9852559 10245032 10590631 10861300 11031831 11084916 11014954
54642 11014954 10827908 10537608 10160865 9713156 9205546 8643594 8029352 7366415 6665756
54633 6665756 5948914 5246424 4592211 4016663 3540907 3173525 2910046 2735303 2627847
54624B627847o3643m3280m6210p1347j13863j63374k05600k27101k20390j86469
54614A286570j33111p0085m978N7197J11460J51382J71446J71264J57555J41775
54604B040475J34981J43040J64804J94021K23539K48524K66407K74766K70390
54595C960947K50695K15119J63907R5388N263j10329k50258m06168n64251p09322
54585B650991q28216r10929r50552r43741q92025q02420o85964n54748m19489
54576d337093k88904j70217o9386R679O6172J02451J22438J29404J25137J11361
54566d198958R1641P1334N5132M4523L7530L0801K2418J3933J0560J8783M1881
54555c760422P6053J10365J31160J28210R9014M9766o445n3129p4950o2577j6520
$$ plain form
54624 2627847 2564204 2520924 2474714 2403367 2289504 2126130 1920530 1693429 1473039 1286570
54614 1286570 1153459 1083374 1078396 1135593 1247053 1398435 1569881 1741145 1898700 2040475
54604 2040475 2175456 2318496 2483300 2677321 2900860 3149384 3415791 3690557 3960947
54595 3960947 4211642 4426761 4590668 4686056 4691319 4580990 4330732 3924564 3360313 2650991
54585 2650991 1822775 911846 -38706 -982447 -1874472 -2676892 -3362856 -3917604 -4337093
54576 -4337093 -4625997 -4796214 -4865600 -4855921 -4789749 -4687298 -4564860 -4435456 -4310319 -4198958
54566 -4198958 -4107317 -4035983 -3980851 -3936328 -3898798 -3867997 -3845579 -3831646 -3821086 -3802303 -3760422
54555 -3760422 -3684369 -3574004 -3442844 -3314634 -3215620 -3165854 -3172299 -3225428 -3300378 -3362955 -3379475
54544c379475N1658J21930J71842J84144J53276Q8374J1338n0362p3982n0292
54534b771549J3961J00761J88914K60867L06536L24593L21290L06510K88819K73008
54524c86290K61414K56245K59178K68276K75900K70579K42054J85980J05403Q706
54514A747445r4040j93492k80925l46672l80295l74225l29087k56219j74460j02744
54504g84714n3443l0448l1765n3026q8707j31231j70540j95997j99622j78564
54494a918057j35761p9258k0475K8907O0725P2650O7469N0398K6855J596k1907
54483a866858m2454o1270q0112r8275j11282j12848r8974p1225l6923o228J1982
54472b574467J3077k551l0336o2854r1082j06016j00853p2797k2993M5521J29690
$$ plain form
54544 -3379475 -3327817 -3205887 -3034045 -2849901 -2696625 -2608251 -2596913 -2647275 -2721257 -2771549
54534 -2771549 -2757588 -2656827 -2467913 -2207046 -1900510 -1575917 -1254627 -948117 -659298 -386290
54524 -386290 -124876 131369 390547 658823 934723 1205302 1447356 1633336 1738739 1747445
54514 1747445 1653405 1459913 1178988 832316 452021 77796 -251291 -507510 -681970 -784714
54504 -784714 -838157 -868605 -900370 -953396 -1042103 -1173334 -1343874 -1539871 -1739493 -1918057
54494 -1918057 -2053818 -2133076 -2153551 -2124644 -2063919 -1991269 -1923800 -1873402 -1846547 -1844951 -1866858
54483 -1866858 -1909312 -1970582 -2050694 -2148969 -2260251 -2373099 -2472073 -2543298 -2580221 -2586449 -2574467
54472 -2574467 -2561390 -2563941 -2594277 -2657131 -2748213 -2854229 -2955082 -3027879 -3050872 -3005351 -2875661
54461b875661K25682L26090M18745M89652N28215N30450M98424M37954L56865
54452I36416K63927J67600P4961q416p8201j31693j68804j92236k06145k14038
54442D43371k17389k16175k11282k06766k09301k24395k52593k89145l27101l60453
54432b071229l85166l98792m00070l88245l61530l15833k45906j49133k9434J01930
54422d643408K29522L38608M18668M64443M76095M59488M25070L83462L39516
54413a108536K89992K27823J49996O2929j8191p4893r2186o3488P964J11404K32619
54402b74567L57313M72485N66931O32255O64134O62291O28564N64511M70631L47807
54392E092355J99629L3751j38083l00656m36179n26463n57364n24412m36428l14329
$$ plain form
54461 -2875661 -2649979 -2323889 -1905144 -1415492 -887277 -356827 141597 579551 936416
54452 936416 1200343 1367943 1442904 1434488 1356287 1224594 1055790 863554 657409 443371
54442 443371 225982 9807 -201475 -408241 -617542 -841937 -1094530 -1383675 -1710776 -2071229
54432 -2071229 -2456395 -2855187 -3255257 -3643502 -4005032 -4320865 -4566771 -4715904 -4745338 -4643408
54422 -4643408 -4413886 -4075278 -3656610 -3192167 -2716072 -2256584 -1831514 -1448052 -1108536
54413 -1108536 -818544 -590721 -440725 -377796 -395987 -470880 -563066 -626554 -618590 -507186 -274567
54402 -274567 82746 555231 1122162 1754417 2418551 3080842 3709406 4273917 4744548 5092355
54392 5092355 5291984 5325735 5187652 4886996 4450817 3924354 3366990 2842578 2406150 2091821
54382B091821j85400p5992n537J7487k162m7167r3467j20826j23118j11358j06592
54371A237689j26881j76909k46528l17478l71934l97270l87027l41718k70632
54362a398688j91155j22835p8883o1493o3589p3975q1646p8368o0879l2415j805
54351b245731K0505K7483J8845J499j2433r113K2360Q4841J69842K59082L31502
54340a331318L72006L76358L50027L03398K46990J88266J30423P3818J9894k5344
54330G04518n2111n2165k4500K3178P7889J26465J58828J68479J51800J07923
54320A390304L9264m8518j47569k48761l41164m10796m41145m17047l30974j88170
54310a144576p306J84340L58869M94979N81511O17063O07310N62170M94126M17345
$$ plain form
54382 2091821 1906421 1830429 1824892 1842379 1840217 1793050 1699583 1578757 1455639 1344281 1237689
54371 1237689 1110808 933899 687371 369893 -2041 -399311 -786338 -1128056 -1398688
54362 -1398688 -1589843 -1712678 -1791561 -1853054 -1916643 -1990618 -2072264 -2150632 -2211511 -2243926 -2245731
54351 -2245731 -2225226 -2197743 -2178898 -2177399 -2189832 -2198945 -2176585 -2091744 -1921902 -1662820 -1331318
54340 -1331318 -959312 -582954 -232927 70471 317461 505727 636150 709968 729862 704518
54330 704518 652407 600242 575742 598920 676809 803274 962102 1130581 1282381 1390304
54320 1390304 1429568 1381050 1233481 984720 643556 232760 -208385 -625432 -956406 -1144576
54310 -1144576 -1151882 -967542 -608673 -113694 467817 1084880 1692190 2254360 2748486 3165831
54300C165831L45971K90542K54313K33250K21021K15402K20492K42584K82884
54291E472290L32291L71437L76228L26679K15272N0845j44009l40280n10372o32967
54281E517414o94528o89735o22603n07467l67306k28359j12965l3958P301J9081
54271B286875J4639O651L463R139K6414N8999J10006J77180K49186L07376L33211
54260C583139L16567K59342J73178P4935j6575q3206j11923j00240n8458n773
54250D030986L7856N9375N6445L6557J2635k515l12K2328O3888J19831J84110
54239D621184K50436L12702L64072L95550L96269L57296K77941J70618N9801k5941
54229G179928o4957n0509P960Q9791J71250K33658K68721K79267K75698K70838
$$ plain form
54300 3165831 3511802 3802344 4056657 4289907 4510928 4726330 4946822 5189406 5472290
54291 5472290 5804581 6176018 6552246 6878925 7094197 7145042 7001033 6660753 6150381 5517414
54281 5517414 4822886 4133151 3510548 3003081 2635775 2407416 2294451 2260493 2267794 2286875
54271 2286875 2301514 2308165 2311628 2320767 2347181 2406180 2516186 2693366 2942552 3249928 3583139
54260 3583139 3899706 4159048 4332226 4407161 4390586 4307380 4195457 4095217 4036759 4030986
54250 4030986 4068842 4128217 4184662 4221219 4233854 4231339 4231027 4253355 4317243 4437074 4621184
54239 4621184 4871620 5184322 5548394 5943944 6340213 6697509 6975450 7146068 7205869 7179928
54229 7179928 7114971 7064462 7072422 7162213 7333463 7567121 7835842 8115109 8390807 8661645
54219H661645K75618K95829L29392L65336L87136L80227L38963K67488J74046
54210A1475680O4432n9109j93104l27903m48403n40257n96169o17549o11862n89291
54200G556465n60734n35734n18857n06514m88517m55512m07068l53175l07615
54191C422739k79484k70219k76947k96762l27402l65194m03848m35876m55379
54182C11628m60150m52080m36110m18891m07654m08630m24193m50193m76485m91551
54172d114309m87991m64827m26026l77786l26537k77466k33184j93192j54868
54163g056186j15664p5413l7461p701Q548J0072J241r507j3083l183K1813N9422
54151g217102J05834J58666K16957K78527L38161L89321M27762M52975M66133
$$ plain form
54219 8661645 8937263 9233092 9562484 9927820 10314956 10695183 11034146 11301634 11475680
54210 11475680 11540112 11481003 11287899 10959996 10511593 9971336 9375167 8757618 8145756 7556465
54200 7556465 6995731 6459997 5941140 5434626 4946109 4490597 4083529 3730354 3422739
54191 3422739 3143255 2873036 2596089 2299327 1971925 1606731 1202883 767007 311628
54182 311628 -148522 -600602 -1036712 -1455603 -1863257 -2271887 -2696080 -3146273 -3622758 -4114309
54172 -4114309 -4602300 -5067127 -5493153 -5870939 -6197476 -6474942 -6708126 -6901318 -7056186
54163 -7056186 -7171850 -7247263 -7284724 -7292425 -7283877 -7273805 -7272564 -7282071 -7295154 -7298337 -7276524 -7217102
54151 -7217102 -7111268 -6952602 -6735645 -6457118 -6118957 -5729636 -5301874 -4848899 -4382766
54142d382766M67562M56686M33861M00999L59995L11210K54569J92674J32911
54133a372299Q6254O3486P1224J09616J71881K45019L11429L52187L52608L08809
54123G00214K31451J43004O8780K6598K0673M1668P1085Q7417P2775J8977o8858
54112A413784j73564k72391l46337l87807m02618m05297m10546m25767m48223
54103a858766m67402m70491m47786l95679l16676k18101j11356j1819O2595R5935
54093d139546Q0476K0741o8442j69395k69569l64301m53151n34096o00554o42185
54083g140022o46986o03373n03418l47605j48540O9604K76296M42179N46098N79283
54073g476484N45194M55635L26539J76507K7455r6283j72429j86710j36738l2257
$$ plain form
54142 -4382766 -3915204 -3458518 -3024657 -2623658 -2263663 -1952453 -1697884 -1505210 -1372299
54133 -1372299 -1286045 -1222559 -1151335 -1041719 -869838 -624819 -313390 38797 391405 700214
54123 700214 931665 1074669 1143449 1170047 1190720 1232388 1303473 1390890 1463665 1482642 1413784
54112 1413784 1240220 967829 621492 233685 -168933 -574230 -984776 -1410543 -1858766
54103 -1858766 -2326168 -2796659 -3244445 -3640124 -3956800 -4174901 -4286257 -4298076 -4235481 -4139546
54093 -4139546 -4059070 -4038329 -4106771 -4276166 -4545735 -4910036 -5363187 -5897283 -6497837 -7140022
54083 -7140022 -7787008 -8390381 -8893799 -9241404 -9389944 -9320340 -9044044 -8601865 -8055767 -7476484
54073 -7476484 -6931290 -6475655 -6149116 -5972609 -5945154 -6041437 -6213866 -6400576 -6537314 -6569571
54063f569571J07447K57816L94259M97529N58001N77462N67180N42157N13927
54054b553793M86220M56239M19915L76281L27587K75901K19887J54781P5968j6050
54044B22936j12787j99388k60165k84584k70314k22321j50021o4771K1656R8675
54034a221084J59491K03476K35697K62576K86411L03400L06724K91281K55656
54025A083628K00699J28089M1354n2210j41826k16799k71178l06713l32286l59909
54015b27151l99008m51804n12159n68087o06423o17630n99213n56480m99937m40015
54005e477907l81719l22405k54468j71676p5213K4889J14265J81655K24191K47468
53995e890920K61079K72757K84323K91388K87111K67931K37736K07552J90611
$$ plain form
54063 -6569571 -6462124 -6204308 -5810049 -5312520 -4754519 -4177057 -3609877 -3067720 -2553793
54054 -2553793 -2067573 -1611334 -1191419 -815138 -487551 -211650 8237 163018 238986 222936
54044 222936 110149 -89239 -349404 -633988 -904302 -1126623 -1276644 -1341415 -1319759 -1221084
54034 -1221084 -1061593 -858117 -622420 -359844 -73433 229967 536691 827972 1083628
54025 1083628 1284327 1412416 1453770 1401560 1259734 1042935 771757 465044 132758 -227151
54015 -227151 -626159 -1077963 -1590122 -2158209 -2764632 -3382262 -3981475 -4537955 -5037892 -5477907
54005 -5477907 -5859626 -6182031 -6436499 -6608175 -6683388 -6658499 -6544234 -6362579 -6138388 -5890920
53995 -5890920 -5629841 -5357084 -5072761 -4781373 -4494262 -4226331 -3988595 -3781043 -3590432
53986c590432J95657K22283K61252K99810L28725L46346L57037L65946L74831
53977h38545L82183L86884L91559M02027M22213M47629M62620M44546L73222K40250
53967C114588N3347j65308l84913n73638p06139p69029p62587o98335n93720m66197
53957a951931l29118j91198n9144N9662J57847K31805K84184L21600L49346L68566
53947g58381L78672L81906L84785L94246M11465M28129M28543L97098L27251K26490
53937C000204J13660J0013p0463j25590j62345j89521k10572k20755k09877j68703
53927A766051r5457P14J00774J81172K21890K13808J61564Q0324j1079r6328j64689
53916B358744k11550k37654k47007k43488k28040j98844j54533r7539l4897K3442
$$ plain form
53986 -3590432 -3394775 -3172492 -2911240 -2611430 -2282705 -1936359 -1579322 -1213376 -838545
53977 -838545 -456362 -69478 322081 724108 1146321 1593950 2056570 2501116 2874338 3114588
53967 3114588 3167935 3002627 2617714 2044076 1337937 568908 -193679 -892014 -1485734 -1951931
53957 -1951931 -2281049 -2472247 -2531391 -2471729 -2313882 -2082077 -1797893 -1476293 -1126947 -758381
53947 -758381 -379709 2197 386982 781228 1192693 1620822 2049365 2446463 2773714 3000204
53937 3000204 3113864 3123877 3053414 2927824 2765479 2575958 2365386 2144631 1934754 1766051
53927 1766051 1670594 1671308 1772082 1953254 2175144 2388952 2550516 2630840 2619761 2523433 2358744
53916 2358744 2147194 1909540 1662533 1419045 1191005 992161 837628 740089 705192 728634
53906G28634O7091Q7663Q1309N1105P789l2358n1909l7166J7940J09621K24310
53895A254029L41957M42451N12660N50099N61015N54697N38352N15134M84907
53886E755301M45967L97020L38829K73940K04133J28203M3587m9008j43053k29027
53876G165892k99795l53346l91845m20230m46370m80651n32567o05536o93797
53867B941755p83738q58560r03548r09361q72406p93193o75403n27235l63283
53858c744972k03032o4650M2155J18623J73234K15972K55501K99910L57075M31484
53848b118700N19071O05337O70352O98738O88045O49681O02075N61414N35856
53839C411869N25008N22231N17332M99531M61128M00922L25460K47383J81379
$$ plain form
53906 728634 795725 883388 964697 1015802 1023591 991233 939324 902158 920098 1029719 1254029
53895 1254029 1595986 2038437 2551097 3101196 3662211 4216908 4755260 5270394 5755301
53886 5755301 6201268 6598288 6937117 7211057 7415190 7543393 7586980 7537972 7394919 7165892
53876 7165892 6866097 6512751 6120906 5700676 5254306 4773655 4241088 3635552 2941755
53867 2941755 2158017 1299457 395909 -513452 -1385858 -2179051 -2854454 -3381689 -3744972
53858 -3744972 -3948004 -4012654 -3970499 -3851876 -3678642 -3462670 -3207169 -2907259 -2550184 -2118700
53848 -2118700 -1599629 -994292 -323940 374798 1062843 1712524 2314599 2876013 3411869
53839 3411869 3936877 4459108 4976440 5475971 5937099 6338021 6663481 6910864 7092243
53830G092243J38593J21016J18913J14004Q7628K9229n9490j65790k70532l53989
53820F851825m01450m07478l77381l25207k68876k24147j99653j95065k03216
53811D249352k14803k22518k22291k12127j91278j61424j28156r9805q3256q0077
53801B633617q6125r4281r7584r1443p5382n3939l4950k5533k9259m7252q1016
53790A916853j32337j99558k74690l45351l99951m31205m36059m14840l72464
53781a089602l20094k72946k43408k34246k37767k41471k34982k13179j75146
53772c262841j22138n6827J6205Q9841J54183J97607K10152J88663J40384Q1287
53762b363484K8946n717k2319k8367l2892m1248n4023o8984q3104r3111r5649
$$ plain form
53830 7092243 7230836 7351852 7470765 7584769 7672397 7701626 7642136 7476346 7205814 6851825
53820 6851825 6450375 6042897 5665516 5340309 5071433 4847286 4647633 4452568 4249352
53811 4249352 4034549 3812031 3589740 3377613 3186335 3024911 2896755 2796950 2713694 2633617
53801 2633617 2547492 2453211 2355627 2264184 2188802 2134863 2099913 2074380 2045121 1997869 1916853
53790 1916853 1784516 1584958 1310268 964917 564966 133761 -302298 -717138 -1089602
53781 -1089602 -1409696 -1682642 -1926050 -2160296 -2398063 -2639534 -2874516 -3087695 -3262841
53772 -3262841 -3384979 -3441806 -3425601 -3335760 -3181577 -2983970 -2773818 -2585155 -2444771 -2363484
53762 -2363484 -2334538 -2340255 -2362574 -2390941 -2423833 -2465081 -2519104 -2588088 -2671192 -2764303 -2859952
53751b859952q8823p4721o0420n5595o7792r8804j44772j99579k58656l20247
53741d229361l83211m42986m89308n08477m89739m31530l42973k39822j38233
53732g695640n0433J6423N9440P9104P9207O7219N3804N0505O6131J03928J60900
53721g009412K28989K97086L53794L90828M05689M01652L85037L61729L34938
53712c849670L04780K69348K27196J80508J36918J07645J01730J19576J50896
53703b251073J79929J95173J96641J95216K05214K36382K90289L61312M39597
53694D8680N14372N77149O23613O52364O60754O41411N83728M80717L36467J67707
53684E286962k686j55605k81575l79434m51219m98672n22634n22953m97599m43213
$$ plain form
53751 -2859952 -2948775 -3023496 -3083916 -3139511 -3207303 -3306107 -3450879 -3650458 -3909114 -4229361
53741 -4229361 -4612572 -5055558 -5544866 -6053343 -6543082 -6974612 -7317585 -7557407 -7695640
53732 -7695640 -7746073 -7729650 -7670210 -7591106 -7511899 -7444680 -7390876 -7340371 -7274240 -7170312 -7009412
53721 -7009412 -6780423 -6483337 -6129543 -5738715 -5333026 -4931374 -4546337 -4184608 -3849670
53712 -3849670 -3544890 -3275542 -3048346 -2867838 -2730920 -2623275 -2521545 -2401969 -2251073
53703 -2251073 -2071144 -1875971 -1679330 -1484114 -1278900 -1042518 -752229 -390917 48680
53694 48680 563052 1140201 1763814 2416178 3076932 3718343 4302071 4782788 5119255 5286962
53684 5286962 5284276 5128671 4847096 4467662 4016443 3517771 2995137 2472184 1974585 1531372
53674A531372l58913k50882j32740k0199P6017J53493K16293K70772L22263L73214
53664B180690M21946M62177M84662M81479M50895L99511L39738K83871K38460
53655E743429K02356J69305J33026R1497M8070R115j9913l7326m5455m8992n3166
53644F191946o2595q0346j06958j40272j77061k15821k58971l12600l82920m70225
53634C984177n63482o40143o73424o43928n48809m03373k35466p6418M7807J23224
53624C70165J50597J43095J19213R4173P4292N7122L6262O796l2136p7895j25728
53613H15956j69168j99996k09403j91105j45124p9615q515N4639J02970J37999
53603A08638J65587J89824K09962K21968K22061K09068J85059J55626J30252J20887
$$ plain form
53674 1531372 1172459 921577 788837 768638 844655 998148 1214441 1485213 1807476 2180690
53664 2180690 2602636 3064813 3549475 4030954 4481849 4881360 5221098 5504969 5743429
53655 5743429 5945785 6115090 6248116 6339613 6387683 6396798 6376885 6339559 6294104 6245112 6191946
53644 6191946 6129351 6049005 5942047 5801775 5624714 5408893 5149922 4837322 4454402 3984177
53634 3984177 3420695 2780552 2107128 1463200 914391 511018 275552 199134 246941 370165
53624 370165 520762 663857 783070 877243 951535 1008657 1044919 1051715 1019579 941684 815956
53613 815956 646788 446792 237389 46284 -98840 -178455 -186970 -132331 -29361 108638
53603 108638 274225 464049 674011 895979 1118040 1327108 1512167 1667793 1798045 1918932
53593A918932J37112J79635K37332K91762L27100L38299L31484L17119L01625
53584D380400K82670K49798J89140R0061m8970k17830l96513n60101o85108p55898
53574B527649p69789p38457o83612o27833n85025n55455n27517m84206m10530
53565b854775k98784j50447K4918K12590L95705N57492O83088P61869P89790P69568
53555H91014P07799O11207M85455L37118J75758J3253j38962k71816l78352m52731
53545A979743m90516m90434m56245l97403l27907k63424k17118j95493j96393
53536a055190k11020k29557k46796k63543k82643l03309l18806l18887k94381
53527c524132k40768j60449o4376K8066R3320J11922P6762l645j08920k15515
$$ plain form
53593 1918932 2056044 2235679 2473011 2764773 3091873 3430172 3761656 4078775 4380400
53584 4380400 4663070 4912868 5102008 5192069 5143099 4925269 4528756 3968655 3283547 2527649
53574 2527649 1757860 1019403 335791 -292042 -877067 -1432522 -1960039 -2444245 -2854775
53565 -2854775 -3153559 -3304006 -3279088 -3066498 -2670793 -2113301 -1430213 -668344 121446 891014
53555 891014 1598813 2210020 2695475 3032593 3208351 3221604 3082642 2810826 2432474 1979743
53545 1979743 1489227 998793 542548 145145 -182762 -446186 -663304 -858797 -1055190
53536 -1055190 -1266210 -1495767 -1742563 -2006106 -2288749 -2592058 -2910864 -3229751 -3524132
53527 -3524132 -3764900 -3925349 -3989725 -3961659 -3868339 -3756417 -3679655 -3683300 -3792220 -4007735
53517d007735l05889l73511m21210m54402m74348m76592m55441m10529l49904
53508g729561k86919k32909j91014j55786j18774p5377k7292K0914O7466J15826
53498h613426J71625K36452L03467L58781L88315L85459L54008L04582K47864
53489e862873J89874J31863P3348J4903m1153r1546j32647j60488j71536j64807
53479f215062j43617j14338q2520m9856j4911K3298O2436R7000J20844J29854
53469f186872J23073J02213P0895L4922K801j5643j3422R533M6124Q6254J22091
53458e618031J50865J74241J95653K17538K40100K62244K83404L03831L22847
53449c467308L37681L45713L49043L56609L80526M28581M98349N76683O43927
$$ plain form
53517 -4007735 -4313624 -4687135 -5108345 -5562747 -6037095 -6513687 -6969128 -7379657 -7729561
53508 -7729561 -8016480 -8249389 -8440403 -8596189 -8714963 -8790340 -8817632 -8796718 -8729252 -8613426
53498 -8613426 -8441801 -8205349 -7901882 -7543101 -7154786 -6769327 -6415319 -6110737 -5862873
53489 -5862873 -5672999 -5541136 -5467788 -5452885 -5494038 -5585584 -5718231 -5878719 -6050255 -6215062
53479 -6215062 -6358679 -6473017 -6555537 -6605393 -6620304 -6597006 -6534570 -6437570 -6316726 -6186872
53469 -6186872 -6063799 -5961586 -5890691 -5855769 -5852968 -5868611 -5882033 -5872500 -5826376 -5740122 -5618031
53458 -5618031 -5467166 -5292925 -5097272 -4879734 -4639634 -4377390 -4093986 -3790155 -3467308
53449 -3467308 -3129627 -2783914 -2434871 -2078262 -1697736 -1269155 -770806 -194123 449804
53440D49804O79795O68752O04272M90998L43321J80538K1253j19836k32306l09311
53430B777280l47382l46743l11800k51547j79177j09845n6811k8033k5105m4461
53420A076376p9263j20763j59082j84163j87773j66583j24803p3913k8598j024
53410d9589L020j5723n2568j01851j58367k17139k72840l20297l56026l79113
53400a920493l90462l91350l83032l67518l48144l29147l14779l08575l12524
53391e066024l25590l42227l52415l44507l10332k50153j74438j01036m8970l1582
53381g347274n1675j00176j58833k05802k21838j94997j23653j7860J02340K13381
53371h106387K97653L50476L79895L99791M21052M45468M64544M63201M26593
$$ plain form
53440 449804 1129599 1798351 2402623 2893621 3236942 3417480 3438733 3318897 3086591 2777280
53430 2777280 2429898 2083155 1771355 1519808 1340631 1230786 1173975 1145942 1120837 1076376
53420 1076376 997113 876350 717268 533105 345332 178749 53946 -19967 -48565 -49589
53410 -49589 -46569 -62292 -114860 -216711 -375078 -592217 -865057 -1185354 -1541380 -1920493
53400 -1920493 -2310955 -2702305 -3085337 -3452855 -3800999 -4130146 -4444925 -4753500 -5066024
53391 -5066024 -5391614 -5733841 -6086256 -6430763 -6741095 -6991248 -7165686 -7266722 -7315692 -7347274
53381 -7347274 -7398949 -7499125 -7657958 -7863760 -8085598 -8280595 -8404248 -8422108 -8319768 -8106387
53371 -8106387 -7808734 -7458258 -7078363 -6678572 -6257520 -5812052 -5347508 -4884307 -4457714
53362d457714L46577K24579P0146j02412k76555m34650n59395o36926o60847o34296
53352g121493n67590m72280l55951k21856p3329Q1122K26369L43961M18456M43799
53342g298792M26579L83754L35311K95920K70406K54756K40415K18693J83853
53333d689105J34861P5722J4204m0573q0515r9946r6015o8480j9438M6536J22005
53322d700744J97002K61302L08275L37979L56693L72459L89225M03577M06254
53313a667978L87341L41706K71445J84516R1162N72q0669j48363j99795k33242
53303a053305k48379k47166k34320k16603k01147j93918j99316k20649k59958
53294c074761l16171l82686m47033m94367n13325n00654m61918m08594l53877
$$ plain form
53362 -4457714 -4111137 -3886558 -3816412 -3918824 -4195379 -4630029 -5189424 -5826350 -6487197 -7121493
53352 -7121493 -7689083 -8161363 -8517314 -8739170 -8812499 -8731377 -8505008 -8161047 -7742591 -7298792
53342 -7298792 -6872213 -6488459 -6153148 -5857228 -5586822 -5332066 -5091651 -4872958 -4689105
53333 -4689105 -4554244 -4478522 -4464318 -4504891 -4585406 -4685352 -4781367 -4849847 -4869285 -4822749 -4700744
53322 -4700744 -4503742 -4242440 -3934165 -3596186 -3239493 -2867034 -2477809 -2074232 -1667978
53313 -1667978 -1280637 -938931 -667486 -482970 -391808 -391236 -471905 -620268 -820063 -1053305
53303 -1053305 -1301684 -1548850 -1783170 -1999773 -2200920 -2394838 -2594154 -2814803 -3074761
53294 -3074761 -3390932 -3773618 -4220651 -4715018 -5228343 -5728997 -6190915 -6599509 -6953386
53285f953386l09096k81172k71119k73923k80200k79055k61072k20708j57899
53276i287630p8439P710R0284J63129K26356K84576L42152L98439M45865M71781
53266f935777M62840M09955L12218J78772K7927j16480k30332k94215k96835k36719
53256f718646j22381K9464J97754L61756N04574O14465O84518P11730O96131O40650
53246b399985N52231M43302L31162K33799J63836J24457J09647J07878J06600
53237b27073R5452O7612J9975m6787j28053k16158l03408l85766m63737n38822
53227b126765o08626o65521p00313p07243o85887o39414n72267m89592l97835
53218g593463l04679k18231j46555r7621p8018q9630j26329j73901k14190k31249
$$ plain form
53285 -6953386 -7262482 -7543654 -7814773 -8088696 -8368896 -8647951 -8909023 -9129731 -9287630
53276 -9287630 -9366069 -9358359 -9268075 -9104946 -8878590 -8594014 -8251862 -7853423 -7407558 -6935777
53266 -6935777 -6472937 -6062982 -5750764 -5571992 -5544065 -5660545 -5890877 -6185092 -6481927 -6718646
53256 -6718646 -6841027 -6811563 -6613809 -6252053 -5747479 -5133014 -4448496 -3736766 -3040635 -2399985
53246 -2399985 -1847754 -1404452 -1073290 -839491 -675655 -551198 -441551 -333673 -227073
53237 -227073 -131621 -64009 -44034 -90821 -218874 -435032 -738440 -1124206 -1587943 -2126765
53227 -2126765 -2735391 -3400912 -4101225 -4808468 -5494355 -6133769 -6706036 -7195628 -7593463
53218 -7593463 -7898142 -8116373 -8262928 -8360549 -8438567 -8528197 -8654526 -8828427 -9042617 -9273866
53208i273866k16272j69522r8923j5729P1173J59238K51472L50784M53598N48008
53198g940039O18440O53377O50135O13649N51634M71200L79271K84827J99420
53189c518086J34656R8271R1480J09600J45831J95701K58418L33616M16237M94007
53179a240269N49651N66260N33209M51026L33570K05362R3436J7144j8351k1384
53169A469654p386Q738J7456J5666N171r562k3446l2671l6622l9101m7784p1519
53157A248594j16451j82724k63206l44636m10429m43831m30834l63146k41294
53148a547957p6533J10487K94376M50771N60949O15017O13921N68556M93969M00572
53138B484128K89447J57279P726j40892k59373l20902l14509k50070j52870n1660
$$ plain form
53208 -9273866 -9490138 -9659660 -9758583 -9774312 -9703139 -9543901 -9292429 -8941645 -8488047 -7940039
53198 -7940039 -7321599 -6668222 -6018087 -5404438 -4852804 -4381604 -4002333 -3717506 -3518086
53189 -3518086 -3383430 -3285159 -3193679 -3084079 -2938248 -2742547 -2484129 -2150513 -1734276 -1240269
53179 -1240269 -690618 -124358 408851 859877 1193447 1398809 1492245 1509389 1491038 1469654
53169 1469654 1462268 1471006 1488462 1504128 1509299 1499737 1476291 1443620 1406998 1367897 1320113 1248594
53157 1248594 1132143 949419 686213 341577 -68852 -512683 -943517 -1306663 -1547957
53148 -1547957 -1624490 -1514003 -1219627 -768856 -207907 407110 1021031 1589587 2083556 2484128
53138 2484128 2773575 2930854 2938580 2797688 2538315 2217413 1902904 1652834 1499964 1448304
53128A448304L3022R4547J37967J72653K05083K35574K59243K69297K60666K32569
53118C348925J88785J35068P5041P520p2305j68202k78191l93417n01297n90198
53108A751729o52616o86197o93587o81555o58660o31971o04900n77627n49045
53099c984429n18152m84146m46222m03754l56489l04221k46117j80330j04470
53090g028330j7321P8640J75476K60523L19935L43487L28475K81383K16793J53480
53080d887459J08475R1162J00074J24205J48502J61050J58526J47116J38233J41183
53070c568933J56931J76967J88069J79711J49071J00896M3543j5631p3344j31242
53060b793962j94156k65897l44653m21580m84318n23269n36081n27390n04571
$$ plain form
53128 1448304 1481326 1575873 1713840 1886493 2091576 2327150 2586393 2855690 3116356 3348925
53118 3348925 3537710 3672778 3747819 3755339 3683034 3514832 3236641 2843224 2341927 1751729
53108 1751729 1099113 412916 -280671 -962226 -1620886 -2252857 -2857757 -3435384 -3984429
53099 -3984429 -4502581 -4986727 -5432949 -5836703 -6193192 -6497413 -6743530 -6923860 -7028330
53090 -7028330 -7045651 -6967011 -6791535 -6531012 -6211077 -5867590 -5539115 -5257732 -5040939 -4887459
53080 -4887459 -4778984 -4687822 -4587748 -4463543 -4315041 -4153991 -3995465 -3848349 -3710116 -3568933
53070 -3568933 -3412002 -3235035 -3046966 -2867255 -2718184 -2617288 -2573745 -2589376 -2662720 -2793962
53060 -2793962 -2988118 -3254015 -3598668 -4020248 -4504566 -5027835 -5563916 -6091306 -6595877
53051f595877m72975m33911l86525l31807k75482k27432j97738j91571k05592
53042i318910k27701k40722k28998j85116j12928k4762O5366J47474K16287K67853
53032i642157K96974K99138K75225K34089J90165J57855J46595J58914J91100
53023g692102K35006K79938L14529L28940L17493K80635K24863J60385R8205M8215
53013e403893J8119J1772K7070N5446Q4882J05451J13903J13971J12163J11735
53003d649381J08582R1436M6548l5035j50883k84951m11321n02033n34553m95894
52993f817485l83546k05227K1904K73285N20769P37349R01604J001164J034751
52984b915432J012218R52146Q77045Q07028P53770P17408O88452O54230O06468
$$ plain form
53051 -6595877 -7068852 -7502763 -7889288 -8221095 -8496577 -8724009 -8921747 -9113318 -9318910
53042 -9318910 -9546611 -9787333 -10016331 -10201447 -10314375 -10339137 -10273771 -10126297 -9910010 -9642157
53032 -9642157 -9345183 -9046045 -8770820 -8536731 -8346566 -8188711 -8042116 -7883202 -7692102
53023 -7692102 -7457096 -7177158 -6862629 -6533689 -6216196 -5935561 -5710698 -5550313 -5452108 -5403893
53013 -5403893 -5385774 -5374002 -5346932 -5291486 -5206604 -5101153 -4987250 -4873279 -4761116 -4649381
53003 -4649381 -4540799 -4449363 -4402815 -4437850 -4588733 -4873684 -5285005 -5787038 -6321591 -6817485
52993 -6817485 -7201031 -7406258 -7384354 -7111069 -6590300 -5852951 -4951347 -3950183 -2915432
52984 -2915432 -1903214 -951068 -74023 733005 1486775 2204183 2892635 3546865 4153333
52975D153333N45867M81505M26026L89778L76711L82975L97661M05201L89832
52966G948889L41464K60159J56056M4605n9548j46522k12151k57011k84843l00950
52956G490148l10978l19976l31345l45630l59972l69146l67943l53996l29908
52947D401254l03574k85627k84403l00925l27090l48302l49342l21000k64836
52938A616155j93580j26184p9546o1240o6733q1644q7514o9185k1311M9112J26393
52927A004723J94246K43122K71916K83852K81080K62757K27457J76751J16523
52918C062427N5677M011k9484l8234j9869K2642Q1555J46260K05274K47749K64794
52907D002802K50947K05350J31977L8605o5131j69866k67883l53272m21282m67809
$$ plain form
52975 4153333 4699200 5180705 5606731 5996509 6373220 6756195 7153856 7559057 7948889
52966 7948889 8290353 8550512 8706568 8751173 8691625 8545103 8332952 8075941 7791098 7490148
52956 7490148 7179170 6859194 6527849 6182219 5822247 5453101 5085158 4731162 4401254
52947 4401254 4097680 3812053 3527650 3226725 2899635 2551333 2201991 1880991 1616155
52938 1616155 1422575 1296391 1216845 1155605 1088872 1007228 919714 850529 829218 878330 1004723
52927 1004723 1198969 1442091 1714007 1997859 2278939 2541696 2769153 2945904 3062427
52918 3062427 3118104 3122115 3092631 3054397 3034528 3057170 3138725 3284985 3490259 3738008 4002802
52907 4002802 4253749 4459099 4591076 4629681 4564550 4394684 4126801 3773529 3352247 2884438
52897B884438m89588m84917m54790m04642l46175k97030k75962k94198l48058
52888e10922m18741m80845n14538n13911m87242m50814m21138m09435m19361m47164
52878e074111m83471n16300n34480n30249n00067m43854l63474k61531j41196
52869h848733p348J31880K65019L79577M65250N15931N30554N14448M80596M47429
52859e125397M31750M41174M72206N14585N56633N87214N95575N72517N13157
52850d40586M18609K95077J51573k179j57111l05587m41267n58370o51465p16409
52840b407715p51620p58280p39202o97524o36645n61208m77390l91247l06332
52831g727163k23328j42321o4888O638P1623J31884J90051K48116L07835L70844
$$ plain form
52897 2884438 2394850 1909933 1455143 1050501 704326 407296 131334 -162864 -510922
52888 -510922 -929663 -1410508 -1925046 -2438957 -2926199 -3377013 -3798151 -4207586 -4626947 -5074111
52878 -5074111 -5557582 -6073882 -6608362 -7138611 -7638678 -8082532 -8446006 -8707537 -8848733
52869 -8848733 -8856081 -8724201 -8459182 -8079605 -7614355 -7098424 -6567870 -6053422 -5572826 -5125397
52859 -5125397 -4693647 -4252473 -3780267 -3265682 -2709049 -2121835 -1526260 -953743 -440586
52850 -440586 -21977 273100 424673 422494 265383 -40204 -481471 -1039841 -1691306 -2407715
52840 -2407715 -3159335 -3917615 -4656817 -5354341 -5990986 -6552194 -7029584 -7420831 -7727163
52831 -7727163 -7950491 -8092812 -8157700 -8151062 -8079439 -7947555 -7757504 -7509388 -7201553 -6830709
52821f830709M36340M98246N46194N70973N70069N48789N16964M84830M60601
52812b197703M49414M52503M66599M84525M97035M95106M71907M24296L53941
52803A897623K67756J77100R5195L2721p179l1442n4251q9242j41644k05974k70083
52792A670580l21152l48891l45663l06547k30881j23505O478J48682K93119M29117
52782H71337N43200O19492O44002O10536N23955L98100K49704R2884o1936k04681
52772D286593l22091l98404m21095l87771l09154k05849j00726j1272N4510R7545
52762B282286J23921J40414J51290J57022J54807J40528J11265O7107J1358n0247
52752C289751j09899j57361j80617j69216j19689l9831N1767J32078J83407K01396
$$ plain form
52821 -6830709 -6394369 -5896123 -5349929 -4778956 -4208887 -3660098 -3143134 -2658304 -2197703
52812 -2197703 -1748289 -1295786 -829187 -344662 152373 647479 1119386 1543682 1897623
52803 1897623 2165379 2342479 2437674 2470395 2463216 2431774 2377523 2288281 2146637 1940663 1670580
52792 1670580 1349428 1000537 654874 348327 117446 -6059 419 149101 442220 871337
52782 871337 1414537 2034029 2678031 3288567 3812522 4210622 4460326 4553210 4491274 4286593
52772 4286593 3964502 3566098 3145003 2757232 2448078 2242229 2141503 2130231 2184741 2282286
52762 2282286 2406207 2546621 2697911 2854933 3009740 3150268 3261533 3328640 3339998 3289751
52752 3289751 3179852 3022491 2841874 2672658 2552969 2513138 2564905 2696983 2880390 3081786
52742C081786J96395J87061J89903K11001K44321K76678K95798K96970K85204
52733E265117K72420K71503K90219L27453L72680M08394M14700L75002K81272
52724H278760J37198m1793k31648m05182n38692o17733o39779o12627n49840m66328
52714D312336l76093k91716k23763j79109j58886j57858j66516j75824j82125
52705B400446j88614k01690k24490k52379k73175k71321k33514j54216l9800R0760
52695F52007K10742K94842L27973L09190K49962J69374Q8921K7389m224o425R197
52684B328948K5457K7518Q534k9980q2180j42687k08987k80716l57415m36777
52674H51715n14296n83648o37176o66605o64603o26835n53520m50010l26280j94889
$$ plain form
52742 3081786 3278181 3465242 3655145 3866146 4110467 4387145 4682943 4979913 5265117
52733 5265117 5537537 5809040 6099259 6426712 6799392 7207786 7622486 7997488 8278760
52724 8278760 8415958 8374165 8142517 7737335 7198643 6580910 5941131 5328504 4778664 4312336
52714 4312336 3936243 3644527 3420764 3241655 3082769 2924911 2758395 2582571 2400446
52705 2400446 2211832 2010142 1785652 1533273 1260098 988777 755263 601047 561247 652007
52695 652007 862749 1157591 1485564 1794754 2044716 2214090 2303011 2330400 2326176 2319751 2328948
52684 2328948 2354405 2381923 2390457 2360477 2278297 2135610 1926623 1645907 1288492 851715
52674 851715 337419 -246229 -883405 -1550010 -2214613 -2841448 -3394968 -3844978 -4171258 -4366147
52664d366147o7211N0309J56730K53156L38437M08051M56620M81100M82233M64295
52654a342427M33704L96766L57481L17508K78610K44675K20061K04930J92024
52645A303332J68267J20398M0884o8614j96838l25059m31424m96684n09168m66610
52635h61516l74430k42811q5235Q1444K37731L64907M49932M88805M86219M52025
52625I97071L96883L29362K55266J78395J01595K7653l9689r5118j32631j48056
52615A870731j41319j16452p9731l8284k54K5341L1325J6734j1262m0744o1822
52604A454263p1307p1686o6329n6054m0076j9082L661K4314M0825N2984O0802
52593A312315O3825O2286N8389N5933N8622O8460Q4898J04403J20661J26172J14868
$$ plain form
52664 -4366147 -4433358 -4383049 -4226319 -3973163 -3634726 -3226675 -2770055 -2288955 -1806722 -1342427
52654 -1342427 -908723 -511957 -154476 163032 441642 686317 906378 1111308 1303332
52645 1303332 1471599 1591997 1632881 1564267 1367429 1042370 610946 114262 -394906 -861516
52635 -861516 -1235946 -1478757 -1563992 -1482548 -1244817 -879910 -429978 58827 545046 997071
52625 997071 1393954 1723316 1978582 2156977 2258572 2286225 2246536 2151418 2018787 1870731
52615 1870731 1729412 1612960 1533229 1494945 1494691 1520032 1551357 1568091 1556829 1516085 1454263
52604 1454263 1382956 1311270 1244941 1188887 1148811 1129729 1133390 1157704 1198529 1251513 1312315
52593 1312315 1376140 1438426 1496815 1552748 1611370 1679830 1764728 1869131 1989792 2115964 2230832
52582B230832Q4018L4114l2280j11008j95774k78211l49650m03791m38294m54164
52572H5792m53458m37151m04897l56649k94043k19753j35884m4393N0002J38108
$$ plain form
52582 2230832 2314850 2348964 2316684 2205676 2009902 1731691 1382041 978250 539956 85792
52572 85792 -367666 -804817 -1209714 -1566363 -1860406 -2080159 -2216043 -2260436 -2210434 -2072326
$$ [...]
##END NTUPLES=NMR SPECTRUM
##END=
