##TITLE=31Pdec_DE-177rm_3h
 , 24 sc
21.8.2026
##JCAMPDX= 6.0         $$ Bruker NMR JCAMP-DX V2.0
##DATA TYPE= NMR SPECTRUM
##DATA CLASS= NTUPLES
##ORIGIN= UXNMR, Bruker Analytische Messtechnik GmbH
##OWNER= root
$$ XWIN-NMR		Version 3.5
$$ Fri Aug 21 14:14:30 2026 Russian Standard Time (UT+4h)  she@DPX200
##.OBSERVE FREQUENCY= 81.013821
##.OBSERVE NUCLEUS= ^31P
##.ACQUISITION MODE= SIMULTANEOUS
##.ACQUISITION SCHEME= undefined
##.AVERAGES= 64
##.DIGITISER RES= 17
##SPECTROMETER/DATA SYSTEM= spect
##.PULSE SEQUENCE= zgpg30
##.SOLVENT NAME= DMSO
##.SHIFT REFERENCE= (INTERNAL, DMSO, 0, 197.392)
##AUDIT TRAIL= $$ (NUMBER, WHEN, WHO, WHERE, WHAT)
$$ ##TITLE= Audit trail, XWIN-NMR		Version 3.5
$$ ##JCAMPDX= 5.01
$$ ##ORIGIN= Bruker BioSpin GmbH
$$ ##OWNER= she
$$ F:/spectra/data/she/nmr/P31/2/pdata/1/auditp.txt
$$ ##AUDIT TRAIL=  $$ (NUMBER, WHEN, WHO, WHERE, WHAT)
(   1,<2026-08-21 14:12:49.84 +0400>,<she>,<DPX200>,
      <created by zg, POWCHK disabled, PULCHK disabled
       configuration hash MD5:
       00 E9 B6 7A A2 85 ED C7 34 08 36 98 17 FE 4E 26
       data hash MD5: 32K
       0B 26 1F 29 2A B7 5F C7 0D 3E 87 83 15 AA 7F 04>)
(   2,<2026-08-21 14:12:52.31 +0400>,<she>,<DPX200>,
      <Start of raw data processing
       efp BC_mod = 2 LB = 1.5 FT_mod = 6 PKNL = 1 PHC0 = 1958.989 PHC1 = 86.89841 SI = 64K 
       data hash MD5: 64K
       56 E7 85 17 77 88 3C 3C 37 38 8C 84 AE AF 1D 80>)
(   3,<2026-08-21 14:13:25.98 +0400>,<she>,<DPX200>,
      <pk PHC0 = 45.05491 PHC1 = -99.8 
       data hash MD5: 64K
       A8 B7 44 BC 8A AF 97 F8 89 7A A8 28 0A 68 87 60>)
(   4,<2026-08-21 14:13:53.39 +0400>,<she>,<DPX200>,
      <pk PHC0 = -78.28197 PHC1 = 192.7999 
       data hash MD5: 64K
       5D 14 6A 5E 76 A7 B6 EA E0 94 72 6D 6A DC DC 21>)
(   5,<2026-08-21 14:13:56.62 +0400>,<she>,<DPX200>,
      <abs ABSG = 5 
       data hash MD5: 64K
       B6 98 87 98 2D DC C1 8E 95 4B 0F 63 04 2D 1A 69>)
$$ ##END=
$$ 
$$ hash MD5
$$ 11 90 62 83 70 E8 B7 AC E6 9D 8E 0A 7E 52 B2 E4
##$RELAX= 
##$RELAX= 
##$RELAX= 
##$RELAX= 
##$RELAX= 
##$RELAX= 
##$RELAX= 
##$RELAX= 
$$ Bruker specific parameters
$$ --------------------------
##$DU= <F:/spectra>
##$EXPNO= 2
##$NAME= <P31>
##$PROCNO= 1
##$TYPE= <nmr>
##$USER= <she>
##$AMP= (0..31)
100 100 100 100 100 100 100 100 100 100 100 100 100 100 100 100 100 100 
100 100 100 100 100 100 100 100 100 100 100 100 100 100 
##$AQSEQ= 0
##$AQ_mod= 1
##$AUNM= <au_zg>
##$AUTOPOS= <>
##$BF1= 81.014009
##$BF2= 200.13
##$BF3= 200.13
##$BF4= 200.13
##$BF5= 200.13
##$BF6= 200.13
##$BF7= 200.13
##$BF8= 200.13
##$BYTORDA= 1
##$CFDGTYP= 0
##$CFRGTYP= 5
##$CHEMSTR= <none>
##$CNST= (0..31)
1 1 145 1 1 1 1 1 1 1 1 1 1 1 1 1 1 1 1 1 1 1 1 1 1 1 1 1 1 1 1 1 
##$CPDPRG= <waltz16>
##$CPDPRG1= <>
##$CPDPRG2= <waltz16>
##$CPDPRG3= <>
##$CPDPRG4= <mlev>
##$CPDPRG5= <mlev>
##$CPDPRG6= <mlev>
##$CPDPRG7= <mlev>
##$CPDPRG8= <mlev>
##$CPDPRGB= <>
##$CPDPRGT= <>
##$D= (0..31)
0 1 0 0 0 0 0 0 0 0.06 0 0.03 2e-05 3e-06 0 0 0.0002 0 0 0 0 0 0 0 0 0 
$$ [...]
##$SUBNAM3= <"">
##$SUBNAM4= <"">
##$SUBNAM5= <"">
##$SUBNAM6= <"">
##$SUBNAM7= <"">
##$SUBNAM8= <"">
##$SUBNAM9= <"">
##$SW= 400.765351723535
##$SWIBOX= (0..15)
0 1 3 0 0 0 0 0 0 0 0 0 0 0 0 0 
##$SW_h= 32467.5324675325
##$TD= 32768
##$TD0= 1
##$TE= 0
##$TE2= 300
##$TE3= 300
##$TEG= 300
##$TL= (0..7)
0 120 53 12 22 120 120 120 
##$TP= (0..7)
150 150 150 150 150 150 150 150 
##$TP07= 0
##$TPNAME0= <>
##$TPNAME1= <>
##$TPNAME2= <>
##$TPNAME3= <>
##$TPNAME4= <>
##$TPNAME5= <>
##$TPNAME6= <>
##$TPNAME7= <>
##$TPOAL= (0..7)
0.5 0.5 0.5 0.5 0.5 0.5 0.5 0.5 
##$TPOFFS= (0..7)
0 0 0 0 0 0 0 0 
##$TUNHIN= 0
##$TUNHOUT= 0
##$TUNXOUT= 0
##$USERA1= <user>
##$USERA2= <user>
##$USERA3= <user>
##$USERA4= <user>
##$USERA5= <user>
##$V9= 5
##$VALIST= <valist>
##$VCLIST= <CCCCCCCCCCCCCCC>
##$VD= 0
##$VDLIST= <DDDDDDDDDDDDDDD>
##$VPLIST= <PPPPPPPPPPPPPPP>
##$VTLIST= <TTTTTTTTTTTTTTT>
##$WBST= 1024
##$WBSW= 4
##$XGAIN= (0..3)
0 0 0 0 
##$XL= 0
##$YL= 0
##$YMAX_a= 61032
##$YMIN_a= -43860
##$ZGOPTNS= <>
##$ZL1= 120
##$ZL2= 120
##$ZL3= 120
##$ZL4= 120
##$ABSF1= 197.3918
##$ABSF2= -203.3724
##$ABSG= 5
##$ABSL= 3
##$ALPHA= 0
##$AQORDER= 0
##$ASSFAC= 0
##$ASSFACI= 0
##$ASSFACX= 0
##$ASSWID= 0
##$AUNMP= <proc_1d>
##$AZFE= 0.1
##$AZFW= 0.5
##$BCFW= 0
##$BC_mod= 2
##$BYTORDP= 0
##$COROFFS= 0
##$CY= -3
##$DATMOD= 1
##$DC= 0
##$DFILT= <>
##$DTYPP= 0
##$F1P= 0
##$F2P= 0
##$FCOR= 1
##$FTSIZE= 65536
##$FT_mod= 6
##$GAMMA= 0
##$GB= 0
##$INTBC= 1
##$INTSCL= 9.790993e-09
##$ISEN= 30
##$LB= 1.5
##$LEV0= 0
##$LPBIN= 0
##$MAXI= 10000
##$MC2= 0
##$MEAN= 0
##$ME_mod= 0
##$MI= 50
##$NCOEF= 0
##$NC_proc= -6
##$NLEV= 6
##$NOISF1= 182.463
##$NOISF2= 159.3651
##$NSP= 0
##$NTH_PI= 0
##$NZP= 0
##$OFFSET= 197.3918
##$PC= 4
##$PHC0= 1925.762
##$PHC1= 179.8983
##$PH_mod= 1
##$PKNL= yes
##$PPARMOD= 0
##$PSCAL= 0
##$PSIGN= 0
##$REVERSE= no
##$SF= 81.014063255964
##$SI= 65536
##$SIGF1= 159.3651
##$SIGF2= -187.1042
##$SINO= 113.3802
##$SIOLD= 16384
##$SREGLST= <1H.CDCl3>
##$SSB= 0
##$STSI= 65536
##$STSR= 0
##$SW_p= 32467.5324675325
##$SYMM= 0
##$S_DEV= 0
##$TDeff= 32768
##$TDoff= 0
##$TI= <>
##$TILT= no
##$TM1= 0
##$TM2= 0
##$TOPLEV= 0
##$USERP1= <user>
##$USERP2= <user>
##$USERP3= <user>
##$USERP4= <user>
##$USERP5= <user>
##$WDW= 1
##$XDIM= 65536
##$YMAX_p= 281646271
##$YMIN_p= -66252279
$$ End of Bruker specific parameters
$$ ---------------------------------
##NTUPLES= NMR SPECTRUM
##VAR_NAME=  FREQUENCY,     SPECTRUM/REAL,   SPECTRUM/IMAG
##SYMBOL=    X,             R,               I
##VAR_TYPE=  INDEPENDENT,   DEPENDENT,       DEPENDENT
##VAR_FORM=  AFFN,          ASDF,            ASDF
##VAR_DIM=   65536,         65536,           65536
##UNITS=     HZ,            ARBITRARY UNITS, ARBITRARY UNITS
##FACTOR=    0.49542278885378, 1,            1
##FIRST=     15991.5117654749, 0,            0
##LAST=      -16476.0207020576, 0,           0
##MIN=       -16476.0207020576, -66252279,   0
##MAX=       15991.5117654749, 281646271,    0
$$ Real data points
##PAGE= N=1
##DATA TABLE= (X++(R..R)), XYDATA
$$ [...]
46491 -150632 -1204623 -2338707 -2808286 -2344978 -1616858 -1582113 -2267344 -2650159 -2007861
46482 -2007861 -886569 -271377 -221036 -6200 613921 1060887 958550 714182 737687 703461
46472 703461 128488 -702140 -994445 -477350 377033 1128452 1791802 2335573 2318013 1485018
46462 1485018 449891 199122 851981 1355853 669384 -1002974 -2419125 -2567421 -1465026
46453 -1465026 119390 1326894 1634978 1100008 362654 110094 363332 543780 337216
46444 337216 128756 392372 1038695 1668223 2110797 2326795 2095285 1295531 303718 -382215
46434 -382215 -786241 -1250745 -1710382 -1706427 -1111680 -326800 297130 750225 988833 749874
46424 749874 -46269 -1021627 -1643313 -1635013 -1129046 -666146 -899379 -1876452 -2718149 -2512730
46414 -2512730 -1467199 -604075 -362518 -202488 325990 914647 1181634 1285976 1425629
46405 1425629 1347104 865778 376438 328001 586933 788244 930385 1141199 1204302 824644
46395 824644 127902 -498709 -828308 -796326 -461373 -231595 -619386 -1417167 -1708438 -1154632
46385 -1154632 -604380 -815275 -1285140 -1184042 -771030 -790364 -940491 -220741 1357028
46376 1357028 2631320 2900931 2556616 2032666 1288820 553345 409445 721634 535431
46367 535431 -441364 -1252153 -1188108 -913038 -1320390 -2080483 -2218215 -1537615 -611076 132099
46357 132099 433328 -183428 -1782098 -3249075 -3232400 -1888571 -798633 -1008853 -1942477
46348 -1942477 -2444264 -2127699 -1330277 -411551 337291 479982 -252659 -1480962 -2394393
46339 -2394393 -2505569 -1988734 -1271649 -521985 324385 1158948 1614865 1536430 1333776 1533990
46329 1533990 1996368 1955620 991856 -370606 -1245007 -1273209 -707298 63921 712772 966637
46319 966637 841209 730159 874489 916060 423331 -310181 -561017 -216227 97639 -4038
46309 -4038 -200872 -210721 -348782 -892481 -1383547 -1172473 -428078 -30345 -502156 -1493670
46299 -1493670 -2315532 -2566710 -2189074 -1312349 -234664 683516 1258556 1475768 1232782
46290 1232782 365260 -963610 -2160445 -2672873 -2411338 -1625514 -636772 149276 320921
46281 320921 -79023 -397120 -103707 454819 512767 13938 -302111 -22094 379202 410623
46271 410623 407098 956812 1879003 2424192 2336760 2107470 2185177 2483968 2729589 2780794
46261 2780794 2476508 1642670 463631 -540335 -1103984 -1408323 -1495877 -982982 249094
46252 249094 1469418 1760553 1112742 350923 21182 -150928 -610205 -1243247 -1558683
46243 -1558683 -1327506 -773893 -255717 21388 26388 -164928 -424509 -645824 -773770 -725677
46233 -725677 -367647 275070 803590 681535 -149193 -1036093 -1240229 -738140 -133258 216721
46223 216721 596182 1279572 1869758 1712128 818535 -60813 -318311 -106804 805 -303144
46213 -303144 -832011 -1176399 -1112881 -860064 -937180 -1624788 -2580055 -3140876 -2978029 -2308947
46203 -2308947 -1593153 -1236925 -1422939 -1870449 -1887604 -1119190 -206383 -191814 -1203419 -2246883
46193 -2246883 -2436195 -1883397 -1151937 -437585 265765 667761 438722 -251028 -924479
46184 -924479 -1386386 -1725535 -1885571 -1659283 -1057993 -339043 317560 908095 1444249 1920439
46174 1920439 2352531 2641751 2536440 1976164 1348874 1128316 1305532 1382455 881075 -243020
46164 -243020 -1531653 -2248848 -1913537 -797162 317617 999018 1473572 1950355 2161294
46155 2161294 1944571 1774045 2116487 2611760 2549213 1932065 1385575 1141002 826448 258215
46145 258215 -260650 -538132 -758094 -985349 -989881 -782638 -790409 -1212938 -1652029 -1678794
46135 -1678794 -1394781 -1130662 -913221 -563729 -120233 124054 -77816 -691179 -1334875
46126 -1334875 -1468613 -928119 -288607 -315780 -946666 -1226755 -487556 772574 1493167
46117 1493167 1278312 679252 398991 560547 786617 769593 603830 540236 526703 235005
46107 235005 -353930 -692220 -319176 424869 758092 424429 -141915 -529374 -682095 -520221
46097 -520221 130389 1014527 1407137 928747 17383 -676080 -994580 -1147648 -1286010 -1470551
46087 -1470551 -1662069 -1471064 -393067 1311463 2425507 2003547 508536 -768565 -1154213
46078 -1154213 -933183 -518720 13802 585453 959714 1105992 1254373 1416054 1256605
46069 1256605 658294 44251 -160229 -141726 -417620 -1034355 -1406749 -1049964 -207859 461530
46059 461530 675420 686613 655276 257422 -812165 -2210680 -3211029 -3496207 -3321017
46050 -3321017 -2943377 -2331455 -1504893 -760369 -382024 -392556 -678849 -1076700 -1280857 -1035524
46040 -1035524 -522560 -201852 -155302 17754 515460 978730 1032302 777557 518819 385926
46030 385926 439138 720939 975330 792449 302161 200590 761700 1397026 1590687 1604075
46020 1604075 1698668 1398573 381243 -504431 -206333 876829 1378746 1012537 931774
46011 931774 1856692 2975272 3176243 2451847 1493956 657730 -1521 -269621 -126954
46002 -126954 -184377 -994884 -2097684 -2462490 -1888477 -1316557 -1570590 -2309656 -2575126 -2060281
45992 -2060281 -1401292 -1273348 -1609405 -1875357 -1809745 -1543119 -1115372 -340550 719566
45983 719566 1549747 1744370 1514003 1309049 1145482 680720 -157710 -1008495 -1518520 -1616542
45973 -1616542 -1351102 -784817 -110716 394798 633719 742576 850752 908273 758545 318789
45963 318789 -227226 -383958 267814 1488776 2447552 2576718 2098304 1502014 903115
45954 903115 267750 -161966 -214330 -240567 -631829 -1158917 -1433076 -1736135 -2565733 -3489830
45944 -3489830 -3402615 -2066616 -564335 60003 -94016 -315917 -246591 56515 441312
45935 441312 653991 454282 45771 -29203 355678 759760 997693 1502354 2501661 3412208
45925 3412208 3541252 2950814 2157950 1379243 557681 -207953 -772838 -1258293 -1833523
45916 -1833523 -2376831 -2676952 -2740089 -2619895 -2234541 -1637173 -1144192 -901663 -673151 -347403
45906 -347403 -241276 -552334 -956864 -1159738 -1372943 -1754579 -1854212 -1250590 -360221 77644
45896 77644 26812 -45708 -132010 -602793 -1227289 -1140237 -14486 1372713 2055593 1942665
45886 1942665 1681952 1727327 1801959 1275126 21366 -1222865 -1661043 -1569297 -2027272 -3249503
45876 -3249503 -3928702 -2934158 -1075484 -187852 -734573 -1380599 -956064 191683 1064846
45867 1064846 1326898 1285398 1217401 1211297 1277446 1258388 953114 542710 504325 903949 1188490
45856 1188490 884811 88983 -912270 -1992855 -2883401 -3043768 -2277945 -1125948 -261906
45847 -261906 181395 352085 147111 -554970 -1384822 -1738025 -1447442 -783652 96870 1222504
45837 1222504 2332268 2834697 2459309 1649181 1055570 798886 476772 -139598 -681493
45828 -681493 -605485 83679 760645 849542 360597 -301266 -796912 -945082 -629254 47483
45818 47483 636732 691535 190876 -584052 -1407291 -2043882 -2082042 -1319738 -202601 617838
45808 617838 1070301 1478177 1717484 1304850 407324 -32420 488474 1344837 1705732 1560428
45798 1560428 1366112 1215752 943427 680162 709875 997412 1346777 1798663 2392286 2755441
45788 2755441 2457331 1653673 931366 617946 637514 876592 1222199 1361342 1042106 496225
45778 496225 174083 127188 85989 37964 186711 377341 180112 -353106 -621281 -387342
45768 -387342 -209326 -632468 -1415134 -1949019 -2049165 -1855377 -1276714 -152108 1132562
45759 1132562 1812181 1683031 1422601 1735512 2517526 3138042 3266688 3064332 2759556
45750 2759556 2498365 2563583 3221802 4196034 4758387 4645683 4483841 4896278 5543229 5603726
45740 5603726 4969695 4268478 3781078 3158577 2398032 2252735 3128005 4175956 4199292
45731 4199292 3149002 2058686 1643835 1613485 1389401 925549 593493 594419 722475 620312
45721 620312 206518 -151242 -46816 312097 188417 -680907 -1510717 -1370007 -442424 183661
45711 183661 -79844 -714255 -964202 -733024 -364799 -3579 453477 1015014 1547480 1976837
45701 1976837 2320050 2545512 2509556 2039322 1140030 201232 -183754 113422 392858 -151910
45691 -151910 -1340621 -2084185 -1686523 -646642 41209 -36259 -648390 -1528315 -2522184
45682 -2522184 -3287407 -3362365 -2631888 -1448377 -278916 506377 545851 -374873 -1891818
45673 -1891818 -3096017 -3347216 -2935027 -2616167 -2566238 -2198856 -1126692 134632 770096
45664 770096 683891 447206 382954 283553 77499 133256 596080 953894 728288 234680
45654 234680 151528 572210 974913 965850 589281 51803 -391491 -416425 21195 453847
45644 453847 506170 508309 869962 1077727 233205 -1383759 -2289835 -1657965 -317399 551914
45634 551914 870649 1179921 1490688 1477716 1304523 1334270 1304974 675107 -337774 -893387
45624 -893387 -702599 -320305 -211634 -257959 -352391 -767947 -1577654 -2246585 -2226746 -1624376
45614 -1624376 -922516 -311991 340732 1031113 1487878 1516929 1270354 1123435 1335771 1813729
45604 1813729 2197336 2237217 2069814 2034247 2246489 2471886 2403359 1943465 1210568 374556
45594 374556 -482590 -1362444 -2174906 -2624011 -2481162 -2021808 -1911783 -2478004 -3307106 -3733509
45584 -3733509 -3472439 -2605272 -1322092 -4905 810546 1006218 1107295 1480102 1690549
45575 1690549 1267716 683518 702825 1055708 857015 281707 534731 1840298 2749572
45566 2749572 2149451 866767 349558 672652 993000 1272515 2145003 3348374 3710469
45557 3710469 2866827 1842368 1590286 1895608 2107733 2078620 1842575 1116796 -167412
45548 -167412 -1286269 -1362735 -403272 765017 1401396 1300778 576667 -491619 -1432913
45539 -1432913 -1817482 -1605875 -1089690 -542704 -115682 43751 -151845 -563768 -922736
45530 -922736 -1077163 -990840 -574989 223821 1141664 1637007 1372603 615266 74690 318997
45520 318997 1326479 2573922 3515604 3917678 3767516 3095058 2086569 1212898 896522
45511 896522 1026259 1082971 778349 268021 -301507 -1037041 -1889491 -2384517 -2095985 -1148684
45501 -1148684 39325 1250329 2342540 2893161 2510766 1499002 731375 695011 951950
45492 951950 734486 -89262 -815940 -663418 321322 1185758 1042460 83147 -660495 -621221
45482 -621221 -324275 -449367 -759972 -548682 143100 487783 60491 -576212 -625793 101969
45472 101969 1227095 2179226 2397959 1684515 601516 60923 256246 451974 83833
45463 83833 -469220 -590422 -345747 -124413 192277 956302 1862296 2114109 1523642 790144
45453 790144 521541 512594 234277 -370885 -856358 -774261 -26032 1045827 1765713 1595053
45443 1595053 708229 -88905 -187480 260759 740927 1040623 1213919 1116524 474704 -530511
45433 -530511 -1180280 -973365 -225223 345218 437669 260747 -38936 -533790 -1031017 -982863
45423 -982863 -239300 506004 506293 -58044 -421380 -349780 -241532 -169322 366003 1480062
45413 1480062 2427216 2515990 1950297 1299527 649185 -164489 -922522 -1297133 -1473874 -1836544
45403 -1836544 -2207445 -2041820 -1292900 -509979 -135769 -203897 -585909 -968195 -750248 340512
45393 340512 1601495 2036558 1657616 1348124 1448428 1419693 1098821 1233997 2212162 3112364
45383 3112364 2803022 1452410 233376 -96750 315927 1012229 1624017 1866670 1703414
45374 1703414 1434086 1234345 812944 -82609 -1102932 -1714135 -1920201 -2058681 -2122835
45365 -2122835 -1863648 -1379037 -984053 -605001 75377 925289 1449629 1567232 1650962 1727206
45355 1727206 1337554 420833 -330447 -378864 -86494 -107493 -446684 -633654 -573024 -666354
45345 -666354 -1118072 -1559147 -1477594 -789543 95661 625652 489860 -170340 -825275 -923119
45335 -923119 -351709 404209 636635 51904 -943434 -1637010 -1652318 -1114604 -301728 569000
45325 569000 1176279 1112044 353117 -498242 -751173 -305357 417629 1058851 1564451 1976076
45315 1976076 2296202 2534334 2670523 2631005 2446659 2260303 1995134 1299629 130343
45306 130343 -912975 -1259108 -1092352 -896339 -568081 298291 1405531 1905717 1673362
45297 1673362 1604102 2348519 3463289 4195512 4441667 4439551 4101097 3284326 2349097 1833912
45287 1833912 1798157 1948722 2155632 2366623 2288149 1716556 1017015 718168 731303 513901
45277 513901 -39339 -425420 -313534 -2007 45562 -267764 -743001 -1152696 -1294356 -1068726
45267 -1068726 -666823 -464188 -603312 -857779 -988251 -1041678 -1211800 -1569372 -2001167 -2269662
45257 -2269662 -2104201 -1423531 -539440 26441 25730 -307264 -556594 -526920 -332521 -203681
45247 -203681 -237853 -294824 -188598 -17176 -105844 -454302 -485782 290206 1496881 2212375
45237 2212375 2059294 1520958 1126973 862355 604404 600780 1046678 1523128 1383516 567560
45227 567560 -401394 -1121626 -1569919 -1714856 -1379554 -595819 311357 1122380 1832273 2246786
45217 2246786 1954712 1006773 168393 -12166 -95537 -1077419 -2883818 -4193125 -3958204
45208 -3958204 -2596832 -1354825 -875379 -803470 -565770 -81663 288208 191830 -357263
45199 -357263 -919457 -989663 -576709 -295988 -655277 -1353671 -1563179 -863947 334144 1240729
45189 1240729 1330407 660969 -145466 -338081 187421 624569 172132 -857403 -1364748
45180 -1364748 -917804 -265893 -216616 -624158 -861898 -746068 -470197 -44394 574349 1012777
45170 1012777 748233 -184264 -1174685 -1675075 -1530173 -860092 -51022 301012 -35985
45161 -35985 -472243 -224842 624156 1232454 1159500 805343 566185 224507 -459949 -1093647
45151 -1093647 -1100477 -543975 -44755 -23396 -359852 -661771 -569872 55608 928020 1405893
45141 1405893 1081081 260435 -388758 -623103 -796548 -1282673 -2002697 -2579903 -2742598
45132 -2742598 -2486321 -1991712 -1484810 -1111110 -884510 -753485 -666103 -543322 -308567 -41046
45122 -41046 38988 -101468 -146530 139329 432582 191496 -478437 -723411 44765 1340515
45112 1340515 2153779 2120029 1754025 1603937 1624214 1486971 1121283 706833 392490 267512
45102 267512 404399 655611 572803 -139846 -1150171 -1781276 -1774272 -1510005 -1455957 -1637204
45092 -1637204 -1694639 -1270340 -345233 593844 799536 6421 -1096781 -1529288 -1177778
45083 -1177778 -838393 -1020942 -1301532 -1170655 -944147 -1255311 -1983869 -2330140 -1857029
45074 -1857029 -933451 -147958 297741 586292 997874 1624733 2142615 1993654 1076762
45065 1076762 74421 -261669 36773 416402 687220 1101962 1692863 2146359 2330331
45056 2330331 2383955 2291823 1944055 1585300 1528713 1425455 635469 -549128 -992946 -393710
45046 -393710 74220 -591013 -1756562 -2136407 -1542555 -718070 25324 877179 1514635
45037 1514635 1230974 177162 -563366 -419563 11412 71675 -41998 37858 5265 -567455
45027 -567455 -1324818 -1548195 -1240106 -1046146 -1149847 -983726 -245180 426721 261587 -485551
45017 -485551 -749915 -17781 1015346 1363008 965935 605961 790836 1240982 1542945
45008 1542945 1769072 2106657 2271922 1823203 909669 186429 -25477 -20275 -61491 51192
44998 51192 508340 991687 1063341 845683 888603 1414848 2082292 2542044 2871324 3274851
44988 3274851 3631233 3613363 3120754 2305562 1249448 -16165 -1111348 -1368506 -622893
44979 -622893 331658 520233 -83477 -647632 -649808 -397091 -265568 -52609 514180 1123655
44969 1123655 1295250 1108276 900912 501353 -466798 -1565821 -1704452 -587063 752529
44960 752529 1317092 1386682 1757929 2299083 2198605 1469691 1175938 1882964 2720742 2548005
44950 2548005 1491495 627960 427094 290403 -324914 -1026730 -1062678 -341010 509348
44941 509348 874155 632221 66832 -382386 -360975 131318 733890 1149585 1451634 1769003
44931 1769003 1880749 1505603 885826 612826 819501 986320 711034 287028 264153 705422
44921 705422 1151614 1178012 791374 368322 289445 517754 551638 23540 -691616 -832638
44911 -832638 -252871 384638 539472 402899 316915 142677 -326090 -767397 -731615 -348220
44901 -348220 -56171 138334 504441 829843 530054 -408607 -1212103 -1275537 -902501 -824159
44891 -824159 -1242927 -1595078 -1209046 -140527 701912 503486 -329085 -463383 609658
44882 609658 1686979 1388377 147617 -278256 847676 2403747 3033362 2615675 1782656
44873 1782656 908936 164338 -160040 -66337 -91110 -514805 -768731 -256578 615614 911157
44863 911157 411144 -262054 -598319 -646686 -609214 -599389 -795034 -1290762 -1777822 -1855693
44853 -1855693 -1658154 -1650742 -1781443 -1431432 -394634 656513 1026361 889905 901817 1176669
44843 1176669 1133519 320688 -963302 -1957861 -2159432 -1686722 -1039332 -547644 -47290
44834 -47290 844115 2078928 2948290 2713540 1459593 96571 -563589 -523757 -284547
44825 -284547 -103202 100761 289933 262730 106037 198166 565211 702180 346530 -22844
44815 -22844 91710 388357 263508 -174833 -309113 -72601 -4464 -201190 -11958 974278
44805 974278 2299715 3281376 3699463 3576470 2894404 1892159 1064072 474485 -342420
44796 -342420 -1387817 -1796432 -1063777 -49711 91223 -431682 -387995 655162 1778914
44787 1778914 2027841 1488599 861616 574975 575741 566991 234947 -472228 -1184477 -1440626
44777 -1440626 -1143503 -471434 454085 1429010 1923672 1544436 669311 78587 -23389
44768 -23389 -75104 -274506 -271767 133368 604978 843916 1062696 1588967 2333639 2890290
44758 2890290 2926025 2396489 1674865 1465900 2154645 3169803 3442810 2592060 1206231
44749 1206231 -74209 -1141907 -1940002 -2102848 -1492325 -584343 85282 452590 617521
44740 617521 546665 454102 848625 1638774 1802031 726275 -606658 -761600 74090 268410
44730 268410 -915008 -2264930 -2371131 -1492671 -904988 -993955 -972941 -323145 446607 737552
44720 737552 842738 1470061 2650430 3671600 3983947 3685164 3106026 2420633 1845086
44711 1845086 1759680 2256889 2839750 2962443 2706412 2553108 2637944 2650465 2380583 1906215
44701 1906215 1275401 505007 -63269 36476 641076 911452 354132 -500950 -782120 -315825
44691 -315825 361079 745188 726743 403325 -39129 -296917 -117327 468139 1212905 1875923
44681 1875923 2273686 2311806 2144118 2084471 2123979 1760207 639296 -780752 -1597285 -1486339
44671 -1486339 -1032706 -967855 -1334471 -1560271 -1243206 -674298 -461752 -664803 -573171 375460
44661 375460 1658880 2178706 1730747 1328165 1762403 2477453 2465549 1807370 1496188 1882432
44651 1882432 2148014 1498296 196302 -899940 -1312002 -1099246 -482809 224779 585782
44642 585782 434358 226170 561081 1354518 1896218 1828271 1632862 1863831 2251928 2074827
44632 2074827 1285349 670430 736348 990036 712992 25494 -367849 -245626 -52028 -76026
44622 -76026 -98172 19002 -20522 -422705 -855958 -832696 -262056 556563 1184721 1169993
44612 1169993 339430 -806083 -1355945 -872856 286815 1577702 2656212 3072472 2371567
44603 2371567 942434 26070 222833 606244 86062 -911825 -1110517 -384510 13864
44594 13864 -754731 -2068543 -2791860 -2493502 -1473101 -246391 666609 932844 701371
44585 701371 427992 316497 249173 216888 334092 418518 96227 -562347 -977680 -745984
44575 -745984 -8822 845279 1389688 1149151 12125 -1292089 -1764880 -1320210 -812161
44566 -812161 -792284 -914520 -746958 -450482 -335331 -385065 -570001 -1042696 -1667695 -1925701
44556 -1925701 -1643050 -1266091 -1092959 -859786 -443849 -256625 -453188 -492811 -105336 48420
44546 48420 -523941 -1073136 -647408 283024 399435 -462362 -1045619 -517604 431458 651379
44536 651379 -80626 -1111158 -1773590 -1822569 -1391590 -826786 -362460 123664 807724 1452696
44526 1452696 1634383 1391497 1197834 1277860 1413922 1453700 1485289 1414150 921187 57570
44516 57570 -615940 -770441 -764208 -1030732 -1386998 -1363096 -979371 -753396 -985573 -1379285
44506 -1379285 -1437027 -1046377 -579299 -453556 -660159 -814058 -704767 -626122 -975302 -1659901
44496 -1659901 -2183453 -2262467 -2049709 -1741774 -1294290 -629988 120360 706378 943173 803486
44486 803486 513180 504258 991450 1611229 1802363 1553659 1404451 1650025 1969310 1982657
44476 1982657 1737000 1382540 782983 -162521 -1085100 -1441740 -1094074 -274281 824625
44467 824625 2028841 2923719 3138939 2924929 2958476 3404256 3595693 2952707 1889296
44458 1889296 1361191 1633651 1990405 1775305 1283703 1277641 1862523 2308444 2007299 1221396
44448 1221396 719488 937429 1683008 2437474 2711032 2284207 1396336 633864 402283
44439 402283 550018 666657 605261 474751 283285 -53943 -419083 -569039 -500462 -392033
44429 -392033 -202089 258702 816818 997776 776486 751017 1210520 1476548 723440 -776509
44419 -776509 -1830581 -1741177 -1011519 -514703 -455230 -464710 -356567 -290158 -259063 118713
44409 118713 1111027 2405285 3327044 3424309 2738980 1674149 769211 432432 601541
44400 601541 721939 328702 -397881 -938332 -1185579 -1432431 -1621133 -1230619 -158593
44391 -158593 881426 1277541 1319055 1525518 1644469 1069008 -16021 -724952 -638598 -122134
44381 -122134 501925 1277184 1998062 2132529 1685898 1391117 1618891 1781987 1334011 725196
44371 725196 699705 1114564 1195147 686551 41534 -387680 -664260 -801041 -620760 -217725
44361 -217725 -65296 -435591 -992740 -1126147 -535489 544097 1522403 1849715 1408880
44352 1408880 572072 -153853 -457110 -227414 459386 1209291 1477533 1140190 657449
44343 657449 414016 199286 -311436 -868562 -922024 -399031 268711 762200 1037580 972471
44333 972471 382154 -574128 -1421533 -1840983 -1809127 -1398022 -849987 -684958 -1175253 -1795595
44323 -1795595 -1787672 -1204046 -712928 -421198 220435 1186093 1552150 890595 87240 49548
44313 49548 329986 -69724 -1043866 -1531474 -1046881 -77459 930951 1964704 2725659
44304 2725659 2558144 1503170 600991 582261 872377 503984 -468594 -1162132 -1163135 -885206
44294 -885206 -704584 -454046 53101 541986 621221 286030 -191472 -654754 -1094361 -1422435
44284 -1422435 -1455339 -1112532 -524677 42920 364569 444976 532366 789291 963629 645374
44274 645374 -86819 -607171 -526254 -202458 -150554 -248822 -23896 462299 628057 297064
44264 297064 -6829 118287 398921 464374 447919 550751 459063 -167926 -887085 -868623
44254 -868623 -92036 519755 329399 -209442 -259716 327185 1022244 1409822 1545541 1618169
44244 1618169 1608196 1349295 763636 -11237 -667281 -916108 -697351 -216828 176199 107652
44234 107652 -673824 -2017216 -3263371 -3716019 -3309455 -2573753 -1883524 -1078765 2128
44225 2128 989749 1352495 1096569 737212 692454 1019992 1586073 2066745 1897680 800353
44215 800353 -539442 -884319 155837 1562642 2112353 1766075 1384197 1362843 1234404
44206 1234404 610962 -136518 -384407 29133 878396 1934225 2912232 3357276 3027389
44197 3027389 2239741 1455198 661874 -426759 -1695440 -2657955 -3166011 -3565498 -4008575
44188 -4008575 -4097448 -3489464 -2497011 -1768429 -1596018 -1774687 -1916414 -1685331 -979499 -147090
44178 -147090 207821 -79134 -428864 -183849 628592 1472048 1980734 2095541 1763436 995421
44168 995421 142795 -340504 -427910 -484924 -761203 -1238934 -1845830 -2389428 -2400019 -1567589
44158 -1567589 -314387 596030 1024803 1457652 2002606 2088210 1401084 466570 -88772
44149 -88772 -297175 -434190 -355071 200553 1001896 1583534 1873299 2084661 2217711 2150972
44139 2150972 2011131 1947871 1740763 1169324 595339 561710 907982 948320 531800 217335
44129 217335 252166 110288 -591130 -1343873 -1454460 -1068322 -872516 -994558 -840061 -72548
44119 -72548 766476 866671 122453 -741059 -940393 -383864 351956 709246 723164 855377
44109 855377 1327904 1821940 1930426 1731721 1685726 1994985 2301219 2112318 1389489 574936
44099 574936 103098 31518 144939 246174 241309 72754 -231821 -468000 -426937 -233090
44089 -233090 -323761 -936437 -1720647 -2019920 -1490552 -327670 1017484 2144908 2791786
44080 2791786 2897239 2694111 2558278 2621534 2632267 2326953 1857076 1677549 1998214 2466526
44070 2466526 2448775 1579773 37676 -1619067 -2825734 -3319790 -3214729 -2782636 -2129956
44061 -2129956 -1181315 -92924 496375 3585 -1252430 -2146335 -1947100 -1119086 -604475
44052 -604475 -621128 -665384 -482603 -364076 -482555 -634129 -818768 -1374600 -2172360 -2354860
44042 -2354860 -1481027 -423992 -391583 -1344726 -2147363 -2132960 -1713881 -1417312 -1171820 -856759
44032 -856759 -833389 -1381705 -2041081 -2095477 -1548045 -1132075 -1372723 -2008703 -2421018 -2370343
44022 -2370343 -2140679 -2050819 -2018963 -1725927 -1135593 -622187 -481884 -545389 -493080 -358588
44012 -358588 -406740 -652254 -876377 -1035265 -1224140 -1283978 -971117 -586014 -834198 -1792063
44002 -1792063 -2546930 -2284612 -1325896 -603527 -434607 -383640 -165256 -40843 -239333 -504471
43992 -504471 -467483 -175046 5048 -116593 -319628 -226785 275837 887838 1181253 998498
43982 998498 461492 -341014 -1383596 -2363135 -2718799 -2281667 -1624273 -1406548 -1585551
43973 -1585551 -1663575 -1507497 -1385973 -1273459 -756464 188046 852659 575927 -463344
43964 -463344 -1521410 -2092619 -2147265 -1820712 -1261218 -716785 -438630 -438306 -504769 -469941
43954 -469941 -342722 -215728 -157486 -174727 -209506 -223630 -313625 -606044 -977328 -1074280 -752614
43943 -752614 -295975 -2431 238372 666612 1121289 1176400 757583 222018 -213726 -712206
43933 -712206 -1338202 -1739797 -1587470 -1059111 -578701 -271137 -14405 107931 -165542 -734213
43923 -734213 -980150 -392544 763650 1586644 1382255 342308 -626392 -751903 -56830
43914 -56830 837475 1422720 1607324 1400878 738744 -161317 -643644 -242509 690643 1372391
43904 1372391 1483393 1280312 936892 331258 -427519 -802354 -442364 338409 934362
43895 934362 1038441 700943 128033 -349687 -388839 49594 700961 1405072 2145257 2568872
43885 2568872 2052523 634091 -649522 -907658 -441198 -10308 475451 1584552 2883777
43876 2883777 3001438 1507152 -193546 -445974 752116 2029353 2396049 2071291 1777093
43867 1777093 1876801 2285668 2742496 2933000 2599636 1798175 1012018 814931 1297754 1902167
43857 1902167 2011591 1719207 1741054 2433446 3231824 3394064 3008534 2756935 2832615 2708381
43847 2708381 2014845 1052747 255701 -328866 -769005 -919642 -681548 -246615 187350
43838 187350 646404 1122917 1446312 1633394 1976852 2519341 2848922 2744260 2613171 2878150
43828 2878150 3278552 3244468 2696942 2036279 1571966 1388897 1534232 1867619 1920789 1387522
43818 1387522 628414 265931 409977 675613 784343 709117 405506 -110868 -546586 -651413
43808 -651413 -610364 -655842 -516904 144167 928601 1063802 537422 131337 255626 501696
43798 501696 539484 688703 1212670 1683134 1559768 981762 505171 324438 139761 -394607
43788 -394607 -1352174 -2454560 -3139879 -3019479 -2472432 -2435023 -3303813 -4326426 -4376362 -3116591
43778 -3116591 -1179135 519336 1363257 1232557 510014 -180097 -471164 -445659 -308959
43769 -308959 -135357 -6209 -25305 -27053 335533 986706 1347878 1181497 1068134 1585167
43759 1585167 2370753 2537337 1780286 578446 -491932 -1130443 -1204584 -846549 -546787
43750 -546787 -600021 -568304 103884 1038671 1231721 481113 -272443 -295467 7738 -23686
43740 -23686 -183418 126533 737779 897006 511076 395188 1077790 2000306 2290489 1897164
43730 1897164 1475381 1370419 1251162 792290 276914 267185 880216 1635353 1954699 1655336
43720 1655336 1014219 521606 542305 1041425 1607366 1846599 1745370 1550473 1390702 1228318
43710 1228318 1123067 1227290 1447357 1415401 969587 425505 172051 196161 218630 109870
43700 109870 -82115 -348357 -654263 -774863 -561189 -358745 -771072 -1857917 -2857711
43691 -2857711 -2948625 -2158233 -1312791 -1132251 -1549630 -1938534 -1852592 -1413746 -1017530 -823307
43681 -823307 -645370 -277898 216564 559634 517280 136593 -165136 189097 1404483 2931938
43671 2931938 3818385 3571170 2583843 1674921 1359481 1588469 1948336 1994854 1613398 1195072
43661 1195072 1246177 1692965 1862617 1386236 815993 941499 1644298 1896954 989434 -533149
43651 -533149 -1300657 -406197 1723452 3656688 4207301 3430834 2324596 1626965 1243816
43642 1243816 877892 647484 707230 758778 547934 517866 1243322 2375804 2943256 2724360
43632 2724360 2531115 2937086 3499779 3602047 3339938 3030416 2442183 1249068 -96667
43623 -96667 -706479 -384496 202964 462778 410916 248079 -2692 -244267 -202016 123050
43613 123050 280304 -7530 -349768 -218898 236105 389183 86885 -121908 172027 664063
43603 664063 915028 1081226 1541535 2028638 1810411 812168 -84378 -177743 137450 59679
43593 59679 -409695 -565900 -120853 459998 785809 1061936 1527720 1880900 1663255 932315
43583 932315 173270 -294048 -499910 -547761 -505129 -557013 -936504 -1564842 -1948666 -1618109
43573 -1618109 -634085 451668 1138577 1371867 1375004 1283556 1164379 1272333 1869694 2666438
43563 2666438 2855726 2035559 797989 10437 -222831 -381814 -538106 -238444 593818
43554 593818 1338473 1500594 1293115 1117205 982999 791231 695251 751095 647450 282541
43544 282541 201312 826558 1540379 1275786 -32379 -1289462 -1633342 -1348885 -1161970
43535 -1161970 -1195641 -1053144 -581821 -61119 272319 491914 723330 895778 899686 851831
43525 851831 988461 1256309 1210452 547382 -328305 -603149 -43544 624395 584321 -60336
43515 -60336 -498533 -278550 269258 650695 778933 769046 551428 4323 -703925 -1185957
43505 -1185957 -1213817 -867474 -342908 256304 935453 1687429 2367930 2719467 2610372 2254021
43495 2254021 2053193 2154788 2273759 2059040 1532804 1022913 725120 536599 365303
43486 365303 395043 850525 1588507 2177984 2438105 2646905 3037536 3296019 2886188 1834326
43476 1834326 859901 625512 1084314 1664043 1877278 1634029 1164150 790940 643399
43467 643399 507538 139168 -245263 -104127 682110 1570221 2082087 2360092 2633091 2553239
43457 2553239 1668746 343327 -452582 -257083 524443 1357523 2071791 2552914 2612145
43448 2612145 2423373 2514314 2976375 3188492 2734457 2124045 2072410 2419167 2383315 1708342
43438 1708342 932317 552378 499275 535375 666043 945477 1246462 1459830 1667437 1917499
43428 1917499 2039873 1878845 1554324 1331629 1358786 1643759 2129232 2653659 2983116 3007400
43418 3007400 2760743 2180848 1145252 -33522 -489832 341675 1872703 2862247 2799062
43409 2799062 2303516 2056531 1904588 1372810 572702 44491 -20336 206534 801456 2016557
43399 2016557 3511586 4331593 3988958 3104080 2593859 2576410 2482288 1977513 1325423 961959
43389 961959 1083635 1549274 1861646 1408468 149958 -1023301 -1107422 -205106 518218
43380 518218 210038 -767979 -1507382 -1698491 -1741047 -1955609 -2120020 -1818227 -996031 -70105
43370 -70105 439988 352961 -74680 -452796 -578047 -423178 -8292 485403 613806 54742
43360 54742 -888501 -1532633 -1644410 -1638976 -1801036 -1769652 -1161282 -343043 -62428 -444307
43350 -444307 -844379 -677119 56213 1087513 2232572 3225085 3624522 3252756 2518825
43341 2518825 1992631 1782136 1629512 1514966 1760170 2436429 3012584 2869996 2049912
43332 2049912 1246351 1055672 1388726 1630586 1236952 160290 -1129063 -1944566 -1871213
43323 -1871213 -1162235 -622045 -904422 -1847200 -2580888 -2357084 -1252060 -61551 442189
43314 442189 155899 -351652 -414201 127192 837893 1174734 1036435 829591 1015900 1610152
43304 1610152 2117427 1992105 1206332 320729 -111249 -163825 -379746 -986594 -1538369 -1477214
43294 -1477214 -817809 -66721 330672 206984 -441469 -1387071 -2078697 -2055243 -1516768 -1140047
43284 -1140047 -1250463 -1498739 -1431100 -1016052 -469549 69706 478724 618857 647372 1033328
43274 1033328 1892692 2564210 2296170 1227893 246259 -86940 -25138 -36037 -184851 -305771
43264 -305771 -410108 -619241 -888869 -1065339 -1106863 -1045502 -834317 -438601 4007 334536
43254 334536 630102 1063875 1511423 1586277 1186667 752937 749260 1048154 1135177 898860
43244 898860 884247 1599475 2787201 3644338 3718134 3345850 3129106 3156714 2960126 2224342
43234 2224342 1303842 835786 938537 1076592 780878 219685 -131635 -134419 -1718 140908
43224 140908 324552 458850 395589 244707 217606 190334 -81026 -320635 40291 858335
43214 858335 1238417 829962 401927 600279 891332 512301 -183004 -318510 34403 118311
43204 118311 -35611 358228 1316380 1861806 1621062 1480762 2136479 2998418 3187464 2759722
43194 2759722 2220856 1572664 658128 -135706 -376747 -370373 -628028 -875506 -395319 841875
43184 841875 2118588 2889248 3079163 2632730 1532657 285915 -294070 54186 846725
43175 846725 1537488 1947472 2044176 1809033 1386746 941231 351831 -500058 -1145354 -785041
43165 -785041 670599 2244952 2855994 2422242 1835250 1967381 2807470 3516315 3341033
43156 3341033 2483594 1895277 2157127 2863640 3248812 2993782 2136006 727527 -828285
43147 -828285 -1522025 -622821 1291628 2864891 3450313 3440797 3258477 2849202 2252596 1826839
43137 1826839 1616735 1210919 588675 460156 1281383 2433212 2923818 2586306 2072098
43128 2072098 1866955 1815514 1577780 1140010 750390 557219 468301 368949 395732 842389
43118 842389 1722118 2586483 2941312 2718219 2196768 1665159 1355926 1452198 1842805 2087545
43108 2087545 1947786 1727517 1779666 1986687 2092466 2138216 2101486 1629439 822064 730235
43098 730235 2092507 3971575 4803261 4563368 4576989 5229332 5381560 4382902 3157255
43089 3157255 2612290 2307829 1621171 1090033 1476366 2345192 2743743 2707972 2975082 3599050
43079 3599050 3918016 3706520 3468713 3672059 4336164 5196426 5734416 5380289 4267426
43070 4267426 3393302 3417368 3764256 3605704 3165447 3131207 3266238 2762762 1769196 1393435
43060 1393435 2121850 3244171 4006672 4437670 4812744 5122102 5376748 5776766 6258071
43051 6258071 6388049 5967772 5324078 4838145 4550688 4328386 4104925 3955296 4179149
43042 4179149 5087823 6346275 6919744 6300635 5434260 5610073 6680240 7319505 6926558
43033 6926558 6210425 5836147 5617859 5369301 5490293 6151053 6742737 6782434 6720929 7208179
43023 7208179 8030935 8382465 7880695 6860421 5913964 5477915 5597545 5826537 5639231
43014 5639231 5129508 4956008 5438330 6127943 6457193 6353468 5992061 5434789 4824154
43005 4824154 4510417 4648124 4977173 5231591 5434486 5620255 5649880 5475955 5219165 4872030
42995 4872030 4339359 3812918 3590204 3505321 3180450 2866433 3223565 4138710 4703788 4659073
42985 4659073 4817812 5545545 5890546 5041822 3746932 3281303 3664832 3906155 3509695
42976 3509695 2758001 1927120 1220671 1142924 1914863 2730521 2568665 1611875 951162 1014074
42966 1014074 1217894 1101434 844883 659797 600810 1044189 2389829 4093768 4904333
42957 4904333 4377017 3404922 2968855 3092855 3330572 3530837 3684413 3621034 3324956 3115908
42947 3115908 3168664 3258368 3247993 3390000 3885183 4574049 5294423 6080670 6769797 6908317
42937 6908317 6365310 5627038 5220618 5236024 5573188 6125902 6508314 6234524 5523694 5307954
42927 5307954 5999435 6850163 7050685 6847897 6906184 7121067 6925592 6419797 6267576 6586888
42917 6586888 6809103 6695065 6729613 7332672 8285158 9124360 9609176 9649250 9256993 8728694
42907 8728694 8433593 8289969 7890146 7242757 6854983 6895822 6871389 6470136 6164900 6466574
42897 6466574 7018837 7047138 6425344 5647088 4897352 3876907 2612808 1750571 1729438
42888 1729438 2148384 2323179 2151283 2050227 2246465 2498239 2461656 2086611 1708672 1887491
42878 1887491 2959168 4521196 5586084 5585769 5044544 4853255 5060626 4973419 4422345 4182601
42868 4182601 4834146 5840628 6273471 5987437 5462632 4816271 3735283 2309435 1149363
42859 1149363 492828 -138002 -1033457 -1591404 -1035713 463587 1935261 2779243 3303696
42850 3303696 4027440 4860928 5222964 4787977 3895603 3236018 3216881 3625260 3875704 3600696
42840 3600696 2983000 2482591 2327352 2419121 2684933 3241158 4078121 4824457 5104331 5022765
42830 5022765 4996348 5145131 5206864 5102388 5167522 5597547 6021871 5977233 5546641 5154142
42820 5154142 4952915 4856559 4980476 5506562 6207319 6696870 7118892 7907975 8820916 9033833
42810 9033833 8483937 8235836 8924995 9613063 9064928 7641541 6879889 7372781 8097256
42801 8097256 7958978 7080494 6204629 5551350 4812226 3891491 3154792 3036041 3607069
42792 3607069 4413824 4681079 3952355 2668395 1872679 2187159 3258005 4302578 4964817
42783 4964817 5470953 6131222 6915253 7518272 7755151 7803485 7932766 8010020 7568920 6533660
42773 6533660 5545616 5249088 5534398 5876999 6117341 6366919 6410084 5911438 5120457 4630529
42763 4630529 4442478 4055598 3564184 3746576 4746229 5558509 5371795 4649456 4208804
42754 4208804 3918080 3183143 2243143 1959929 2466984 2974875 2994755 2920665 3158178 3397355
42744 3397355 3172341 2647976 2381793 2600728 3148486 3951187 5046837 6161988 6737777
42735 6737777 6608080 6338605 6554323 7108531 7340355 7094997 6934934 7164594 7233767 6569171
42725 6569171 5539171 4953164 4902685 4854879 4760817 5212264 6376850 7570967 8177040
42716 8177040 8321188 8329539 8161691 7793210 7588532 7815363 8217513 8457523 8532085 8386277
42706 8386277 7665984 6363290 5234962 5011167 5543013 6219093 6817048 7416568 7902841
42697 7902841 8179694 8512471 9021618 9175711 8462775 7256550 6300622 5617104 4721156
42688 4721156 3693844 3122688 2994238 2563292 1555170 765475 1089360 2382788 3576723
42679 3576723 3705432 2734851 1537053 995080 1057049 976475 567530 541945 1207239 1702852
42669 1702852 1375375 1116461 2091511 3662946 4055226 2906837 1632595 1161038 875504
42660 875504 189126 -354560 -274899 -156228 -571990 -1039163 -939284 -589825 -485557 -265516
42650 -265516 588803 1650289 2095249 1883289 1552746 1296949 1040895 975870 1199674 1232640
42640 1232640 675529 -50856 -361786 -420967 -598950 -575014 55510 797039 1006001 1196641
42630 1196641 2279598 3733092 4014567 2910220 2023890 2490172 3495843 3754182 3353914
42621 3353914 3230943 3546886 3576464 2887438 1866067 1174215 1169429 1763879 2540566 3123112
42611 3123112 3567696 4134502 4613610 4369341 3292130 2192037 1845348 2071178 2227200
42602 2227200 2266490 2689107 3564693 4217291 4073843 3484258 3404145 4283389 5462997 5882437
42592 5882437 5383262 4961810 5472408 6464782 6877205 6649503 6856946 8215504 10303354
42583 10303354 12483727 14632793 16356198 16372718 13757880 9503082 5873307 4176300
42575 4176300 3816470 3514762 2761254 1938380 1609703 1949085 2541955 2654718 2008768
42566 2008768 1256487 1273640 2011531 2574640 2477619 2201170 2280261 2454953 2149365 1337669
42556 1337669 441522 -319293 -970919 -1393613 -1405639 -1165939 -1039815 -1058729 -882535 -306680
42546 -306680 523878 1387312 2104577 2383010 1966616 1061384 236713 -243515 -626320 -1057006
42536 -1057006 -1237571 -1048265 -1077209 -1947465 -3298653 -4045614 -3679930 -2798724 -2229097
42527 -2229097 -2116071 -2096960 -1925159 -1547538 -880194 32147 773422 935106 761468 1008087
42517 1008087 1982980 3012952 3129323 2171597 961877 382381 501964 729183 650507
42508 650507 445888 470471 733843 1016100 1308584 1801537 2459303 2946385 3076324 3045513
42498 3045513 3044884 2882445 2261350 1321465 640824 684369 1393806 2311523 2981539 3216618
42488 3216618 3068862 2612931 1828894 769365 -232817 -724904 -559207 -28108 441932
42479 441932 588062 361602 -22915 -60149 650725 1809903 2547836 2388832 1794166 1497886
42469 1497886 1631411 1855205 2039868 2309777 2559372 2449186 1911292 1270878 816076
42460 816076 544096 355588 248781 319642 742565 1623712 2658125 3164738 2819993 2152968
42450 2152968 1883492 1955008 1732608 1016659 275114 -69330 15539 498286 1291204 1910374
42440 1910374 1867419 1541465 1908162 3160682 4356177 4747351 4652662 4539907 4104838
42431 4104838 3010888 1855140 1469280 1682958 1698691 1413682 1429798 1874688 2163622
42422 2163622 2022259 1904945 2171517 2545233 2664919 2591541 2469790 2188152 1698003 1266960
42412 1266960 1103846 1059072 979971 1081294 1688154 2813434 4172573 5381329 5983939
42403 5983939 5609591 4402654 3103774 2411230 2343994 2406389 2226448 1806663 1271458
42394 1271458 676795 142627 -4558 589660 1882069 3204985 3670971 3016584 1965196
42385 1965196 1508865 1851742 2314339 2265644 1817070 1502225 1604810 2026399 2596897 3247233
42375 3247233 3933298 4545760 4889789 4758512 4148740 3385192 2824708 2425478 1865404
42366 1865404 1126071 625333 623976 836000 885225 882950 1228448 1985159 2747292 3048863
42356 3048863 2717620 1982976 1447953 1724800 2741611 3555231 3264946 2064779 980329
42347 980329 576479 421142 -36569 -590768 -677234 -299190 -23608 -131287 -263281 -43233
42337 -43233 316761 291348 -258462 -905410 -1102033 -620473 375004 1455368 2126748 2156456
42327 2156456 1803418 1548015 1507817 1331118 797151 256772 202554 590243 935931 985211
42317 985211 912540 916253 1055664 1505239 2442344 3503649 3897347 3434764 2995945 3430210
42307 3430210 4287769 4274486 2874559 910453 -546466 -1208268 -1315273 -939819 -23291
42298 -23291 1166759 2089792 2442049 2380464 2262393 2303814 2428909 2352160 1911828 1387351
42288 1387351 1267407 1554525 1594228 936342 155508 314528 1603280 3012716 3560985
42279 3560985 3415761 3443058 3955622 4435812 4451316 4301204 4491509 4898992 4852696 4000992
42269 4000992 2793656 2025017 2107421 2915415 4149520 5574697 6905986 7755874 7931995
42260 7931995 7734845 7799242 8639783 10421931 13021321 15978009 18349357 19020985 17561446
42251 17561446 14711049 11766240 9509472 7928005 6803947 6114254 5767856 5402915
42243 5402915 4754180 3980118 3353859 2835227 2251671 1748557 1715152 2306859 3302986 4355309
42233 4355309 5085736 5055794 4098508 2766069 2036351 2345011 3150487 3625191 3531800 3228338
42223 3228338 3064854 3071976 3111102 3031424 2697357 2101728 1511885 1357422 1868304 2816010
42213 2816010 3627823 3824499 3439370 2977972 2865480 3004212 3034573 2910441 2891159 2986903
42203 2986903 2832917 2265817 1660568 1469337 1723288 2205899 2785154 3284304 3349342 2826687
42193 2826687 2043195 1372946 795965 256151 97474 575416 1200812 1266848 917093 955695
42183 955695 1591905 2153386 2196808 2101247 2230478 2279163 1979770 1800771 2241998 2890771
42173 2890771 2946043 2431333 2133660 2426824 2871463 3034416 3038818 3093381 3021209 2585860
42163 2585860 1951907 1525095 1518916 1847768 2256774 2425252 2151476 1583826 1096826 840362
42153 840362 641731 480451 748185 1721055 2956418 3618062 3426539 2965237 2925784 3310625
42143 3310625 3588770 3451574 3094584 2774695 2440081 1976055 1554501 1430385 1518266 1527731
42133 1527731 1500625 1813998 2532530 3160834 3321756 3376568 3992067 5259903 6626525
42124 6626525 7602812 8148285 8370703 8266287 7884490 7428630 7023173 6610325 6210323
42115 6210323 6033237 6127634 6120065 5591778 4668881 3992124 4023748 4514453 4773576 4444338
42105 4444338 3889066 3715877 4015001 4287478 4173063 3984287 4325507 5381783 6832473
42096 6832473 8292348 9515016 10297393 10618079 10894465 11705165 13144074 14765658 16265746
42087 16265746 17882403 19989622 22644479 25752196 29355222 33408126 37369747 40258881
42079 40258881 41135366 39593479 36070224 31746728 27804157 24556082 21531986 18501956
42071 18501956 15985469 14455116 13479166 12204620 10505558 9103387 8546985 8528191 8317337
42062 8317337 7561803 6541330 5856681 5947811 6732251 7616644 7948628 7512951 6617644
42053 6617644 5820933 5589766 5974495 6465857 6407987 5750657 5148522 5090179 5244062 5026662
42043 5026662 4519296 4308107 4585026 4989189 5330776 5904198 6925326 8086699 8876055
42034 8876055 9058323 8718365 8085737 7436518 6979598 6770299 6826429 7189286 7658284 7698522
42024 7698522 7011958 6049115 5517667 5534777 5769277 6238277 7256929 8613731 9560973
42015 9560973 9805482 9863267 10262924 11051018 12234807 13929669 15785660 17107099 18004005
42006 18004005 19650821 22855036 27095723 31520635 35977810 40187685 42767657 42389011
41998 42389011 39540257 35965245 32591516 29190973 25907029 23695991 22967302 22990584
41990 22990584 23127044 23645547 24789295 25985290 26702357 27343240 28466144 29658462 30048833
41981 30048833 29635260 29266925 29380625 29496262 29115096 28595738 28876545 30554189 33372416
41972 33372416 36475622 39062111 40836351 41921117 42524644 42904509 43527078 44826372
41964 44826372 46660666 48333265 49328126 49728831 49720227 49005194 47029592 43602517 39071608
41955 39071608 34105901 29525350 26033607 23704736 21855359 19782964 17567977 15840068
41947 15840068 14846150 14165657 13419064 12850969 12890090 13284015 13075821 11654926 9641919
41938 9641919 8339449 8220557 8379420 7806641 6810930 6550001 7355260 8374934 9016336
41929 9016336 9837442 11475519 13402447 14527488 14634592 14398857 14151556 13461282 12023727
41920 12023727 10257601 8758853 7679928 6953258 6740833 7281789 8437469 9646938
41912 9646938 10318132 10198184 9443489 8387711 7230229 6027183 5020214 4709856 5313312
41903 5313312 6301336 6843439 6684980 6257882 5974350 5845906 5884889 6424217 7729064
41894 7729064 9514452 11128172 12155860 12736298 13371752 14469725 15916890 17060173
41886 17060173 17291278 16694545 15900064 15257769 14479392 13262203 11925413 11074351 10813300
41877 10813300 10687800 10377862 10071224 10040782 10151430 10003445 9416408 8574333 7780639
41868 7780639 7263278 7157323 7416851 7682572 7479173 6711208 5801766 5161380 4695847
41859 4695847 4124186 3659182 3942718 5192466 6743480 7653437 7589521 6973899 6433028
41850 6433028 6270333 6361768 6428608 6430784 6617467 7026695 7130723 6450030 5484423 5395049
41840 5395049 6539897 7932737 8503315 8277391 7825767 7215510 6284643 5452127 5291782
41831 5291782 5544961 5506100 5250310 5462650 6052983 6063225 5217834 4492665 4652505 5184513
41821 5184513 5342031 5401963 6037575 7064846 7755215 8038153 8491319 9294820 10007407
41812 10007407 10371301 10673610 11280608 12366198 14070306 16303204 18297760 18938566 17801585
41803 17801585 15558625 13256045 11515301 10462225 9970899 9746156 9472334 9114747 8908238
41794 8908238 8944604 8987601 8815864 8542092 8436750 8567686 8743320 8737458 8498732 8193891
41784 8193891 8067683 8211181 8479943 8655550 8584382 8133791 7258474 6290808 5904424 6441317
41774 6441317 7405417 7979919 7957860 7775662 7704393 7527859 7126684 6862130 7071275 7542234
41764 7542234 7858205 8023569 8347038 8822916 9061577 8891432 8650413 8652349 8607019 7929598
41754 7929598 6624829 5533524 5506908 6526110 7864640 8941242 9651352 9957427 9696397
41745 9696397 8987992 8386235 8291316 8514985 8727550 8986918 9430393 9799316 9829822 9873967
41735 9873967 10481692 11470329 12096976 12173608 12298572 12822222 13288918 13222444 12829397 12485092
41725 12485092 12070255 11375432 10755051 10734769 11153098 11266468 10660892 9616425 8604006
41716 8604006 7826732 7275427 6903269 6684152 6681762 7008973 7572376 8053543 8380514 8948258
41706 8948258 9986736 10955851 11089269 10398825 9564111 8907174 8170298 7382269 7154680
41697 7154680 7752075 8525707 8791212 8757609 8987325 9356878 9302664 8891144 8842923 9442254
41687 9442254 10122585 10332593 10225519 10212187 10346399 10536585 10975335 11899776 13108541
41678 13108541 14070354 14409361 14088203 13335385 12617972 12394201 12579141 12556106 12104126
41669 12104126 11970502 12950828 14655603 15921625 16371979 16749575 17555033 18179890 17806032
41660 17806032 16510508 14966633 13588584 12568426 12324467 13163532 14613573 15679218
41652 15679218 15774475 15072995 14114355 13466704 13560697 14338051 15165714 15553903 15824271 16589458
41642 16589458 17754076 18642750 19029611 19378351 20041293 20867516 21688127 22566007 23464984
41633 23464984 24318821 25551140 27809711 30973508 34185067 37190243 40844675 45804590
41625 45804590 51512462 57202462 63286895 70917708 80627800 92289842 106142291 122938913
41617 122938913 143030721 165750278 189253161 210070192 223221681 224417049 213128820
41610 213128820 193184238 169998713 147469614 127328638 110280343 96733433 86598721
41603 86598721 79120517 73245188 68177898 63715835 60141746 57700452 56172128 55096705
41595 55096705 54348108 54258763 55255698 57636478 61551821 66817426 72906972 79693416 88131035
41586 88131035 99539445 114179503 131297082 150652629 172806398 196946065 218999409
41579 218999409 233009885 234717600 223864417 203784666 179534960 155859522 135480596
41572 135480596 118533542 103792969 90545226 79105289 69820818 62317767 55950163
41565 55950163 50528808 46308270 43443013 41575868 39867103 37574713 34876418 32889202
41557 32889202 32378416 32584356 31954568 30024498 27861162 26530506 25945121 25583003 25506710
41548 25506710 25975987 26654190 27045522 27382837 28241520 29453550 30263024 30546386 31032152
41539 31032152 32160608 33535323 34808047 36334490 38440136 40655447 42332463 43611445
41531 43611445 45110551 46955634 48861144 51049309 54294064 58918353 64440076 70512834
41523 70512834 77639965 86506679 97022830 108614295 121347470 136276078 154588488
41516 154588488 176601323 201385611 226830999 249949224 267706271 278268583 281646271
41509 281646271 278937163 270870065 257285248 238197529 215181656 191309228 169504885
41502 169504885 151063483 135835119 123521913 114314076 108229151 104308184 100865016
41495 100865016 96520803 90934227 84739845 79013073 74690329 72193476 71384473 71698366
41487 71698366 72149563 71381329 68319090 63195648 57658176 53402748 50786468 49085756
41479 49085756 47808574 47074909 46757183 46106320 44679061 43109954 42437580 42968359 44273217
41470 44273217 46010298 48098352 50075787 50888506 49651171 46483453 42499273 39037851
41462 39037851 36760555 35195476 33172656 29996835 26242069 23164987 21359807 20314999
41454 20314999 19301461 18233639 17428896 16940174 16578291 16416642 16803527 17817511 19017949
41445 19017949 19832754 19989645 19503137 18478632 17119056 15795228 14855324 14293944 13741844
41436 13741844 12907428 11987565 11497470 11656871 12096273 12291926 12153551 11971946 11888532
41427 11888532 11743202 11467186 11250055 11153763 10932826 10545218 10511649 11290239 12487933
41418 12487933 13293230 13697721 14622107 16546015 18602043 19586031 19526002 19571174 20384075
41409 20384075 21331838 21518468 21073237 20917938 21489103 22213329 22287675 21574436 20533776
41400 20533776 19543282 18578982 17492481 16336796 15351319 14775103 14751001 15302965 16294924
41391 16294924 17431229 18355512 18771173 18538444 17780330 16876447 16151908 15492996 14482394
41382 14482394 13069369 11866005 11473221 11674227 11714837 11354521 11155635 11586600 12321261
41373 12321261 12775498 12983741 13481231 14516411 15886878 17501529 19574105 22130009
41365 22130009 24793953 27370333 30310347 34171556 38655294 42501025 44464896 44358679
41357 44358679 43200471 42511967 43423282 46126048 49844826 53293251 55479413 56495863
41349 56495863 57670548 60664441 66004936 72372867 77548606 80312839 81434959 82633439
41341 82633439 84491168 85557254 83742682 78597488 71937274 66117044 62016770 58971380
41333 58971380 56194931 53503251 50728445 47383421 43359494 39299088 35721426 32300945
41325 32300945 28639891 25288428 23199347 22432022 22196620 22019150 22038533 22244854 22330826
41316 22330826 22360046 22695184 23127171 22983204 22304446 21944199 22175078 22241206 21782459 21591751
41306 21591751 22196179 22752161 22404100 21852847 22300708 23483327 24166836 24231916 24768861
41297 24768861 26138523 27358032 27634196 27253467 26624252 25632342 24445950 23883381 24301884
41288 24301884 24934969 24974530 24621569 24470104 24513931 24404674 24108495 23643919 22688979 21155959
41278 21155959 19736416 19137792 19047072 18524847 17247670 15766103 14677974 14094337 13813223
41269 13813223 13513568 12841420 11742677 10668512 10120175 10114237 10408186 11008707 11986340
41260 11986340 12955155 13311136 13040028 12833115 13258867 14158587 15072684 16053959 17723921
41251 17723921 20389994 23334162 25480668 26964053 29467837 34443936 41533451 49647682
41243 49647682 58974340 70109129 81016214 87013523 85246004 77935864 69713455 62747713
41235 62747713 56207057 49611464 44309822 41494106 40781031 41329309 42679190 43757057
41227 43757057 42646577 38567284 33124749 28518352 25184066 22110255 18794986 15792689
41219 15792689 13624377 12100342 10730836 9262428 7879594 7194080 7752534 9212409
41211 9212409 10357664 10307816 9368415 8372654 7654163 7077424 6572937 6092530 5417015
41202 5417015 4516511 3756645 3332246 2951594 2519871 2541388 3238212 3891748 3856476 3665658
41192 3665658 4158280 4957410 4980825 4266894 4054058 4924732 5987966 6228188 5726421
41183 5726421 5133418 4722069 4429706 4226607 4016449 3652339 3340500 3520767 4123499
41174 4123499 4539680 4573937 4745482 5305637 5704575 5536979 5271492 5328928 5091671 3792236
41164 3792236 2026920 1343291 2320077 3925691 4932529 5207771 5309693 5450501 5353745
41155 5353745 4817119 3980148 3140572 2578522 2493803 2896790 3536999 4033763 4127822 3876994
41145 3876994 3694473 4118669 5329905 6830699 7775186 7758814 7223180 6959466 7217717
41136 7217717 7434303 6948730 5933450 5379491 5994159 7286356 8078739 7903714 7465116
41127 7465116 7535373 7838391 7498716 6374974 5322152 5008358 5009501 4490645 3524081 3199042
41117 3199042 4310519 6308015 7865067 8365648 8456372 9044265 10121402 10919320 11004233
41108 11004233 10697718 10360293 9799073 8743999 7577914 7100349 7605905 8551505 9158224
41099 9158224 9059687 8338222 7265509 6219061 5675495 5996860 7108411 8439697 9326077
41090 9326077 9607558 9778349 10314211 10840675 10349697 8490222 6295631 5180330 5410066
41081 5410066 6083463 6508363 6914255 7668035 8487570 8883257 8912568 8969680 9108768 9077904
41071 9077904 8817762 8418219 7751507 6742790 5935010 6078162 6979707 7422874 6628877
41062 6628877 5305976 4736865 5169262 5710211 5660924 5323291 5400230 6113133 7122402
41053 7122402 7946293 8225087 7874986 7254804 6968946 7242733 7652180 7704042 7496178 7509512
41043 7509512 7917013 8488227 9085602 9767017 10317631 10189821 9222117 8074165 7550386
41034 7550386 7674757 7820264 7637616 7417104 7514630 7864154 8234600 8595874 8923557 8896256
41024 8896256 8204172 7122588 6412606 6539143 7227541 7914932 8398585 8813789 9163621
41015 9163621 9257597 9147151 9234374 9697850 10071245 9769281 8922313 8238971 7994131 7670905
41005 7670905 6897954 6267687 6646491 7886319 8888351 8985897 8627653 8478550 8478455 8259049
40995 8259049 8008863 8254464 8972036 9571520 9790684 10056112 10816297 11944495 12960773
40986 12960773 13483753 13327309 12544701 11584116 11028804 10915711 10644429 9861832 9094375
40977 9094375 9079579 9715011 10163478 9895636 9158348 8448072 8008810 7921300 8212587 8663765
40967 8663765 8860439 8672294 8413848 8311419 8097417 7455107 6662575 6376789 6782748
40958 6782748 7322565 7407467 7137327 7084558 7507714 8086839 8477136 8817572 9433458 10192989
40948 10192989 10529156 10144765 9364486 8654160 8113890 7657786 7345971 7177540 6848990
40939 6848990 6207417 5747515 6067744 6891872 7275850 6875280 6349146 6282757 6395244 6250443
40929 6250443 6141919 6609842 7446805 7893437 7678624 7242186 6990367 6934694 7079811 7537589
40919 7537589 8078277 8132401 7574086 7098508 7410000 8250124 8629098 7978007 6771117
40910 6771117 5965006 6040624 6701559 7349300 7613235 7378786 6567982 5220073 3769328
40901 3769328 2896938 2930413 3576783 4355718 5061099 5689325 6250507 6866676 7697130 8474542
40891 8474542 8543883 7833446 7377851 8192826 9886676 11177669 11654587 12081462 12859243
40882 12859243 13247472 12627455 11651137 11312665 11415063 10871199 9349625 7803943 7273226
40873 7273226 7751801 8444260 8733183 8652068 8614737 8906143 9451252 10031061 10619367 11336303
40863 11336303 12104819 12654166 12957559 13347587 14019066 14718482 15136239 15299647 15357106
40854 15357106 15358746 15572081 16567219 18436844 20222114 20745084 19896276 18528387 17190789
40845 17190789 15657647 13771594 12044609 11080581 10846299 10844766 10716437 10412615 10027671
40836 10027671 9712061 9597803 9653443 9746808 9901140 10267665 10781999 11104033 10995036 10523791
40826 10523791 9852581 9136538 8746578 9233071 10805871 13044108 15295530 17166108 18494001
40817 18494001 19150794 19159999 18854611 18663332 18795325 19218100 19745042 19994674 19487603 18029242
40807 18029242 15908363 13610746 11521442 10009001 9471421 9969705 10970235 11745833
40799 11745833 11969918 11764430 11378223 11096972 11288558 12162548 13500636 14873199 16080784
40790 16080784 17205263 18403865 19953478 22314553 25686654 29504093 32799783 35150733
40782 35150733 36900057 38391726 39466441 39949981 40180276 40573853 40893352 40502235 39411929
40773 39411929 38589761 38862870 39692242 39458155 37099489 33199565 29199826 25763569 22399757
40764 22399757 18713017 15379404 13404529 12771911 12440398 11592260 10324559 9107517
40756 9107517 8172772 7622641 7587656 7949759 8348112 8810706 9956831 12113680 14568763
40747 14568763 16227955 16778582 16652751 16065306 14821020 13090392 11636783 11002068 11008126
40738 11008126 11347496 12169635 13737045 15939997 18526863 21367255 23995921 25316194
40730 25316194 24471828 21901042 18938212 16449698 14426256 12784487 11759398 11335169
40722 11335169 11038334 10663497 10603032 11052413 11479190 11424821 11317591 11800754 12632553 13052924
40712 13052924 13040364 13333745 14182674 14929667 15079077 15049938 15502929 16553588 18123535
40703 18123535 20519597 23995130 27965904 31236192 32971032 33110980 31969642 29811635
40695 29811635 26786614 23001191 18709999 14583382 11516974 9854033 9015809 8245846
40687 8245846 7476074 7063494 7000653 7010840 7221134 7984166 9060585 9788837 10198310 11082495
40677 11082495 12596318 13627468 13212318 11915217 10985260 10607597 9939548 8659266 7438311
40668 7438311 6770034 6310808 5788903 5733884 6617940 7808588 8199895 7704812 7340558
40659 7340558 7751002 8345742 8233838 7452089 6704245 6201680 5509914 4598610 4274932
40650 4274932 5070988 6185904 6270605 5150116 4040883 3938024 4491525 4824945 4810490
40641 4810490 4907017 5159528 5121889 4644492 4069814 3675081 3538523 3931328 5108882 6574938
40631 6574938 7316915 7105865 6853209 7194429 7398130 6407074 4480378 2934512 2477129
40622 2477129 2664535 2951863 3353069 3837944 3929279 3413305 2877192 2967003 3477902 3743783
40612 3743783 3686776 3877921 4603820 5418112 5741667 5516320 5110637 4889679 5049733 5596732
40602 5596732 6237939 6480718 6116067 5515043 5195418 5164938 4987801 4484331 3997561 3850219
40592 3850219 3917520 4003204 4290093 4987309 5772399 6142419 6235938 6688515 7601623 8294948
40582 8294948 8288065 7867869 7339449 6434152 5067375 4035723 4070209 4583690 4361388 3365798
40572 3365798 2841042 3534098 4781821 5628380 5943313 6014065 5861665 5562188 5623163 6407163
40562 6407163 7608892 8792498 9966551 11122530 11748422 11464540 10718083 10168050 9769589
40553 9769589 9201817 8832813 9362218 10685102 12054927 13424651 15754674 19710557 24627743
40544 24627743 28953738 31288230 31075701 29024644 27012874 26823832 28471909 30062818
40536 30062818 29532059 26304780 21353868 16234636 12206496 9694476 8220171 7085490
40528 7085490 6183243 5816296 5869530 5822092 5603139 5676232 6097082 6280101 6028387 6012456
40518 6012456 6727628 7632212 7874951 7361944 6665710 6487266 7644203 10730526 14937975
40509 14937975 17882728 17695815 15040278 12204192 10512582 9573018 8754957 8134503 7781750
40500 7781750 7201740 6002443 4490887 3244864 2576276 2603823 3280781 4106174 4361634
40491 4361634 3936044 3458349 3379057 3436402 3332778 3393599 4065679 5123654 5900410 6146198
40481 6146198 6229325 6537891 7008429 7262385 7007310 6275271 5363118 4575466 4087128 4125970
40471 4125970 5123246 7386054 10632959 14126476 17274446 19842364 21625726 22338290
40463 22338290 21998196 21191879 20857220 21920754 24899377 29283437 33286667 34932847
40455 34932847 33895409 31967605 31310937 32351546 33560033 33010190 29913193 24977220
40447 24977220 19756756 15608351 12902777 11081406 9473420 7962273 6845664 6296569
40439 6296569 6147211 6057329 5730601 5072871 4275283 3678462 3488685 3670899 4047483 4342159
40429 4342159 4247198 3750156 3320509 3388729 3674567 3511430 2883387 2563817 3006993 3670234
40419 3670234 3822253 3558329 3517677 3896485 4249100 4137685 3585157 2942553 2550998 2439997
40409 2439997 2241077 1629214 941343 960819 1889091 2988234 3537181 3651212 3784164
40400 3784164 3990795 4227145 4799596 5746433 6250575 5632379 4648750 4714958 5852771
40391 5852771 6531726 5811034 4591123 4207686 4644748 4870120 4360429 3507909 2821767
40382 2821767 2456437 2458486 2899670 3676904 4510228 5178272 5562264 5543041 5095453 4437463
40372 4437463 3893631 3648592 3726544 4045301 4331592 4193506 3546945 2847621 2645593 3015639
40362 3015639 3674118 4495160 5513816 6471895 6877648 6742095 6856590 7914771 9500945
40353 9500945 10379430 9859976 8574677 7791534 8237964 9753893 11727340 13416282 14013504
40344 14013504 13029972 10855506 8560776 6882323 5685446 4630914 3933739 3973678 4425778
40335 4425778 4428119 3660217 2739544 2401419 2716319 3316051 3977128 4636256 5114014 5264678
40325 5264678 5342464 5857070 6998720 8448945 9828685 11081245 12242391 13050865 13123696
40316 13123696 12495983 11637335 10807165 9733180 8194308 6598404 5522705 4872999 4071766
40307 4071766 3032619 2295985 2086510 1941564 1583192 1463519 1926709 2418988 2196740
40298 2196740 1385325 632129 81085 -495312 -798240 -181873 1235423 2468552 2859306
40289 2859306 2720454 2629869 2706810 2799697 2842600 2788039 2604807 2458748 2475568 2338291
40279 2338291 1687540 915774 853388 1558427 2183798 2261328 2314196 2843869 3504611 3783476
40269 3783476 3785293 3744317 3380419 2435699 1397627 1010867 1367759 1999256 2510975 2642333
40259 2642333 2144830 1216020 686822 1135993 2083267 2607680 2447874 1943896 1294433
40250 1294433 563974 106011 240308 716996 1132969 1566488 2100224 2144401 1222640 170716
40240 170716 392205 1878512 3071935 2912280 1980947 1281801 934175 652495 623453
40231 623453 1130328 1911884 2632380 3503254 4677267 5407874 4698865 2716833 765841
40222 765841 -278050 -836886 -1631248 -2375440 -2091804 -594043 985290 1452940 959202
40213 959202 657144 1120427 1727201 1724522 1228879 767170 408917 -21699 -294831 -96524
40203 -96524 228832 56208 -461434 -493556 236836 1047645 1278546 1016551 656659 385191
40193 385191 347412 710096 1228123 1274818 649230 -77200 -302798 -66630 263220 520497
40183 520497 685110 710084 670890 742725 888963 983748 1278964 2135746 3191073 3555278
40173 3555278 3090874 2687587 2912347 3271954 3323000 3536036 4253243 4685427 4039402 3008111
40163 3008111 2936948 3896263 4790860 5149765 5524241 6100900 6223569 5641986 5128278 5291489
40153 5291489 5616133 5310415 4528614 4145468 4668493 5821623 6908099 7222349 6405586
40144 6405586 4801874 3318344 2652220 2752482 3167538 3690411 4440997 5470233 6516536
40135 6516536 7141736 7039055 6257824 5157493 4136530 3477329 3410983 4006738 4835112
40126 4835112 5131076 4655478 4068148 4014585 4215074 4074056 3835331 4227832 5061862 5213611
40116 5213611 4261312 3196122 2997892 3261043 2901307 1705942 475874 -69570 119102
40107 119102 752940 1509878 2013873 1997209 1600962 1253527 1211731 1389590 1575553 1622477
40097 1622477 1496373 1343084 1449278 1942622 2575537 2988408 3147393 3317219 3577737
40088 3577737 3576019 2930834 1832589 1018761 991130 1389160 1434576 967299 615879 810466
40078 810466 1157939 1188943 1227389 1860686 2836245 3234830 2660751 1585058 578206 -66929
40068 -66929 10781 1079493 2619555 3598176 3714772 3642122 3796770 3733156 3144574 2561162
40058 2561162 2452414 2424397 1994084 1453466 1231464 1087177 771437 818947 1656373 2442034
40048 2442034 1972082 502905 -466403 -181065 633420 1057657 1009286 828814 731820 927850
40038 927850 1537999 2156040 2157160 1643155 1441009 1982982 2822052 3420399 3745106 3874281
40028 3874281 3697716 3301715 3046298 2972596 2688887 2084312 1580499 1458221 1560419 1878548
40018 1878548 2699244 3844415 4544762 4545022 4609451 5364993 6329166 6748992 6776155 7045696
40008 7045696 7631997 8283026 9249698 10879434 12559553 13031040 11837306 9754032 7757597
39999 7757597 6247310 5300502 4920279 4791047 4389681 3612738 2837529 2183743 1253260
39990 1253260 -75542 -1070127 -873382 353039 1446813 1456497 596741 -99306 69918
39981 69918 869923 1670306 2264830 2834739 3335654 3536051 3678376 4321961 5202912 5092385
39971 5092385 3497438 1782584 1556728 2410865 2553171 1569152 1056282 2091710 3476504
39962 3476504 3476783 2331613 1770516 2505575 3504510 3775608 3704484 4127941 4857772 4875954
39952 4875954 3784528 2456820 2101741 2982164 4297092 5224346 5763309 6430727 7469968
39943 7469968 8788679 10493455 12784184 15090277 15977510 14543954 11635687 9080326
39935 9080326 7823211 7368838 6975818 6679581 6896485 7635426 8591596 9677222 10932445
39926 10932445 12036466 12390715 11747316 10443635 8978855 7649391 6630686 6041719
39918 6041719 5725893 5246066 4370988 3416297 2879894 2888718 3231834 3747063 4340723 4774011
39908 4774011 4866100 4876671 5235591 5861055 6240055 6300360 6653244 7707011 9055106 10090375
39898 10090375 10707667 10950602 10523844 9335833 8085724 7476910 7125205 6166534 4786187
39889 4786187 4057453 4159352 3922303 2624023 1223106 1067744 2135655 3380751 4240719
39880 4240719 4878943 5315595 5324703 5127508 5322676 6024790 6745509 7217915 7684272 8202219
39870 8202219 8295592 7625242 6589260 5949679 6121183 6981053 8062909 8774485 8761222
39861 8761222 8284672 7986550 8088456 8084243 7419485 6204033 5010811 4228220 3921245
39852 3921245 4114899 4786892 5609828 6099545 6148162 6135900 6344908 6488264 6089731 5221902
39842 5221902 4527458 4439100 4686027 4763045 4604360 4452506 4261707 3720131 2850172 2090793
39832 2090793 1679553 1433354 1296900 1561520 2256078 2898186 3286711 3955924 5202129
39823 5202129 6179405 5848697 4557636 3728568 4018826 4693049 4891688 4601765 4130372
39814 4130372 3494071 2747618 2205684 1910585 1511446 1054897 1195063 2129265 3024836
39805 3024836 3127631 2820687 2884021 3272173 3429428 3337699 3346076 3305122 2836156 2267235
39795 2267235 2319255 2906059 3202123 2966306 2845852 3167548 3369941 3039082 2701780 3033677
39785 3033677 3839178 4359202 4239996 3800033 3610229 4033959 4855109 5269730 4753312
39776 4753312 4032498 4468593 6179130 7583247 7376169 6223489 5735051 6360319 7235448
39767 7235448 7712616 7969525 8185672 8129602 7754672 7407686 7187574 6752815 6047414 5644794
39757 5644794 6021697 6892915 7547896 7537820 6883885 5996065 5544952 5975620 6902100 7351504
39747 7351504 6837226 5840555 5041621 4501849 3875800 3005926 1969522 924642 267787
39738 267787 536097 1699658 2906574 3439702 3619337 4205666 5210790 6004167 6424401
39729 6424401 6976930 7857527 8531353 8536056 8104790 7696247 7416617 7216590 7171278 7175663
39719 7175663 6780800 5784142 4666103 3979637 3566063 2886993 1975437 1508943 1923623
39710 1923623 2904588 3840719 4433788 4769408 5097386 5653107 6431960 7026458 6925869
39701 6925869 6111916 5169564 4695670 4772034 5090882 5324614 5179308 4367767 2942169
39692 2942169 1604995 1243989 1916858 2538499 1924870 144116 -1455581 -1672015 -668054
39683 -668054 408342 762607 530983 150328 -263090 -659363 -638736 211075 1690682
39674 1690682 3114703 4057294 4672534 5302697 6100214 7067802 8139068 9108058 9751631
39665 9751631 10141413 10571723 11032327 11036738 10238698 9032443 8212662 8073596 8140456 7876561
39655 7876561 7416384 7361724 7893765 8351393 7897940 6531986 5175128 4669552 4900349
39646 4900349 5057353 4563951 3535223 2515215 2073675 2528809 3671733 4752255 5075007
39637 5075007 4670651 4128320 3810880 3602448 3423371 3505541 3964993 4491426 4717029 4623007
39627 4623007 4392826 4145219 3990677 4044849 4181705 4080547 3731073 3560547 3804240 4080827
39617 4080827 3893650 3254053 2508310 1858927 1380118 1179432 1178564 1060599 826742 1045919
39607 1045919 2075701 3375312 4132734 4262863 4208057 4102726 3866761 3826207 4326530
39598 4326530 4836772 4421202 3207878 2429933 2721738 3268899 3100001 2431081 2112594
39589 2112594 2323369 2490201 2181155 1515685 863996 531914 599363 831729 927715 934191
39579 934191 1085732 1228916 977241 546340 684536 1444113 1825815 1221733 471339 682057
39569 682057 1571901 1939281 1453976 987551 1218438 1791273 2006526 1686010 1169924 899508
39559 899508 1089334 1490372 1546584 1085865 612503 531079 474374 -7280 -508557 -346175
39549 -346175 233555 409235 198389 410061 1105386 1247374 240616 -1169243 -1985034
39540 -1985034 -2069926 -1705817 -933825 47582 606054 488392 276105 414397 478560 93839
39530 93839 -170538 257949 751147 295517 -891716 -1648761 -1508700 -959113 -238174 921219
39520 921219 2261858 2882038 2470439 1703580 1082541 319872 -690191 -1252509 -886298
39511 -886298 -198783 -4294 -164657 -63567 265430 320105 93231 -8855 -31780 -399563
39501 -399563 -986496 -1072219 -381857 507002 1010954 1186617 1266107 1141447 732362 413739
39491 413739 566582 957548 1023569 616596 67959 -336535 -510475 -299084 431222 1379911
39481 1379911 1962943 2042307 2092660 2423148 2662446 2388320 1906214 1865390 2285950 2569270
39471 2569270 2465718 2408578 2712908 3037413 2997477 2809020 2829222 2858553 2534298 2173153
39461 2173153 2467155 3343385 3889085 3651654 3337241 3767670 4645619 4944839 4286541
39452 4286541 3386744 3215571 4148002 5920875 8057982 10317731 12966147 16482132 20645096
39443 20645096 24095083 25405939 24694245 23592260 23347492 23431031 22435327 19965738 17069169
39434 17069169 14913790 13608762 12460120 11003758 9523833 8669800 8717128 9216983 9399743
39425 9399743 8954886 8293072 7928467 7782805 7362497 6515057 5646712 5138319 4867282
39416 4867282 4468389 3867114 3401903 3512122 4314119 5313686 5599418 4690152 3282237
39407 3282237 2746902 3640404 5054276 5727635 5442205 4933319 4821200 5259248 6392855
39398 6392855 8332674 10562672 12118355 12686489 12982362 13694787 14578503 15038239 15162370
39389 15162370 15613810 16772141 18496591 20464206 22150944 22697614 21527715 19129065
39381 19129065 16632466 14611995 12924212 11686920 11486511 12272498 12920215 12555531 11696113
39372 11696113 11325783 11317648 10685083 9172891 7641459 6795937 6356886 5718786 4743990
39363 4743990 3613240 2498943 1745875 1838814 2753714 3753267 4242723 4446161 4811580
39354 4811580 5180547 5154956 4975566 5278377 6018883 6361823 5841415 5077768 5015727 5799169
39344 5799169 6730863 7159298 7099241 7000407 7117054 7237353 7043618 6603522 6277640 6148014
39334 6148014 5888665 5368587 5010220 5241896 5946801 6845569 8014118 9412786 10243850
39325 10243850 9621588 7810310 5983102 4736667 3697784 2666568 2106981 2150451 2146909
39316 2146909 1809617 1865510 2775363 3656996 3498333 2789139 2769167 3449044 3631894 2802233
39306 2802233 1793636 1433936 1578092 1758216 1864625 1812710 1336847 561794 156056
39297 156056 518266 1324447 2150372 2935906 3518101 3382965 2401324 1311949 937610
39288 937610 1264459 1726116 2035709 2263014 2363161 2115876 1453250 595150 -15993 157415
39278 157415 1337668 2986041 4141520 4392426 4151846 3886656 3634468 3479804 3841213
39269 3841213 4887301 6228312 7560454 8987893 10281126 10587185 9573339 8194385
39261 8194385 7488272 7167619 6346894 5187063 4672448 4950093 5068091 4487077 3843695
39252 3843695 3903244 4530291 5073887 5243424 5275913 5530815 6049672 6350093 5839222 4706346
39242 4706346 4004667 4349656 5014641 5027789 4645093 4753180 5286629 5560036 5949293 7667983
39232 7667983 10634884 13057098 13672257 13096565 12319697 11188006 9297462 7242500 5838827
39223 5838827 4925473 4026928 3493851 3833890 4447535 4219984 3083626 1951267 1317944
39214 1317944 905490 532361 385518 465648 556341 677638 869052 718871 -75384 -834426
39204 -834426 -478340 1039747 2699672 3791932 4493776 5075703 5477017 5868191 6759263
39195 6759263 8170045 9326896 9515997 8765256 7530161 6241777 5279905 4798152 4429303
39186 4429303 3731744 3000241 2963377 3578919 3900785 3348058 2331017 1383403 545680
39177 545680 -36238 124583 869838 1062159 68168 -1134696 -1252394 -468410 127138
39168 127138 450313 1449794 3228046 4427299 3993230 2681792 2174423 3187090 5007234
39159 5007234 6579811 7486774 7903515 8014836 7677370 6639463 5065573 3710890 3320591
39150 3320591 3783666 4114361 3474266 2123776 1175296 1412278 2517424 3530792 3895544
39141 3895544 3816397 3637886 3272063 2524735 1706037 1402935 1634222 1709912 1117094 180783
39131 180783 -388541 -298779 232536 907222 1523348 1888786 1900165 1680792 1446742 1298684
39121 1298684 1256228 1323607 1368711 1157894 722798 468046 663325 1064272 1343575 1644187
39111 1644187 2269191 2981425 3128058 2483148 1533295 849375 556850 532274 738525 1150488
39101 1150488 1626556 2089022 2632733 3211803 3365768 2581373 990893 -514357 -1080368
39092 -1080368 -778530 -482005 -732358 -957641 -181393 1549193 2954927 2988851 2097141
39083 2097141 1592935 2019605 2654384 2603660 1894694 1286540 1285791 1617234 1663749 1311684
39073 1311684 1176238 1781904 2639721 2638885 1527204 436177 472468 1274537 1659787 1364405
39063 1364405 1235376 1746164 2289877 2226924 1798583 1506973 1234369 593232 -272509 -856752
39053 -856752 -1019343 -998813 -860602 -465570 53240 260199 -42716 -539001 -713618 -243082
39043 -243082 874235 2279190 3315011 3436739 2748114 2013066 1967874 2609414 3240676
39034 3240676 3259428 2821950 2568038 2712090 2749671 2299651 1879862 2306594 3457009 4271141
39024 4271141 4072895 3284848 2656665 2434071 2613395 3331858 4422743 5097399 4759008
39015 4759008 3820129 3093010 2683891 2180513 1650077 1605830 2065961 2484251 2672313 2983254
39005 2983254 3420757 3374682 2580100 1668461 1367440 1686853 2239544 2828482 3350210 3659014
38995 3659014 3933691 4630051 5614860 5955200 5194357 4274533 4381643 5291279 5800519
38986 5800519 5559074 5410447 5878902 6391857 6374780 6226693 6621479 7461641 8164198 8585708
38976 8585708 9050068 9703760 10436654 11370198 12914228 15239408 17964502 20407270 21984859
38967 21984859 22447862 21961652 20979486 19915066 18939600 18065202 17198957 16060985 14404084
38958 14404084 12534574 11254269 10920201 10860752 10182457 8922249 7868427 7429016 7347692
38949 7347692 7494092 8150125 9299046 10373225 11155277 12362095 14796090 18325065 22214205
38940 22214205 26028253 29512321 31921693 32442618 31407569 30290424 30107511 30320320
38932 30320320 29660156 27599551 24615149 21377670 18223384 15291445 12685457 10420338
38924 10420338 8488916 7020424 6154696 5746878 5412796 4909529 4309696 3801214 3512553
38915 3512553 3540910 3881749 4213856 4026756 3236265 2530429 2743556 3827571 4749967
38906 4749967 4613840 3691628 3091729 3491041 4484259 5187184 5174065 4701628 4282756 4256912
38896 4256912 4600081 4923065 4765395 4082367 3326408 2889448 2677155 2478683 2476038 2938347
38886 2938347 3586186 3830167 3635243 3577228 3955948 4448657 4818968 5304877 5934652 6096424
38876 6096424 5369424 4304980 3711339 3503803 2984795 2032163 1220122 845274 661245
38867 661245 671412 1350664 2747450 4048009 4507402 4358739 4370571 4885537 5741987 6848981
38857 6848981 8368050 10474186 13292318 16898672 20995739 24681706 26950352 27531039
38849 27531039 27089667 26588725 26482196 26379879 25386115 22926137 19354433 15605428 12254563
38840 12254563 9270459 6727239 5137017 4650775 4443759 3583525 2284180 1607896 1979706
38831 1979706 2686444 2954298 2860691 2865714 2970549 2843772 2538629 2551075 3059567 3425253
38821 3425253 2776216 1162733 -122742 250808 2131264 4006737 4796474 4953175 5379771
38812 5379771 5890610 5595183 4452664 3377869 2802892 2234606 1549862 1644902 3091903
38803 3091903 4944534 5760992 5357202 4720113 4508438 4521873 4555314 4897480 5744146 6694960
38793 6694960 7149597 6952438 6522128 6522267 7382401 8936589 10605383 12117972 13860610
38784 13860610 16246444 19005194 21487627 23401530 24711545 25030022 23833116 21336642
38776 21336642 18525604 16144185 14161303 12369438 10950782 10164250 9898441 9842697 9812567
38767 9812567 9693499 9336886 8687538 7788180 6612340 5212847 4037226 3632930 3932741
38758 3932741 4279083 4253635 3991304 3608306 2990194 2364749 2335912 2913905 3190105 2542821
38748 2542821 1590436 1321340 1786216 2331549 2674234 2997861 3350002 3700745 4264211
38739 4264211 4972847 4977560 3601586 1570324 320013 232477 590866 1157618 2487143
38730 2487143 4441357 5720832 5506859 4543526 3883988 3459620 2707595 1854628 1604988
38721 1604988 2008182 2522630 2911275 3298042 3570169 3467777 3145057 3015838 3125186
38712 3125186 3161380 2934236 2424039 1655169 996784 1167934 2273918 3216052 2876578
38703 2876578 1620554 731344 571205 366787 -196346 -365388 339985 1231737 1506124
38694 1506124 1413268 1706623 2478398 3171668 3341942 2860956 1751642 401981 -337848
38685 -337848 141291 1491336 2758680 3311693 3162439 2654115 2185711 2000479 1901724
38676 1901724 1421100 568844 63440 412355 1137008 1435177 1285333 1261022 1493071 1563413
38666 1563413 1374778 1378027 1786148 2157988 1976240 1218754 255500 -404886 -265880 692476
38656 692476 1618768 1507890 539234 59650 895856 2322951 3197321 3496178 3997479
38647 3997479 4836546 5269796 4823925 3909965 3147076 2678752 2374129 2201722 2108774 1898232
38637 1898232 1527112 1262832 1275383 1305901 1025645 543759 248631 250268 300971 262901
38627 262901 357037 830089 1540661 2017347 1905762 1316834 724126 476633 420329 137889
38617 137889 -387635 -598176 -100268 620935 668359 -89788 -791104 -691614 -25753 572773
38607 572773 1033638 1658470 2285458 2415567 2138328 2131555 2525778 2532541 1637305 480006
38597 480006 -95869 -318709 -963843 -1890484 -2124850 -1415748 -692182 -633696 -673983 -36733
38587 -36733 902009 1088199 290968 -668333 -1103185 -1131944 -1023181 -540138 615731 2031231
38577 2031231 2761525 2351059 1404821 942744 1239255 1537945 1067360 138611 -139615
38568 -139615 761378 2114044 2783139 2342576 1120087 -372454 -1576858 -1878746 -1181853
38559 -1181853 -352446 -372002 -1020720 -1097294 -82885 1123990 1427095 819809 16345
38550 16345 -589910 -969938 -914451 -233698 643276 976868 659004 287116 249037 284350
38540 284350 89286 -170581 -220016 -151207 -232064 -491793 -755942 -905778 -906830 -765871
38530 -765871 -624287 -683976 -876257 -856901 -545991 -391096 -757595 -1268085 -1174862 -330386
38520 -330386 608763 976238 756941 400633 313748 666035 1396090 2178102 2555142 2326534
38510 2326534 1756361 1310712 1266917 1589109 1991343 2062988 1587774 882022 550901 699391
38500 699391 681559 -21759 -935386 -1101014 -343466 555430 1003758 1291272 1851288 2402869
38490 2402869 2356295 1737278 1131364 867869 817983 935643 1379878 1970078 2093426 1487722
38480 1487722 736693 614668 1169043 1792693 2042607 2033184 2070031 2208915 2251501 2028631
38470 2028631 1642771 1453550 1729612 2276534 2598214 2525397 2425270 2582619 2662095 2156578
38460 2156578 1183817 382435 66717 -58256 -290451 -483414 -360029 90470 714930
38451 714930 1374617 1810192 1632018 740811 -412080 -1222951 -1476527 -1348984 -1071189
38442 -1071189 -773065 -463022 46373 996275 2237020 3128972 3173323 2599730 2060990
38433 2060990 1888444 1919916 1895329 1690620 1296512 921017 982760 1590883 2132143 1867561
38423 1867561 944404 314303 556211 1269157 1779064 1930220 1896914 1681504 1223817 713932
38413 713932 379195 126183 -273365 -778941 -1138272 -1197373 -913346 -265910 549476 1049724
38403 1049724 951169 592576 515925 739356 811687 491014 -27789 -507921 -886712 -1109014
38393 -1109014 -1148238 -1215075 -1547894 -1959786 -2010318 -1678639 -1388549 -1241409 -761772 315107
38383 315107 1504006 2238029 2680645 3355294 4226695 4728886 4625630 4292920 4078280
38374 4078280 3852916 3383802 2789748 2370400 2195788 2112925 2045295 2050650 2089492 1925056
38364 1925056 1356404 496166 -279674 -675771 -698150 -504950 -177728 212959 449013 365899
38354 365899 203094 418338 1050061 1590536 1657527 1444564 1254750 973588 436006 15393
38344 15393 258068 1029898 1625231 1778754 1990387 2640863 3302745 3301699 2637828 1957368
38334 1957368 1767974 2012804 2358944 2622738 2833563 2988961 2861525 2186567 1119912
38325 1119912 305402 202532 469239 387734 -160506 -599009 -526415 -131386 351465 954045
38315 954045 1496859 1500002 1024534 926054 1614542 2169135 1566837 353668 31152 959641
38305 959641 2007260 2358006 2491304 2964355 3309749 2885131 2051483 1674439 1940560
38296 1940560 2424991 2932882 3484799 3755485 3373241 2687880 2463547 2783527 2965459
38287 2965459 2633459 2155592 1838651 1419376 732715 271482 546054 1278524 1767964
38278 1767964 1815649 1794684 1970010 2260112 2620595 3156031 3743740 3953419 3547174 2804337
38268 2804337 2166913 1762305 1455579 1189361 1029186 966326 931046 1001468 1377671 2092176
38258 2092176 2929049 3696511 4364294 4786898 4539154 3375524 1793216 763173 788377
38249 788377 1498926 2283068 2985314 3746342 4468254 4838115 4735290 4239945 3365923 2240403
38239 2240403 1485456 1822328 3097862 4216522 4385238 4028231 4045463 4492721 4560827
38230 4560827 3740929 2444367 1416074 1026013 1279684 2055117 3023103 3653347 3665070
38221 3665070 3332607 3080541 2924503 2605775 2159905 1971554 2215046 2548849 2510575 2031608
38211 2031608 1438685 1090918 1128956 1452793 1812508 2000009 2056249 2216246 2569658 2884405
38201 2884405 2875395 2533182 2051498 1562130 1142113 967477 1173546 1582563 1852135 1914449
38191 1914449 1970776 2004143 1679111 918660 221227 77796 340047 553048 697253 1091151
38181 1091151 1625855 1686402 1030556 288728 248622 895166 1488707 1470533 1006111 659684
38171 659684 739642 1008021 968123 432628 -244000 -627656 -824710 -1327715 -2177557 -2677233
38161 -2677233 -2221888 -1106216 -110648 516980 1193599 2168633 3052996 3318679 2909977
38152 2909977 2172838 1443427 906213 662620 719117 978593 1362696 1888004 2592210 3486066
38142 3486066 4552737 5608912 6206528 5998633 5292184 4888709 5163856 5602986 5514721
38133 5514721 4912447 4319181 3938980 3520082 2962087 2531689 2378320 2289184 2117893 2072139
38123 2072139 2310645 2572170 2553435 2454776 2764098 3561701 4402176 4943331 5387908 6123613
38113 6123613 7088441 7721106 7590024 6993133 6835161 7823397 9763658 11717171 12894430
38104 12894430 13344404 13752314 14680491 16102788 17604709 18920459 20275914 22232862
38096 22232862 25157438 28895593 33153630 38136350 44319569 51215211 56671331 58050587
38088 58050587 54339589 46933933 38425527 30931443 25419649 21868144 19591104 17760859
38080 17760859 16109635 15035034 14744804 14530497 13347526 11086861 8850282 7818598
38072 7818598 8066556 8591101 8349449 7197895 5917495 5363629 5566178 5748014 5278734
38063 5278734 4402260 3836018 3878515 4245175 4617577 4893582 4918327 4479899 3738088 3243559
38053 3243559 3298508 3628182 3906385 4234473 4757449 5129571 4848953 3987769 3118481 2545317
38043 2545317 2077505 1632990 1559349 2053019 2617681 2545932 1824133 1145870 1008169 1188273
38033 1188273 1255754 1195812 1165773 936248 167012 -771642 -901700 119236 1348260 1641224
38023 1641224 1063173 630399 829596 1114325 974032 807700 1316002 2419706 3236290
38014 3236290 3010584 1811949 416005 -348912 -283004 30388 -104168 -641246 -881136
38005 -881136 -445447 226768 493265 180241 -561992 -1536755 -2249820 -1939507 -511784
37996 -511784 915641 1158688 489342 247471 976598 1796237 1843556 1523130 1784908 2684803
37986 2684803 3317472 2998731 1982162 1011066 569543 676582 1113260 1614673 1924043
37977 1924043 1900731 1703682 1752632 2292597 3006491 3313558 3104445 2849222 2817411 2606083
37967 2606083 1819742 865060 507055 814577 1159040 1207808 1260177 1495233 1556628 1193769
37957 1193769 765092 669855 680880 359061 -77355 154327 1358870 2764823 3202825
37948 3202825 2327999 996256 294990 284575 11158 -1143854 -2567792 -3229981 -2980408
37939 -2980408 -2430630 -1830756 -905502 203190 734171 346036 -370034 -777497 -920723
37930 -920723 -937552 -439364 862332 2380856 3210565 3214342 2980753 2900557 2827684 2531855
37920 2531855 2021365 1481711 1194444 1337033 1604480 1353050 462685 -326464 -370901 5166
37910 5166 155495 199370 690179 1449932 1613829 858541 -174821 -823696 -1133159 -1453666
37900 -1453666 -1833516 -2027526 -1757823 -896760 255018 924125 591891 -220946 -427120
37891 -427120 282660 1073883 1069470 328277 -451752 -782008 -736189 -767916 -1284752 -2142692
37881 -2142692 -2619130 -2245458 -1503471 -1143404 -974457 -146343 1311649 2167092 1580331
37872 1580331 234537 -658516 -831179 -819901 -882720 -796348 -467599 -79141 296795 737747
37862 737747 1165103 1359863 1229498 805181 104893 -760760 -1509200 -1940503 -2101888 -2036300
37852 -2036300 -1645571 -1007972 -474958 -136614 460862 1650487 2977960 3666123 3552044
37843 3552044 3082060 2500883 1578993 209293 -1152657 -1851489 -1665612 -964415 -290716
37834 -290716 173759 675790 1357162 1835195 1656356 1074406 845352 1157284 1357225 986273
37824 986273 453802 250279 88107 -545360 -1422688 -1875337 -1777694 -1535846 -1288925 -839913
37814 -839913 -307244 -139465 -402419 -623213 -461432 -97525 110297 -20427 -473083 -981534
37804 -981534 -1057695 -467611 384546 913943 1038856 1000997 778406 261936 -238132 -393517
37794 -393517 -578517 -1336275 -2232026 -2253510 -1436963 -978863 -1396890 -1716794 -1109697 -280214
37784 -280214 -294421 -834862 -739558 213080 1211540 1872803 2638567 3642574 4243006 4038525
37774 4038525 3530482 3293598 3100883 2442435 1522557 1117247 1529698 2173891 2279077
37765 2279077 1701768 911307 373430 145582 36050 -37361 12293 190834 284255 68534
37755 68534 -407038 -842081 -976257 -795306 -465573 -153141 44232 45992 -198922 -583074
37745 -583074 -835886 -809340 -705816 -794890 -942585 -782320 -435424 -582860 -1482278 -2322544
37735 -2322544 -2088417 -845447 381843 864595 726233 362614 8136 -66401 355572
37726 355572 920226 913876 286731 -121209 272061 986742 1263322 1119591 1068298 1175794
37716 1175794 1017301 379277 -467189 -1031098 -813779 404604 2049142 2884607 2258031
37707 2258031 973855 352717 647237 1047697 1067310 1086407 1438390 1744470 1503870 828088
37697 828088 235084 30391 127286 216790 -30646 -654710 -1188007 -1063360 -370614 99407
37687 99407 -273993 -1279404 -2196728 -2509636 -2177363 -1489490 -830627 -383936 48278 724655
37677 724655 1422108 1524427 764653 -450707 -1613662 -2632758 -3497656 -3782727 -2976739
37668 -2976739 -1240414 557416 1629935 1880055 1728635 1631522 1902689 2774105 4286187
37659 4286187 6039211 7300673 7654291 7546863 7922294 9181108 10728298 11774316 12407987
37650 12407987 13540452 15788011 18721452 21424753 23743143 26787949 31961993 39411310
37642 39411310 47836921 56311774 65946072 78905939 96057120 117124253 143379469
37635 143379469 177391574 217242678 252031736 267067573 255624991 224475190 187152245
37628 187152245 153446455 126119837 104654270 88314682 75768656 65030755 55312642
37621 55312642 47557892 42313128 38326426 34124385 29884880 26691631 24663968 22884373
37613 22884373 20776531 18612367 16807104 15437527 14382628 13386678 12080364 10421277
37605 10421277 8987366 8354592 8292080 8048200 7341039 6561701 6031992 5601055 5081503
37596 5081503 4617428 4423510 4498089 4770865 5234581 5743908 5967700 5796045 5599525 5801647
37586 5801647 6279384 6448957 5962355 5128380 4572001 4583196 4867683 4852862 4140793 2743464
37576 2743464 1113848 47376 274959 1740309 3273859 3443147 2028819 393584
37568 393584 37798 962212 1857503 1794936 1195681 1029291 1587723 2395834 2967014 3177694
37558 3177694 3045615 2613084 2102742 1831650 1833578 1802230 1531146 1200863 1089407 1202379
37548 1202379 1399458 1728289 2338090 3097560 3605376 3673295 3551935 3514917 3417880 2907413
37538 2907413 1960502 963796 299397 102330 399858 1149081 2017354 2445232 2190595
37529 2190595 1641223 1362728 1491061 1799078 2164005 2600563 2913176 2730279 1963658
37520 1963658 933976 -18942 -753696 -1117569 -913376 -250145 422707 871053 1358621
37511 1358621 2097421 2721725 2698325 2059644 1310657 725792 176163 -376475 -669268 -536451
37501 -536451 -177256 127464 339638 604592 1058432 1737560 2468770 2842416 2577981 1967182
37491 1967182 1638122 1765992 1835690 1366483 577611 92600 217404 774523 1458089 2053382
37481 2053382 2419619 2548615 2613335 2754790 2870267 2790304 2579373 2443949 2402248 2277582
37471 2277582 1998356 1677148 1382701 1065277 776993 756589 1139598 1679922 1918291 1651359
37461 1651359 1162093 931112 1131761 1475633 1578537 1369306 1031406 664005 233103
37452 233103 -177166 -349799 -243774 -73046 16735 106115 220975 154167 -261859 -917500
37442 -917500 -1591270 -2095813 -2147603 -1481592 -346075 525642 815079 1106571 1985833 2997484
37432 2997484 3149013 2269274 1189877 648412 687862 1116667 1785187 2253662 1964206
37423 1964206 1085483 533974 770045 1194161 1188939 1105616 1549361 2213837 2274749 1668270
37413 1668270 1111753 935781 764648 463700 522312 1086737 1329001 445483 -1077865
37404 -1077865 -1868015 -1249258 115828 1186344 1609188 1620115 1362152 805644 204888
37395 204888 98567 662384 1377564 1610874 1356921 1159491 1437970 2178065 3163526 4100634
37385 4100634 4496441 3895005 2507729 1301160 1111707 1789804 2460140 2497406 1985254
37376 1985254 1329456 771041 339178 15956 -211757 -359398 -398468 -252324 90422 474040
37366 474040 653046 530543 314381 329768 596263 711296 340803 -244313 -380877 215806
37356 215806 1149898 1877714 2271970 2527917 2762874 2899908 2775542 2223101 1241728 201166
37346 201166 -375258 -392157 -273401 -307364 -278948 -41353 -5746 -521932 -1080384 -819562
37336 -819562 260491 1274476 1683037 1848550 2164953 2351087 2076279 1742522 1998853
37327 1998853 2735385 3178418 2919720 2312738 1807337 1393262 886452 369952 62639
37318 62639 -13790 42266 269294 736442 1246489 1429138 1173242 755347 462013 243726
37308 243726 -166178 -899447 -1783200 -2422069 -2437947 -1809101 -1032999 -737572 -1004046 -1281704
37298 -1281704 -1112670 -665066 -305596 41669 670760 1407045 1665481 1206460 415209
37289 415209 -187290 -316421 156125 1140361 2114169 2487017 2314588 2168399 2201819 1963930
37279 1963930 1341192 961717 1235419 1644213 1557233 1202691 1172394 1405778 1374957 934957
37269 934957 275374 -667342 -1970296 -3116525 -3444327 -3095377 -2720856 -2327767 -1306475
37260 -1306475 322335 1595978 1830865 1411580 1029136 787690 459827 85546 -116057
37251 -116057 -71811 212239 711481 1167042 1181314 739753 294719 164710 183173 40137
37241 40137 -383904 -1030619 -1568506 -1370188 -228840 940171 945176 -22658 -517753 104511
37231 104511 829000 713129 355197 681550 1163696 510722 -1289402 -2832932 -3083466
37222 -3083466 -2270782 -1059764 156034 964890 855703 -139220 -1236221 -1676663 -1443154
37213 -1443154 -1096828 -1168741 -1714449 -2214946 -2021397 -1165637 -481390 -524284 -689831 -5940
37203 -5940 1425030 2505740 2610484 2247004 2168485 2479244 2795359 2754565 2202754 1336032
37193 1336032 757155 927111 1497693 1667321 1208400 579773 30329 -667940 -1430522
37184 -1430522 -1587941 -794808 403294 1325887 1940746 2468053 2735009 2474961 1911002
37175 1911002 1517317 1417044 1406995 1355338 1249119 1096854 1061958 1378554 1853867 1848792
37165 1848792 1123489 316808 163446 605040 1114493 1458480 1556984 1034533 -257179
37156 -257179 -1477804 -1447437 -114100 1363441 2083703 2207100 2120394 1623337 456043
37147 456043 -925216 -1715158 -1668590 -1211668 -832611 -714965 -787680 -772940 -317565 567051
37137 567051 1278564 1183979 395767 -300956 -299387 312023 1070545 1650177 1950954 1970477
37127 1970477 1796682 1566715 1248735 604732 -407173 -1291004 -1379761 -620875 236711
37118 236711 411858 -67039 -455317 -159629 675426 1449301 1778559 1782723 1812776 2034585
37108 2034585 2268652 2170233 1585297 771685 205493 78950 57391 -298944 -881843 -1049943
37098 -1049943 -453453 353892 440921 -388169 -1345281 -1646295 -1427913 -1398571 -1806330 -2172773
37088 -2172773 -2016827 -1434299 -858864 -591945 -721416 -1170382 -1572498 -1367885 -361843
37079 -361843 934061 1795638 2033287 2024993 2147746 2464995 2855886 3085327 2769157 1655947
37069 1655947 49530 -1330347 -2015230 -2095922 -1838865 -1343473 -748582 -435962 -664161
37060 -664161 -1126399 -1225075 -815379 -403434 -498643 -996062 -1419013 -1637524 -1996080 -2649233
37050 -2649233 -3131191 -2906839 -2139085 -1485527 -1223970 -1077789 -918598 -1020910 -1390671
37041 -1390671 -1471979 -975757 -475591 -593651 -1012662 -981027 -494826 -232086 -518047 -1140439
37031 -1140439 -2027118 -3171676 -3878853 -3137208 -1079569 822400 1477735 1317067 1235388
37022 1235388 1216349 744635 -49196 -545198 -591528 -492954 -260151 332174 1008357 1083928
37012 1083928 433306 -220741 -190657 420650 1035559 1339377 1479466 1716104 2082368 2379001
37002 2379001 2425786 2237743 1894576 1369961 714885 285161 394120 777055 886347 730903
36992 730903 803789 1078527 885520 130662 -239712 366213 1111062 917086 97078 -236021
36982 -236021 61795 141114 -331624 -852903 -1259068 -1994300 -2942914 -3124333 -2062011 -590917
36972 -590917 232726 336695 285081 403119 770335 1490223 2389604 2894002 2714878 2287897
36962 2287897 2117684 2124667 2080151 2207276 2774588 3451944 3669640 3394403 3043163 2851537
36952 2851537 2821415 3063911 3633262 4133893 4009150 3197774 2130273 1188215 555198
36943 555198 423949 824026 1302391 1316910 1006303 1075524 1783782 2504224 2522621 1903475
36933 1903475 1249480 854849 483140 -84539 -669561 -1019367 -1254909 -1684525 -2229983
36924 -2229983 -2412135 -2057176 -1657699 -1697057 -1910744 -1713786 -1157501 -805571 -713418 -332345
36914 -332345 383082 633592 33430 -547958 -145490 841911 1219531 707269 162749 184111
36904 184111 392516 261335 -96453 -258191 -43551 538728 1406328 2167933 2197853 1312617
36894 1312617 125399 -549614 -463127 67121 676558 1249658 1848916 2534439 3191791
36885 3191791 3511762 3287068 2717158 2204888 1870109 1538211 1191729 1058685 1164820
36876 1164820 1173259 856540 443194 313943 576520 1048519 1402655 1264363 528107 -294537
36866 -294537 -450413 129998 711170 818836 927578 1633698 2598271 2981929 2694708 2478891
36856 2478891 2757162 3094272 2988676 2603041 2351314 2156752 1540748 298131 -1209687
36847 -1209687 -2373817 -2799579 -2567573 -2185097 -2168660 -2523526 -2710622 -2241614 -1226025
36838 -1226025 -230800 300147 356813 182375 -30244 -215880 -304017 -113692 524542 1498267
36828 1498267 2366478 2736393 2656786 2474532 2330663 2027073 1419189 673311 25102 -468478
36818 -468478 -795326 -871805 -758375 -716441 -775081 -516025 324899 1274787 1649838 1540305
36808 1540305 1667314 2220851 2491633 1912231 886863 180367 -50312 -106533 11135
36799 11135 588515 1556894 2432498 2893359 2966617 2677268 2013851 1281929 955875 1004538
36789 1004538 832302 122520 -698059 -1138591 -1365690 -1794664 -2247587 -2084698 -1151001
36780 -1151001 -119249 250781 -99211 -618981 -806996 -584967 -128301 444829 1100021
36771 1100021 1658608 1741031 1146080 269101 -117570 340367 1158745 1569207 1377384 1055905
36761 1055905 1060650 1332605 1529764 1505063 1386078 1320772 1353242 1515731 1829583 2160003
36751 2160003 2285332 2270447 2557580 3354608 4047523 3723452 2394916 1162164 814804
36742 814804 797100 161625 -870203 -1189172 -532984 59261 -201065 -745985 -656941 -87715
36732 -87715 63579 -476819 -1041757 -926947 -42234 1241918 2406204 2995910 2924116 2516488
36722 2516488 2009638 1263695 315779 -179227 315421 1273083 1588823 930931 -40362
36713 -40362 -727882 -1124558 -1240237 -813877 110600 962721 1339142 1426846 1500957 1551287
36703 1551287 1653625 2063972 2549007 2268731 904281 -607537 -1123753 -702768 -278763
36694 -278763 -220851 -5409 728602 1531995 1721500 1116489 76431 -797435 -935168 -216158
36684 -216158 727837 975013 244586 -877039 -1689241 -2026863 -2072629 -1913846 -1538861 -1037553
36674 -1037553 -571918 -282539 -338124 -862337 -1659453 -2244610 -2360092 -2268013 -2300124 -2321260
36664 -2321260 -1970208 -1310469 -834443 -785651 -859494 -742102 -619326 -841731 -1254141 -1225235
36654 -1225235 -382897 932299 2038012 2546029 2512156 2126655 1490455 701921 -20103
36645 -20103 -438820 -517630 -453432 -433145 -391557 -117021 387814 813800 926390 867456 868089
36634 868089 841674 632474 562977 1174437 2277690 2841408 2230093 1116144 633641 944336
36624 944336 1281698 1241964 1264267 1702787 2103748 1791592 797534 -145947 -349471 280274
36614 280274 1225937 1757069 1553358 1042770 917015 1286024 1624078 1589902 1457725 1554412
36604 1554412 1722893 1675848 1519792 1521034 1601481 1488926 1212070 1034818 971210 746605
$$ [...]
##END NTUPLES=NMR SPECTRUM
##END=
