##TITLE=31Pdec_DE-12
 , 24 sc
 24.2.2026
##JCAMPDX= 6.0         $$ Bruker NMR JCAMP-DX V2.0
##DATA TYPE= NMR SPECTRUM
##DATA CLASS= NTUPLES
##ORIGIN= UXNMR, Bruker Analytische Messtechnik GmbH
##OWNER= root
$$ XWIN-NMR		Version 3.5
$$ Tue Feb 24 13:53:07 2026 Russian Standard Time (UT+4h)  she@DPX200
##.OBSERVE FREQUENCY= 81.013821
##.OBSERVE NUCLEUS= ^31P
##.ACQUISITION MODE= SIMULTANEOUS
##.ACQUISITION SCHEME= undefined
##.AVERAGES= 24
##.DIGITISER RES= 17
##SPECTROMETER/DATA SYSTEM= spect
##.PULSE SEQUENCE= zgpg30
##.SOLVENT NAME= DMSO
##.SHIFT REFERENCE= (INTERNAL, DMSO, 0, 197.392)
##AUDIT TRAIL= $$ (NUMBER, WHEN, WHO, WHERE, WHAT)
$$ ##TITLE= Audit trail, XWIN-NMR		Version 3.5
$$ ##JCAMPDX= 5.01
$$ ##ORIGIN= Bruker BioSpin GmbH
$$ ##OWNER= she
$$ F:/spectra/data/she/nmr/P31/2/pdata/1/auditp.txt
$$ ##AUDIT TRAIL=  $$ (NUMBER, WHEN, WHO, WHERE, WHAT)
(   1,<2026-02-24 13:51:27.95 +0400>,<she>,<DPX200>,
      <created by zg, POWCHK disabled, PULCHK disabled
       configuration hash MD5:
       00 E9 B6 7A A2 85 ED C7 34 08 36 98 17 FE 4E 26
       data hash MD5: 32K
       BA E5 45 59 B2 D8 CB AF 59 99 2F 61 E5 25 41 29>)
(   2,<2026-02-24 13:51:43.31 +0400>,<she>,<DPX200>,
      <Start of raw data processing
       efp BC_mod = 2 LB = 1.5 FT_mod = 6 PKNL = 1 PHC0 = 1409.455 PHC1 = 66.30067 SI = 64K 
       data hash MD5: 64K
       6A 88 D3 33 81 C0 D5 D4 13 8D 3A 84 6C 27 73 23>)
(   3,<2026-02-24 13:52:07.76 +0400>,<she>,<DPX200>,
      <pk PHC0 = -13.68917 PHC1 = 0 
       data hash MD5: 64K
       10 89 B2 1C AC C6 BF C3 17 36 25 09 95 CD 74 DF>)
(   4,<2026-02-24 13:52:20.67 +0400>,<she>,<DPX200>,
      <abs ABSG = 5 
       data hash MD5: 64K
       8F 5B 27 D9 0C F1 FD DE AA D9 58 12 92 41 85 E1>)
$$ ##END=
$$ 
$$ hash MD5
$$ 92 E0 05 B7 88 20 48 F9 54 D8 D9 57 AA FF CA 25
##$RELAX= 
##$RELAX= 
##$RELAX= 
##$RELAX= 
##$RELAX= 
##$RELAX= 
##$RELAX= 
##$RELAX= 
$$ Bruker specific parameters
$$ --------------------------
##$DU= <F:/spectra>
##$EXPNO= 2
##$NAME= <P31>
##$PROCNO= 1
##$TYPE= <nmr>
##$USER= <she>
##$AMP= (0..31)
100 100 100 100 100 100 100 100 100 100 100 100 100 100 100 100 100 100 
100 100 100 100 100 100 100 100 100 100 100 100 100 100 
##$AQSEQ= 0
##$AQ_mod= 1
##$AUNM= <au_zg>
##$AUTOPOS= <>
##$BF1= 81.014009
##$BF2= 200.13
##$BF3= 200.13
##$BF4= 200.13
##$BF5= 200.13
##$BF6= 200.13
##$BF7= 200.13
##$BF8= 200.13
##$BYTORDA= 1
##$CFDGTYP= 0
##$CFRGTYP= 5
##$CHEMSTR= <none>
##$CNST= (0..31)
1 1 145 1 1 1 1 1 1 1 1 1 1 1 1 1 1 1 1 1 1 1 1 1 1 1 1 1 1 1 1 1 
##$CPDPRG= <waltz16>
##$CPDPRG1= <>
##$CPDPRG2= <waltz16>
##$CPDPRG3= <>
##$CPDPRG4= <mlev>
##$CPDPRG5= <mlev>
##$CPDPRG6= <mlev>
##$CPDPRG7= <mlev>
##$CPDPRG8= <mlev>
##$CPDPRGB= <>
##$CPDPRGT= <>
##$D= (0..31)
0 1 0 0 0 0 0 0 0 0.06 0 0.03 2e-05 3e-06 0 0 0.0002 0 0 0 0 0 0 0 0 0 
0 0 0 0 0 0 
##$DATE= 1771926687
##$DBL= (0..7)
120 120 120 11 120 120 24 19 
##$DBP= (0..7)
150 150 150 150 150 150 150 150 
##$DBP07= 0
##$DBPNAM0= <>
##$DBPNAM1= <>
##$DBPNAM2= <>
$$ [...]
##$SUBNAM3= <"">
##$SUBNAM4= <"">
##$SUBNAM5= <"">
##$SUBNAM6= <"">
##$SUBNAM7= <"">
##$SUBNAM8= <"">
##$SUBNAM9= <"">
##$SW= 400.765351723535
##$SWIBOX= (0..15)
0 1 3 0 0 0 0 0 0 0 0 0 0 0 0 0 
##$SW_h= 32467.5324675325
##$TD= 32768
##$TD0= 1
##$TE= 0
##$TE2= 300
##$TE3= 300
##$TEG= 300
##$TL= (0..7)
0 120 53 12 22 120 120 120 
##$TP= (0..7)
150 150 150 150 150 150 150 150 
##$TP07= 0
##$TPNAME0= <>
##$TPNAME1= <>
##$TPNAME2= <>
##$TPNAME3= <>
##$TPNAME4= <>
##$TPNAME5= <>
##$TPNAME6= <>
##$TPNAME7= <>
##$TPOAL= (0..7)
0.5 0.5 0.5 0.5 0.5 0.5 0.5 0.5 
##$TPOFFS= (0..7)
0 0 0 0 0 0 0 0 
##$TUNHIN= 0
##$TUNHOUT= 0
##$TUNXOUT= 0
##$USERA1= <user>
##$USERA2= <user>
##$USERA3= <user>
##$USERA4= <user>
##$USERA5= <user>
##$V9= 5
##$VALIST= <valist>
##$VCLIST= <CCCCCCCCCCCCCCC>
##$VD= 0
##$VDLIST= <DDDDDDDDDDDDDDD>
##$VPLIST= <PPPPPPPPPPPPPPP>
##$VTLIST= <TTTTTTTTTTTTTTT>
##$WBST= 1024
##$WBSW= 4
##$XGAIN= (0..3)
0 0 0 0 
##$XL= 0
##$YL= 0
##$YMAX_a= 13810
##$YMIN_a= -16089
##$ZGOPTNS= <>
##$ZL1= 120
##$ZL2= 120
##$ZL3= 120
##$ZL4= 120
##$ABSF1= 197.3918
##$ABSF2= -203.3724
##$ABSG= 5
##$ABSL= 3
##$ALPHA= 0
##$AQORDER= 0
##$ASSFAC= 0
##$ASSFACI= 0
##$ASSFACX= 0
##$ASSWID= 0
##$AUNMP= <proc_1d>
##$AZFE= 0.1
##$AZFW= 0.5
##$BCFW= 0
##$BC_mod= 2
##$BYTORDP= 0
##$COROFFS= 0
##$CY= -3
##$DATMOD= 1
##$DC= 0
##$DFILT= <>
##$DTYPP= 0
##$F1P= 0
##$F2P= 0
##$FCOR= 1
##$FTSIZE= 65536
##$FT_mod= 6
##$GAMMA= 0
##$GB= 0
##$INTBC= 1
##$INTSCL= 9.790993e-09
##$ISEN= 30
##$LB= 1.5
##$LEV0= 0
##$LPBIN= 0
##$MAXI= 10000
##$MC2= 0
##$MEAN= 0
##$ME_mod= 0
##$MI= 50
##$NCOEF= 0
##$NC_proc= -9
##$NLEV= 6
##$NOISF1= 182.463
##$NOISF2= 159.3651
##$NSP= 0
##$NTH_PI= 0
##$NZP= 0
##$OFFSET= 197.3918
##$PC= 4
##$PHC0= 1395.766
##$PHC1= 66.30067
##$PH_mod= 1
##$PKNL= yes
##$PPARMOD= 0
##$PSCAL= 0
##$PSIGN= 0
##$REVERSE= no
##$SF= 81.014063255964
##$SI= 65536
##$SIGF1= 159.3651
##$SIGF2= -187.1042
##$SINO= 113.3802
##$SIOLD= 16384
##$SREGLST= <1H.CDCl3>
##$SSB= 0
##$STSI= 65536
##$STSR= 0
##$SW_p= 32467.5324675325
##$SYMM= 0
##$S_DEV= 0
##$TDeff= 32768
##$TDoff= 0
##$TI= <>
##$TILT= no
##$TM1= 0
##$TM2= 0
##$TOPLEV= 0
##$USERP1= <user>
##$USERP2= <user>
##$USERP3= <user>
##$USERP4= <user>
##$USERP5= <user>
##$WDW= 1
##$XDIM= 65536
##$YMAX_p= 272962794
##$YMIN_p= -248192954
$$ End of Bruker specific parameters
$$ ---------------------------------
##NTUPLES= NMR SPECTRUM
##VAR_NAME=  FREQUENCY,     SPECTRUM/REAL,   SPECTRUM/IMAG
##SYMBOL=    X,             R,               I
##VAR_TYPE=  INDEPENDENT,   DEPENDENT,       DEPENDENT
##VAR_FORM=  AFFN,          ASDF,            ASDF
##VAR_DIM=   65536,         65536,           65536
##UNITS=     HZ,            ARBITRARY UNITS, ARBITRARY UNITS
##FACTOR=    0.49542278885378, 1,            1
##FIRST=     15991.5117654749, 0,            0
##LAST=      -16476.0207020576, 0,           0
##MIN=       -16476.0207020576, -248192954,  0
##MAX=       15991.5117654749, 272962794,    0
$$ Real data points
##PAGE= N=1
##DATA TABLE= (X++(R..R)), XYDATA
$$ [...]
45830B756886j117731k378013j143122O52315j49171k248592k106476K19748J784104
45821c730052J661964J056845o2523k212197l297340o88530L826471N381367K771889
45812D707894J5048K23817J488714N66684k159749l652430k509031l03664O18974
45803a003743n68385k605773l210472j277864J712176L243849K681476J457849
45795D29113M77932p41300j829143p97322K748576N392296L509399j493051m238530
45786C457970k140547J323980J435915j604801l519644j970413Q65402J933758
45778b18380J132214L70839N57161J088915J298966Q97466k97396j723161j930838
45769A175786m81915Q81138N87553k48640K41171J298621R48779O1993J285105
$$ plain form
45830 2756886 1639155 -738858 -1881980 -1229665 -1378836 -3627428 -5733904 -5514156 -3730052
45821 -3730052 -2068088 -1011243 -1073766 -3285963 -6583303 -7271833 -3445362 1936005 4707894
45812 4707894 4722942 4946759 6435473 7002157 4842408 1189978 -1319053 -1622717 -1003743
45803 -1003743 -1572128 -4177901 -7388373 -8666237 -6954061 -3710212 -1028736 429113
45795 429113 907045 165745 -1663398 -2460720 287856 5680152 9189551 7696500 3457970
45786 3457970 1317423 2641403 4077318 2472517 -1047127 -3017540 -2152138 -218380
45778 -218380 913834 1284673 1841834 2930749 4229715 5127181 4829785 3106624 1175786
45769 1175786 693871 1575009 2162562 1913922 2155093 3453714 4402493 4464486 5749591
45760E749591L800966L513529j53177k172662N08320L431944J013315m553083
45752A1138743o210084k457094J006128L45237j476059r01839J57183j658780
45744e6565m450984l280075J923628N289487K835693k067961l290341j1954K723254
45735c85818J284939j682182j339614K338411M597092K675375o79038j734523
45727E074642r49503j099659k250589j983322Q6698J418650M73861j331384k220885
45718b781491k023718q01920J833643M811252N416217K632558j199046l404976
45710D482519l683900k528974M29869M294774N564457K113176k970711m775625
45702B925585k878014j022648j161207j493243o11640J60947k30172l99825R20342
$$ plain form
45760 5749591 9550557 13064086 12910909 10738247 11246567 14678511 15691826 11138743
45752 11138743 4928659 2471565 3477693 3822930 2346871 1445032 1602215 -56565
45744 -56565 -4507549 -7787624 -5863996 -574509 2261184 193223 -3097118 -3109072 -385818
45735 -385818 899121 -783061 -2122675 215736 4812828 7488203 6809165 5074642
45727 5074642 4125139 3025480 774891 -1208431 -1121733 296917 770778 -560606 -2781491
45718 -2781491 -4805209 -5607129 -3773486 1037766 6453983 9086541 7887495 4482519
45710 4482519 798619 -1730355 -1300486 2994288 8558745 10671921 7701210 2925585
45702 2925585 47571 -975077 -2136284 -3629527 -4241167 -4080220 -4310392 -4710217 -3789875
45693c789875K579357L004678K449046J570329j37010k428292k753046O59443
45685A154630N215425O225251K558206k173234m056136k577549J46608J904914
45677H398115J692271k8215j777915k599618l070642l850870l877851j784411
45669f899136J243553K349518J049630p163Q57012J961653J488529O99595J468797
45660D211988K301459J06409m355393o042476j847284M867609P641318L898274
45652A0781904k814646p096503o800506l684704k94656K396666M283077M693141
45644A463773L127953Q38293j71568O8789m49656k148851k385301P95236N022772
45635F161440O087291L306282l4276j411960j695314k514940l391929k869679
$$ plain form
45693 -3789875 -1210518 1794160 4243206 5813535 5676525 3248233 495187 1154630
45685 1154630 6370055 12595306 15153512 12980278 8924142 6346593 6493201 8398115
45677 8398115 10090386 10062171 8284256 5684638 2613996 -1236874 -5114725 -6899136
45669 -6899136 -5655583 -3306065 -2256435 -2263598 -1406586 555067 2043596 2743191 4211988
45660 4211988 6513447 6619856 2264463 -3778013 -5625297 -757688 6883630 10781904
45652 10781904 7967258 870755 -5929751 -9614455 -9909111 -7512445 -3229368 1463773
45644 1463773 4591726 5430019 5258451 5327240 4877584 2728733 343432 1138668 6161440
45635 6161440 12248731 15555013 15520737 14108777 12413463 9898523 6506594 3636915
45627C636915j008385P10088J187948L87236j109413k290147k086583n41564P42786
45618c71119K29765j551082k356163p84051J931779L104130J639926n47717q36437
45609D59031O54376J233883l79843k012579j288347P47443J480852R68342J329854
45600C193012K356244J253217k477226n253410m252120j320666J66276J92319
45592f142354J183134L591363N165215M155445J060877k545313n056765n018555
45584c606953k284802Q52511J443430o70569k423445j170396K026212L464238
45576b369774J013316l197800m791707k009278K208177L795954K217428p4605
45568c208289j708376l013160l000774K28980M994316O164739K212080j733784
$$ plain form
45627 3636915 2628530 3338618 4526566 4913802 3804389 1514242 -572341 -1113905 -371119
45618 -371119 -141354 -1692436 -4048599 -4832650 -2900871 203259 1843185 1295468 459031
45609 459031 1113407 2347290 1967447 -45132 -1333479 -586036 894816 1863158 3193012
45600 3193012 5549256 6802473 4325247 -928163 -5180283 -6500949 -6334673 -6142354
45592 -6142354 -4959220 -1367857 3797358 7952803 9013680 6468367 1411602 -3606953
45584 -3606953 -5891755 -5039244 -3595814 -4266383 -6689828 -7860224 -5834012 -2369774
45576 -2369774 -1356458 -4554258 -9345965 -11355243 -9147066 -5351112 -3133684 -3208289
45568 -3208289 -4916665 -7929825 -10930599 -10701619 -5707303 457436 2669516 935732
45560I35732j188566J045972R4303k326625n73995N036244P711004M146558j020595
45551A3860032k546330j171590l52201q21185j496849k326353l068695k059314
45543A7515Q02596K369141N81517j848634j328233J155703K059769J088965R23065
45534E821404J958187J536679j194029l282525k050790J376832L847191L655861
45526A1668810J334101j427105k760715j884289j83304P3624j337934k229775
45518C253413j290754l37256j820840m828239n449922j682940L332335M402998
45510d421205M47122l987127m186978r10339J174719j00776k054495j530326Q86400
45501a4683005K366687J727901K48784j99810J332140L927011M520381O46833
$$ plain form
45560 935732 -252834 793138 887441 -1439184 -2013179 3023065 10734069 14880627 13860032
45551 13860032 11313702 10142112 9789911 8968726 7471877 5145524 2076829 17515
45543 17515 820111 3189252 3770769 1922135 593902 1749605 3809374 4898339 5821404
45534 5821404 7779591 9316270 8122241 4839716 2788926 4165758 8012949 11668810
45526 11668810 13002911 11575806 8815091 6930802 6747498 6821122 5483188 3253413
45518 3253413 1962659 1625403 -195437 -5023676 -10473598 -12156538 -8824203 -4421205
45510 -4421205 -3974083 -7961210 -12148188 -13058527 -11883808 -11984584 -14039079 -15569405 -14683005
45501 -14683005 -12316318 -10588417 -10339633 -10539443 -9207303 -5280292 -759911 -113078
45493a13078n203659o701632j637314L962202L425418j098607j917289K438557
45485f845402N034013J452744l288120k464654K438993M736824K694082Q67942
45477D626422J957897K913218N97731k984521l791978j486865P36722P87746m06312
45468B950060j272276j680798k116769k205514j132198Q94717K505181K745351
45460F87754K279756K383511K860830J979699r07494l635951l534192j133872
45452I80041K29527r82839k146233j44480L911754N818755L805285N99830o42467
45443A1429173k94434n02527j073509K12603L274124M456899J130047m094871
45435A4537505n961112k926713J330808L146312L176176L786213M119546J050238
$$ plain form
45493 -113078 -5316737 -12018369 -13655683 -9693481 -6268063 -7366670 -9283959 -6845402
45485 -6845402 -1811389 -358645 -3646765 -6111419 -3672426 1064398 3758480 4626422
45477 4626422 6584319 9497537 10095268 7110747 3318769 1831904 2568626 3356372 2950060
45468 2950060 1677784 -3014 -2119783 -4325297 -5457495 -4562778 -2057597 687754
45460 687754 2967510 5351021 8211851 10191550 9284056 5648105 2113913 980041
45452 980041 1209568 226729 -1919504 -2063984 1847770 7666525 11471810 12071640 11429173
45443 11429173 11134739 10632212 9558703 9771306 13045430 17502329 18632376 14537505
45435 14537505 8576393 5649680 6980488 10126800 13302976 17089189 21208735 22258973
45427B2258973n058096r041968p161238k153358N80368K64329Q25342L965008
45419D479360N919232K796385l434928o880906m752362k90283J443191o90859
45411a411170l024400j656256K649082N085829K886576o23378j03377M464401
45403H267307P577526N686644J514330m69314L42624J776371K563977K054734
45395B9314199j108298o441088r756208p735647k879319O2807J077956L557643
45387F092045O996561O820617K129713k013479j938909j26818j00924r70306l13523
45378A6574977J059174Q96344m26877j021530q03853p38986m60462N38579Q78752
45369A6496118p05890k534511j869159J086612L315967K581146o72753m125148
$$ plain form
45427 22258973 17200877 8158909 997671 -1155687 -575319 -310990 514352 4479360
45419 4479360 10398592 13194977 9760049 2879143 -1873219 -2163502 -720311 -1411170
45411 -1411170 -4435570 -6091826 -3442744 1643085 4529661 3906283 3802906 8267307
45403 8267307 15844833 21531477 23045807 22576493 22919117 24695488 27259465 29314199
45395 29314199 28205901 21764813 12008605 4272958 1393639 1456446 2534402 6092045
45387 6092045 13088606 19909223 22038936 20025457 18086548 17959730 17858806 16888500 16574977
45378 16574977 17634151 18530495 18103618 17082088 16278235 15539249 15078787 15617366 16496118
45369 16496118 15790228 13255717 11386558 12473170 15789137 18370283 17697530 13572382
45361A3572382n062288k432503J282815J902638j348535m380554l343775P70867
45353I61047M123158M430110J839046k136215m798641l912818q10770R47770J208130
45344A850817L382580P268624P347808J828157k632240p63277K378525m06878
45336B0254116o102414o291239j187858J264981q46247j163760K495528L966003
45328A2389110J71139k718415N75860N879132O685882L680490J541108J209973
45320B9414279Q10646L65126O77368P31677K42599J474694M979980P287541O334869
45311E2318779M960900N278674M473282Q10640j339876J601116N174960L460310
45303G6738785r86031j529893J156153P76842k997602l821660m1510K080491j176009
$$ plain form
45361 13572382 8510094 6077591 7360406 9263044 7914509 3533955 190180 961047
45353 961047 5084205 9514315 11353361 9217146 4418505 505687 -305083 642687 1850817
45344 1850817 5233397 12502021 19849829 21677986 19045746 18282469 20660994 20254116
45336 20254116 14151702 7860463 6672605 7937586 7091339 5927579 8423107 12389110
45328 12389110 12560249 9841834 10417694 16296826 22982708 26663198 28204306 29414279
45320 29414279 30224925 30590051 31267419 31999096 32241695 33716389 38696369 45983910 52318779
45311 52318779 57279679 62558353 67031635 67842275 66502399 68103515 73278475 76738785
45303 76738785 75752754 74222861 75379014 76155856 73158254 69336594 69295084 71375575 70199566
45294G0199566n096620m668187k081647j674996k565738j425754Q88556O48901
45286E4224081k526588n144499m912145k921496q35620J279100L605342M873936
45278D7642111L251243j296328o085520p675675n079647p52784J893713J485211
45270C3382324r40831l360002l858507j661875J652886K911790M69254m101676
45262B4493363p815755q359641m478526K701228P981668N811001k041603o688245
45254A1603490l307882K182131K162194j445056j486731K267578L460018L55744
45246A5791486j727284K08688K829392L312511K909047J811012k108712o864054
45238A6162086o333669l41293K884350p75126l901449P25664P692919O786498
$$ plain form
45294 70199566 65102946 60434759 58353112 56678116 54112378 52686624 53575180 54224081
45286 54224081 51697493 46552994 41640849 38719353 37883733 39162833 42768175 47642111
45278 47642111 50893354 49597026 43511506 35835831 30756184 30003400 31897113 33382324
45270 33382324 32441493 29081491 25222984 23561109 25213995 28125785 28595039 24493363
45262 24493363 16677608 8317967 3839441 6540669 14522337 20333338 18291735 11603490
45254 11603490 8295608 10477739 12639933 11194877 9708146 11975724 15435742 15791486
45246 15791486 14064202 14272890 17102282 20414793 23323840 25134852 23026140 16162086
45238 16162086 9828417 9487124 12371474 11596348 7694899 8420563 16113482 22899980
45230B2899980j427847p194989o216190l420586k805800k436991p16009J61525
45222a156907p06258p36676Q67237J320358J04942R22154M681529O059034J434238
45213A2789651m281899m120492P12010K858476m37225m372035m435549j920628
45205c207691j04181O78561J546252J816633M27433j247356j212772m67620j498414
45196c269155l473462k655701J460629M168145K132650j113126K0531M754271
45188B024782O832503L425896j523134l702588l588050l138113j702830J198788
45180a72746K390593r29114n377108m602931J779827P011402N991791J431447
45172G523161p39751Q60700K603017J603000p64396j096825J822344N410859N547197
$$ plain form
45230 22899980 21472133 14277144 8060954 4640368 1834568 -602423 -1318432 -1156907
45222 -1156907 -1863165 -2599841 -1732604 -412246 -307304 614850 5296379 11355413 12789651
45213 12789651 8507752 4387260 5099270 7957746 7520521 3148486 -1287063 -3207691
45205 -3207691 -3311872 -2633311 -1087059 729574 1157007 -90349 -1303121 -1770741 -3269155
45196 -3269155 -6742617 -9398318 -7937689 -3769544 -1636894 -2750020 -2729489 2024782
45188 2024782 8857285 12283181 10760047 7057459 3469409 331296 -1371534 -172746
45180 -172746 2217847 1288733 -4088375 -8691306 -6911479 99923 6091714 7523161
45172 7523161 6783410 7644110 10247127 11850127 11085731 9988906 11811250 17222109 22769306
45163B2769306P91258n410544p570087l872001J698324L837463J860347k34052
45155A3870014N77064K596275K476421M38386j47276J675997K324250j076559
45147B2734572n562329n578085o12916L733135K815122j831777n484732n866544
45139D346446l990532j389013J149813K892247L079144J546006j074467l169635
45131C390009k422477J769552N856859M833068j328397o575933o024718j793109
45123b295146P75621K41545p46197m42897N69439J980475M096591N761682N052767
45114A4993880K172180q09525k847455m188110m350015k587399K0073J604513
45106D008142K127283K311602J026189k711098n915216m219216J491580N343791
$$ plain form
45163 22769306 23560564 18150020 10579933 6707932 8406256 12243719 14104066 13870014
45155 13870014 14447078 17043353 19519774 19958160 19810884 21486881 23811131 22734572
45147 22734572 17172243 11594158 10981242 14714377 17529499 15697722 10212990 4346446
45139 4346446 355914 -1033099 116714 3008961 6088105 7634111 6559644 3390009
45131 3390009 967532 2737084 8593943 13427011 12098614 5522681 -502037 -2295146
45123 -2295146 -1519525 -1277980 -2024177 -2467074 -1897635 82840 4179431 9941113 14993880
45114 14993880 17166060 16356535 13509080 9320970 4970955 2383556 2403629 4008142
45106 4008142 6135425 8447027 9473216 6762118 846902 -3372314 -1880734 3463057
45098C463057M212776J126603j44185K50079O18253Q44773J009880K50797r95312
45089A0636721p90775N22018n9731k773172l269059R55841O043114P018965M193416
45080B2477338Q47815k025450m570122m840691j544307K323918L274889K610247
45072A8553637L213779L570249P33204k777768j847709K298941L193426n69345
45064B6368414l429251k584436k075869m371939n177792j090499L778953M249868
45056A5667449K095390J761545K320405K55459k885323k711174o6424J84489k267133
45047A4354683k829798n42243N1472k866075m860306k743802J70369L705j320350
45038e82345J9759L207318M769491M374291M053046L618346J520957q79155n11942
$$ plain form
45098 3463057 7675833 8802436 8658251 8908330 9526583 10371356 11381236 11632033 10636721
45089 10636721 9845946 10367964 10308233 7535061 4266002 5221843 11264957 18283922 22477338
45080 22477338 23325153 21299703 16729581 11888890 10344583 12668501 15943390 18553637
45072 18553637 21767416 25337665 26070869 23293101 21445392 23744333 26937759 26368414
45064 26368414 22939163 20354727 18278858 13906919 8729127 7638628 11417581 15667449
45056 15667449 17762839 19524384 21844789 22100248 19214925 16503751 16437327 16621816 14354683
45047 14354683 11524885 10982642 11034114 8168039 3307733 563931 734300 738005 -582345
45038 -582345 -562586 2644732 7414223 11788514 15841560 19459906 20980863 20101708 19589766
45029A9589766K102517K815392l52401m528905n734387k976545J500111L975712
45021A6391260J797602l431136o082608k843564K270043K966532l24715j508269
45013I235145J320767L162124P96667k046737j536550j23090j308181k668398
45005F831747q0951M235797M507851P32782j318318O62647K417412M09944l084490
44996A5314421m177741k502144l7211J899705K631631J885656J001686J700964
44988A7716967K794188J418219j587312j780638J616313L193509p58945o081987
44980A6530314o731155l472794j505734j902085j284497J031198J689475l29105
44972D025617j515563K40284K230557J895463J191764K760831M774602L446827
$$ plain form
45029 19589766 21692283 24507675 24155274 19626369 13891982 10915437 12415548 16391260
45021 16391260 18188862 14757726 8675118 5831554 8101597 11068129 10743414 9235145
45013 9235145 10555912 13718036 14514703 12467966 10931416 10808326 9500145 6831747
45005 6831747 6750796 10986593 15494444 16227226 14908908 15571555 17988967 18398911 15314421
44996 15314421 11136680 8634536 8597325 10497030 13128661 15014317 16016003 17716967
44988 17716967 20511155 21929374 20342062 18561424 20177737 23371246 22612301 16530314
44980 16530314 9799159 6326365 4820631 2918546 1634049 2665247 4354722 4025617
44972 4025617 2510054 2750338 4980895 6876358 8068122 10828953 15603555 19050382
44964A9050382r55122m287644m168317k340008j419787j959255l120995l986740
44956c187486l525791j181266J746310K990177K305781J725811J950000Q65343
44948C688879k390743m206401p41284N654524Q277555M717515j81950j338007
44940A3480088L95925J474696J466666J780312J232332k206000o336761o530518
44932D756740k843684m97473k058517l739054j646520K388260M211354L241801
44924C812907J572230j09958j885438j910384J390059N371813N532516J810992
44916A5584737j079398q6541K609591L309765J260453j807062m247922n086366
44908A0457257l749741q79149J477690J704132K14764j338110j838861j265957
$$ plain form
44964 19050382 18095260 13807616 9639299 7299291 5879504 3920249 799254 -3187486
44956 -3187486 -6713277 -7894543 -6148233 -3158056 -852275 873536 2823536 3688879
44948 3688879 1298136 -2908265 -3649549 2004975 10282530 15000045 14818095 13480088
44940 13480088 13876013 15350709 16817375 18597687 19830019 17624019 11287258 4756740
44932 4756740 1913056 1415583 -642934 -4381988 -6028508 -3640248 571106 3812907
44924 3812907 5385137 5275179 3389741 1479357 2869416 8241229 13773745 15584737
44916 15584737 14505339 14418798 17028389 20338154 21598607 19791545 15543623 10457257
44908 10457257 6707516 5828367 7306057 9010189 9224953 7886843 6047982 4782025
44900D782025j73636Q09549J234430Q23024p54093l549300o399037p215657n245761
44891a5688456k343888p51725k39761J005527L123361M139703K932420Q67219
44883f955600j26231J85322O60050M74179o0120N6060J275924K411513J470100
44874f08803j534458l546168j844759K156046M432266L397079J253482K01360
44866C906045k81680j507906l048480l584701k940849j893352p92969N47989K196835
44857g399068M035760N697150O104685M064133N4673l410834m065004j996482
44849C085013J045892L655520N248545N225894K976920r27503m199381m321117
44841A1789783j094285K478750K760350n88531l971811l831483n17145K667881
$$ plain form
44900 4782025 4608389 5417938 6652368 7475392 6721299 3171999 -3227038 -10442695 -15688456
44891 -15688456 -18032344 -18784069 -19023830 -18018303 -14894942 -10755239 -7822819 -6955600
44883 -6955600 -7081831 -6896509 -6236459 -5762280 -5822400 -5766340 -4490416 -2078903 -608803
44874 -608803 -2143261 -5689429 -7534188 -5378142 -945876 2451203 3704685 3906045
44866 3906045 3624365 2116459 -932021 -4516722 -7457571 -9350923 -10143892 -9595903 -7399068
44857 -7399068 -3363308 2333842 8438527 12502660 12557333 9146499 5081495 3085013
44849 3085013 4130905 7786425 13034970 18260864 21237784 20310281 16110900 11789783
44841 11789783 10695498 13174248 15934598 15346067 11374256 7542773 7025628 9693509
44833I693509L417674K108513J73944j512805k570919k723091j847517L048K266215
44824I008571L264790J246260k913989n502254m103339o25349J671594K571790
44816D618074L739082M659783L286565J38338j932557k181164k683315m179312
44808E465494m667412l021084q51943K86845P60497J083066J051009J220161K259229
44799C585862K486293l79613m546854n415534k365855M05510J110004K925703
44791b194484O907017Q205865L482983k927039n111384l579490k085133o30051
44783B068284K323652M167362J602968k434194k274085J447054L167440J911290
44775A1979771K005653M127298L316313k205508p017276o174379j484829K640482
$$ plain form
44833 9693509 13111183 15219696 15393640 13880835 11309916 8586825 6739308 6742356 9008571
44824 9008571 12273361 13519621 10605632 5103378 1000039 374690 2046284 4618074
44816 4618074 8357156 13016939 16303504 16441842 14509285 12328121 9644806 5465494
44808 5465494 798082 -2223002 -3074945 -2788100 -2027603 -944537 106472 1326633 3585862
44799 3585862 6072155 5692542 1145688 -4269846 -6635701 -6230191 -5120187 -2194484
44791 -2194484 4712533 12918398 16401381 13474342 8362958 4783468 2698335 2068284
44783 2068284 4391936 8559298 10162266 7728072 5453987 6901041 10068481 11979771
44775 11979771 13985424 18112722 21429035 19223527 12206251 6031872 4547043 7187525
44767G187525M723697M840108K351796j772779m184746l611934k663052k868841
44759D001774j997690R02503K237705m09918l127914j020472M004852N814059
44751A0404899K839345n29592p99792P09389J204034L07708l51474M72189K210474
44742A6467180K612840r087l843875m583053r67657K591980J351669l377336o050910
44733D191751m131509m91663J136154L07578r58622j101364m09708m27651k019147
44724c904181l689620k896307L01952K638026J967486K26872J87008J329299J553703
44715b285762J152664J815081K886117K169597p7920j417334j360808j839272
44707A042363l288469l609425j786963M64451J680992K579532L852232M470750
$$ plain form
44767 7187525 11911222 16751330 19103126 17330347 13145601 9533667 6870615 4001774
44759 4001774 2004084 2906587 5144292 4734374 1606460 585988 4590840 10404899
44751 10404899 13244244 12714652 11914860 12624249 13828283 14135991 13784517 14256706 16467180
44742 16467180 19080020 19070933 15227058 10644005 9676348 12268328 13619997 10242661 4191751
44733 4191751 60242 -431421 704733 1012311 53689 -1047675 -1457383 -1885034 -3904181
44724 -3904181 -7593801 -10490108 -10188156 -7550130 -5582644 -5355772 -5168764 -3839465 -2285762
44715 -2285762 -1133098 681983 3568100 5737697 5659777 4242443 2881635 1042363
44707 1042363 -2246106 -5855531 -7642494 -7178043 -5497051 -2917519 934713 5405463
44699E405463L519354J699746j49174k104006l686959l445825j367109K16581
44691H8071k97371j486946j388901p34684j592783l703383m408085k217477J237024
44682a4504535L249853L031591K111358K166945K988684K893723J061308j219430
44674A779497k070268j106876O95388K374907L117649J938379j048465l564607
44666B115604l335444j183908m0917r20428j947365j508510j39707J103184J878191
44657c979300J611414k89914k460863k266773M04179K425900J804876K83546J5480
44648b451455L23083m8523l7856J466411K555654R02651j928610k328902j12608
44639a660155J376771N49552m23683N19392K355246K883197J459108j019294l062574
$$ plain form
44699 5405463 8924817 10624563 10475389 8371383 4684424 1238599 -128510 88071
44691 88071 -209300 -1696246 -3085147 -3819831 -5412614 -9115997 -13524082 -15741559 -14504535
44682 -14504535 -11254682 -8223091 -6111733 -3944788 -956104 1937619 2998927 1779497
44674 1779497 -290771 -1397647 -702259 1672648 4790297 6728676 5680211 2115604
44666 2115604 -1219840 -2403748 -2444665 -3365093 -5312458 -6820968 -6960675 -5857491 -3979300
44657 -3979300 -2367886 -2657800 -5118663 -7385436 -6981257 -4555357 -2750481 -2466935 -2451455
44648 -2451455 -2128372 -2176895 -2214751 -748340 1807314 2709965 781355 -1547547 -1660155
44639 -1660155 -283384 266168 -157515 361877 2717123 5600320 7059428 6040134 2977560
44630B977560k989794k48229L069485L775923J253031j935137l280986k431740
44622A90113j38670K433472L064185R5957m282490n333690j933827J517463J496358
44613b891129N28609K567355N747949M525274j678995o812493o141744j871994
44605f027168J031553J433622J825560L590047N334933N240840K946000n79222
44597A4796165l486070l849994j596185O96186M43160j692896k709829j237405
44589A363132J155114K695868L370070L395584J833035j599044m678358m693263
44581B842138j808101J310563K891780L280574K910209J281112j289915k830509
44573H587851k045197l09813P3528j172298k373791k222222o58223J895183M513664
$$ plain form
44630 2977560 -12234 -260463 2809022 6584945 7837976 5902839 2621853 190113
44622 190113 51443 2484915 5549100 5645057 1362567 -3971123 -5904950 -4387487 -2891129
44613 -2891129 -2362520 204835 5952784 10478058 8799063 1986570 -4155174 -6027168
44605 -6027168 -4995615 -3561993 -1736433 1853614 7188547 12429387 15375387 14796165
44597 14796165 11310095 7460101 5863916 6560102 7003262 5310366 2600537 1363132
44589 1363132 2518246 5214114 8584184 11979768 13812803 12213759 7535401 2842138
44581 2842138 1034037 2344600 5236380 8516954 11427163 12708275 11418360 8587851
44573 8587851 6542654 6232841 6306369 5134071 2760280 538058 -120165 1775018 6288682
44564F288682N319931K978469j034726l313391k322091o814J014402M86315k13717
44555I197060n57498j097138j765876j473824L22733K452555K906335R33969j729897
44546I188419k220023J76601K606601J897951j123610k724661j832403j460957
44538D507918l164213l534256M95009N581728N952134K166395M36431K892338
44530A5333484M352840R59985l439919l521143p67359k95147k199205k105107
44522H318429O20709J380382j982524n346232m432442p44533J388557P97141l43730
44513c44243k94151R28718K637472L655547K542259m36502k649754k181309m31204
44504C426833Q1100q04597j572436j817689j937664j182540J120462L020225J752941
$$ plain form
44564 6288682 11608613 14587082 13552356 10238965 7916874 7910060 8924462 9410777 9197060
44555 9197060 8639562 7542424 5776548 4302724 4625457 7078012 9984347 10918316 9188419
44546 9188419 6968396 7144997 9751598 11649549 10525939 7801278 5968875 4507918
44538 4507918 1343705 -2190551 -1695542 3886186 9838320 12004715 12441146 15333484
44530 15333484 19686324 20646309 17206390 13685247 12917888 12622741 10423536 8318429
44522 8318429 8939138 10319520 8336996 2990764 -1441678 -2186211 -797654 -513 -344243
44513 -344243 -638394 290324 2927796 6583343 9125602 8689100 6039346 3858037 3426833
44504 3426833 3507933 2703336 1130900 -686789 -2624453 -3806993 -2686531 333694 2086635
44495B086635j790988l425739j203833K126285L302847K674745K452890K852476
44487I075318K241722J98102j665501j850184n58841R96449J901336J819158N41139
44478A2698698k055599n231192o914883n174837p61389K935569L610042K642335
44470A748744K405743K283238J24245k932823k779759J564480N538242M720037
44462A2672147L45221l158862l919160l125271j563653R55417L349196L645697
44454I200732J843166m6437r97202j772613k589504k413254j169855m03707q27518
44445H23808j166890m06432O57231J137722J437025J642035N87817j615163k065087
44436A032066J159421M943775M323671k73443k650700P71587N363273M116606
$$ plain form
44495 2086635 295647 -3130092 -4333925 -2207640 1095207 3769952 6222842 9075318
44487 9075318 11317040 11515142 9849641 7999457 7440616 8437065 10338401 12157559 12698698
44478 12698698 10643099 5411907 -1502976 -6677813 -7439202 -4503633 -893591 1748744
44470 1748744 4154487 6437725 6561970 3629147 849388 2413868 7952110 12672147
44462 12672147 13017368 9858506 5939346 2814075 1250422 2205839 5555035 9200732
44454 9200732 11043898 10997461 10000259 8227646 5638142 3224888 2055033 1651326 823808
44445 823808 -343082 -749514 -92283 1045439 2482464 4124499 4712316 3097153 1032066
44436 1032066 2191487 7135262 11458933 11185490 8534790 9306377 14669650 18786256
44428A8786256k658254p297579m646625J544227L878314M98861l740859m157280
44420B207061j188406J805352K913552K383035Q06505j300472k707840k111021
44412B807766J17942J876279J528330k43970j119940K91040K589834K706976n31123
44403A0023134m306204m433628j85602M786278O685076N257459K662724N17536
44395B1006773n19531J47115K216716L596828K469257m6176j116560J04387J702316
44386B9561125J797482M51544j205719k229978k223200j695414j753177k227811
44378B0474852j103009K306574M856119L181727r67321k665548r83985K1496j663639
44369B3457266k696296l76386K431811K002092j08906n5002J633619J387723o91942
$$ plain form
44428 18786256 16128002 8830423 4183798 5728025 9606339 10105200 6364341 2207061
44420 2207061 1018655 2824007 5737559 8120594 8927099 7626627 4918787 2807766
44412 2807766 2925708 4801987 6330317 6086347 4966407 5257447 7847281 10554257 10023134
44403 10023134 5716930 1283302 1097700 5883978 12569054 17826513 20489237 21006773
44395 21006773 20487242 20634357 22851073 26447901 28917158 28870982 27754422 27858809 29561125
44386 29561125 31358607 31810151 30604432 28374454 26151254 24455840 22702663 20474852
44378 20474852 19371843 21678417 26534536 29716263 28748942 26083394 25099409 25120905 23457266
44369 23457266 20760970 20384584 22816395 24818487 24709581 24654579 26288198 27675921 26983979
44360B6983979p79951J859899L002915r1748m380416n371805k804597L49053K303760
44351B1071089L333210L615623K774004J272997M20510P44426J374469J217938
44343C5824266J99123q00921j033566p59522p64212j014994o18523M83281J000694
44334C2515626M89805O06558K359299L501871J426613k161282k933961l78920
44326C5425609J285649k87281k010962p20004J471008P10196k166966k966591
44318C0740658p34738J209343Q10641r0956M10153J224827P31538k76085j65089
44309C3860292P51494J066004P73999R22591J406156J037058l13220j347576j375721
44300C6781077j259253j758346k180563j643185p98167r53601j754813j248071
$$ plain form
44360 26983979 26204028 28063927 31066842 30975094 26594678 21222873 18418276 18767329 21071089
44351 21071089 24404299 28019922 30793926 32066923 32487433 33231859 34606328 35824266
44343 35824266 36023389 35222468 34188902 33429380 32665168 31650174 31031651 31514932 32515626
44334 32515626 33005431 33611989 35971288 39473159 40899772 38738490 35804529 35425609
44326 35425609 36711258 36423977 34413015 33693011 35164019 35874215 33707249 30740658
44318 30740658 30005920 31215263 32025904 31934948 32345101 33569928 34301466 34025381 33860292
44309 33860292 34611786 35677790 36451789 37374380 38780536 39817594 39504374 38156798 36781077
44300 36781077 35521824 33763478 31582915 29939730 29141563 28187962 26433149 25185078
44292B5185078J232628L439416K574192j213657m766278n283265k902018Q8427
44284A8354523J744449J855687J352279P40505o40857l289624n532502m341349
44276A0243111P06159N601266N943035J971915k499865n168470o259605n194918
44268E342628n80781N532250P748365M017477j338630l830140m311574n045544
44260G534051m321888m49M647036M724184J657622R97126L076851K776904j028272
44251B0063165l142978j117807N72825j153856k301063O44768L457553R07098
44243A7929705l753252l371710J784411M860090L341476J597714K162064J735368
44235B6285866j964682n384708m471305o19228K001804K123986J451911J136790
$$ plain form
44292 25185078 26417706 29857122 32431314 31217657 26451379 21168114 18266096 18354523
44284 18354523 20098972 21954659 23306938 24047443 23406586 20116962 14584460 10243111
44276 10243111 10949270 16550536 22493571 24465486 21965621 16797151 10537546 5342628
44268 5342628 4761847 10294097 18042462 22059939 20721309 16891169 12579595 7534051
44260 7534051 3212163 3211714 7858750 12582934 14240556 15237682 18314533 21091437 20063165
44251 20063165 16920187 15802380 16375205 15221349 12920286 13565054 17022607 17929705
44243 17929705 14176453 10804743 12589154 17449244 20790720 22388434 24550498 26285866
44235 26285866 24321184 18936476 14465171 13845943 15847747 17971733 19423644 20560434
44227B0560434P59945k62082j844641l112663k819209j074224q0407j058192j474818
44218I594143J339729M719912L475958j768936m503828j853348J555059J589537
44210A4148226M91200J017080O18141l035392n653922k327749L432278M088858
44202A2778720l75571k898763p04449J477723M31827o84809J058128L162564K420489
44193A6665859o7318j918683l401033n102358n353686l295005j344974j401221
44185e218419j472507P42462L684054M591579L751369K800092J380899q98512
44177I361017j672565Q56572L778822L053581k96423k115747j983322l038413
44169G943522n416807n405227k010837Q37487O11458J74724K606858N607925M662645
$$ plain form
44227 20560434 21320379 21058297 19213656 16100993 13281784 12207560 12127153 11068961 9594143
44218 9594143 10933872 15653784 19129742 17360806 12856978 11003630 12558689 14148226
44210 14148226 14639426 15656506 16274647 13239255 7585333 5257584 8689862 12778720
44202 12778720 12403149 9504386 8799937 10277660 10709487 10024678 11082806 14245370 16665859
44193 16665859 16598541 14679858 11278825 6176467 822781 -2472224 -3817198 -5218419
44185 -5218419 -6690926 -5948464 -2264410 2327169 6078538 8878630 10259529 9361017
44177 9361017 7688452 8545024 12323846 15377427 15081004 12965257 10981935 7943522
44169 7943522 2526715 -2878512 -4889349 -4051862 -3440404 -3265680 -658822 4949103 9611748
44160I611748j85598m088793l337076P36932L657394K286655k365847o069543
44152B45872n433248j223827K938799M703011M379669K821511L90935j699970
44144G122752j649862L68548K086353K385640K269458J791437q00971n041983
44136H531372o597049k677929L203087N313205K971681K39691n13602p67769j740422
44127G962265k113722r30812L80206M33961O3835N50546J447964J612595R58519
44118A0365357j45135j887519l945977m507417k116761J945633M660652M573444
44110H942277K902075J392988M09917l87440p01088j33319M55020l33804k000205
44101A0546421j978652P83518L223090J397562l792399o738908m049755J009739
$$ plain form
44160 9611748 9426150 5337357 2000281 2737213 6394607 8681262 6315415 245872
44152 245872 -5187376 -6411203 -3472404 1230607 5610276 8431787 8822722 7122752
44144 7122752 5472890 5841438 7927791 10313431 12582889 14374326 13573355 8531372
44136 8531372 1934323 -743606 2459481 7772686 10744367 10984058 10470456 9702687 7962265
44127 7962265 5848543 4917731 5297937 5731898 5795733 6346279 7794243 9406838 10365357
44118 10365357 10220222 8332703 4386726 -120691 -2237452 -291819 4368833 8942277
44110 8942277 11844352 13237340 13647257 13259817 12558729 12425410 12880430 12546626 10546421
44101 10546421 8567769 9351287 12574377 13971939 10179540 3440632 -609123 400616
44093D00616K928273R32901j105237o37915Q83111J354837J040386J177571J762989
44084H737532K039536J698230N28439j755672m288376m986849k975972p1555J355425
44075B80738J139112Q20273J271345K143755L030894L741637L703398K428868
44067A8560020N83538m95575m54836k36562o76370j627458k609878l443162l801882
44058E797835k865842k38295K903078M338496K921374j95141k958554m671681
44050E031270n844022n950850l225487K187397O588819O456372K974731L74122
44042H592352J92110J45521j126152j751211m73720N47361p18041k476237j969714
44033I62269K8725R32750R25856K011798L523674K875767O54320M75306K921365
$$ plain form
44093 400616 3328889 4261790 3156553 2518638 3401749 4756586 5796972 6974543 8737532
44084 8737532 10777068 12475298 13003737 11248065 6959689 1972840 -1003132 -1074687 280738
44075 280738 1419850 2240123 3511468 5655223 8686117 12427754 16131152 18560020
44067 18560020 19143558 18647983 18193147 17956585 17280215 15652757 13042879 9599717 5797835
44058 5797835 2931993 2693698 5596776 9935272 12856646 12661505 9702951 5031270
44050 5031270 -812752 -6763602 -9989089 -7801692 -1212873 5243499 8218230 8592352
44042 8592352 8784462 8929983 7803831 6052620 5578900 6126261 5408220 2931983 962269
44033 962269 990994 1923744 2849600 4861398 8385072 11260839 11915159 12390465 15311830
44024A5311830L979309J293047k018498k343544q81966p05472j352530l20776
44016A2961400J800157J882357o00098k715309k508983j160488l16870k5869J50760
44007I467057L80437J319423L252151M240207J926253k268260l866873j395777
43999A3054618J459873J461661L01655Q69819K046258Q98080j949833l279058
43991A4863073k572117k123634k177897m38905K805871L531146P5142l245912
43983A0716767j726700K887277M532804P30091m652510o356191l183062J650041
43975D598517L963151K226674j216617k618930j098418M50003l93619j993712
43967C917049j350804R20346J355522p69729j910391N32233M178740M896770K324177
$$ plain form
44024 15311830 19291139 20584186 18565688 16222144 15340178 14634706 13282176 12961400
44016 12961400 14761557 16643914 16043816 13328507 10819524 9659036 9342166 9316297 9467057
44007 9467057 9847494 11166917 14419068 18659275 20585528 18317268 14450395 13054618
43999 13054618 14514491 15976152 16277807 17147626 19193884 20091964 18142131 14863073
43991 14863073 12290956 10167322 7989425 7550520 10356391 13887537 13962679 10716767
43983 10716767 8990067 11877344 16410148 17140239 12487729 6131538 2948476 4598517
43975 4598517 8561668 10788342 9571725 6952795 5854377 6304380 5910761 3917049
43967 3917049 2566245 3486591 4842113 4072384 2161993 2694226 6872966 11769736 14093913
43958A4093913k08792n50596j60419j301915l558486m335203k247252J134215
43950B865465L180156L075901K038209J131839K41603n53492k70115J181641J965851
43941A4857058Q42299m72318K35634J748349R77502j703315k271783P90427L738998
43932A8742851L115496Q61808O37481J453923o55650n427186p432218l389506
43924G906999L209296O699323N817334L323564R74721k017398n791383p901069
43916A2221387n878978n93922M171507N342986L174528L86441p19105j13405N05168
43907A8496607l74560k586221m282488l490266j84672L164646L761337J437902
43899A5942285j179975j815977j097025j202184k539363l050256j079166K136928
$$ plain form
43958 14093913 13885121 13334525 13174106 11872191 8313705 3978502 1731250 2865465
43950 2865465 6045621 9121522 11159731 12291570 12533173 11979681 11709566 12891207 14857058
43941 14857058 15699357 15227039 15462673 17211022 18188524 16485209 14213426 15003853 18742851
43932 18742851 21858347 22720155 23357636 24811559 24155909 18728723 11296505 7906999
43924 7906999 11116295 17815618 23632952 26956516 27931237 25913839 20122456 12221387
43916 12221387 6342409 5748487 9919994 15262980 18437508 18823949 18104844 17991439 18496607
43907 18496607 18122047 15535826 11253338 7763072 7578400 10743046 14504383 15942285
43899 15942285 14762310 12946333 11849308 10647124 8107761 5057505 3978339 6115267
43891F115267L793425K988537J706132J864477K424718Q21777l023148n931904
43883A0759281n309179k063210J388987M225296O463807O743398L681473j199214
43875B4690639m631888n366564m233649j362208K969043N224457J389226o063139
43867A2615917r156659m750701J041393K061722O94972K371524N892876N844793
43859A6615837K154313J85836J977385L850006L014468O89877j940529n108139
43851B1439054o836817l876659K002081M412077J442460j214180P76394L845455
43843B1989865K993125k17009j244677k25324l51334j281097j2478K986623L926769
43834B8564463J701470p35437j070044k173J083585J514191M69881k196226m369214
$$ plain form
43891 6115267 9908692 12897229 14603361 16467838 18892556 19714333 16691185 10759281
43883 10759281 5450102 3386892 4775879 9001175 15464982 22208380 25889853 24690639
43875 24690639 20058751 14692187 10458538 9096330 12065373 17289830 18679056 12615917
43867 12615917 3459258 -1291443 -250050 1811672 2506644 4878168 10771044 16615837
43859 16615837 18770150 18955986 20933371 24783377 27797845 28487722 26547193 21439054
43851 21439054 14602237 10725578 12727659 17139736 18582196 17368016 18144410 21989865
43843 21989865 24982990 24765981 23521304 23295980 22944646 21663549 21651071 24637694 28564463
43834 28564463 30265933 29530496 28460452 28458279 29541864 31056055 31525936 29329710 24960496
43825B4960496l708559j039444Q65529J211135J065603L30905j624822k951910
43817A9108933r82605K949967M281135J494414j919417k652512j411898o06200
43809B0261817j357894l761672o951775q005415m273225J950916M772957K390721
43801E026430m10644K92272J771101j66726l878401m595623k109775m14988n89275
43792e075629N65399M245860O959653N868375K810247O89916o82850k188516j841211
43783A1351244K218279O804390O522795J601115j737377j69462J919924m02263
43775B8108645m481144m043437P91998L501772J260482j089729O43738L298973
43767B7991298K031063j594793k496881m79732J8144k381601m132389k946091
$$ plain form
43825 24960496 21251937 20212493 21078022 22289157 23354760 23685665 22060843 19108933
43817 19108933 18126328 21076295 25357430 26851844 24932427 22279915 20868017 20261817
43809 20261817 18903923 15142251 8190476 185061 -4088164 -2137248 2635709 5026430
43801 5026430 4615786 4908058 6679159 6512433 2634032 -1961591 -4071366 -4486354 -5075629
43792 -5075629 -4510230 -264370 6695283 12563658 15373905 16063821 15380971 13192455 11351244
43783 11351244 13569523 20373913 26896708 28497823 26760446 26590984 28510908 28108645
43775 28108645 23627501 19584064 20376062 23877834 25138316 24048587 24692325 27991298
43767 27991298 30022361 28427568 25930687 25450955 25469099 23087498 18955109 16009018
43759A6009018r21698m04302r32054j604936k605387k955698o89394K976898L684017
43750A2556464N60190j226230K019098O017807M155878k611825o649808l906388
43742A0915186J466653L549058J749986l38367m06946O66157J194518Q73043M76571
43733B0145859M26044K35603o28617j738687k151648j812427j611308j790096
43725A1074723j423097j83736N11316o28866k427091k240456O32961L673071L828172
43716A2816997J058590j460167r67037J493233K292724p3231l016714l500654
43708H643741j916532m55066P84003L081223N300431M464915O71231j859110o784
43699A8708052M341018O811167N046817O3967m696779n303019j026930L406987
$$ plain form
43759 16009018 15087320 14683018 13750964 12146028 9540641 6584943 5895549 8872447 12556464
43750 12556464 13116654 11890424 13909522 19927329 24083207 21471382 14821574 10915186
43742 10915186 12381839 15930897 17680883 17342516 16935570 17601727 18796245 19669288 20145859
43733 20145859 20571903 20807506 20178889 18440202 16288554 14476127 12864819 11074723
43725 11074723 9651626 9467890 9979206 9350340 6923249 4682793 5315754 8988825 12816997
43716 12816997 13875587 12415420 11448383 12941616 15234340 15161109 12144395 8643741
43708 8643741 6727209 6272143 7056146 10137369 15437800 19902715 20573946 18714836 18708052
43699 18708052 23049070 29860237 34907054 34971021 30274242 24971223 23944293 27351280
43691B7351280K391759l095334o205600l362689J510744L534025K927444J821776
43683B6873405k14790l412360m552730j307539L027952L818491J779824R28458
43675B6940711K094119L048317L024819K491906N11239k874369l902861j48480
43667C1185401L890415K432952k150217k492640K211521N343709L555188N75181
43659D4551510o75606j988649l822546k882221J207939L651776K301588J208719
43651D3552510K757018L062268k37323k394446M03990L554420J571295k072611
43643E0197121o59066L970508M075037j314419n000278k922652R21685K159463
43635E1427399J871542K471386L236587K760378J892760J751975J810791J803425
$$ plain form
43691 27351280 29743039 26647705 20442105 17079416 18590160 22124185 25051629 26873405
43683 26873405 26658615 23246255 18693525 17385986 20413938 24232429 26012253 26940711
43675 26940711 29034830 32083147 35107966 37599872 38111111 35236742 31333881 31185401
43667 31185401 35075816 37508768 35358551 32865911 35077432 40421141 43976329 44551510
43659 44551510 43875904 41887255 38064709 35182488 36390427 40042203 42343791 43552510
43651 43552510 46309528 49371796 49134473 46740027 47144017 50698437 52269732 50197121
43643 50197121 49538055 53508563 57583600 56269181 51268903 48346251 49267936 51427399
43635 51427399 53298941 55770327 59006914 61767292 63660052 65412027 67222818 69026243
43627F9026243K740387M390844M433131J886719q41330j057218Q68167K776044
43619H4222987L767487M338356M517899L584044J652404N62387K323205O209180
43611A11177949Q150740M823830j532673m809819k480336J403479K301843J050411
43603A20085424Q52566J677696J803087K383942N414172Q695517Q316070N417395
43595A54645869M772166O685571O533801L403339K676832P346238J2578665J2753423
43587B11395904R184181O581046N779993M693283L444227L635383M519530M394513
43579B53628060M114074M905470M497991L15586m843961n849601l448808l467637
43571B49851174p215983r051122n746860k134544l311685o372935n579867k250941
$$ plain form
43627 69026243 71766630 76157474 80590605 82477324 81635994 80578776 81446943 84222987
43619 84222987 87990474 92328830 96846729 100430773 102083177 102645564 104968769 111177949
43611 111177949 119328689 124152519 122619846 117810027 115329691 116733170 119035013 120085424
43603 120085424 120937990 122615686 124418773 126802715 132216887 140912404 149228474 154645869
43595 154645869 159418035 166103606 172637407 176040746 178717578 186063816 198642481 211395904
43587 211395904 220580085 227161131 232941124 237634407 241078634 244714017 249233547 253628060
43579 253628060 257742134 262647604 267145595 267461181 262617220 256767619 253318811 249851174
43571 249851174 242635191 233584069 227837209 225702665 222390980 216018045 210438178 208187237
43563B08187237k709920p736769j1104557r423889o884643p580258q830194o439203
43555A47477804k356320j724943m753468p051593o902222o651756p000141n634976
43547A05402385k732548k307318n596446p927218n567259j622139j037900l026490
43539G5585067l119933m57474J806232J932689P71786j517624n206432p933604
43531F1860707o670208k847880r45611j627020j057898K146311M346785K910182
43523E8115368k7003k090048m251227o886722o793173k262511K470613K526955
43515D0802252m99963j543803j68907l08722k712551l207990N78547N302495O482056
43506D4723414L709908m70675m141517o446154o581823m688124k694511k363936
$$ plain form
43563 208187237 205477317 197740548 186635991 177212102 170327459 162747201 153917007 147477804
43555 147477804 145121484 143396541 138643073 131591480 124689258 118037502 111037361 105402385
43547 105402385 102669837 100362519 94766073 86838855 81271596 79649457 78611557 75585067
43539 75585067 72465134 72007660 73813892 75746581 76518367 75000743 69794311 61860707
43531 61860707 55190499 52342619 51397008 49769988 48712090 50858401 55205186 58115368
43523 58115368 58088365 55998317 51747090 44860368 38067195 35804684 38275297 40802252
43515 40802252 40302289 38758486 38589579 38280857 35568306 32360316 32938863 38241358 44723414
43506 44723414 48433322 47962647 43821130 37374976 30793153 26105029 23410518 21046582
43498B1046582k917163j976263J329252N203777P079726O028061L361614J315893
43490D0471479J066592J713285J317306p62709k757322k278824O44846L061769
43482D2476422K357669m63286j988671p96549J024240J206447O8912j324544l401571
43473C9159069n986683o083351j572555L929210M452322P5259k799383p06960
43465C0466928K376229K262073J264463L408907O834866O522646K493006m12033
43457E5217085k26378J23974j161964j958107r23608l86973j978268l011207n03880
43448D5190674L469757L877565o51516o051264p627315m730716m56158J870934
43440C4891961J431841n952j72217J395120K945716K375745n91432m034140n509479
$$ plain form
43498 21046582 18129419 16153156 17482408 22686185 29765911 35793972 39155586 40471479
43490 40471479 41538071 43251356 44568662 43805953 41048631 38769807 39414653 42476422
43482 42476422 44834091 44370805 42382134 41585585 42609825 43816272 43885184 42560640 39159069
43473 39159069 33172386 27089035 25516480 29445690 33898012 33973271 31173888 30466928
43465 30466928 32843157 35105230 36369693 39778600 46613466 53136112 55629118 55217085
43457 55217085 54990707 55114681 53952717 51994610 51071002 50684029 48705761 45694554 45190674
43448 45190674 48660431 52537996 51886480 45835216 38207901 33477185 33021027 34891961
43440 34891961 36323802 36317850 36145633 37540753 40486469 42862214 42270782 38236642 32727163
43431C2727163m183657j395389R79515K486491L839080M974215M708937K833188
43423D6969543J143805J239969K278313K230248O43287j183866k151686k026660
43415D9142953o13699K094606M895384N909182M596935K506694J706372K726467
43407G2964894L965543L152518k2830k876349k494796N14191K824868L161043
43399H1189082L724426N859151P236590N501521K155873Q8120n35271q44963M0788
43390A04415317L016662N359276L660989k73511j071881K531032O049104N935226
43382A29622214L711750K220286J647605J054443O79630Q66762J091377J279389
43374A42173456J805006J675231l15583k204058m33948M152538O115261L126224
$$ plain form
43431 32727163 28543506 27148117 28127632 30614123 34453203 39427418 44136355 46969543
43423 46969543 48113348 49353317 51631630 53861878 54505165 53321299 51169613 49142953
43415 49142953 48529254 50623860 55519244 61428426 66025361 68532055 70238427 72964894
43407 72964894 76930437 80082955 80060125 77183776 74688980 75203171 78028039 81189082
43399 81189082 84913508 90772659 98009249 103510770 105666643 105754763 105219492 104374529 104415317
43390 104415317 107431979 112791255 116452244 116178733 115106852 117637884 123686988 129622214
43382 129622214 133333964 135554250 137201855 138256298 138935928 139802690 140894067 142173456
43374 142173456 143978462 145653693 145338110 143134052 142700104 146852642 152967903 156094127
43366A56094127k37054R03097N033646P428522O936195O038863O444000P955222
43358A96596618R873695J0632710Q030370K672691r53107J41285L170643L898981
43350B34063886K892717L540975N778929O359310M516574K983772L380534M212775
43342B67729472L666650J566672j229525k978423j685976J595266J865008l525118
43334B67004026r335279q295884j692150J831999j442919n525054m456838j005224
43326B37082677j560272o551565j0799613j1162779r261325p390610n653862l611278
43318A81091373k062000k056668l275400m190415l763032k830569l297529n483756
43310A54132004p287330p271411p265781r433016j1730703r872426l914384R90414
$$ plain form
43366 156094127 155857073 156760170 161793816 169222338 176158533 182197396 188641396 196596618
43358 196596618 206470313 217103023 225133393 227806084 226852977 226994262 230164905 234063886
43350 234063886 236956603 240497578 246276507 252635817 257152391 260136163 263516697 267729472
43342 267729472 271396122 272962794 271733269 268754846 267068870 268664136 270529144 267004026
43334 267004026 257668747 249372863 247680713 249512712 248069793 242544739 238087901 237082677
43326 237082677 235522405 228970840 218171227 207008448 197747123 190356513 184702651 181091373
43318 181091373 179029373 176972705 173697305 169506890 165743858 162913289 159615760 154132004
43310 154132004 146844674 139573263 132307482 122874466 111143763 101271337 97356953 98347367
43302I8347367J480582j60473p82072j157655l155796n339518n094125l140826
43294H0997484k264712k746546k483037r75778J0470l99180j179060j661341k418882
43285F6879418l617572m441275m431385l878235k908276j606792p82976j098302
43277D4114605j749660j557191r41410j107794j643638q72987J403657L317200
43269D0962782L306806J713299m4804p00349J92679J594727J520892l98952j787348
43260D6359732p43507Q93153P3309k458935k971129n66435J311580J43391k124397
43251C9916762k422946p75956P72499J363885J499695J576071J888890K716525
43243D6535425L198380J866896o04865j512342m59360p33616l943414o231612
$$ plain form
43302 98347367 99827949 99667476 98885404 97727749 94571953 89232435 84138310 80997484
43294 80997484 78732772 75986226 73503189 72527411 72537881 72138701 70959641 69298300 66879418
43285 66879418 63261846 58820571 54389186 50510951 47602675 45995883 45212907 44114605
43277 44114605 42364945 40807754 39866344 38758550 37114912 36241925 37645582 40962782
43269 40962782 44269588 45982887 45938083 45237734 45430413 47025140 48546032 48147080 46359732
43260 46359732 45616225 46509378 46582687 44123752 41152623 40586188 41897768 42041159 39916762
43251 39916762 37493816 36717860 37490359 38854244 40353939 41930010 43818900 46535425
43243 46535425 49733805 51600701 50995836 49483494 49024134 48290518 44347104 38115492
43235C8115492l495295J831623L681177R13899j716395r76581J226078K400546
43227D1980544L014988L694302K940799K00291j971918j485769J18302N71238
43219D9062777L66605O32044J57197k038448l419344j251572K350064L074712
43211D8934035J212083J025292L357358L966017N79113l109239l016523m45862
43203E2502274Q37267L40720Q1310R9089j400756m154430n463129l818193m27507
43194C8596645K938953N384470O018445L956758M5447k982159l080242q90725
43186D9987592J336972K244061K389991L024875M049955L621705N49179l222894
43178F3981436m165026j562846J558609K693996K655997K654541J488179j472422
$$ plain form
43235 38115492 34620197 36451820 40132997 41046896 39330501 38353920 39579998 41980544
43227 41980544 44995532 48689834 51630633 51830924 49859006 48373237 48491539 49062777
43219 49062777 49429382 50061426 50218623 48180175 44760831 43509259 45859323 48934035
43211 48934035 50146118 51171410 54528768 58494785 59073898 55964659 52948136 52502274
43203 52502274 53339541 53680261 53761571 53860660 52459904 48305474 42842345 39024152 38596645
43194 38596645 41535598 46920068 52938513 56895271 56940718 53958559 50878317 49987592
43186 49987592 51324564 53568625 55958616 58983491 63033446 66655151 67204330 63981436
43178 63981436 59816410 58253564 59812173 62506169 65162166 67816707 69304886 67832464
43170F7832464l057752k63494L997012L961650l80060k830178p5120L822296M220508
43161G7227326K480246K204915K652908N90855l259544m395756r08551L995324
43153H0587723O155740M409246K71048l678391m729356j879495K393434M025951
43145H7555900J805114j553714l231117l487205m127256n317884n462672l725563
43137F2455603j358120k19077n71976r25511j23363J052142J112538K47050P1814
43128F1741100Q93596R16622j114863m068600o103467o500992m843382o60936
43120D0259078M282810N774267K078433k779752l996091k669110l463123o668521
43112C2817991p566820l974583O64810L155387M689234O717619P112973L897684
$$ plain form
43170 67832464 64774712 64511218 68508230 72469880 72089820 69259642 69184522 73006818 77227326
43161 77227326 79707572 81912487 84565395 85156250 81896706 77500950 76592399 80587723
43153 80587723 86743463 91152709 91423757 87745366 83016010 81136515 83529949 87555900
43145 87555900 89361014 87807300 84576183 81088978 76961722 71643838 66181166 62455603
43137 62455603 61097483 60878406 60306430 59380919 59257556 60309698 61422236 61669286 61741100
43128 61741100 62634696 63551318 62436455 58367855 52264388 45763396 40920014 40259078
43120 40259078 44541888 50316155 52394588 49614836 45618745 42949635 39486512 32817991
43112 32817991 25251171 21276588 21941398 25096785 29786019 36503638 43616611 47514295
43104D7514295n92003k959695l492207m044275l756240j012658K349214L232105
43096C7238536K284133K288686K783976J198332j402956j237324J330237J635048
43088D6118668j325479k617629N25954L886948L081798K32492o13588l70796j833432
43079D7084936l203960j024441K588027K423747q70358j207486L001446O063662
43071E4855573M041109K63685j222189j886636m073312n104619j721571K891922
43063D8043962K795531j502577l598014q01001K534467K384570N08525Q0093J06477
43054E0552033k152617n668827o455717l275137N97931J783473P59826K63827
43046C6404792R55894M31663l030177o993426o896248j798623L696210M612818
$$ plain form
43104 47514295 46922292 43962597 40470390 36426115 32669875 31657217 34006431 37238536
43096 37238536 39522669 41811355 44595331 45793663 44390707 43153383 44483620 46118668
43088 46118668 44793189 42175560 42701514 46588462 49670260 49902752 49289164 48918368 47084936
43079 47084936 43880976 42856535 45444562 47868309 46997951 45790465 48791911 54855573
43071 54855573 58896682 59160367 57938178 56051542 51978230 46873611 45152040 48043962
43063 48043962 50839493 49336916 45738902 44937901 47472368 49856938 50365463 50445556 50552033
43054 50552033 48399416 42730589 36274872 32999735 33597666 35381139 36140965 36404792
43046 36404792 37360686 37792349 34762172 27768746 20872498 19073875 22770085 27382903
43038B7382903J405787j313158j004462L42243O8725j376831j717945k43789J590143
43029B5133616K301530J989088J793972K157724J928609j47303k951474l508401
43021B8697361j022609J404873J195635O31928L323567P346442O580330k37605
43013D7919922o318243n143992J384430O098788N385605J687370j128464j673898
43005D8211518r67498q78445k283702l442925j514930K943512N252601K739399
42997E0059530p82587q4211L853683N617287L695708J982177K646743K769788
42989F9758118Q7280k476704j431317J289575J040614k406966m548858k856186
42981E8455556j73458k04315k244163k549390K42311L325909L483310R12239j521397
$$ plain form
43038 27382903 28788690 27475532 26471070 26813313 26882038 25505207 23787262 23543473 25133616
43029 25133616 27435146 29424234 31218206 33375930 35304539 35157236 32205762 28697361
43021 28697361 27674752 29079625 30275260 30907188 34230755 41577197 48157527 47919922
43013 47919922 41601679 36457687 37842117 43940905 49326510 51013880 49885416 48211518
43005 48211518 47244020 46365575 44081873 40638948 39124018 42067530 47320131 50059530
42997 50059530 49276943 49192732 53046415 58663702 62359410 64341587 66988330 69758118
42989 69758118 69845398 67368694 65937377 67226952 68267566 65860600 61311742 58455556
42981 58455556 58282098 58077783 55833620 53284230 53526541 56852450 60335760 61247999 59726602
42972E9726602j728898K0515K155857L015227J527927j545349l255896j472402
42964E8443583J588705J440803k215201m125271o05174M756619N725282J870545
42956F6879891j462801q58071J569801K679133K547624K564190K248922M68330
42948G6637019j755108k156326n95459N23978k54966j016291R45690M558166N321334
42939H2208037J530648k155347m90896M491801O030759K886914J114469L725798
42931I9342183N226489J054023l525220j036317N788725P682800L038651m55121
42923A17116213J483992M103020K737299k06028p42838N75703J687084K793227
42915A29547672L699155K387714m86946p44984K332535L532297J16385k886564
$$ plain form
42972 59726602 57997704 58018219 60174076 63189303 64717230 63171881 59915985 58443583
42964 58443583 60032288 61473091 59257890 55132619 54527445 59284064 65009346 66879891
42956 66879891 65417090 64559019 66128820 68807953 71355577 73919767 76168689 76637019
42948 76637019 74881911 72725585 72130126 72654104 72399138 71382847 72328537 76886703 82208037
42939 82208037 83738685 81583338 81092442 85584243 91615002 94501916 95616385 99342183
42931 99342183 104568672 105622695 102097475 101061158 106849883 114532683 117571334 117116213
42923 117116213 118600205 122703225 125440524 125234496 124491658 125067361 126754445 129547672
42915 129547672 133246827 135634541 135147595 134402611 136735146 140267443 140383828 137497264
42907A37497264o79211L325583L404997P97733M08143J880759J166683j409774
42899A46392177j875768j06759K08512j503915k231863j713441l037537o362933
42891A29768473p766225n499359k514100j587911k211936l281026m851725o259892
42883I5796299o049894m481487l038607j605042M85027J371772j095058m702414
42875G6680596n264570l215799k474678k953580m98996M782041O739138K134435
42867G5928587m337499o917975n693618l638400j480382R80452K364015J996598
42859E9201778J601602K031125J532534m84411j645956q53235k74582p47735J50994
42850F0512114K539325J956040l233261p187683m609568Q16060J911637j433224
$$ plain form
42907 137497264 136818053 140143636 143548633 144346366 144754509 146635268 147801951 146392177
42899 146392177 144516409 144409650 144618162 143114247 140882384 139168943 136131406 129768473
42891 129768473 122002248 116502889 113988789 112400878 110188942 106907916 102056191 95796299
42883 95796299 89746405 85264918 82226311 80621269 81106296 82478068 81383010 76680596
42875 76680596 71416026 68200227 65725549 62771969 62272973 67055014 73794152 75928587
42867 75928587 71591088 64673113 58979495 55341095 53860713 54841165 57205180 59201778
42859 59201778 60803380 62834505 64367039 63882628 62236672 61383437 61108855 60361120 60512114
42850 60512114 63051439 65007479 61774218 54586535 49976967 50793027 52704664 51271440
42842E1271440l523954k243228n88524j13345Q29093K485149K820893J462491
42834E2400015m842j499450l892946n541059m011636q98807q1796j346719q38537
42825C4284223J887586K675127k47950l210553k910971q92280p0497n48070j035174
42816B9931441j220791q03965Q98754K777664K368974n4741j059364O54658J937654
42807C5430284K09223k546719l253030k121143q50003O48334K600855L005565
42799C3123366M94641k252129j607558J599413L201473J547638j006365k198807
42791C2901672k286577j956323n62261K350153N287363N650499K025194m190480
42783C9219240r000103q647322l515809J535260K127575r68229l456521k874411
$$ plain form
42842 51271440 47747486 45504258 44915734 44802389 45631482 48116631 50937524 52400015
42834 52400015 52395173 50895723 47002777 41461718 37450082 36551275 36469479 35122760 34284223
42825 34284223 36171809 38846936 38598986 35388433 32477462 31585182 31514685 30966615 29931441
42816 29931441 28710650 27906685 28805439 31583103 33952077 33897336 32837972 33492630 35430284
42807 35430284 35639507 33092788 29839758 27718615 26868612 27516946 30117801 33123366
42799 33123366 33618007 31365878 29758320 31357733 34559206 36106844 35100479 32901672
42791 32901672 30615095 28658772 28096511 30446664 35734027 41384526 43409720 39219240
42783 39219240 30219137 21571815 18056006 19591266 21718841 20750612 17294091 14419680
42775A4419680m20916J872078L308796L648694K345101l20194k736055l505940
42767A8611244k635191p68005J650637L850307M432728K575736q30514l792263
42759B3094679m715003l232131k30691K589949L764087L132133J655642K02684
42751B6261349r09856j298454n42484Q26793J497621J175645J036420J441015
42743B9488049O20504k496665n151927l276963K531666O372318L915682k151682
42735B9850982n591823l991690k75413K068787K289668J042560j099863k774273
42727B1518935k007992J001557K962243J188663k736298m697917l007221j51332
42719A4070638N20167j145086k053983J3784K950261K616078r86827k538857J148728
$$ plain form
42775 14419680 13998764 15870842 19179638 22828332 25173433 24853239 22117184 18611244
42767 18611244 15976053 15208048 16858685 20708992 25141720 27717456 26886942 23094679
42759 23094679 18379676 15147545 14916854 17506803 21270890 24403023 26058665 26261349
42751 26261349 25351493 24053039 23510555 24337348 25834969 27010614 28047034 29488049
42743 29488049 30108553 27611888 22459961 19182998 21714664 28086982 32002664 29850982
42735 29850982 24259159 20267469 19992056 22060843 24350511 25393071 24293208 21518935
42727 21518935 19510943 20512500 23474743 24663406 21927108 17229191 14221970 14070638
42719 14070638 14590805 13445719 11391736 11405520 14355781 16971859 15985032 13446175 14594903
42710A4594903N187965K861247l574246m927603J085436N428387J098793n856672
42702A5898210n303271J844055N786633K843653o67828J02338J725621n9431l043415
42693A9126565k931634j31241K251044L722054N452493O406142M521328O58482
42685C9075233j863056j347250O17348J150338j278470n225328o784640l421421
42677B0922754K245185M796321K806124M32981J105979K867133J995842j639516
42669C5532803n253723o739199n356089j356595K700168K931508p66445l181234
42661A8511194n38579L685731L491040j131629m685614l967039j051910J059852
42653A5373046J644668Q46003j255272l320779l291876j025531J644200L584789
$$ plain form
42710 14594903 19782868 22644115 19069869 14142266 15227702 20656089 21754882 15898210
42702 15898210 10594939 12438994 18225627 21069280 20401452 20503790 22229411 22169980 19126565
42693 19126565 16194931 16063690 18314734 22036788 27489281 33895423 38416751 39075233
42685 39075233 37212177 35864927 36482275 37632613 36354143 31128815 24344175 20922754
42677 20922754 23167939 27964260 30770384 31203365 32309344 35176477 37172319 35532803
42669 35532803 30279080 23539881 18183792 16827197 19527365 22458873 21692428 18511194
42661 18511194 17972615 21658346 25149386 24017757 19332143 15365104 14313194 15373046
42653 15373046 17017714 17863717 16608445 13287666 9995790 8970259 10614459 14199248
42645A4199248M939685N132145K850151j449864m981113n190650j909284K678546
42637A6268864N243330L766610L34800j98966L583432O881865N008615K95408
42629D1183958j372409P86215K266166J016807k31551K9899o55410l455676n038668
42620C4529331k531964J766101L493225J559944j818014m110629l687178m25781
42612B8775035L194226L903002J808469J07207j92829j382726l397595k027245
42604C0787544L890929Q249014N669616J14024n24727L912226O296168L474942
42596F1869736K0223k64845J96317j417254k825391j203950J081289L54760j554461
42587E6256424J01267M793005O731167L534315l69937r54188n38485k981488o336093
$$ plain form
42645 14199248 19138933 24271078 27121229 25671365 20690252 15499602 13590318 16268864
42637 16268864 21512194 25278804 25613604 25414638 28998070 35879935 40888550 41183958
42629 41183958 39811549 40597764 42863930 43880737 43649186 43679085 43023675 39567999 34529331
42620 34529331 31997367 33763468 37256693 38816637 36998623 32887994 29200816 28775035
42612 28775035 31969261 35872263 37680732 37787939 37595110 36212384 32814789 30787544
42604 30787544 34678473 42927487 48597103 48711127 48186400 52098626 58394794 61869736
42596 61869736 61889959 61625114 61821431 60404177 57578786 56374836 57456125 57810885 56256424
42587 56256424 56357691 61150696 67881863 71416178 71046241 70092053 69553568 66572080 60235987
42578F0235987n206203Q35793O151988O827945N148732M651116M577775K172186
42570H5395319k100384m977309m769626k509208L22710K641932L214880J934850
42562G9153164J037758K471451M645988M466751J968930n0993m79294n67391m78628
42553I2167736R29630K579492J657259j312906k092035Q77737L835517L738290
42545A02380720K766867L610422M165928J364430k481872k208491K515712O627399
42537A18741115O511638L455926K42645j897582k206666L55088N173792R230395
42529A39606351R572840N725269k92699n048671n343685r44310M162285N180694
42521A52618074J604520k585630l885275k639106j178800o08689n25771o22059
$$ plain form
42578 60235987 55029784 55865577 62017565 68845510 73994242 78645358 83223133 85395319
42570 85395319 83294935 78317626 73548000 71038792 71361502 74003434 77218314 79153164
42562 79153164 80190922 82662373 87308361 91775112 93744042 93693049 93213755 92646364 92167736
42553 92167736 93097366 95676858 97334117 96021211 93929176 94806913 98642430 102380720
42545 102380720 105147587 108758009 112923937 114288367 111806495 109598004 112113716 118741115
42537 118741115 125252753 128708679 128951324 127053742 124847076 125202164 130375956 139606351
42529 139606351 149179191 154904460 154611761 149563090 144219405 143275095 147437380 152618074
42521 152618074 154222594 151636964 147751689 145112583 143933783 143325094 142799323 142177264
42513A42177264j226708k550888m086259m801399l952894j911380n0824L96783
42505A23993695p57377k746261m268767m137296k637510k025729m037032o930852
42497I6452871p178062m392663j915533j700484j826351p11078k43424j888892
42489G6596384k954090o52856K608233K563899j75p03417Q65154M79485l260829
42480G5541788n975929l940724N71742K829345J634774n45230j325273k01399
42472F8589094J905342L270369K557743L34164j595483k606694l505892m274694
42464F4673949l613527j292284R16028J340805J5874k012056l423641k885049
42456E3720099n19466J196526K76497j522815j099721Q33821N96222k386416m425098
$$ plain form
42513 142177264 140950556 138399668 134313409 129512010 125559116 123647736 123596912 123993695
42505 123993695 123236318 120490057 116221290 112083994 109446484 107420755 103383723 96452871
42497 96452871 89274809 84882146 82966613 81266129 79439778 78728700 78485276 76596384
42489 76596384 73642294 72989438 75597671 78161570 78161395 77457978 78323132 78802617 75541788
42480 75541788 69565859 65625135 66196877 69026222 70660996 70115766 68790493 68589094
42472 68589094 70494436 73764805 76322548 76656712 75061229 72454535 68948643 64673949
42464 64673949 61060422 59768138 60684166 62024971 62040845 60028789 56605148 53720099
42456 53720099 53200633 54397159 54673656 53150841 52051120 52884941 53481163 51094747 46669649
42447D6669649l376887j527702j148524j122154r7630O41054l1289o45389j01220
42438C9259908l4972j516847k400253r87357N85583M4970p27761Q74435K816324
42429C7914030J205776k902874m466469k098328j09179j889046n075173n205337
42421A7373400j684417J949405K540208M91912j395325j389156m89104l60629
42413A7036294n52340N87223K671219L493159K762277K592916L313807K266768
42405C4171323j322176l823130k413314L43869N74324j025223j303190k67995
42397B4934488j62440o56301L98670K427936K775435J228250k05899j253098k865748
42388B6621293l658691j607104J280205J134426j125206r09086J916284K185508
$$ plain form
42447 46669649 43292762 41765060 40616536 39494382 39396752 40037806 40006517 39361128 39259908
42438 39259908 39224936 37708089 35307836 34320479 34906062 34951032 34223271 35097706 37914030
42429 37914030 39119806 36216932 31750463 29652135 29542956 27653910 22578737 17373400
42421 17373400 15688983 17638388 20178596 20670508 19275183 17886027 17396923 17036294
42413 17036294 16483954 17071177 19742396 23235555 25997832 28590748 31904555 34171323
42405 34171323 32849147 29026017 26612703 26956572 27530896 26505673 25202483 24934488
42397 24934488 24772048 24115747 24514417 26942353 29717788 30946038 30740139 29487041 26621293
42388 26621293 22962602 21355498 22635703 23770129 22644923 21735837 23652121 25837629
42380B5837629j768521m706417k729878O98638Q88013o62672K93410L314833M324575
42371B5489610K226129k2810j52790J103880K030433J658492o0855j918309k064004
42362B8289776m53110N80048m10399j842367j804852q71817k69954O25149K492009
42353B6334483L647006K257427l70173j420087m13338J004108J855947J832356
42345C4727729j15831m004090o543683m185924J555997N027374L236509r35751
42337B8762330l055101k168560k80229J205965K577449L950583M036656J671295
42329C6700388j759251k842707l27605K268931O65379l875290n555356k121372
42321B3153117J926999K302656J154351K640672N474932M849336J84386m120854
$$ plain form
42380 25837629 24069108 19362691 16632813 17331451 18219464 17556792 17850202 21165035 25489610
42371 25489610 27715739 27692929 27540139 28644019 30674452 32332944 32272089 30353780 28289776
42362 28289776 27836666 28416714 28006315 26163948 24359096 23487279 23217325 23842474 26334483
42353 26334483 29981489 32238916 31868743 30448656 30035318 31039426 32895373 34727729
42345 34727729 34611898 30607808 24064125 19878201 21434198 26461572 29698081 28762330
42337 28762330 25707229 23538669 23258440 24464405 27041854 30992437 35029093 36700388
42329 36700388 34941137 32098430 31770825 34039756 34705135 30829845 25274489 23153117
42321 23153117 25080116 27382772 28537123 31177795 36652727 41502063 41686449 37565595
42313C7565595n266743m726103m186110l246181j888572j219275p73255J152949
42305A7412305L463650K519939k020163n494962m528907j505088j68456l7043
42297I641275J448997L638073L371208j3426l540032m213895j678583K227031
42289A0880648M773998L903359K63398k824158k790504m65096J732069K752894
42281A8226608K562029O65774k552937m402375k745190L19734N85565k518883
42273A0140325n127724m259211j319494N12008J13236j451135k735301k601694
42265f728990n66568K326571M036690L817523K926853K407362J624973J7244j298027
42256H563631j276888j061602k280168l905205l113405O13507M379850N540915
$$ plain form
42313 37565595 32298852 27572749 23386639 20140458 18251886 17032611 16259356 17412305
42305 17412305 20875955 23395894 21375731 15880769 11351862 9846774 9678318 9641275
42297 9641275 11090272 14728345 18099553 18086127 14546095 10332200 8653617 10880648
42289 10880648 15654646 19558005 19821403 16997245 14206741 13741645 15473714 18226608
42281 18226608 20788637 21454411 18901474 14499099 11753909 12073643 12659208 10140325
42273 10140325 5012601 753390 -566104 -54096 59140 -1391995 -4127296 -6728990
42265 -6728990 -7295558 -4968987 -932297 2885226 5812079 8219441 9844414 9861658 8563631
42256 8563631 7286743 6225141 3944973 39768 -3073637 -2460130 1919720 7460635
42248G460635M571038L070582O77405l736560q379185q833571l323136L964104
42240d528688O814570L854013m18974j696344p89129r87052k270795j232382L145133
42231A890352O859449N969013K056473l09155l73132j685905n403793p160662
42223A842640l220437L060427M826940Q77578k814215j486362K100821K101211
42215G288603j923722m306583j006992M744366O205373J467090m079496m345513
42207D043126J3483K993330J675244r1314J841738N031376L988258j102425m309325
42198A4083491k774621l44470o61312j749360p83389K52617j562463l816250k046007
42189E98236K403898L715193N36521k045722l81969K986356M202150L304944K209754
$$ plain form
42248 7460635 12031673 15102255 15779660 12043100 3663915 -5169656 -8492792 -4528688
42240 -4528688 2285882 6139895 5720921 4024577 3235448 2248396 -22399 -1254781 1890352
42231 1890352 8749801 14718814 16775287 16466132 16093000 14407095 9003302 1842640
42223 1842640 -1377797 1682630 6509570 7387148 4572933 3086571 5187392 7288603
42215 7288603 5364881 1058298 51306 4795672 11001045 12468135 8388639 4043126
42207 4043126 4056609 7049939 8725183 8633869 10475607 15506983 19495241 18392816 14083491
42198 14083491 11308870 10964400 10303088 8553728 7770339 8022956 6460493 2644243 598236
42189 598236 3002134 6717327 7253848 5208126 4826157 7812513 12014663 15319607 17529361
42180A7529361J110252m04136j374404j126837p36126p79121J79283K850296N151988
42171B2400556M936067K729704j16412l569611o943190p469367m017293j74802
42163G775652o9252k471912k622913R15000M742463N627481L736680Q33143j704158
42154A6762184k672740j523523L39521P80558k62787j031959q39252n62957m43714
42145A0545331K05599J093731J226323J152975K317140L976871L652863J174302
42137B5345135p12890o48408m61421j326366j292702J179853L879196L696505
42129B9658902R55521j637275k776151k760051j460171Q95728J897364p44063
42121B4029804n162250o741139m067757n98706N73405O58159J866926K706560
$$ plain form
42180 17529361 18639613 18235477 16861073 15734236 14998110 14218989 14398272 17248568 22400556
42171 22400556 27336623 30066327 29949915 26380304 19437114 11967747 7950454 7775652
42163 7775652 7706400 5234488 2611575 3526575 8269038 13896519 17633199 18466342 16762184
42154 16762184 14089444 12565921 12905442 13686000 13423213 12391254 11552002 10989045 10545331
42145 10545331 10750930 11844661 13070984 14223959 16541099 20517970 24170833 25345135
42137 25345135 24632245 23983837 23522416 22196050 20903348 22083201 25962397 29658902
42129 29658902 30614423 28977148 26200997 23440946 21980775 22876503 24773867 24029804
42121 24029804 18867554 12126415 8058658 7459952 8033357 8691516 10558442 13265002
42113A3265002N6734m753160n822405k67452O667602P032390l5973o960328o847943
42104B334467j270294K989239K914084J784355L114613N514875N247114J854056
42096B4482509j146460q54869J506970K317255J6639l047280l534088j320038
42088A8420638L24071r46174l450855l971349k228816q43438j172740j518282
42080D613055n2254K429694L768643L111948J252809p01134j990269k232922j651334
42071H548236q72226p2086J181120K963569M404068M260078J865511k007828m770444
42062A5499998l711000N73166L728532K682437j73768o67350O11738l70205l667628
42053A4505920m513684j096955K208531K009188J116454K652170L700685M61445
$$ plain form
42113 13265002 13321736 8568576 2746171 2478719 9146321 16178711 16142738 9182410 2334467
42104 2334467 1064173 4053412 6967496 8751851 11866464 17381339 22628453 24482509
42096 24482509 23336049 22481180 23988150 26305405 26322044 23274764 19740676 18420638
42088 18420638 18744709 17798535 14347680 10376331 8147515 7304077 6131337 4613055
42080 4613055 4560801 6990495 10759138 13871086 15123895 14422761 12432492 10199570 8548236
42071 8548236 7676010 7603924 8785044 11748613 16152681 20412759 22278270 20270442 15499998
42062 15499998 11788998 12362164 16090696 18773133 18599365 17932015 18543753 18173548 14505920
42053 14505920 9992236 8895281 11103812 13113000 14229454 16881624 20582309 21043754
42045B1043754l704726k199490M172932P264765K791523m389185p657401o194591
42037A1127581l044986p5219K115190K428975O98408q30841k3656K161699L086145
42028A7643296K012193P49269J086317K480599K344088j062317n610938o481903
42020A3160604j936423L520430M329484R84897j523858j494647k125141m985303
42012I930043o909893n289871k037383L12186K458327N154146N872207K692733
42004A2182495j230771j511187R07217J374548j231757l151801j627245J488709
41996G200208K707492R57068j969194l368310j951463O51547J430645O9126k65191
41987E461928K123200M142863K445178j022544j923604l38156o8928j992296l066107
$$ plain form
42045 21043754 17339028 15139538 19312470 26577235 29368758 24979573 17322172 11127581
42037 11127581 8082595 8007376 10122566 12551541 13249949 12419108 12395452 14557151 17643296
42028 17643296 19655489 20404758 21491075 23971674 26315762 25253445 19642507 13160604
42020 13160604 11224181 14744611 19074095 20058992 18535134 17040487 14915346 9930043
42012 9930043 3020150 -2269721 -4307104 -3994918 -1536591 3617555 9489762 12182495
42004 12182495 10951724 9440537 10347754 11722302 10490545 7338744 5711499 7200208
41996 7200208 9907700 10864768 8895574 5527264 3575801 4227348 5657993 5727119 5461928
41987 5461928 7585128 11727991 14173169 13150625 11227021 10888865 10819937 8827641 5761534
41978E761534k009699r59644o86817Q37382L589557M094269J170029j419129q77449
41969I500033K99920o52199j465301R81057M343874L907713J76568j849412k63017
41960A4979236J792127J763547O33388n02635k428232m831121n094465k292317
41952D019528M01811k86205l192698m348865j930299K143172M624793L682847
41944E114084J54796k916492k940036o84944O56399j94626j023097K30738K412927
41935H09749L309024K794180J828965L00053j623645j872227N33671K317800k56649
41926H140921n056528n973327j558615K742728K396723n54139j972947j640855
41918c476039j331382l20057K718096N485833M460320N51259j956244j611359
$$ plain form
41978 5761534 3751835 2792191 2105374 2942756 6532313 10626582 11796611 10377482 9500033
41969 9500033 9799953 9147754 7682453 8663510 13007384 16915097 17091665 15242253 14979236
41960 14979236 16771363 18534910 19168298 18665663 16237431 11406310 6311845 4019528
41952 4019528 4421339 4135134 942436 -3406429 -5336728 -3193556 1431237 5114084
41944 5114084 5268880 2352388 -587648 -1272592 -616193 -810819 -1833916 -1603178 809749
41935 809749 4118773 6912953 8741918 9041971 7418326 5546099 6079770 8397570 8140921
41926 8140921 3084393 -2888934 -4447549 -1704821 691902 137763 -1835184 -3476039
41918 -3476039 -4807421 -5127478 -2409382 3076451 7536771 8088030 6131786 4520427
41910D520427p47554m70935P30795K760576K794557p4009k872037l112888j670282
41901A858650K42556L059281N658875M313191j765802p159128o452910j275992
41893a521279K667263L283273K593234J552997o30619k794537k325749L90228
41885C214811K148440J883494J607528K114358J821001N94296O08085K152471
41877A6144484K541928Q28373k44217Q88266J464793j044108m295865m322033
41869A1961621j329565R64192M77039j511975k807490k195797J49353K246596
41861G953974J525792j582924k763600J063975O954963R001169N524587N83329
41853B8261265j432233k13161J575252J583805n93985l504695m954174l915790
$$ plain form
41910 4520427 3772873 3301938 4032733 6793309 9587866 9513857 6641820 3528932 1858650
41901 1858650 2101206 5160487 10819362 15132553 13366751 6207623 -245287 -1521279
41893 -1521279 1145984 4429257 7022491 8575488 7944869 5150332 2824583 3214811
41885 3214811 5363251 7246745 8854273 10968631 12789632 13383928 13992013 16144484
41877 16144484 18686412 19514785 19270568 20158834 21623627 20579519 16283654 11961621
41869 11961621 10632056 11596248 12073287 10561312 7753822 5558025 5707378 7953974
41861 7953974 9479766 7896842 5133242 6197217 13152180 22153349 27677936 28261265
41853 28261265 26829032 26615871 28191123 29774928 29180943 25676248 20722074 16806284
41845A6806284j451208P47779K069582K481210J518001p00325k380389j864378
41837A7226556n0172P69936J15047m72740k21680j58012j015144j785550j101927
41828A3306314Q64755K437160J990433n00980l166769l899617k660610j437067
41820F933619j552576k124377j775908n00937J032223K478514L052462J584461
41812I127481j222098k557272j340727j52471j039936j801572K65649L016698
41804D295752K157885j789051l848502j855134J062687J803988Q43890n89983
41796B081532k734829m928822m711946j557084J414095J632626M74000M12191
41788g918237J272671J611907J681551K524444L580062L319095J252679j985348
$$ plain form
41845 16806284 15355076 16102855 18172437 20653647 22171648 21471323 19090934 17226556
41837 17226556 17176384 17946320 18061367 17588627 17366947 17208935 16193791 14408241 13306314
41828 13306314 14171069 16608229 18598662 18097682 14930913 11031296 8370686 6933619
41820 6933619 5381043 3256666 1480758 979821 2012044 4490558 7543020 9127481
41812 9127481 7905383 5348111 4007384 3854913 2814977 1013405 1279054 4295752
41804 4295752 6453637 4664586 816084 -1039050 23637 1827625 2671515 2081532
41796 2081532 -653297 -5582119 -10294065 -11851149 -10437054 -8804428 -8330428 -7918237
41788 -7918237 -6645566 -5033659 -3352108 -827664 2752398 6071493 7324172 5338824
41780E338824n169579o241342l726526M15581J954627N7040j043505J670315M963732
41771a780833L894817p90895l636883j770435K280465M604164L741408P45552
41763G287360j997358k139909L47030K644205K527129J237092R42943J067842
41755A1916334N4396q69491M46459K429945J417546k159240l799934j920681k49586
41746G265748j549183l287674k318642k34596m31054k318932k454870k53914J230627
41737d352490J94509j425323j142359O46861J625877P36176p25812q63358N94604
41728d711315K051393K105000J465167J963085L699080M539036L083364P74649
41720A4969459j98005q2166r85801l504606n626065n269968k599599P53257L692907
$$ plain form
41780 5338824 169245 -6072097 -9798623 -9383042 -7428415 -7371375 -8414880 -6744565 -1780833
41771 -1780833 2113984 1323089 -2313794 -4084229 -1803764 2800400 6541808 7287360
41763 7287360 5290002 3150093 3497123 6141328 8668457 9905549 10848492 11916334
41755 11916334 11970730 11101239 11547698 13977643 15395189 13235949 9436015 7515334 7265748
41746 7265748 5716565 2428891 110249 -124347 -555401 -2874333 -5329203 -5583117 -4352490
41737 -4352490 -4157981 -5583304 -6725663 -6078802 -4452925 -3716749 -4442561 -5305919 -4711315
41728 -4711315 -2659922 -554922 910245 2873330 6572410 11111446 14194810 14969459
41720 14969459 14771454 14689288 13703487 10198881 4572816 -697152 -3296751 -2543494 1149413
41711A149413N911082O664606M673814j0730m596931n353965j601444K835278
41703I671123L428519R6082k840434k138732N73832J581669J39684j278593j084121
41694H149029l65283j29904P36505L085028M856228L328328o05851l069442k470713
41685A3513925j584825l100748n361168m846387j560210Q52983J46713j924495
41677c864212k478017q05504J929349M350567N267757M143773K223000J570682
41669A2337395J948599N69172l521066o839252n619179j196700J472163P3240
41661g75628k862487l875718k301390J91895J762998J654763P87331J175159L348529
41652h94548M816514L075258l52496j561038J08993J280824P2395j085553P1410
$$ plain form
41711 1149413 7060495 13725101 18398915 18388185 13791254 8437289 6835845 9671123
41703 9671123 13099642 13195724 10355290 8216558 8790390 10372059 10511743 9233150 8149029
41694 8149029 7783746 7653842 8390347 11475375 16331603 19659931 19054080 15984638 13513925
41685 13513925 11929100 8828352 3467184 -1379203 -2939413 -2086430 -1939717 -3864212
41677 -3864212 -6342229 -7147733 -5218384 -867817 4399940 8543713 10766713 12337395
41669 12337395 14285994 14855166 11334100 4494848 -1124331 -2321031 -848868 -775628
41661 -775628 -3638115 -7513833 -9815223 -9623328 -7860330 -6205567 -5418236 -4243077 -894548
41652 -894548 3921966 6997224 6644728 5083690 5192683 6473507 6545902 5460349 5531759
41643E531759J646788R38855p48674k89454J757794J835969p30029k540139j659436
41634E743433o97216k344720m706788m046543n78751J811523J335586N21069J702626
41625a259781L107373J698337j686755k936034l21142L026522L281185O73409
41617E583114j484877j341567j20420N44497R43084K118802L526075L302567R57052
41608A4028327j389252j456231j4923o2844k405454l989914k228271P33086Q18583
41599D033107j838967l138586j517632j72665j348671k432597n24333K450055
41591d490289K839083R70240k87247p61973k275025l842866k509710J030746K370979
41582f956062j26668k878524k412966M31949L012321M182445L582480R41101k072994
$$ plain form
41643 5531759 7178547 8117402 7368728 7079274 8837068 10673037 9943008 7402869 5743433
41634 5743433 5046217 2701497 -2005291 -6051834 -6630585 -4819062 -3483476 -2962407 -1259781
41625 -1259781 1847592 3545929 1859174 -1076860 -1398002 1628520 4909705 5583114
41617 5583114 4098237 2756670 2636250 3180747 4123831 6242633 9768708 13071275 14028327
41608 14028327 12639075 11182844 11167921 11105077 8699623 4709709 2481438 3214524 4033107
41599 4033107 2194140 -944446 -2462078 -2634743 -3983414 -6416011 -6940344 -4490289
41591 -4490289 -1651206 -680966 -968213 -1730186 -4005211 -7848077 -10357787 -9327041 -6956062
41582 -6956062 -7082730 -9961254 -12374220 -11942271 -8929950 -4747505 -1165025 -223924 -2296918
41573b296918k349300L04022K099087O22153j557656j001729J572744L231908
41565F24311L504428L839690L930341K008060j685595m552914m850141l333827
41557e15647j731833r85098q75459m42301R51172K608475L362597L380076L459871
41548I211853K679815n23567m463547m922471j324632J463091K5152k440125j336851
41539a631282K057403K997498Q46587o54293K27965J261549O49999p21485j753240
41530C280701k217781j115186K404171N952514N435203P49505l337385l291298
41522G860444p67211R39819J317589J410860P74439j481523l886619l606621k86563
41513B274614K860014K433409j283602m408781l704393m66292R28805j265355
$$ plain form
41573 -2296918 -4646218 -4342196 -2243109 -1620956 -3178612 -4180341 -2607597 624311
41565 624311 4128739 7968429 11898770 13906830 12221235 7668321 2818180 -515647
41557 -515647 -2247480 -3232578 -4108037 -4550338 -3599166 -990691 2371906 5751982 9211853
41548 9211853 11891668 11368101 6904554 1982083 657451 2120542 2145694 -294431 -1631282
41539 -1631282 426121 3423619 4270206 3615913 3843878 5105427 5755426 5033941 3280701
41530 3280701 1062920 -52266 2351905 8304419 13739622 14489127 11151742 7860444
41522 7860444 7093233 8033052 9350641 10761501 11535940 10054417 6167798 2561177 2274614
41513 2274614 5134628 7568037 6284435 1875654 -1828739 -2295031 -1366226 -2631581
41505b631581l604230k099805K078719L993372J411382k634555l841277j082601
41497h410576L350019O097577N091807J213367k196003k735635j495997q09749
41489A04810n14979J069142L143427K718695o32415l415637k914104q02112l42985
41480a586158j695256k036811J57969K594686J643544k825033o158287m024791
41472a3930137J577942M229787J765445o96272J168401L878161J856703k995954
41464c145924l800731M70714L515605J599510j647234k236847j579271k148624
41456h972802k486399l81909K726268M246929M378452M271832L071170J41362
41448F994903k247034j923744n39065r82481k685002k672833k14497K359376K812098
$$ plain form
41505 -2631581 -6235811 -8335616 -6256897 -2263525 -852143 -3486698 -7327975 -8410576
41497 -8410576 -5060557 1037020 6128827 7342194 5146191 2410556 914559 104810
41489 104810 -410169 658973 3802400 6521095 5888680 2473043 -441061 -1243173 -1586158
41480 -1586158 -3281414 -5318225 -5160256 -2565570 -922026 -3747059 -9905346 -13930137
41472 -13930137 -12352195 -8122408 -6356963 -7053235 -5884834 -2006673 -149970 -3145924
41464 -3145924 -6946655 -6475941 -2960336 -1360826 -3008060 -5244907 -6824178 -8972802
41456 -8972802 -11459201 -11841110 -9114842 -4867913 -489461 3782371 6853541 6994903
41448 6994903 4747869 2824125 2285060 1302579 -1382423 -4055256 -4269753 -1910377 901721
41439I01721R95767j529442k554953j092120R97596J053991k51225K87872K794623
41430A603830L458220R45936q48391O86045K132385j81918l716357l952123j816761
41421a689134j362968k454661j623822J256101K982012K976989L602154M706475
41413H393146L417260j14399j939834l31338J993847K742510K756591K634458
41405A9552241J031325j863744l069824j209264R85908N35714k130855m927041
41397H904460o665563o328964k873300K152489M497519K116097j838926l042646
41389c078834j193746Q06807J133197L44304l05164Q8535J784196L603115L388682
41380F571092O34858k303657k871537j164821J040459K830983M116344M093730
$$ plain form
41439 901721 1897488 368046 -2186907 -3279027 -2281431 -1227440 -1478665 -1190793 1603830
41430 1603830 5062050 6007986 5159595 5845640 7978025 7796107 4079750 127627 -1689134
41421 -1689134 -3052102 -5506763 -7130585 -5874484 -2892472 84517 3686671 8393146
41413 8393146 11810406 11696007 9756173 9424835 11418682 14161192 16917783 19552241
41405 19552241 20583566 18719822 15649998 14440734 15426642 15962356 13831501 8904460
41397 8904460 2238897 -4090067 -6963367 -4810878 -313359 1802738 -36188 -3078834
41389 -3078834 -4272580 -3465773 -2332576 -1988272 -2293436 -2204901 -420705 3182410 6571092
41380 6571092 7205950 4902293 2030756 865935 1906394 4737377 8853721 12947451
41372A2947451J864166j520644l414453k547869n63689J12352p69214j458626
41364D649474j153086j277565k846692l869671j606368K947565N568819M316100
41356F728576J586731m35659k840153o134881p019065l085882J864624K142378
41348g193331j606195l572984j561479P59458O70899L6853O92797J182601L99245
41339a0192136K93413K259335M220559L964537K449388J325917O0490j818247
41331B563256k367339k13056K275360J959804m36137j573668k71834J532671J772664
41322E241721O9438k644732m583856m139661j934029n76729r70316o18032K506999
41313g649197O248611O899977M179894R92651p17569j167517n60849J293101L146242
$$ plain form
41372 12947451 14811617 13290973 9876520 7328651 6764962 6877314 6108100 4649474
41364 4649474 3496388 2218823 -627869 -4497540 -6103908 -3156343 2412476 6728576
41356 6728576 8315307 7879648 5039495 -1095386 -8114451 -11200333 -9335709 -7193331
41348 -7193331 -8799526 -12372510 -13933989 -13174531 -12503632 -12466779 -11773982 -10591381 -10192136
41339 -10192136 -9898723 -7639388 -3418829 545708 2995096 4321013 4381503 2563256
41331 2563256 195917 -17139 2258221 4218025 3781888 2208220 1936386 3469057 5241721
41322 5241721 5311159 2666427 -1917429 -6057090 -7991119 -8567848 -9538164 -10156196 -7649197
41313 -7649197 -1400586 5499391 9679285 10671936 9954367 8786850 8226001 9519102 12665344
41304A2665344K791394Q9565k420127k716249j630664j201883j871081k352559
41296C353740j730233n99722Q0423M97748J471195K635766K483755P53809o98824
41287H247657n62884l9373m27376m71765J251985K850496J600468j010079j059883
41278A0379246J072321O50410l603305o553449l976957J294630L681642K049616
41270D994154o56327k318332k824545k238420q71072J5344k57546q29803j171465
41261f158012j744854j671975J044900N180827N928298J627130k799285k498386
41253a091357P01245K153190J430158R51913N95342j166624k970983k589555j451407
41244c438078k045287k613403l993L670784L410437k78845j712991R78920L352773
$$ plain form
41304 12665344 15456738 15546303 13126176 10409927 8779263 7577380 5706299 3353740
41296 3353740 1623507 1023785 1104208 1601956 3073151 5708917 8192672 8946481 8247657
41287 8247657 7684773 7645400 7218024 6746259 7998244 10848740 12449208 11439129 10379246
41278 10379246 11451567 12101977 8498672 1945223 -2031734 -737104 2944538 4994154
41270 4994154 4337827 2019495 -805050 -3043470 -3914542 -3899198 -4156744 -4986547 -6158012
41261 -6158012 -7902866 -9574841 -8529941 -3349114 2579184 4206314 1407029 -1091357
41253 -1091357 -390112 1763078 3193236 4145149 4740491 3573867 602884 -1986671 -3438078
41244 -3438078 -5483365 -8096768 -8100761 -4429977 -1019540 -1298385 -3011376 -2032456 1320317
41235A320317K152984m71439j817070k295649k227245K2836M072635N896132L055688
41226I709189j558700l550949j930717J411434M273468M689361J800916k317632
41218A2526370m260569l585490k668530k012926L20755L837690M830277K228061
41210A1215638l17985m61319o76464k807623l682487k64965M460832N342109K215209
41201A5022945j176510l286732n179748o194102l944268J271526N701385O329383
41193H543879L531475l19496k797538k405156K17435K284271J754915k65921j432608
41184I111256j365840j152373q59810J25940J064780N63385r97219j826686j361511
41175C301922p02790n50571m32876n8345L1559n81842j511609j929536j170415
$$ plain form
41235 1320317 3473301 3001862 1184792 -1110857 -3338102 -3315266 757369 6653501 9709189
41226 9709189 8150489 4599540 2668823 4080257 8353725 13043086 14844002 12526370
41218 12526370 8265801 4680311 2011781 -1145 319610 4157300 8987577 11215638
41210 11215638 10897653 10436334 9759870 6952247 3269760 3004795 7465627 12807736 15022945
41201 15022945 13846435 10559703 5379955 -814147 -4758415 -3486889 2214496 8543879
41193 8543879 12075354 11755858 8958320 6553164 6770599 9054870 10809785 10543864 9111256
41184 9111256 7745416 6593043 5733233 5859173 6923953 7487338 6490119 4663433 3301922
41175 3301922 2599132 2048561 1615685 1557340 1588899 1007057 -504552 -2434088 -3604503
41166c604503O44007K266759K380304J297307N47081N37575J71575q41283j329026
41157B069796j052811j350377k140305j029332K477433M578457K168725j737879
41149C983707j500645K998273N758132K794544k644043m703446k383541k6141
41141D276840j182503m183497m571695r21421L258016L826764Q82169k057274
41133f72601k790679k209437j621575r12066n379K10937m62396q75359n23164
41124i861719l54208p07498m64016Q05501J960418K453011L019498L344387J892457
41115B087831p06889j324488Q47348K410726Q83236j617511k363155k199678k588835
41106d571415j997338P49942K621922N76337k755729k492514J098605L515229
$$ plain form
41166 -3604503 -2960496 -693737 1686567 2983874 3530955 4068530 4240105 3398822 2069796
41157 2069796 1016985 -333392 -2473697 -3503029 -1025596 3552861 5721586 3983707
41149 3983707 2483062 5481335 11239467 14034011 11389968 6686522 4302981 4276840
41141 4276840 3094337 -1089160 -5660855 -6582276 -3324260 502504 1384673 -672601
41133 -672601 -3463280 -5672717 -7294292 -8206358 -8211737 -8000800 -8463196 -9338555 -9861719
41124 -9861719 -10215927 -10923425 -11387441 -10581940 -8621522 -6168511 -3149013 195374 2087831
41115 2087831 1380942 56454 903802 3314528 4197764 2580253 217098 -1982580 -4571415
41106 -4571415 -6568753 -5818811 -3196889 -2620552 -5376281 -7868795 -6770190 -3254961
41098c254961L036423J875613J160363k70144k259302l059112k705770k721211
41090h198101k754984j376186N38017J364667K526711N749722P655845L279067
41082H784758n028855q756634m505841K004153M822444M489798L577391J763153
41074G150367j056179k064992p1514J487902r4461k389167k472457j878001k690345
41065d078847k597408J124098N676399O121558K771615J71750k1229l02672j973314
41056F891950k943224j303266K032536M669105M823013K509592J3432k13556O48401
41047A7127983j305224o178086q345210m327077J247145K258739K33023P78500
41039A489793L469781K740205j835265m015056j010740K025754M44543l013293
$$ plain form
41098 -3254961 -218538 1657075 2817438 2547294 287992 -2771120 -5476890 -8198101
41090 -8198101 -10953085 -12329271 -11791254 -10426587 -7899876 -2150154 5505691 8784758
41082 8784758 3755903 -5000731 -9506572 -7502419 -2679975 1809823 5387214 7150367
41074 7150367 6094188 4029196 3957682 5445584 5351123 2961956 489499 -1388502 -4078847
41065 -4078847 -6676255 -5552157 124242 6245800 9017415 9189165 9167936 8865264 6891950
41056 6891950 3948726 2645460 4677996 9347101 14170114 16679706 16693138 16479582 17127983
41047 17127983 15822759 9644673 1299463 -3027614 -1780469 478270 711293 1489793
41039 1489793 4959574 7699779 5864514 1849458 838718 2864472 3309015 295722
41031B95722l421819r46532J031543J345281Q15579m01005j798600j502827O91421
41022c891237K026100J399691J903740N185320O990554L263486k410026l506565
41014A0961063p15705n60259m465375o514436l369486N43787O62414q97375q6279
41005d441651K388003L552408L404854L072774J259627k450312l924887J4822
40997B875638M817577L516235k502545n137901j831754J349312K40040j451978
40989A874624J20267K177994J003167j199410n43687J764859K388475J941663
40981I527952K522240K484492k70481k727153j223987Q76153k341458q449044
40973C98714q741015j716692M040684K757292q14425m94646J679813N12767k949348
$$ plain form
41031 295722 -3126097 -4072629 -3041086 -1695805 -880226 -1281231 -3079831 -4582658 -3891237
41022 -3891237 -1865137 -465446 1438294 6623614 13614168 16877654 14467628 10961063
41014 10961063 10245358 9685099 5219724 -1294712 -4664198 -4120411 -3457997 -4355372 -4441651
41005 -4441651 -2053648 1498760 4903614 7976388 9236015 6785703 2860816 2875638
40997 2875638 7693215 11209450 8706905 3569004 1737250 3086562 3326602 1874624
40989 1874624 1994891 4172885 5176052 3976642 3432955 5197814 7586289 9527952
40981 9527952 12050192 14534684 14264203 11537050 10313063 11189216 8847758 398714
40973 398714 -8342301 -10058993 -6018309 -3261017 -4075442 -4570088 -2890275 -2377508 -5326856
40964e326856l462151o6097L187399L496473J750999k99677j635515j456134N0484
40955c761075J216365J218449J428609K543680K553640N0246k638943k556217
40947E4754n22408N18398m2390n75148l21297L46229J357359K116401R47036k033021
40937A845913l496211j345823J482909J034217j775945k953429j404503P42232
40929e870640K272050L339223L161298J369194L45797J995846L667155J950070
40921A2229993j108704j143018N97883q29908m642924m485611P43320M005890
40913E366921J068891k865101j930424J200935N88053l128528m384547j426818
40905e510618K302009L854144L036689L68638k852036l719502j117336J334264
$$ plain form
40964 -5326856 -8789007 -8855104 -5667705 -2171232 -420233 -719910 -2355425 -3811559 -3761075
40955 -3761075 -2544710 -1326261 102348 2646028 5199668 5249914 2610971 54754
40947 54754 -467654 50744 8354 -566794 -888091 -541862 815497 2931898 3878934 1845913
40937 1845913 -1650298 -2996121 -1513212 -478995 -2254940 -5208369 -6612872 -5870640
40929 -5870640 -3598590 -259367 2901931 4271125 4616922 6612768 10279923 12229993
40921 12229993 11121289 9978271 10576154 9746246 5103322 617711 1361031 5366921
40913 5366921 6435812 3570711 1640287 2841222 3429275 300747 -4083800 -5510618
40905 -5510618 -3208609 645535 3682224 4050862 1198826 -2520676 -3638012 -2303748
40897b303748p4503k916426j858248K749228M973862K323924q34818n35400J109348
40888B633219L60222j949219k380945n90306P33553L78722m28729j184086k958730
40879e386299n512619o266612l633552K86136K017687R07486n38508j31627J815191
40870a6442717L949276N800438P180580O914347L944334m65169l152636k171220
40862E557233J298931M311169M653164J991913k335411o129815p650318o710814
40854e013948m302384j310490J744017L961509M224805K387481m58793k966720
40846a734523m111028l247616q97584Q87061O93391J35827J852148M884674M933117
40837C395467N53317l713837k925353J562505M134003K584061K10381J44826J138285
$$ plain form
40897 -2303748 -2378251 -5294677 -7152925 -4403697 570165 2894089 2059271 1523871 2633219
40888 2633219 2993441 1044222 -1336723 -1927029 -1193476 -814754 -1243483 -2427569 -5386299
40879 -5386299 -10898918 -17165530 -20799082 -20512946 -18495259 -17587773 -18126281 -18257908 -16442717
40870 -16442717 -12493441 -6693003 487577 7401924 11346258 10881089 7728453 5557233
40862 5557233 6856164 11167333 15820497 17812410 15476999 9347184 1696866 -5013948
40854 -5013948 -9316332 -10626822 -8882805 -4921296 -696491 1690990 1232197 -1734523
40846 -1734523 -5845551 -9093167 -9990751 -9103690 -8410299 -8274472 -6422324 -1537650 3395467
40837 3395467 3948784 234947 -2690406 -1127901 3006102 5590163 5800544 5945370 7083655
$$ [...]
##END NTUPLES=NMR SPECTRUM
##END=
