##TITLE=31Pdec_LR-744-CK1
 CDCl3, 24 sc
 8.2.2022
##JCAMPDX= 6.0         $$ Bruker NMR JCAMP-DX V2.0
##DATA TYPE= NMR SPECTRUM
##DATA CLASS= NTUPLES
##ORIGIN= UXNMR, Bruker Analytische Messtechnik GmbH
##OWNER= root
$$ XWIN-NMR		Version 3.5
$$ Tue Feb  8 12:18:32 2022 Russian Standard Time (UT+4h)  she@DPX200
##.OBSERVE FREQUENCY= 81.013821
##.OBSERVE NUCLEUS= ^31P
##.ACQUISITION MODE= SIMULTANEOUS
##.ACQUISITION SCHEME= undefined
##.AVERAGES= 24
##.DIGITISER RES= 16
##SPECTROMETER/DATA SYSTEM= spect
##.PULSE SEQUENCE= zgpg30
##.SOLVENT NAME= CDCl3
##.SHIFT REFERENCE= (INTERNAL, CDCl3, 0, 248.564)
##AUDIT TRAIL= $$ (NUMBER, WHEN, WHO, WHERE, WHAT)
$$ ##TITLE= Audit trail, XWIN-NMR		Version 3.5
$$ ##JCAMPDX= 5.01
$$ ##ORIGIN= Bruker BioSpin GmbH
$$ ##OWNER= she
$$ F:/spectra/data/she/nmr/P31/1/pdata/1/auditp.txt
$$ ##AUDIT TRAIL=  $$ (NUMBER, WHEN, WHO, WHERE, WHAT)
(   1,<2022-02-08 12:15:34.89 +0400>,<she>,<DPX200>,
      <created by zg, POWCHK disabled, PULCHK disabled
       configuration hash MD5:
       00 E9 B6 7A A2 85 ED C7 34 08 36 98 17 FE 4E 26
       data hash MD5: 32K
       3F AD 3C 53 F6 FA 41 15 9D 90 19 C5 84 98 77 75>)
(   2,<2022-02-08 12:15:37.51 +0400>,<she>,<DPX200>,
      <Start of raw data processing
       efp BC_mod = 2 LB = 1 FT_mod = 6 PKNL = 1 PHC0 = -9396.923 PHC1 = 218.8736 SI = 64K 
       data hash MD5: 64K
       1D F7 4F E8 40 E6 B1 B3 36 98 EB 95 8D 1C 74 21>)
(   3,<2022-02-08 12:16:32.95 +0400>,<she>,<DPX200>,
      <pk PHC0 = -23.21445 PHC1 = 37.6 
       data hash MD5: 64K
       61 BA 8A BA 3E FE 9F 21 7E 3D AC 74 88 EA D1 12>)
(   4,<2022-02-08 12:16:37.46 +0400>,<she>,<DPX200>,
      <abs ABSG = 5 
       data hash MD5: 64K
       68 FD 1F D1 A8 F4 E0 B4 47 E1 C5 A5 04 BC 4E 5D>)
$$ ##END=
$$ 
$$ hash MD5
$$ BA 61 4F 5F 74 EC A0 32 48 48 CC 17 B9 02 B8 77
##$RELAX= 
##$RELAX= 
##$RELAX= 
##$RELAX= 
##$RELAX= 
##$RELAX= 
##$RELAX= 
##$RELAX= 
$$ Bruker specific parameters
$$ --------------------------
##$DU= <F:/spectra>
##$EXPNO= 1
##$NAME= <P31>
##$PROCNO= 1
##$TYPE= <nmr>
##$USER= <she>
##$AMP= (0..31)
100 100 100 100 100 100 100 100 100 100 100 100 100 100 100 100 100 100 
100 100 100 100 100 100 100 100 100 100 100 100 100 100 
##$AQSEQ= 0
##$AQ_mod= 1
##$AUNM= <au_zg>
##$AUTOPOS= <>
##$BF1= 81.014009
##$BF2= 200.13
##$BF3= 200.13
##$BF4= 200.13
##$BF5= 200.13
##$BF6= 200.13
##$BF7= 200.13
##$BF8= 200.13
##$BYTORDA= 1
##$CFDGTYP= 0
##$CFRGTYP= 5
##$CHEMSTR= <none>
##$CNST= (0..31)
1 1 145 1 1 1 1 1 1 1 1 1 1 1 1 1 1 1 1 1 1 1 1 1 1 1 1 1 1 1 1 1 
##$CPDPRG= <waltz16>
##$CPDPRG1= <>
##$CPDPRG2= <waltz16>
##$CPDPRG3= <>
##$CPDPRG4= <mlev>
##$CPDPRG5= <mlev>
##$CPDPRG6= <mlev>
##$CPDPRG7= <mlev>
##$CPDPRG8= <mlev>
##$CPDPRGB= <>
##$CPDPRGT= <>
##$D= (0..31)
0 1 0 0 0 0 0 0 0 0 0 0.03 2e-05 3e-06 0 0 0 0 0 0 0 0 0 0 0 0 0 0 0 0 
0 0 
##$DATE= 1644308134
##$DBL= (0..7)
120 120 120 11 120 120 24 19 
##$DBP= (0..7)
150 150 150 150 150 150 150 150 
##$DBP07= 0
##$DBPNAM0= <>
##$DBPNAM1= <>
##$DBPNAM2= <>
$$ [...]
##$SUBNAM3= <"">
##$SUBNAM4= <"">
##$SUBNAM5= <"">
##$SUBNAM6= <"">
##$SUBNAM7= <"">
##$SUBNAM8= <"">
##$SUBNAM9= <"">
##$SW= 501.771253377433
##$SWIBOX= (0..15)
0 1 3 0 0 0 0 0 0 0 0 0 0 0 0 0 
##$SW_h= 40650.406504065
##$TD= 32768
##$TD0= 1
##$TE= 0
##$TE2= 300
##$TE3= 300
##$TEG= 300
##$TL= (0..7)
0 120 53 12 22 120 120 120 
##$TP= (0..7)
150 150 150 150 150 150 150 150 
##$TP07= 0
##$TPNAME0= <>
##$TPNAME1= <>
##$TPNAME2= <>
##$TPNAME3= <>
##$TPNAME4= <>
##$TPNAME5= <>
##$TPNAME6= <>
##$TPNAME7= <>
##$TPOAL= (0..7)
0.5 0.5 0.5 0.5 0.5 0.5 0.5 0.5 
##$TPOFFS= (0..7)
0 0 0 0 0 0 0 0 
##$TUNHIN= 0
##$TUNHOUT= 0
##$TUNXOUT= 0
##$USERA1= <user>
##$USERA2= <user>
##$USERA3= <user>
##$USERA4= <user>
##$USERA5= <user>
##$V9= 5
##$VALIST= <valist>
##$VCLIST= <CCCCCCCCCCCCCCC>
##$VD= 0
##$VDLIST= <DDDDDDDDDDDDDDD>
##$VPLIST= <PPPPPPPPPPPPPPP>
##$VTLIST= <TTTTTTTTTTTTTTT>
##$WBST= 1024
##$WBSW= 4
##$XGAIN= (0..3)
0 0 0 0 
##$XL= 0
##$YL= 0
##$YMAX_a= 500
##$YMIN_a= -504
##$ZGOPTNS= <>
##$ZL1= 120
##$ZL2= 120
##$ZL3= 120
##$ZL4= 120
##$ABSF1= 248.5645
##$ABSF2= -253.2056
##$ABSG= 5
##$ABSL= 3
##$ALPHA= 0
##$AQORDER= 0
##$ASSFAC= 0
##$ASSFACI= 0
##$ASSFACX= 0
##$ASSWID= 0
##$AUNMP= <proc_1d>
##$AZFE= 0.1
##$AZFW= 0.5
##$BCFW= 0
##$BC_mod= 2
##$BYTORDP= 0
##$COROFFS= 0
##$CY= -3
##$DATMOD= 1
##$DC= 0
##$DFILT= <>
##$DTYPP= 0
##$F1P= 0
##$F2P= 0
##$FCOR= 1
##$FTSIZE= 65536
##$FT_mod= 6
##$GAMMA= 0
##$GB= 0
##$INTBC= 1
##$INTSCL= 5.30512e-09
##$ISEN= 30
##$LB= 1
##$LEV0= 0
##$LPBIN= 0
##$MAXI= 10000
##$MC2= 0
##$MEAN= 0
##$ME_mod= 0
##$MI= 50
##$NCOEF= 0
##$NC_proc= -11
##$NLEV= 6
##$NOISF1= 182.463
##$NOISF2= 159.3651
##$NSP= 0
##$NTH_PI= 0
##$NZP= 0
##$OFFSET= 248.5645
##$PC= 4
##$PHC0= -9420.138
##$PHC1= 256.4736
##$PH_mod= 1
##$PKNL= yes
##$PPARMOD= 0
##$PSCAL= 0
##$PSIGN= 0
##$REVERSE= no
##$SF= 81.014009
##$SI= 65536
##$SIGF1= 159.3651
##$SIGF2= -187.1042
##$SINO= 113.3802
##$SIOLD= 16384
##$SREGLST= <1H.CDCl3>
##$SSB= 0
##$STSI= 65536
##$STSR= 0
##$SW_p= 40650.406504065
##$SYMM= 0
##$S_DEV= 0
##$TDeff= 32768
##$TDoff= 0
##$TI= <>
##$TILT= no
##$TM1= 0
##$TM2= 0
##$TOPLEV= 0
##$USERP1= <user>
##$USERP2= <user>
##$USERP3= <user>
##$USERP4= <user>
##$USERP5= <user>
##$WDW= 1
##$XDIM= 65536
##$YMAX_p= 430284438
##$YMIN_p= -57459749
$$ End of Bruker specific parameters
$$ ---------------------------------
##NTUPLES= NMR SPECTRUM
##VAR_NAME=  FREQUENCY,     SPECTRUM/REAL,   SPECTRUM/IMAG
##SYMBOL=    X,             R,               I
##VAR_TYPE=  INDEPENDENT,   DEPENDENT,       DEPENDENT
##VAR_FORM=  AFFN,          ASDF,            ASDF
##VAR_DIM=   65536,         65536,           65536
##UNITS=     HZ,            ARBITRARY UNITS, ARBITRARY UNITS
##FACTOR=    0.620285442955139, 1,           1
##FIRST=     20137.2065510759, 0,            0
##LAST=      -20513.1999529892, 0,           0
##MIN=       -20513.1999529892, -57459749,   0
##MAX=       20137.2065510759, 430284438,    0
$$ Real data points
##PAGE= N=1
##DATA TABLE= (X++(R..R)), XYDATA
$$ [...]
$$ plain form
38497 2356237 7796600 7007674 686855 -4826484 -5654839 -4452331 -3921955 -1598628 4843610
38488 4843610 11414304 12059445 6689656 397689 -3742200 -6792064 -9690008 -10908386
38480 -10908386 -8744145 -3381379 3420038 8865701 10055406 6705733 2618356 2175791
38472 2175791 5335927 7977711 7229330 4597814 3443764 4865699 6790340 6405299
38464 6405299 3085251 -812502 -2118269 -18144 3213968 4643796 3220776 99673
38456 99673 -2334072 -1762714 1924693 5195631 3523190 -3350233 -10456586 -13109630 -11543500
38447 -11543500 -8671806 -5629246 -2139964 586522 815788 -598962 -1308710 -1209402 -1713465
38438 -1713465 -1674739 1655520 6950017 8939105 6415220 5273732 9581714 13720042
$$ packed form
38497B356237N440363p88926o320819n513339q28355J202508N30376K323327O442238
38488D843610O570694O45141n369789o291967m139889l049864k897944j218378
38480a0908386K164241N362766O801417N445663J189705l349673m087377m42565
38472B175791L160136K641784p48381k631516j154050J421935J924641l85041
38464F405299l320048l897753j305767K100125L232112J429828j423020l121103
38456I9673k433745N71358L687407L270938j672441o873423p106353k653044J566130
38447a1543500K871694L042560L489282K726486K29266j414750p09748R9308n04063
38438a713465L8726L330259N294497J989088k523885j141488M307982M138328
$$ plain form
38430 13720042 9225180 -2895746 -13264774 -16670224 -16267928 -14698432 -9514071 -1059212
38422 -1059212 3383513 119775 -2790703 3232146 12526495 12525118 3791308 199756 7386904
38413 7386904 13668613 8206986 -2677956 -6027500 -796151 4376396 6301591 9009846
38405 9009846 13129229 14281902 11798573 9864050 9609978 8271566 6420209 7574193
38397 7574193 10052700 8340150 4179352 6667550 17908345 27740252 27507404 20646985
38389 20646985 14014377 7116781 -2476088 -10225867 -10462788 -6486281 -5644824 -7515856
38381 -7515856 -6214092 -2516110 -3819473 -11348023 -16156722 -10692031 1819464 12225196
38373 12225196 15106376 11559476 6292372 3796804 4523690 4284619 406649 -2494675
$$ packed form
38430A3720042m494862j2120926j0369028l405450M02296J569496N184361Q454859
38422a059212M442725l263738k910478O022849R294349j377q733810l591552P187148
38413G386904O281709n461627j0884942l349544N231349N172547J925195K708255
38405I009846M119383J152673k483329j934523k54072j338412j851357J153984
38397G574193K478507j712550m160798K488198J1240795R831907k32848o860419
38389B0646985o632608o897596r592869p749779k36921L976507Q41457j871032
38381g515856J301764L697982j303363p528550m808699N464691J2511495J0405732
38373A2225196K881180l546900n267104k495568P26886k39071l877970k901324
$$ plain form
38365 -2494675 2053793 11511701 15716767 11089587 6375295 9748179 16295515 15216814
38357 15216814 5758394 -2178554 -2474708 473531 1400440 2595927 7270700 10369507
38349 10369507 4427695 -7179089 -11756914 -4022484 6409503 8506305 4051813 1874284
38341 1874284 3089840 998042 -6513765 -13780323 -16773835 -16944664 -14319285 -5887874
38333 -5887874 5882909 11727488 7837923 1833756 856836 1266179 -2754284 -7572621
38325 -7572621 -6309514 -1293107 -129737 -2684325 -2241393 2215232 5095909 5067507 6997485
38316 6997485 12454821 17400559 20263008 23189682 23947351 16430517 2256198 -7570909
38308 -7570909 -7042479 -2919786 -3165559 -5508121 -3821403 743772 2341057 -266928
$$ packed form
38365b494675M548468R457908M205066m627180m714292L372884O547336j078701
38357A5216814r458420p936948k96154K948239R26909J195487M674773L098807
38349A0369507n941812j1606784m577825P734430J0431987K096802m454492k177529
38341A874284J215556k091798p511807p266558k993512j70829K625379Q431411
38333e887874J1770783N844579l889565o004167r76920M09343m020463m818337
38325g572621J263107N016407J163370k554588M42932M456625K880677k8402J929978
38316F997485N457336M945738K862449K926674P57669p516834j4174319r827107
38308g570909N28430M122693k45773k342562J686718M565175J597285k607985
$$ plain form
38300 -266928 -3698366 -6119173 -7548685 -6525463 -1894671 3656908 6116730 4884150
38292 4884150 2138112 -368082 -1475112 -520999 593336 -1146204 -4080649 -2391180
38284 -2391180 4332407 7693786 1856342 -6701199 -7491188 -692067 3621696 -626293
38276 -626293 -8793851 -12381955 -7731984 1818539 8775305 7464496 188954 -4518650
38268 -4518650 -2372383 1607011 1915806 1080462 3349476 5063537 -11133 -8808390
38260 -8808390 -12067504 -8418621 -5860972 -8503361 -11106085 -9163524 -5848772 -4969092
38252 -4969092 -4125361 32619 4713213 4333018 -1578228 -7499372 -7776169 -1922141 4639359
38243 4639359 5475102 790410 -1875175 1810068 5294155 814061 -6406053 -4012340
$$ packed form
38300b66928l431438k420807j429512J023222M630792N551579K459822j232580
38292D884150k746038k506194j107030R54113J114335j739540k934445J689469
38284b391180O723587L361379n837444q557541p89989O799121M313763m247989
38276f26293q167558l588104M649971R550523O956766j310809p275542m707604
38268d518650K146267L979394L08795q35344K269014J714061n074670q797257
38260h808390l259114L648883K557649k642389k602724J942561L314752Q79680
38252d969092Q43731M157980M680594l80195n911246n921144k76797N854028O561500
38243D639359Q35743m684692k665585L685243L484087m480094p220114K393713
$$ plain form
38235 -4012340 7590470 13374663 5573495 -4241001 -2303631 7846437 12860033 9669336
38227 9669336 6813100 9080113 11967207 11508740 10308987 11359618 12319198 9162706
38219 9162706 2131822 -4192587 -5520287 -2337161 -282550 -4246653 -11180247 -12060794
38211 -12060794 -2965625 9646740 17214266 17939723 13970478 5617783 -5532950 -12595887
38203 -12595887 -10244219 -2961492 683033 -327792 -658550 1103196 1634201 691250
38195 691250 930808 690028 -3818297 -9102390 -7202494 654513 3604475 -2400425 -7815339
38186 -7815339 -4228726 3411326 5922077 3364911 1702114 2076247 1392636 -850629
38178 -850629 -3692471 -8719071 -15595683 -17275579 -7974551 6148819 12558079 8146091
$$ packed form
38235d012340J1602810N784193p801168r814496J937370J0150068N013596l190697
38227I669336k856236K267013K887094m58467j199753J050631R59580l156492
38219I162706p030884o324409j327700L183126K054611l964103o933594q80547
38211a2060794R095169J2612365P567526P25457l969245q352695j1150733p062937
38203a2595887K351668P282727L644525j010825l30758J761746N31005r42951
38195F91250K39558k40780m508325n284093J899896P857007K949962o004900n414914
38186g815339L586613P640052K510751k557166j662797L74133o83611k243265
38178h50629k841842n026600o876612j679896R301028J4123370O409260m411988
$$ plain form
38170 8146091 2080633 2375213 6431676 6914935 2020601 -2696333 -509522 9134344
38162 9134344 18227345 16998366 5434728 -4997596 -4821112 1931261 5056490 3195111
38154 3195111 3369442 7310010 7928153 1057923 -7844150 -12230619 -12690505 -12311763 -9687590
38145 -9687590 -2083435 7849421 13497856 11000247 1944897 -8409665 -13635341 -10132126
38137 -10132126 -1517585 3681104 1440601 -3323819 -4253260 -2014425 -1452690 -3213957
38129 -3213957 -3303991 43589 3879236 5237749 4333273 1972410 -2753279 -9768220 -14874083
38120 -14874083 -12483960 -2246565 8894944 13198107 10355630 7226891 9118268 14045353
38112 14045353 16909830 15985588 12360142 6292851 -1167519 -5340646 -2615080 2980608
$$ packed form
38170H146091o065458K94580M056463M83259m894334m716934K186811R643866
38162I134344R093001j228979j1563638j0432324J76484O752373L125229j861379
38154C195111J74331L940568O18143o870230q902073m386469m59886L78742K624173
38145i687590P604155R932856N648435k497609r055350j0354562n225676L503215
38137a0132126Q614541N198689k240503m764420r29441K238835N61735j761267
38129c213957r0034L347580L835647J358513r04476k360863m725689p014941n105863
38120a4874083K390123J0237395J1141509M303163k842477l128739J891377M927085
38112A4045353K864477r24242l625446o067291p460370m173127K725566N595688
$$ plain form
38104 2980608 4051177 472707 -790908 2957775 6155787 4207775 -314600 -3401951
38096 -3401951 -4686979 -3712805 1522127 8243650 8921649 3030038 781998 7946184
38088 7946184 14861299 10205829 -986333 -4971917 -586020 548541 -6089128 -11561110
38080 -11561110 -9318892 -4993077 -5264199 -6931700 -3695002 3175390 7360462 5962886
38072 5962886 522780 -6108510 -9595984 -5281441 5567654 14034492 12798740 4828277
38064 4828277 -845093 393078 6002691 11511987 14308085 13566073 10354314 7870841
38056 7870841 8947361 12688520 14709998 11311697 3804736 -1402874 964019 7453429
38048 7453429 7717212 -2558386 -13767780 -13172109 -1470402 8581883 9293735 5358049
$$ packed form
38104B980608J070569l578470j263615L748683L198012j948012m522375l087351
38096c401951j285028R74174N234932O721523O77999n891611k248040P164186
38088G946184O915115m655470j1192162l985584M385897J134561o637669n471982
38080a1561110K242218M325815k71122j667501L236698O870392M185072j397576
38072E962886n440106o631290l487474M314543J0849095Q466838j235752p970463
38064D828277n673370J238171N609613N509296K796098p42012l211759k483473
38056G870841J076520L741159K021478l398301p506961n207610K366893O489410
38048G453429K63783j0275598j1209394N95671J1701707J0052285P11852l935686
$$ plain form
38040 5358049 3078687 1627587 -1040166 -1890474 1448612 4627804 2688200 -1851767
38032 -1851767 -2766599 1080343 5512561 6837435 3919628 -2406963 -8276557 -8434468
38024 -8434468 -2409244 4371242 8251257 11237607 14211965 12839585 5484711 -1011815
38016 -1011815 -147124 4804572 7048721 6885546 8347411 9973013 7862649 4482378
38008 4482378 5201012 8406650 8067147 4279634 2347048 2976637 2559922 1791643 4190149
37999 4190149 6789690 2818668 -5768507 -8850339 -2920811 4454617 7012426 7019612 7666905
37990 7666905 7786823 7192637 8066908 8047837 1611974 -8391426 -11315780 -5378617 -2342117
37981 -2342117 -8969958 -15189427 -9862341 1693425 7025129 5422643 5292381 8278524
$$ packed form
38040E358049k279362j451100k667753q50308L339086L179192j939604m539967
38032a851767r14832L846942M432218J324874k917807o326591n869594j57911
38024h434468O025224O780486L880015K986350K974358j372380p354874o496526
38016a011815Q64691M951696K244149j63175J461865J625602k110364l380271
38008D482378P18634L205638l39503l787513j932586O29589m16715p68279K398506
37999D190149K599541l971022q587175l081832N929528P375428K557809P186O47293
37990G666905J19918n94186Q74271j9071o435863j0003400k924354N937163L036500
37981b342117o627841o219469N327086J1555766N331704j602486j30262K986143
$$ plain form
37973 8278524 8552642 4807852 1188981 -2055644 -7751136 -12341829 -8291259 2856469
37965 2856469 9561812 4925491 -5520400 -12786436 -13997369 -10729760 -4830051 582096
37957 582096 1342115 -2773439 -6749403 -6469184 -3123847 23974 1891789 2844008 2628995
37948 2628995 892072 -2087822 -6055949 -10575403 -14049269 -14594065 -11664862 -5796034
37940 -5796034 1613337 6879760 5566385 -1581381 -7438264 -7114886 -4478908 -5405362
37932 -5405362 -8191779 -7010407 -2007860 1371539 1304679 256924 -1839028 -6815696
37924 -6815696 -11371534 -9776672 -3757336 -729103 -1567121 -40839 4099876 2888481
37916 2888481 -5095861 -9330735 -3423961 3758176 1682301 -5801482 -7916383 -3529605
$$ packed form
37973H278524K74118l744790l618871l244625n695492m590693M050570J1147728
37965B856469O705343m636321j0445891p266036j210933L267609N899709N412147
37957E82096P60019m115554l975964K80219L345337L147821J867815R52219k15013
37948B628995j736923k979894l968127m519454l473866n44796K929203N868828
37940e796034P409371N266423j313375p147766n856883L23378K635978r26454
37932e405362k786417J181372N002547L379399o6860j047755k095952m976668
37924f815696m555838J594862O019336L028233q38018J526282M140715j211395
37916B888481p984342m234874N906774P182137k075875p483783k114901M386778
$$ plain form
37908 -3529605 541657 2655812 6278127 9700079 7287789 455565 -2773598 220395
37900 220395 3983344 5122412 6452675 9435940 10744534 8974121 7460632 7281342
37892 7281342 3978675 -5050589 -15201718 -20231547 -18931969 -13695871 -7011007 -1930193
37884 -1930193 -1220871 -3056105 -2044548 2647639 5207327 2465215 -477085 1116168
37876 1116168 2778270 -2265073 -10857994 -12832333 -5492190 2577930 3802576 1187041
37868 1187041 2022675 6418098 7048552 -596840 -11657081 -17179411 -14346273 -8882939
37860 -8882939 -6666639 -5996653 -1896492 3668493 2440524 -7245096 -14641793 -8929853
37852 -8929853 6751412 19574178 22330276 17860435 10624737 2380561 -3578817 -2785976
$$ packed form
37908c529605M071262K114155L622315L421952k412290o832224l229163K993993
37900B20395L762949J139068J330263K983265J308594j770413j513489j79290
37892G281342l302667r029264j0151129n029829J299578N236098O684864N080814
37884a930193P09322j835234J011557M692187K559688k742112k942300J593253
37876A116168J662102n043343q592921j974339P340143Q070120J224646k615535
37868A187041Q35634M395423O30454p645392j1060241n522330K833138N463334
37860h882939K216300O69986M100161N564985j227969r685620p396697N711940
37852h929853J5681265J2822766K756098m469841p235698q244176n959378P92841
$$ plain form
37844 -2785976 2691932 4199578 -1540681 -6440294 -2075772 8320630 14686275 13093746
37836 13093746 7730548 2821965 -619216 -1342283 1859257 5762947 4401831 -3144495
37828 -3144495 -10764295 -12518564 -8444291 -2293557 2955382 6098454 7376573 8521946
37820 8521946 10742097 12071079 9372013 3206998 -2419541 -5365275 -6724885 -6566371
37812 -6566371 -2785097 4389673 10993104 14194486 14521931 11807787 4291165 -5326123
37804 -5326123 -8647738 -1517061 8918852 12681056 9485560 7053604 9312196 12755904
37796 12755904 13725706 13101159 13193163 14890999 18403528 22422858 22421286 14754386 3366857
37787 3366857 -2462648 1110038 7967006 10134608 6760015 2731080 1404130 1560913
$$ packed form
37844b785976N477908J507646n740259m899613M364522J0396402O365645j592529
37836A3093746n363198m908583l441181p23067L201540L903690j361116p546326
37828c144495p619800j754269M074273O150734N248939L143072J278119J145373
37820H521946K220151J328982k699066o165015n626539k945734j359610J58514
37812f566371L781274P174770O603431L201382L27445k714144p516622r617288
37804e326123l321615P130677J0435913L762204l195496k431956K258592L443708
37796A2755904R69802o24547R2004J697836L512529M019330j572p666900j1387529
37787C366857n829505L572686O856968K167602l374593m028935j326950J56783
$$ plain form
37779 1560913 288908 -2876056 -4343055 547560 11382714 20892747 22563194 18993340
37771 18993340 18109893 21243988 20818266 11903784 607644 -3098015 2516743 10174903
37763 10174903 12937993 10408264 6295125 3146788 553436 -2460916 -4420800 -2390493
37755 -2390493 3021283 6003966 2217204 -4279744 -5142236 1516303 8972394 10635708
37747 10635708 6423360 305435 -3427336 -1219603 6580292 12971972 11074993 4197630
37739 4197630 1452909 2666476 -1814756 -13144138 -18468513 -10905460 -2609102 -5920031
37731 -5920031 -11841391 -3393230 15771424 24564068 15529386 4659514 6164938 13542931
37723 13542931 13700870 7149099 3573417 5481786 6949911 4667980 1557887 892432
$$ packed form
37779A560913j272005l164964j466999M890615J0835154R510033J670447l569854
37771A8993340q83447L134095m25722q914482j1296140l705659N614758P658160
37763A0174903K763090k529729m113139l148337k593352l014352j959884K030307
37755b390493N411776K982683l786762o496948q62492O658539P456091J663314
37747A0635708m212348o117925l732771K207733P799895O391680j896979o877363
37739D197630k744721J213567m481232j1329382n324375P563053Q296358l310929
37731e920031n921360Q448161J9164654Q792644r034682j0869872J505424P377993
37723A3542931J57939o551771l575682J908369J468125k281931l110093o65455
$$ plain form
37715 892432 2591844 4330184 3105898 -2015025 -6597764 -4223471 4296077 9962156
37707 9962156 7260164 1630671 1014375 5248485 9345644 12224986 15026612 14537101
37699 14537101 6900349 -3203627 -5310543 3546852 14527259 17820638 12836913 5648111
37691 5648111 982166 -12469 2653170 8025947 12358843 10615746 2087288 -6409305
37683 -6409305 -5836953 4879165 15947622 16933022 8661362 1034954 -266776 618489
37675 618489 -1614543 -5554380 -7312459 -7309570 -8003295 -8754823 -7956448 -7077147 -7573015
37666 -7573015 -6802752 -2494374 1510110 182983 -4180213 -5201221 -2766625 -2594390
37658 -2594390 -5617433 -5847039 -557596 4919038 5722716 4110910 3423637 1501512 -4042035
$$ packed form
37715H92432J699412J738340j224286n120923m582739K374293Q519548N666079
37707I962156k701992n629493o16296M234110M097159K879342K801626m89511
37699A4537101p636752j0103976k106916Q857395J0980407L293379m983725p188802
37691E648111m665945r94635K665639N372777M332896j743097q528458q496593
37683f409305N72352J0716118J1068457R85400q271660p626408j301730Q85265
37675F18489k233032l939837j758079K889o93725p51528P98375Q79301m95868
37666g573015P70263M308378M004484j327127m363196j021008K434596J72235
37658b594390l023043k29606N289443N476634Q03678j611806o87273j922125n543547
$$ plain form
37649 -4042035 -8466973 -5129206 3417687 6542944 -853416 -11048537 -12902307 -5579451
37641 -5579451 1090797 -511393 -6582073 -7908862 -2477836 2629629 2213704 565099
37633 565099 4714012 13912182 20903354 21639122 18180812 12785394 5364256 -2160034
37625 -2160034 -5042564 -2199814 1034139 25942 -2778111 -2054724 2725379 7541522
37617 7541522 9488226 8341556 4205328 -2026324 -6410001 -4608189 2121000 6915808
37609 6915808 5064848 -449825 -3117375 -1108179 1093520 -974555 -6074712 -8982534
37601 -8982534 -6483573 -111171 6346119 10069959 9925086 6213573 939947 -2965113
37593 -2965113 -3788515 -1805066 1903333 5658587 6632855 3357981 -708807 -240762 3939176
$$ packed form
37649d042035m424938L337767Q546893L125257p396360j0195121j853770P322856
37641e579451O670248j602190o070680j326789N431026N107465m15925j648605
37633E65099M148913R198170O991172P35768l458310n395418p421138p524290
37625b160034k882530K842750L233953j008197k804053P23387M780103M816143
37617G541522J946704j146670m136228o231652m383677J801812O729189M794808
37609F915808j850960n514673k667550K009196K201699k068075n100157k907822
37601h982534K498961O372402O457290L723840j44873l711513n273626l905060
37593b965113q23402J983449L708399L755254R74268l274874m066788M68045M179938
$$ plain form
37584 3939176 4958454 756747 -1262543 4260731 10374613 7072384 -3445069 -10497633
37576 -10497633 -11356159 -12651429 -15782506 -13803289 -6048556 -3041986 -9898540 -15812065
37568 -15812065 -9608740 2690622 6863713 1126852 -4046398 -3430193 -2152487 -3579783
37560 -3579783 -3610425 160950 2761648 -215141 -5095446 -4792490 2663715 12792396
37552 12792396 18802177 15942535 5401673 -5025811 -7760241 -3830373 -1009342 -3453434
37544 -3453434 -7708708 -9541886 -9248620 -8065636 -4375596 3004294 11037901 15170266
37536 15170266 13803901 8319521 1162246 -4538781 -6303599 -5028533 -3803672 -2837541
37528 -2837541 980836 7741815 11749609 8313069 488182 -4377169 -3154481 761488
$$ packed form
37584C939176J019278m201707k019290N523274O113882l302229j0517453p052564
37576a0497633q58526j295270l131077J979217P754733L006570o856554n913525
37568a5812065O203325J2299362M173091n736861n173250O16205J277706j427296
37560c579783l0642L771375K600698k976789m880305L02956P456205J0128681
37552A2792396O009781k859642j0540862j0427484k734430L929868K821031k444092
37544c453434m255274j833178K93266J182984L690040P379890Q033607M132365
37536A5170266j366365n484380p157275n701027j764818J275066J224861R66131
37528b837541L818377O760979M007794l436540p824887m865351J222688L915969
$$ plain form
37520 761488 2333331 -262695 -4846508 -7876915 -8435161 -9261743 -12032490 -13118492 -8400920
37511 -8400920 -1420877 -126823 -4423200 -4782029 3159201 10638230 8607785 1380287
37503 1380287 -1079884 1055910 -76315 -4829705 -4978538 1774216 7194898 5442787
37495 5442787 1414746 1829400 5407040 6818786 4493362 -239322 -6546565 -11783867
37487 -11783867 -10462504 -836991 10775598 16694586 15749044 10875175 3432940 -4896620
37479 -4896620 -8791009 -4654974 2965411 6621652 5844790 5515174 6018631 2581560 -5204494
37470 -5204494 -10539028 -8661775 -3678341 -3239358 -9850220 -19466386 -25855782 -25076775
37462 -25076775 -18381763 -11556236 -8991551 -8700882 -6264458 -2427469 -1787582 -4502992
$$ packed form
37520G61488J571843k596026m583813l030407n58246q26582k770747j086002M717572
37511h400920O980043J294054m296377l58829P941230P479029k030445p227498
37503A380287k460171K135794j132225m753390j48833O752754N420682j752111
37495E442787m028041M14654L577640J411746k325424m732684o307243n237302
37487a1783867J321363R625513J1612589N918988r45542m873869p442235q329560
37479d896620l894389M136035P620385L656241p76862l29616N03457l437071p786054
37470e204494n334534J877253M983434M38983o610862r616166o389396P79007
37462b5076775O695012O825527K564685K90669K436424L836989O39887k715410
$$ plain form
37454 -4502992 -5611353 -3549548 -2821244 -5993006 -9385917 -9862006 -9833879 -11670767 -12959469
37445 -12959469 -11821201 -11116010 -11935103 -8734818 1990202 12938810 14114364 6673777
37437 6673777 514546 192062 1622621 1454726 809310 -314697 -3538923 -5957997 -2154724
37428 -2154724 5628961 7861651 1289390 -6145243 -7835826 -7466708 -9835507 -10973352
37420 -10973352 -5692003 1090942 528006 -5494768 -5767335 3960017 14590543 16011372
37412 16011372 9563845 4667798 6735235 11966331 12880564 6829876 -1157966 -3829705
37404 -3829705 183670 5033008 4913515 351165 -4326478 -7086261 -8786666 -9703110
37396 -9703110 -9219035 -8232849 -8424257 -9110411 -7621556 -3186937 1440852 2505273 -1348746
$$ packed form
37454d502992j108361K061805P28304l171762l392911m76089K8127j836888j288702
37445a2959469J138268P05191q19093L200285J0725020J0948608J175554p440587
37437F673777o159231l22484J430559j67895o45416j124007l224226k419074L803273
37428b154724P783685K232690o572261p434633j690583L69118k368799j137845
37420a0973352N281349O782945n62936o022774k72567R727352J0630526J420829
37412A6011372o447527m896047K067437N231096R14233o050688p987842k671739
37404c829705M013375M849338j19493m562350m677643k759783j700405r16444
37396i703110M84075R86186j91408o86154J488855M434619M627789J064421l854019
$$ plain form
37387 -1348746 -7234052 -9082034 -2971060 7222840 12557988 9517572 4065037 2256181
37379 2256181 1683540 -2285429 -6330000 -3509312 4426960 8409868 5928836 4040175
37371 4040175 6325661 6532600 142027 -6367445 -5240272 -89387 -135807 -5665593 -8309532
37362 -8309532 -4339608 1119718 3800964 6220807 11263311 16055714 15904782 10351057
37354 10351057 2457686 -4459628 -7046204 -2834103 5714968 11365508 9951318 5323075
37346 5323075 2887319 1576129 -2493033 -7115375 -6150215 -415656 1370563 -4905887
37338 -4905887 -12092822 -11815194 -5530272 -271180 1734275 2467457 941045 -4961386
37330 -4961386 -10972786 -9870187 -3447365 -2306159 -10501795 -18300935 -15314625 -4345131
$$ packed form
37387a348746n885306j847982O110974J0193900N335148l040416n452535j808856
37379B256181n72641l968969m044571K820688P936272L982908k481032j888661
37371D040175K285486K06939o390573o509472J127173N150885m6420n529786k643939
37362h309532L969924N459326K681246K419843N042504M792403j50932n553725
37354A0351057p893371o917314k586576M212101Q549071N650540j414190m628243
37346E323075k435756j311190m069162m622342R65160N734559J786219o276450
37338d905887p186935K77628O284922N259092K005455P33182j526412n902431
37330d961386o011400J102599O422822J141206q195636p799140K986310J0969494
$$ plain form
37322 -4345131 4165101 6355970 6111729 5294022 1366121 -5336677 -9455067 -8011807
37314 -8011807 -4971795 -5709843 -10028550 -13084119 -11563038 -7145621 -4337350 -5540870
37306 -5540870 -8443226 -8983604 -6674629 -4845833 -5223414 -5554904 -4196895 -3261515 -4247477
37297 -4247477 -4142358 59030 5786938 8223522 6877948 4611381 2684664 1405893
37289 1405893 2744010 6583020 7133831 4432 -9002131 -9776258 -1804696 5629265
37281 5629265 7056356 6268267 6988709 6602066 2178077 -4239699 -9411594 -11966322 -9742741
37272 -9742741 -1057884 9052622 11650799 6330419 2892504 6397800 9085998 3365437
37264 3365437 -5144729 -5792755 1759013 8986085 11155703 10158549 7563013 2835178
$$ packed form
37322d345131Q510232K190869k44241q17707l927901o702798m118390J443260
37314h011807L040012p38048m318707l055569J521081M417417K808271j203520
37306e540870k902356n40378K308975J828796l77581l31490J358009R35380r85962
37297d247477J05119M201388N727908K436584j345574k266567j926717j278771
37289A405893J338117L839010N50811p129399r006563p74127P971562P433961
37281E629265J427091p88089P20442l86643m423989o417776n171895k554728K223581
37272i742741Q684857J0110506K598177n320380l437915L505296K688198n720561
37264C365437q510166o48026P551768P227072K169618r97154k595536m727835
$$ plain form
37256 2835178 -2882089 -7540174 -11293839 -13990738 -12657840 -6904054 -2860097 -5110977
37248 -5110977 -8648099 -6431212 -993329 554084 -333371 3493686 10275774 9845495
37240 9845495 500116 -6090771 -1238357 8794431 12519310 7575051 -47221 -5112902
37232 -5112902 -6098088 -3652875 -765886 -747087 -1878656 1355929 8876257 12888757 9429499
37223 9429499 5562671 8703806 14400825 13217140 6315978 4366932 11090757 17387439
37215 17387439 15047739 8816555 9066884 16615080 21493401 16618247 7336487 4665263
37207 4665263 11557365 19502076 18926027 9858087 311352 -3750800 -3497522 -2890069 -3139935
37198 -3139935 -3076165 -2493197 -2712030 -4448968 -6591392 -7192547 -5545657 -3490799 -3876882
$$ packed form
37256B835178n717267m658085l753665k696899J332898N753786M043957k250880
37248e110977l537122K216887N437883J547413q87455L827057O782088m30279
37240I845495r345379o590887M852414J0032788L724879m944259p622272n065681
37232e112902r85186K445213K886989J8799j131569L234585P520328M012500l459258
37223I429499l866828L141135N697019j183685o901162j949046O723825O296682
37215A7387439k339700o231184K50329P548196M878321m875154r281760k671224
37207D665263O892102P944711n76049r067940r546735m062152K53278O07453k49866
37198c139935O3770N82968k18833j736938k142424o01155J646890K054858l86083
$$ plain form
37189 -3876882 -6699894 -8017398 -4776328 479891 2830418 2125570 2742322 5980828
37181 5980828 7830852 6414512 6433187 11639337 16538393 11978837 -1578365 -12426793
37173 -12426793 -11188589 -1619750 5293001 4992633 2702572 4029530 7245500 7075732
37165 7075732 2568950 -2756649 -6917006 -10823875 -13464737 -10847387 -2193113 6891725
37157 6891725 10951350 11323873 12367335 13896192 12503529 8792625 7474472 10098820
37149 10098820 12795320 12059594 8194981 2180553 -5725377 -12289245 -11395186 -1765726
37141 -1765726 8648483 10272455 2634213 -5781750 -7883137 -5422195 -5500397 -11171927
37133 -11171927 -17182382 -16139598 -8261195 -2006102 -3494485 -8668761 -9508526 -5144536
$$ packed form
37189c876882k823012j317504L241070N256219K350527p04848O16752L238506
37181E980828J850024j416340J8675N206150M899056m559556j3557202j0848428
37173a2426793J238204R568839O912751l00368k290061J326958L215970j69768
37165G075732m506782n325599m160357l906869k640862K617350Q654274R084838
37157F891725M059625L72523J043462J528857j392663l710904j318153K624348
37149A0098820K696500p35726l864613o014428p905930o563868Q94059R629460
37141a765726J0414209J623972p638242q415963k101387K460942p8202n671530
37133a1171927o010455J042784P878403O255093j488383n174276q39765M363990
$$ plain form
37125 -5144536 -1604006 -2293822 -4989315 -7856180 -11616432 -14466324 -11394843 -1348455
37117 -1348455 9905781 16482088 17555958 14496964 8404179 2492649 989598 3038461
37109 3038461 3538631 2214232 4363859 9290928 7196192 -5863909 -18390425 -17867808
37101 -17867808 -8241592 -2731205 -4196614 -4356444 36622 2736673 430433 -1597764
37093 -1597764 663664 3170802 621949 -6438041 -14020841 -18440746 -15975647 -5221510
37085 -5221510 8041333 14585666 12729945 9684993 10062680 10066999 6016764 1086893 -1110323
37076 -1110323 -2854963 -6466699 -8023008 -3607563 2838663 5059331 4324442 6275321
37068 6275321 10475257 11167630 7635349 5770751 8245046 10342137 8235864 5476062
$$ packed form
37125e144536L540530o89816k695493k866865l760252k849892L071481J0046388
37117a348455J1254236O576307J073870l058994o092785n911530j503051K048863
37109C038461N00170j324399K149627M927069k094736j3060101j2526516N22617
37101a7867808R626216N510387j465409j59830M393066K700051k306240k028197
37093a597764K261428K507138k548853p059990p582800m419905K465099J0754137
37085e221510J3262843O544333j855721l044952L77687M319m050235m929871k197216
37076a110323j744640l611736j556309M415445O446226K220668p34889J950879
37068F275321M199936O92373l532281j864598K474295K097091k106273k759802
$$ plain form
37060 5476062 7337072 12708900 15747344 13445530 8180225 4007656 3218584 5773273
37052 5773273 9621772 11654591 10229096 7104897 5829374 8063469 12102930 14711718
37044 14711718 13689401 9188816 3735259 760079 1716476 4364803 5085626 3077554
37036 3077554 684203 -881226 -3690328 -9037600 -13380409 -11870753 -5396730 -342268
37028 -342268 -538373 -2737733 -1551866 3917564 10039223 12602782 9084739 10954
37020 10954 -9281935 -10930640 -2125184 10884685 18959273 18790823 13543018 7690343
37012 7690343 4496930 5793199 9859660 11416884 7865494 3400858 2608685 3142924
37004 3142924 871448 -860798 4349079 13662469 17007963 12287120 8350821 9990842
$$ packed form
37060E476062J861010N371828L038444k301814n265305m172569p89072K554689
37052E773273L848499K032819j425495l124199j275523K234095M039461K608788
37044A4711718j022317m500585n453557k975180R56397K648327P20823k008072
37036C077554k393351j565429k809102n347272m342809J509656O474023N054462
37028c42268j96105k199360J185867N469430O121659K563559l518043r073785
37020A0954r292889j648705Q805456J3009869Q074588j68450n247805n852675
37012G690343l193413J296269M066461J557224l551390m464636p92173N34239
37004C142924k271476j732246N209877R313390L345494m720843l936299J640021
$$ plain form
36996 9990842 10602965 5188865 436319 3601346 9726107 9941325 6091583 5814939 7558562
36987 7558562 3269196 -5520949 -7653287 -489746 4051432 -3314940 -15756062 -20537086
36979 -20537086 -15199749 -6450845 1072969 6805421 8858259 5201390 -767660 -3015102
36971 -3015102 -1446441 -1661784 -5599362 -8454854 -6743871 -3899828 -4541250 -7371679
36963 -7371679 -7922684 -5615098 -3602309 -2937101 -1446522 1433172 2692149 -58516
36955 -58516 -5239277 -9559206 -11362587 -10465500 -7133729 -3150093 -1759809 -4083598 -7000719
36946 -7000719 -6879035 -4035663 -1197056 673113 1834906 727940 -4167437 -9901100
36938 -9901100 -11183707 -7684692 -4887795 -6374374 -9431089 -10181813 -8979383 -8054721
$$ packed form
36996I990842O12123n414100m752546L165027O124761K15218l849742k76644J743623
36987G558562m289366q790145k132338P163541M541178p366372j2441122m781024
36979b0537086N337337Q748904P523814N732452K052838l656869n969050k247442
36971c015102J568661k15343l937578k855492J710983K844043o41422k830429
36963g371679n51005K307586K012789O65208J490579K879694J258977k750665
36955e8516n180761m319929j803381Q97087L331771L983636J390284k323789k917121
36946g000719J21684K843372K838607J870169J161793j106966m895377n733663
36938i901100j282607L499015K796897j486579l056715p50724J202430R24662
$$ plain form
36930 -8054721 -7383078 -5972870 -4366006 -2915080 -352612 3043127 3955946 1107863
36922 1107863 -1320087 553371 4068073 4380671 2484492 3039153 5738036 5299086 19078
36913 19078 -5822062 -8973804 -10763549 -11965656 -9802276 -3009225 4625451 9107134
36905 9107134 11115905 12933084 13778646 11865823 8650707 7065162 6662924 3975134
36897 3975134 -2449767 -9696319 -13251552 -11023598 -5319897 -1694337 -4395728 -11592692
36889 -11592692 -16457305 -14474282 -8392692 -4386721 -4707001 -6205287 -5272758 -1933154
36881 -1933154 1105298 1826437 658486 -530736 -553440 409514 2148116 5065970 8247946
36872 8247946 8321938 2818737 -5814376 -12254136 -14102665 -12736365 -9013258 -2746415
$$ packed form
36930h054721O71643J410208J606864J450926K562468L395739R12819k848083
36922A107863k427950J873458L514702L12598j896179N54661K698883m38950n280008
36913A9078n841140l151742j789745j202107K163380O793051P634676M481683
36905I107134K008771J817179Q45562j912823l215116j585545m02238k687790
36897C975134o424901p246552l555233K227954N703701L625560k701391p196964
36889a1592692m864613J983023O081590M005971l20280j498286R32529L339604
36881a933154L038452P21139j167951j189222k2704R62954J738602K917854L181976
36872H247946P3992n503201q633113o439760j848529J366300L723107O266843
$$ plain form
36864 -2746415 2843725 1809917 -6135181 -12502892 -9968656 -2329411 697326 -3191639
36856 -3191639 -6476258 -2831617 4668793 8361022 5609961 944592 -197217 2220050
36848 2220050 3367895 121381 -4162808 -3512591 2061032 5139155 765 -9638838
36840 -9638838 -14872139 -11539811 -2888833 5786727 11397678 12968115 11112457 7754568
36832 7754568 4031399 -747331 -5916870 -7424278 -2827862 3245176 3402948 -3049983
36824 -3049983 -9319248 -9818220 -5509597 -499394 2346045 1854333 -1294058 -4132342
36816 -4132342 -4471722 -4038990 -4746390 -3450277 3507439 11506743 11449009 3453768 -1767965
36807 -1767965 1851178 7555716 7193503 2569452 -458174 -1347307 -1046275 3786614 13689336
$$ packed form
36864b746415N590140j033808p945098o367711K534236P639245L026737l888965
36856c191639l284619L644641P500410L692229k751061m665369j141809K417267
36848B220050J147845l246514m284189O50217N573623L078123n138390r639603
36840i638838n233301L332328Q650978Q675560N610951J570437j855658l357889
36832G754568l723169m778730n169539j507408M596416O073038J57772o452931
36824c049983o269265m98972M308623N010203K845439m91712l148391k838284
36816d132342l39380M32732p07400J296113O957716P999304n7734p995241n221733
36807a767965L619143N704538l62213m624051l027626q89133L01032M832889R902722
$$ plain form
36798 13689336 19811164 14921332 6121523 4933639 8382719 3512562 -10323966 -18527888
36790 -18527888 -13382697 -5143197 -5082180 -9562594 -9175063 -3973905 -88392 1602040
36782 1602040 3577638 3702184 -1057355 -6271970 -4667270 2725330 8192746 8770596
36774 8770596 8503708 10457947 13845387 18108401 22451355 22372137 14903753 6790414 8080606
36765 8080606 16637465 19089802 10122806 558553 807073 5764373 4196247 -4254291
36757 -4254291 -11025988 -12676193 -12786628 -12406318 -8820376 -3618257 -2383257 -4618241
36749 -4618241 -2478264 7318752 17470034 19861033 15395649 9877976 5506440 1576807
36741 1576807 -595933 903380 4894430 9487761 15241143 21053266 20585601 10006290
$$ packed form
36798A3689336O121828m889832q799809j187884L449080m870157j3836528q203922
36790a8527888N145191Q239500O1017m480414L87531N201158L885513J690432
36782A602040J975598J24546m759539n214615J604700P392600N467416N77850
36774H770596k66888J954239L387440M263014M342954p9218p468384q113339J290192
36765H080606Q556859K452337q966996r564253K48520M957300j568126q450538
36757d254291o771697j650205j10435L80310L585942N202119J235000k234984
36749d618241K139977R797016J0151282K390999m465384n517673m371536l929633
36741A576807k172740J499313L991050M593331N753382N812123m67665j0579311
$$ plain form
36733 10006290 -2674290 -4564666 5108028 13191439 10452832 3443492 3711431 11733321
36725 11733321 18484304 18885771 16103920 14129320 13167797 12484390 11848982 9489855 3968856
36716 3968856 -1103699 221418 7303766 12331889 11045808 8289151 9306161 11417488
36708 11417488 9999963 7738300 10134327 14698546 13786491 8112283 7798655 16721998
36700 16721998 24448955 19969094 7064649 -1961419 -3689262 -5139660 -9203317 -9292457
36692 -9292457 -1745606 5887744 5745239 2114869 4148615 10064647 9218561 -275212
36684 -275212 -7086112 -3860921 798611 -4773700 -17133437 -22336108 -15857423 -7771858
36676 -7771858 -7565730 -12847114 -15943439 -14202693 -9617810 -4196285 -455874 -1808308
$$ packed form
36733A0006290j2680580j890376R672694Q083411k738607p009340K67939Q021890
36725A1733321O750983M01467k781851j974600r61523o83407o35408k359127n520999
36716C968856n072555J325117P082348N028123j286081k756657J017010K111327
36708A1417488j417525k261663K396027M564219r12055n674208l13628Q923343
36700A6721998P726957m479861j2904445r026068j727843j450398m063657q9140
36692i292457P546851P633350j42505l630370K033746N916032q46086r493773
36684b75212o810900L225191M659532n572311j2359737n202671O478685Q085565
36676g771858K06128n281384l096325J740746M584883N421525L740411j352434
$$ plain form
36668 -1808308 -7438073 -10484699 -6240107 1019638 4258170 3509084 3848788 6315539
36660 6315539 7502476 6656264 6026069 4323519 -2752320 -13780428 -20000286 -15583917
36652 -15583917 -4834853 3677117 6170129 4444321 1801308 1167828 3817655 6992060
36644 6992060 5754112 -211914 -4761180 -2876153 3119254 7793010 9718304 10906836
36636 10906836 12114036 12569473 12147842 10409089 5960590 258767 -954161 5456547
36628 5456547 14127814 17199813 14324411 11439160 11173176 10524570 7595503 4444268
36620 4444268 2551826 1089871 812903 4154101 9687729 11802424 8473089 4738039
36612 4738039 5462727 8709385 9673067 7803744 6297222 6905858 8738125 10566011 11337788
$$ packed form
36668a808308n629765l046626M244592P259745L238532p49086L39704K466751
36660F315539J186937q46212o30195j702550p075839j1028108o219858M416369
36652a5583917J0749064Q511970K493012j725808k643013o33480K649827L174405
36644F992060j237948n966026m549266J885027N995407M673756J925294J188532
36636A0906836J207200M55437m21631j738753m448499n701823j212928O410708
36628E456547Q671267L071999k875402k885251k65984o48606k929067l151235
36620D444268j892442j461955k76968L341198N533628K114695l329335l735050
36612D738039P24688L246658R63682j869323j506522O08636J832267J827886P71777
$$ plain form
36603 11337788 9643692 5241995 339932 -2390153 -2323779 -682849 628277 -446707
36595 -446707 -4405691 -8429748 -9100784 -7341033 -7125216 -8812498 -8563287 -5619265 -4135861
36586 -4135861 -5013197 -2677463 5155167 11232577 9334950 5145067 7289715 11957910
36578 11957910 8105723 -3230162 -7410444 3200669 18013228 22711910 16092685 6251940
36570 6251940 -2347616 -10021237 -15060647 -14173458 -8038497 -493836 6350825 11640714
36562 11640714 12919804 9028131 3900174 2110715 2084296 -1008763 -6870690 -10180044
36554 -10180044 -8530988 -4924348 -2506417 -1919481 -3647042 -7488163 -9582072 -5929364
36546 -5929364 339283 1551782 -3046165 -5235108 -274430 5436892 4139173 -1698200
$$ packed form
36603A1337788j694096m401697m902063k730085O6374J640930J311126j074984
36595d46707l958984m024057o71036J759751K15817j687282K49211K944022J483404
36586d135861q77336K335734P832630O077410j897627m189883K144648M668195
36578A1957910l852187j1335885m180282J0611113J4812559M698682o619225r840745
36570F251940q599556p673621n039410Q87189O134961P544661O844661N289889
36562A1640714J279090l891673n127957j789459k6419l093059n861927l309354
36554a0180044J649056L606640K417931N86936j727561l841121k093909L652708
36546e929364O268647J212499m597947k188943M960678N711322j297719n837373
$$ plain form
36538 -1698200 -4121447 -1784419 300403 812548 3698610 9307370 11390507 5745443
36530 5745443 -3216029 -7694141 -5026555 1465556 7267779 9744351 8619989 5958530
36522 5958530 4496990 4527582 3937239 2298599 2253510 4796837 6046349 2324647 -3229681
36513 -3229681 -3595076 2458622 7781174 5571276 -2420238 -8853576 -9879457 -8190550
36505 -8190550 -7688125 -8359915 -7752342 -5577106 -4511480 -6311954 -8865546 -8470657 -4556200
36496 -4556200 -502641 744552 311549 1123101 3030821 2704057 -1265053 -5558462 -5998995
36487 -5998995 -2728110 328237 287046 -2349099 -5718277 -8733467 -10712752 -10606972 -7608196
36478 -7608196 -1900985 5265068 11258984 12242189 6008234 -4305491 -11252304 -9705155
$$ packed form
36538a698200k423247K337028K084822N12145K886062N608760K083137n645064
36530E745443q961472m478112K667586O492111N802223K476572j124362k661459
36522E958530j461540L0592n90343j638640m5089K543327J249512l721702n554328
36513c229681l65395O053698N322552k209898p991514o433338j025881J688907
36505h190550N02425o71790O07573K175236J065626j800474k553592L94889L914457
36496d556200M053559J247193m33003Q11552J907720l26764l969110m293409m40533
36487e998995L270885L056347m1191k636145l369178l015190j979285J05780K998776
36478g608196N707211P166053N993916R83205o233955j0313725o946813J547149
$$ plain form
36470 -9705155 -1780987 5928881 8956789 7542190 4188884 1207895 400265 2617444
36462 2617444 6605245 9408982 8539244 3419019 -4482558 -11534175 -12950636 -6738755
36454 -6738755 2911386 8684281 7625896 3536601 1094368 413993 -640967 -1603159
36446 -1603159 -395612 2192111 2828564 421271 -2605094 -4087767 -4038398 -2116546 3313042
36437 3313042 11651201 18307348 19053213 14567128 8612339 3448022 -612135 -2921124
36429 -2921124 -2981408 -2112077 -1329525 1481967 8242220 14968964 14692979 7548004 2592196
36420 2592196 6058679 12244832 11262789 2977303 -3007895 -454969 6712766 11688258
36412 11688258 12834066 11630565 7813660 1566054 -2302888 1734478 11519785 17147545
$$ packed form
36470i705155P924168P709868L027908j414599l353306k980989q07630K217179
36462B617444L987801K803737q69738n120225p901577p051617j416461O211881
36454f738755R650141N772895j058385m089295k442233o80375j054960r62192
36446a603159J207547K587723O36453k407293l026365j482673M9369J921852N429588
36437C313042Q338159O656147P45865m486085n954789n164317m060157k308989
36429b921124o0284Q69331P82552K811492O760253O726744k75985p144975m955808
36420B592196L466483O186153r82043q285486n985198K552926P167735M975492
36412A1688258J145808j203501l816905o247606l868942M037366R785307N627760
$$ plain form
36404 17147545 11364248 -2088928 -12254534 -11883973 -3098949 6878617 13132732 15197361
36396 15197361 13976040 9984216 5360247 4323375 8618254 14020191 14692817 10456752
36388 10456752 6375041 5285883 4631289 1544458 -2663862 -4669634 -2612837 3864751
36380 3864751 13297689 20348714 18547243 8421327 -751891 -1117344 4933369 9778523
36372 9778523 10683251 9972581 8594092 6046397 4779444 7667598 11591315 10295743
36364 10295743 4035558 -166893 1090923 3461115 2896517 1377544 1724838 2561447
36356 2561447 2087483 1757009 2171691 10297 -6178403 -10921993 -7921705 1048165 8180523
36347 8180523 9224734 6898931 5687310 7003869 9322435 10388832 9298231 7615135
$$ packed form
36404A7147545n783297j3453176j0165606L70561Q785024R977566O254115K064629
36396A5197361j221321l991824m623969j036872M294879N401937O72626m236065
36388A0456752m081711j089158o54594l086831m208320k005772K056797O477588
36380C864751R432938P051025j801471j0125916r173218l65453O050713M845154
36372I778523R04728p10670j378489k547695j266953K888154L923717j295572
36364A0295743o260185m202451J257816K370192n64598j518973L47294Q36609
36356B561447m73964l30474M14682k161394o188700m743590L000288Q969870P132358
36347H180523J044211k325803j211621J316559K318566J066397j090601j683096
$$ plain form
36339 7615135 7375934 7417781 4455726 -821596 -2486643 2811017 10010059 11514178 6659545
36330 6659545 1449844 594836 3661568 7832197 10610073 10333205 7266121 4102921
36322 4102921 3340902 4861071 7408306 10452059 12886459 12638983 9841239 7291837
36314 7291837 5295039 192242 -8262026 -12833950 -7968618 702932 3053767 -1742895
36306 -1742895 -5754371 -5433068 -5788700 -10246181 -13962161 -10598664 -910574 8272106
36298 8272106 10558040 4419240 -5543737 -11308708 -8963818 -3599398 -3122807 -8140044
36290 -8140044 -12684787 -13841909 -14366269 -15694749 -15080000 -11115466 -6333661 -2919315
36282 -2919315 -983090 -1288625 -3542619 -2450301 6169437 14861546 10519822 -6155134
$$ packed form
36339G615135k39201M1847k962055n277322j665047N297660P199042J504119m854633
36330F659545n209701q55008L066732M170629K777876k76868l067084l163200
36322D102921p62019J520169K547235L043753K434400k47476k797744k549402
36314G291837j996798n102797q454268m571924M865332Q671550K350835m796662
36306a742895m011476L21303l55632m457481l715980L363497R688090R182680
36298H272106K285934o138800r962977n764971K344890N364420M76591n017237
36290h140044m544743j157122n24360j328480O14749L964534M781805L414346
36282b919315J936225l05535k253994J092318Q619738Q692109m341724j6674956
$$ plain form
36274 -6155134 -18193434 -14868720 -5843953 -4722290 -8576941 -5229784 6277826 15398764
36266 15398764 16546517 13569435 9444945 3140966 -3344049 -5678950 -5837017 -9749403
36258 -9749403 -14965617 -11615583 986992 9598193 5000562 -4279348 -4016464 6446270
36250 6446270 15296182 14332845 5799760 -4248199 -11387755 -12409033 -6775514 545786
36242 545786 3287744 1899472 2445895 6733311 9161018 5603933 -41374 -2176949
36234 -2176949 -2114175 -4996288 -10450322 -12288900 -7488307 -135513 4988223 8290182
36226 8290182 12419309 16924919 18990362 17454327 13484061 8881581 5880381 6714845
36218 6714845 11023048 15437247 17705579 18608789 17678577 11439669 490216 -6037761
$$ packed form
36274f155134j2038300L324714R024767J121663l854651L347157J1507610R120938
36266A5398764J147753k977082m124490o303979o485015k334901j58067l912386
36258i749403n216214L350034J2602575Q611201m597631r279910K62884J0462734
36250F446270Q849912r63337q533085j0047959p139556j021278N633519P321300
36242E45786K741958j388272N46423M287416K427707l557085n645307k135575
36234b176949O2774k882113n454034j838578M800593P352794N123736L301959
36226H290182M129127M505610K065443j536035l970266m602480l001200Q34464
36218F714845M308203M414199K268332R03210r30212o238908j0949453o527977
$$ plain form
36210 -6037761 -382488 11782818 17372080 13318369 9264857 12025769 16821873 17191745
36202 17191745 14621161 13077398 11737515 9581503 10616549 17204683 23502355 23275647
36194 23275647 19930511 20681979 24323455 23785505 18888308 17158323 21612267 25950636
36186 25950636 23722411 16048198 8494599 5066985 6214055 8663325 7411528 1980242
36178 1980242 -854240 4229857 12073925 13915349 11069346 12056318 16535221 14030579
36170 14030579 2042227 -6463573 -1042984 10123704 11781639 3037915 -3244245 528308
36162 528308 8295497 10773587 5976520 -1849630 -7250580 -6003353 1978554 10407728
36154 10407728 11850269 6864531 3793803 7842219 14615811 16727980 12631547 5799395
$$ packed form
36210f037761N655273J2165306N589262m053711m053512K760912M796104L69872
36202A7191745k570584j543763j339883k156012J035046O588134O297672k26708
36194B3275647l345136P51468L641476n37950m897197j729985M453944M338369
36186B5950636k228225p674213p553599l427614J147070K449270j251797n431286
36178A980242k834482N084097P844068J841424k846003R86972M478903k504642
36170A4030579j1988352q505800N420589J1166688J657935q743724o282160L772553
36162E28308P767189K478090m797067p826150n400950J247227P981907Q429174
36154A0407728J442541m985738l070728M048416O773592K112169m096433o832152
$$ plain form
36146 5799395 -917030 -5638266 -5142145 1885203 10016006 11492879 6609963 4076251
36138 4076251 8431744 12659271 8254327 -1642566 -6171578 -2052793 2599889 433025
36130 433025 -6174106 -10482123 -9482952 -3624131 5603390 13916625 15663707 11599816
36122 11599816 9955327 14731922 18788211 15042247 8415448 7802665 11394978 11081401
36114 11081401 7972800 10388479 16990980 16183418 5320752 -3153732 -705673 4518618
36106 4518618 2154446 -3995761 -4481872 -462542 633095 -273019 3420600 9756484
36098 9756484 9620601 2250536 -2534219 457980 4876179 4425023 1879321 1642203 1383872
36089 1383872 -2459553 -6602680 -5266026 728914 5463708 6641083 7371303 10333279
$$ packed form
36146E799395o716425m721236M96121P027348Q130803J476873m882916k533712
36138D076251M355493M227527m404944r896893m529012M118785M652682k166864
36130D33025o607131m308017R99171N858821R227521Q313235J747082m063891
36122A1599816j644489M776595M056289l745964o626799o12783L592313l13577
36114A1081401l108601K415679O602501q07562j0862666q474484K448059N224291
36106D518618k364172o150207m86111M019330J095637r06114L693619O335884
36098I756484j35883p370065m784755K992199M418199m51156k545702k37118k58331
36089A383872l843425m143127J336654N994940M734794J177375P30220K961976
$$ plain form
36081 10333279 15081367 20639397 25858756 26835723 19121022 4870456 -6085904 -6037354
36073 -6037354 1521029 6164453 3242566 -1420437 -234619 6433636 11851792 11873764
36065 11873764 8683512 6232152 5609794 5873235 6521108 7224478 6847677 4762837 2359329
36056 2359329 1646789 2646283 3285341 1834669 -1165090 -3415376 -3214240 -1388801 -311131
36047 -311131 -411440 1204151 6995623 14663284 19029104 18309817 16145238 16875844 20961495
36038 20961495 25680526 28224163 27405481 24469306 22978486 25680849 30720556 33472269
36030 33472269 33173621 34872218 42902228 54848048 64346042 68262311 68960038 70716607
36022 70716607 75919674 84107453 93335207 102919658 115254268 133792546 159045261 188164063
$$ packed form
36081A0333279M748088N558030N219359R76967p714701j4250566j0956360M8550
36073f037354P558383M643424k921887m663003J185818O668255N418156K1972
36065A1873764l190252k451360o22358K63441O47873P03370l76801k084840k403508
36056B359329p12540R99494O39058j450672k999759k250286K01136J825439J077670
36047c11131j00309J615591N791472P667661M365820p19287k164579P30606M085651
36038B0961495M719031K543637q18682k936175j490820K702363N039707K751713
36030C3472269k98648J698597Q030010J1945820R497994L916269O97727J756569
36022G0716607N203067Q187779R227754R584451J2334610J8538278K5252715K9118802
$$ plain form
36014 188164063 218551839 249951363 283228425 319586465 359977063 400652441 429050367
36007 429050367 430284438 401377222 355571408 309847688 271625938 239674727 212366264
36000 212366264 189751102 170935945 154832239 141745189 130446770 116522107 98083524
35993 98083524 80362556 69687262 65407301 62931168 61800518 63978729 66072157 61458809
35985 61458809 50866715 43425894 44758364 49900409 51182503 48566558 48403535 54402891
35977 54402891 62947433 66909933 63364177 57846483 59470284 70126113 81237639 84746483
35969 84746483 84245908 89618557 103085761 118140422 131458870 146869743 165798015
35962 165798015 182876739 195431966 209648038 231363713 256444054 276258489 287868120
$$ packed form
36014A88164063L0387776L1399524L3277062L6358040M0390598M0675378K8397926
36007D29050367J234071k8907216m5805814m5723720l8221750l1951211k7308463
36000B12366264k2615162j8815157j6103706j3087050j1298419j3924663j8438583
35993I8083524j7720968j0675294m279961k476133j130650K178211K093428m613348
35985F1458809j0592094p440821J332470N142045J282094k615945j63023N999356
35977E4402891Q544542L962500l545756n517694J623801J0655829J1111526L508844
35969H4746483n00575N372649J3467204J5054661J3318448J5410873J8928272
35962A65798015J7078724J2555227J4216072K1715675K5080341J9814435J1609631
$$ plain form
35955 287868120 292687938 289766786 277880536 261177639 244919686 227242946 202738911
35948 202738911 173403200 148071184 130316912 114719186 97227012 81649379 71871020
35941 71871020 64153541 53029411 40657032 33998857 34602292 36760336 35210439 29909306
35933 29909306 23181207 16658614 12214849 12317961 17260436 23566811 26509443 23921197
35925 23921197 18054623 14452978 17125726 22762213 22267141 11913099 460011 -830568
35917 -830568 6260139 9414526 4103108 -696145 1387233 3369900 -1881510 -7692386
35909 -7692386 -4506988 2686692 2277325 -3114732 -330225 10580226 14341181 5851937
35901 5851937 -359753 5911741 13864832 10885649 3791230 5310565 10748962 6617749
$$ packed form
35955B87868120M819818k921152j1886250j6702897j6257953j7676740k4504035
35948B02738911k9335711k5332016j7754272j5597726j7492174j5577633r778359
35941G1871020p717479j1124130j2372379o658175O03435K158044j549897n301133
35933B9909306o728099o522593m443765J03112M942475O306375K942632k588246
35925B3921197n866574l601645K672748N636487m95072j0354042j1453088j290579
35917h30568P090707L154387n311418m799253K083378J982667n251410n810876
35909g692386L185398P193680m09367n392057K784507J0910451L760955q489244
35901E851937o211690O271494P953091k979183p094419J519335N438397m131213
$$ plain form
35893 6617749 -4471011 -7210222 730380 5821269 2414436 489887 5020368 5369215
35885 5369215 -5697707 -16781294 -13474844 333076 8692594 5391469 -1246381 -2393920
35877 -2393920 1658248 5379632 5014038 1202871 -2196520 -2428691 -1880156 -4896177 -10051311
35868 -10051311 -10773391 -5388886 -444296 -1013217 -3851264 -3939919 -1575347 1423043 5968690
35859 5968690 10861898 10548685 4480926 2140018 10277212 20637304 20243663 10144880
35851 10144880 3344774 5935435 11010503 11360544 7815140 3128439 -2819597 -8256404
35843 -8256404 -8254581 -2893528 -29633 -4587467 -10106413 -6814016 4748925 13611668
35835 13611668 11016553 -861776 -12938068 -18904381 -19520983 -18572426 -17061502 -13477556
$$ packed form
35893F617749j1088760k739211P940602N090889l406833j924549M530481L48847
35885E369215j1066922j1083587L306450J3807920Q359518l301125o637850j147539
35877b393920M052168L721384l65594l811167l399391k32171N48535l016021n155134
35868a0051311p22080N384505M944590n68921k838047q8655K364572K998390M545647
35859E968690M893208l13213o067759k340908Q137194J0360092l93641j0098783
35851A0144880o800106K590661N075068L50041l545404m686701n948036n436807
35843h256404J823N361053K863895m557834n518946L292397J1562941Q862743
35835A3611668k595115j1878329j2076292n966313o16602R48557J510924L583946
$$ plain form
35827 -13477556 -8873028 -7478270 -10262035 -11703689 -6763254 1673100 6607560 6007127
35819 6007127 3513865 2124771 2181445 3712927 5165229 1835746 -7609579 -14773830
35811 -14773830 -10247550 1433244 5209156 -3999120 -13993754 -12819554 -4220044 1040310
35803 1040310 1171214 1822259 4176900 4439677 2569112 2347650 3520928 2089709 -1236704
35794 -1236704 -492602 6077446 12555319 13689589 11215721 9138486 7541656 4644054
35786 4644054 1499410 702168 2123734 2999681 1423626 -2181274 -6049078 -7882684
35778 -7882684 -5855306 -721397 3721907 4054877 929852 -2043081 -2945545 -3472501 -5670813
35769 -5670813 -8279025 -8006183 -4019233 1012946 5091770 9732414 16433566 22352951
$$ packed form
35827a3477556M604528J394758k783765j441654M940435Q436354M934460o00433
35819F007127k493262j389094N6674J531482J452302l329483r445325p164251
35811a4773830M526280J1680794L775912r208276r994634J174200Q599510N260354
35803A040310J30904O51045K354641K62777j870565k21462J173278j431219l326413
35794a236704P44102O570048O477873J134270k473868k077235j596830k897602
35786D644054l144644p97242J421566Q75947j576055l604900l867804j833606
35778g882684K027378N133909M443304L32970l125025k972933r02464n26956k198312
35769e670813k608212K72842L986950N032179M078824M640644O701152N919385
$$ plain form
35761 22352951 23397563 20929037 20530302 23182661 22993019 16378698 8147370 3750278
35753 3750278 331943 -7405573 -15425211 -13613060 -1533228 7807092 3963601 -7506266
35745 -7506266 -12949407 -7935814 -914467 -1242666 -8747181 -15699544 -15921473 -10616648
35737 -10616648 -6127779 -6531979 -9201309 -8864072 -4935006 -1798773 -2146764 -4059690
35729 -4059690 -5310561 -5950042 -5191836 -993303 4696497 5919063 1708456 -855735
35721 -855735 2236455 4317849 -665237 -5358740 1335888 15279190 21177853 15863583
35713 15863583 13282521 21995715 31459405 29268942 20625997 18700127 23340774 23040772
35705 23040772 14442764 6186001 3518282 2025586 -634887 1219199 9660246 15330492
$$ packed form
35761B2352951J044612k468526l98735K652359j89642o614321q231328m397092
35753C750278l418335p737516q019638J812151J2079832R340320l843491j1469867
35745g506266n443141N013593P021347l28199p504515o952363k21929N304825
35737a0616648M488869m04200k669330L37237L929066L136233l47991j912926
35729d059690j250871o39481P58206M198533N689800J222566m210607k564191
35721h55735L092190K081394m983086m693503O694628J3943302N898663n314270
35713A5863583k581062Q713194R463690k190463q642945j925870M640647l00002
35705B3040772q598008q256763k667719j492696k660473J854086Q441047N670246
$$ plain form
35697 15330492 9610062 -1738167 -6138299 -1942232 635643 -4319773 -10286801 -9008304
35689 -9008304 -2310439 1790955 618608 -1400595 -967078 -52397 -966685 -2381578 -2938450
35680 -2938450 -4758358 -9232383 -12148114 -8433990 -687353 3081918 934547 -33603
35672 -33603 5214152 11682934 12235860 8584302 7852737 10903230 11334367 5831477 -1010968
35663 -1010968 -3474307 -1128355 3053003 6252442 5618578 -728239 -9340245 -11833384
35655 -11833384 -3843591 8044805 11989032 3388240 -10491678 -18328921 -15593743 -7470295
35647 -7470295 -2249207 -2946544 -5857866 -6340924 -3647963 499794 4901724 7991059
35639 7991059 6980139 1925320 -1568715 1153514 5841377 3920922 -4948754 -11596021
$$ packed form
35697A5330492n720430j1348229m400132M196067K577875m955416n967028J278497
35689i008304O697865M101394j172347k019203M33517R14681r14288j414893n56872
35680b938450j819908m474025k915731L714124P746637L769271k147371r68150
35672c3603N247755O468782N52926l651558p31565L050493M31137n502890o842445
35663a010968k463339K345952M181358L199439o33864o346817q612006k493139
35655a1833384P989793J1888396L944227q600792j3879918p837243K735178Q123448
35647g470295N221088o97337k911322m83058K692961M147757M401930L089335
35639G991059j010920n054819l494035K722229M687863j920455q869676o647267
$$ plain form
35631 -11596021 -10300175 -6240825 -6344328 -8697290 -6638193 481298 6620014 7439568
35623 7439568 4462324 1598356 1227148 3029032 3937754 667893 -5069013 -6253190
35615 -6253190 776848 9569491 10359098 2504781 -4974135 -5015274 611295 6584370 10429651
35606 10429651 11254642 7283595 -836663 -7088854 -5333227 2880134 9263837 7834862
35598 7834862 382276 -7246942 -11265711 -11148313 -7764363 -3265955 -1265893 -3551886
35590 -3551886 -6794088 -6090169 -2324048 -1760751 -6340942 -9098357 -3633376 5580769
35582 5580769 8661306 4128829 -255029 -629904 -2629446 -10415137 -17459806 -14633676
35574 -14633676 -3406249 5521367 5053756 -2297683 -10429252 -16387360 -20115144 -21173292
$$ packed form
35631a1596021J295846M059350j03503k352962K059097P119491O138716Q19554
35623G439568k977244k863968l71208J801884R08722l269861n736906j184177
35615f253190P030038Q792643P89607p854317p478916m1139N626569N973075L845281
35606A0429651Q24991l971047q120258o252191J755627Q213361O383703j428975
35598G834862p452586p629218m018769J17398L383950M498408K000062k285993
35590c551886l242202P03919L766121N63297m580191k757415N464981R214145
35582E580769L080537m532477m383858l74875j999542p785691p044669K826130
35574a4633676J1227427Q927616m67611p351439q131569n958108l727784j058148
$$ plain form
35566 -21173292 -17999475 -10122491 -859896 3228866 -1682443 -10918533 -15214715 -11704959
35558 -11704959 -6575596 -4725286 -2856698 2439308 5975436 1450089 -6292993 -6284558
35550 -6284558 2421378 9663173 10134421 9841693 12898456 12454650 2675151 -8059140
35542 -8059140 -6602227 5703662 13984993 10140165 2169407 198731 2333125 1128222
35534 1128222 -2315379 -505353 5943782 6391952 -3871279 -14134851 -11716896 145488
35526 145488 6623035 1822000 -4503171 -2594243 3978747 5984370 2699801 769637
35518 769637 2560382 3757328 1811503 -384314 -261195 868811 1916347 4778219
35510 4778219 10202524 14405127 13129463 7507058 3297273 4582835 9515272 12468159
$$ packed form
35566b1173292L173817P876984R262595M088762m911309r236090m296182L509756
35558a1704959N129363J850310J868588N296006L536128m525347p743082Q435
35550f284558Q705936P241795M71248k92728L056763m43806r779499j0734291
35542h059140J456913J2305889Q281331l844828p970758j970676K134394j204903
35534A128222l443601J810026O449135M48170j0263231j0263572K417955J1862384
35526A45488O477547m801035o325171J908928O572990K005623l284569j930164
35518G69637J790745J196946j945825k195817J23119J130006J047536K861872
35510D778219N424305M202603j275664n622405m209785J285562M932437K952887
$$ plain form
35502 12468159 10187040 5337599 2822436 3031722 1899788 -1310301 -920207 6467927
35494 6467927 14057779 12113159 1864234 -4594128 628771 11684922 16388439 9064464
35486 9064464 -5599394 -18072995 -22039842 -19688060 -19104984 -23615758 -25738315 -17397320
35478 -17397320 -4337811 -1333627 -11623320 -21057626 -17630290 -7771099 -5404369 -11869146
35470 -11869146 -16618792 -13757844 -7385420 -1909815 2689262 4968455 879554 -8202651
35462 -8202651 -13883343 -11448858 -6187492 -4421685 -3716532 1549076 8293034 6500571
35454 6500571 -6123046 -17583825 -13945144 3942393 20143686 20703167 8201922 -2856913
35446 -2856913 -3296847 2206514 4246157 1136213 -1865284 -2350417 -3308289 -6018561 -6716321
$$ packed form
35502A2468159k281119m849441k515163K09286j131934l210089L90094P388134
35494F467927P589852j944620j0248925o458362N222899J1056151M703517p323975
35486I064464j4663858j2473601l966847K351782N83076m510774k122557Q340995
35478a7397320J3059509L004184j0289693r434306L427336R859191K366730o464777
35470a1869146m749646K860948O372424N475605M599077K279193m088901r082205
35462h202651n680692K434485N261366J765807P05153N265608O743958j792463
35454F500571j2623617j1460779L638681J7887537J6201293N59481j2501245j1058835
35446b856913m39934N503361K039643l109944l001497m85133r57872k710272o97760
$$ plain form
35437 -6716321 -2792399 2422632 4468193 3871370 3720777 3831801 1694223 -2163627 -4103955
35428 -4103955 -2523022 448639 2487948 3152588 2214124 -799640 -4529436 -6036831
35420 -6036831 -4245190 -982206 2003454 4598183 6322468 5759830 3191336 982169
35412 982169 43404 -1094872 -2399630 -1458703 1285605 1056086 -3559274 -5972766 -626529
35403 -626529 6858381 6399747 -1169864 -4454684 1550879 7973611 5747564 -1047881
35395 -1047881 -2321623 2723266 5258334 -306934 -10128367 -17200844 -17931443 -12132308
35387 -12132308 -2077636 6622772 7604387 150089 -9003616 -12235665 -8350004 -2512974
35379 -2512974 -229556 -2181067 -4137843 -1600076 4903960 9654089 8065438 2481960
$$ packed form
35437f716321L923922N215031K045561n96823j50593J11024k137578l857850j940328
35428d103955J580933K971661K039309O64640r38464l013764l729796j507395
35420f036831J791641L262984K985660K594729J724285n62638k568494k209167
35412I82169r38765j138276j304758R40927K744308k29519m615360k413492N346237
35403f26529P484910m58634p569611l284820O005563O422732k226047o795445
35395a047881j273742N044889K535068n565268r821433p072477p30599N799135
35387a2132308J0054672Q700408R81615p454298r153705l232049L885661N837030
35379b512974K283418j951511j956776K537767O504036M750129j588651n583478
$$ plain form
35371 2481960 -350115 2418388 6094503 4057403 -4196822 -11849324 -11763074 -4503077
35363 -4503077 1346941 -1838962 -11551451 -17175661 -12215902 -2041457 2752455 -1414332
35355 -1414332 -8720420 -12481557 -11991751 -10479081 -10050785 -10615032 -11441986 -11465206 -9149712
35346 -9149712 -4158171 1112210 3352889 2005323 -178124 -722857 -75808 697371 3228218
35337 3228218 9623317 17067447 18905974 13070604 5424355 1560223 -463901 -4316038
35329 -4316038 -6778407 -2825987 3280545 1934493 -6511629 -10870727 -6265577 -1509932
35321 -1509932 -4106887 -8162276 -5406208 380297 332534 -4156120 -4317096 1217985 5516968
35312 5516968 5617533 5238361 5427574 2418016 -3929446 -8299152 -8597041 -9026543 -12324443
$$ packed form
35371B481960k832075K768503L676115k037100q254225p652502Q6250P259997
35363d503077N850018l185903r712489n624210M959759J0174445M793912m166787
35355a414332p306088l761137M89806J512670M28296n64247q26954k3220K315494
35346i149712M991541N270381K240679j347566k183447n44733O47049P73179K530847
35337C228218O395099P444130J838527n835370p646249l864132k024124l852137
35329d316038k462369L952420O106532j346052q446122m359098M605150M755645
35321a509932k596955m055389K756068N786505m7763m488654j60976N535081M298983
35312E516968J00565l79172J89213l009558o347462m369706k97889m29502l297900
$$ plain form
35303 -12324443 -15348985 -14488682 -10112229 -4446978 -123860 -950650 -8192974 -15976542
35295 -15976542 -16812937 -11906127 -9184806 -11035933 -11815570 -8275362 -3822708 -478284
35287 -478284 4471481 10486914 11214517 4895140 -131742 3801048 13016610 17906640
35279 17906640 14357182 5317389 -4382215 -10479293 -10889967 -8718803 -9473862 -12430533
35271 -12430533 -10261998 -614289 8436134 9354796 5418338 4036086 5302761 4344529
35263 4344529 1082925 9158 2046939 3213801 900671 -3235134 -6039279 -5087442
35255 -5087442 503392 8390419 13647081 13573568 10083292 5865000 1431911 -2313383
35247 -2313383 -2882790 -203321 2336115 3309743 4949433 6828387 3885881 -5006461
$$ packed form
35303a2324443l024542Q60303M376453N665251M323118q26790p242324p783568
35295a5976542q36395M906810K721321j851127p79637L540208M452654L344424
35287d78284M949765O015433P27603o319377n026882L932790R215562M890030
35279A7906640l549458r039793r699604o097078m10674K171164p55059k956671
35271a2430533K168535R647709R050423R18662l936458j382252J266675r58232
35263D344529l261604j073767K037781J166862k313130m135805k804145R51837
35255e087442N590834P887027N256662p3513l490276m218292m433089l745294
35247b313383n69407K679469K539436R73628J639690J878954k942506q892342
$$ plain form
35239 -5006461 -12220035 -10436086 -1996020 5586405 8624512 7025198 876235 -6524580
35231 -6524580 -7697652 -347976 6867386 5560080 270810 1331980 8711874 12962342
35223 12962342 10690497 8576188 10660540 10963114 2840118 -10232398 -17762122 -13906938
35215 -13906938 -3597647 2585540 -366920 -6001671 -4052442 6110690 14486347 14076021
35207 14076021 8789703 4480505 40664 -6305537 -9296701 -4139261 3566682 4896395
35199 4896395 805664 -1054790 697222 1377428 742597 2525084 4643411 721737
35191 721737 -8266440 -13979944 -13439134 -12302123 -13804072 -13444149 -7157156 2882995
35183 2882995 12677528 19791169 21409599 16333892 9623804 7763063 9073606 7134200
$$ packed form
35239e006461p213574J783949Q440066P582425L038107j599314o148963p400815
35231f524580j173072P349676P215362j307306n289270J061170P379894M250468
35223A2962342k271845k114309K084352L02574q122996j3072516p529724L855184
35215a3906938J0309291O183187k952460n634751J949229J0163132Q375657m10326
35207A4076021n286318m309198m439841o346201k991164N157440P705943J329713
35199D896395m090731j860454J752012O80206o34831J782487K118327l921674
35191G21737q988177n713504N40810J137011j501949L59923O286993J0040151
35183B882995R794533P113641J618430n075707o710088j860741J310543j939406
$$ plain form
35175 7134200 3017003 3585195 7333136 4673884 -4655229 -7980529 256284 7532947
35167 7532947 1622915 -10633342 -14357958 -8706907 -5282943 -8863949 -12403380 -10498379
35159 -10498379 -6784999 -6038030 -7366469 -8250921 -9177865 -10852991 -10985299 -7408741 -2387091
35150 -2387091 -882278 -4742755 -10212852 -11912620 -8889175 -5586497 -6246119 -9746558
35142 -9746558 -11461688 -8794259 -2715746 4616317 10707335 12452467 8795350 3294258
35134 3294258 742029 1788115 3906893 5952177 7482788 5521376 -2063771 -10680836
35126 -10680836 -12974321 -9141417 -7082642 -11027377 -15830686 -14478688 -6450492 2918529
35118 2918529 7231232 2823364 -7391140 -13866534 -9718436 15168 4392429 1218585
$$ packed form
35175G134200m117197N68192L747941k659252r329113l325300Q236813P276663
35167G532947n910032j2256257l724616N651051L423964l581006l539431J905001
35159a0498379L713380P46969j328439q84452r26944j675126j32308L576558N021650
35150b387091J504813l860477n470097j699768L023445L302678o59622l500439
35142i746558j715130K667429O078513P332063O091018J745132l657117n501092
35134C294258k552229J046086K118778K045284J530611j961412p585147q617065
35126a0680836k293485L832904K058775l944735m803309J351998Q028196R369021
35118B918529M312703m407868j0214504o475394M148098R733604M377261l173844
$$ plain form
35110 1218585 -1894294 -1053960 -1366783 -6450059 -11657004 -11684750 -7476461 -1908591 4159311
35101 4159311 8088487 5431043 -2236243 -6990346 -6252609 -6873898 -12839175 -17429141
35093 -17429141 -13888014 -5977226 -709060 2312104 6570350 10117273 9686741 8050566
35085 8050566 9118210 10238354 7159583 2321707 516614 604497 -440295 670521
35077 670521 8921639 20883103 27398581 24610378 15724402 4647180 -5322980 -9703810
35069 -9703810 -7158362 -3088920 -2465615 -2628977 268840 2898833 1369084 924116 8358920
35060 8358920 18634468 20817673 14959814 10799764 10883697 7979133 -70397 -5926933
35052 -5926933 -5703982 -4254192 -4042440 -275616 8339268 14831858 15305117 14869923 16467617
$$ packed form
35110A218585l112879Q40334l12823n083276n206945k7746M208289N567870O067902
35101D159311L929176k657444p667286m754103P37737o21289n965277m589966
35093a7429141L541127P910788N268166L021164M258246L546923m30532j636175
35085H050566J067644J120144l078771m837876j805093Q7883j044792J110816
35077F70521Q251118J1961464O515478k788203q885976j1077222r970160m380830
35069i703810K545448M069442O23305j63362K897817K629993j529749m44968P434804
35060H358920J0275548K183205n857859m160050Q3933k904564q049530n856536
35052e926933K22951J449790K11752L766824Q614884O492590M73259m35194J597694
$$ plain form
35043 16467617 14152902 5119817 -1172664 4359610 15744357 20120092 15644395 11125483
35035 11125483 10931233 10397946 5676636 -488167 -3929416 -3874070 -1706761 505413 268016
35026 268016 -2441243 -3268657 1232049 7589927 9726148 8346897 9987220 16190032
35018 16190032 19910183 15264139 5980782 508890 1721361 5079224 5493873 2852031
35010 2852031 843709 2178351 5473662 6827562 4865051 3314859 6423210 12116045
35002 12116045 13191996 6787191 -704302 -1162635 5175501 10926703 11331666 8210442
34994 8210442 4390634 -436658 -6130127 -8815244 -5173431 2133409 7026193 7135970
34986 7135970 5531659 5962814 8803702 11245363 9666634 2811843 -5569099 -8969806
$$ packed form
35043A6467617k314715r033085o292481N532274J1384747M375735m475697m518912
35035A1125483j94250n33287m721310o164803l441249N5346K167309K212174k37397
35026B68016k709259q27414M500706O357878K136221j379251J640323O202812
35018A6190032L720151m646044r283357n471892J212471L357863M14649k641842
35010B852031k008322J334642L295311J353900j962511j550192L108351N692835
35002A2116045J075951o404805p491493m58333O338136N751202M04963l121224
34994H210442l819808m827292n693469k685117L641813P306840M892784J09777
34986G135970j604311M31155K840888K441661j578729o854791q380942l400707
$$ plain form
34978 -8969806 -5613087 -1922046 -5176741 -14122399 -20628182 -19493420 -12402195 -3190076
34970 -3190076 5551895 10922233 10154576 4463869 -1325928 -4440405 -6374050 -9022193
34962 -9022193 -12250037 -15616198 -18344055 -17139372 -8758106 4106661 13879840 16195462
34954 16195462 12965609 7305822 804430 -3486845 -1648164 5262506 11051975 11839981
34946 11839981 8929205 3907455 -2695611 -7366917 -6181169 -2902770 -5673007 -13167228
34938 -13167228 -13923819 -3525871 7759778 10073160 6539405 4027958 1745410 -2375817
34930 -2375817 -3778556 53428 1778454 -4147169 -10308382 -8355696 -3665748 -4674951
34922 -4674951 -5854922 2570572 14277016 14519974 4922052 1524227 8328181 11977625
$$ packed form
34978h969806L356719L691041l254695q945658o505783J134762P091225R212119
34970c190076Q741971N370338p67657n690707n789797l114477j933645k648143
34962i022193l227844l366161k727857J204683Q381266J2864767R773179K315622
34954A6195462l229853n659787o501392m291275J838681O910670N789469P88006
34946A1839981k910776n021750o603066m671306J185748L278399k770237p494221
34938a3167228p56591J0397948J1285649K313382l533755k511447k282548m121227
34930b375817j402739L831984J725026n925623o161213J952686M689948j009203
34922d674951j179971Q425494J1706444K42958r597922l397825O803954L649444
$$ plain form
34914 11977625 5667831 -262770 2345811 6326681 3828302 113768 3067376 9870080
34906 9870080 13400946 13040225 10974129 6034835 -1005723 -3825839 8544 3131808
34898 3131808 -605118 -6082426 -5580125 -1085705 234584 -2515804 -5251494 -7338095
34890 -7338095 -10767547 -14004628 -13827680 -11161068 -9332657 -8763851 -8139661 -8059129 -9061518
34881 -9061518 -9036348 -6719225 -4567466 -4612297 -5315394 -5736886 -7758937 -10530965 -8974272
34872 -8974272 -2867893 -757777 -7942625 -16482039 -15335425 -5815278 1747608 3115822
34864 3115822 2723518 3566981 4054633 4184040 5815088 6443818 1270138 -7253969 -10185663
34855 -10185663 -4975299 -224203 -3799363 -12186860 -16191414 -12788483 -6571614 -2498319
$$ packed form
34914A1977625o309794n930601K608581L980870k498379l714534K953608O802704
34906I870080L530866l60721k066096m939294p040558k820116L834383L123264
34898C131808l736926n477308N02301M494420J320289k750388k735690k086601
34890g338095l429452l237081J76948K666612J828411N68806O24190Q0532j002389
34881i061518K5170K317123K151759m4831p03097m21492k022051k772028J556693
34872h974272O106379K110116p184848q539414J146614R520147P562886J368214
34864C115822l92304Q43463M87652J29407J631048O28730n173680q524107k931694
34855a0185663N210364M751096l575160q387497m004554L402931O216869M073295
$$ plain form
34847 -2498319 -2040718 -4856049 -9407519 -11836821 -8436762 -932826 3666906 1124194
34839 1124194 -3995106 -3872695 1683987 4669522 632512 -4217681 -1879233 5625956
34831 5625956 9627168 7671631 5432636 5883870 4684610 -994642 -6037860 -4453670
34823 -4453670 1629088 4811090 1853247 -3429045 -5484529 -3017994 -161306 -1664828
34815 -1664828 -5970227 -5600524 2232879 9174479 6426743 -1304886 -2056612 4608412
34807 4608412 6774398 -461048 -7432289 -6074654 -1308929 314500 1387196 4218660
34799 4218660 1880602 -9853919 -20653235 -18430768 -7183951 650699 3462110 8137394
34791 8137394 13490759 11950823 5978177 6661030 14557792 16814995 6883873 -6088023
$$ packed form
34847b498319M57601k815331m551470k429302L400059P503936M599732k542712
34839A124194n119300J22411N556682K985535m037010m850193K338448P505189
34831E625956M001212j955537k238995M51234j199260n679252n043218J584190
34823d453670O082758L182002k957843n282292k055484K466535K856688j503522
34815a664828m305399L69703P833403O941600k747736p731629p51726O665024
34807D608412K165986p235446o971241J357635M765725J623429J072696K831464
34799D218660k338058j1734521j0799316K222467J1246817P834650K811411M675284
34791H137394N353365j539936n972646O82853P896762K257203r931122j2971896
$$ plain form
34783 -6088023 -12021830 -11896774 -9652437 -3869956 5038059 9170979 3445574 -5389903
34775 -5389903 -8044352 -5251350 -3545407 -3874324 -2783368 -1117775 -2832490 -6868499
34767 -6868499 -8133497 -6149730 -5597800 -7768002 -8267413 -5123124 -2985079 -5554638
34759 -5554638 -8546972 -5562160 1367533 3347462 -2660986 -8685960 -6812803 -655172
34751 -655172 360991 -4283717 -5264127 1860022 9282760 8686429 3485744 2683180 7225713
34742 7225713 10423813 9670528 9597711 13365299 17625345 17568797 11956133 2182985 -9065307
34733 -9065307 -17422171 -19473523 -16723294 -13419354 -10675823 -6945788 -3425042 -3030484
34725 -3030484 -3750087 250366 8923657 14082401 10082719 1487521 -3481190 -2337767
$$ packed form
34783f088023n933807J25056K244337N782481Q908015M132920n725405q835477
34775e389903k654449K793002J705943l28917J090956J665593j714715m036009
34767f868499j264998J983767N51930k170202m99411L144289K138045k569559
34759e554638k992334K984812O929693J979929o008448o024974J873157O157631
34751f55172J016163m644708r80410P124149P422738n96331n200685q02564M542533
34742G225713L198100p53285p2817L767588M260046n6548n612664r773148j1248292
34733i065307q356864k051352K750229L303940K743531L730035L520746L94558
34725c030484p19603M000453Q673291N158744l999682q595198m968711J143423
$$ plain form
34717 -2337767 2638492 9798412 17157283 19740496 14394796 5893958 2474385 5585304
34709 5585304 9325538 10175665 11267852 14812806 16096902 10124588 958805 -1918017
34701 -1918017 3743728 9771466 8403954 891799 -7295926 -14045840 -18500595 -16805579
34693 -16805579 -7792612 227370 -2254474 -11564897 -14741624 -8970105 -6004702 -12986451
34685 -12986451 -20203185 -16124389 -5369582 -870847 -4323565 -6407112 -3354315 -1146624
34677 -1146624 -3070768 -3909292 814162 7870215 11660653 10651731 6296368 784974
34669 784974 -2092840 1428156 10076320 17179679 17123516 10668229 3808250 2504844 7006213
34660 7006213 10258204 5255754 -4464180 -7123415 1230414 9807722 7840602 -1038300
$$ packed form
34717b337767M976259P159920P358871K583213n345700q500838l419573L110919
34709E585304L740234Q50127J092187L544954J284096n972314r165783k876822
34701a918017N661745O027738j367512p512155q187725o749914m454755J695016
34693a6805579R012967Q019982k481844r310423l176727N771519K965403o981749
34685a2986451p216734M078796J0754807M498735l452718k083547L052797K207691
34677a146624j924144q38524M723454P056053L790438j008922m355363n511394
34669G84974k877814L520996Q648164P103359n6163o455287o859979j303406M501369
34660G006213L251991n002450r719934k659235Q353829Q577308j967120q878902
$$ plain form
34652 -1038300 -7102435 -9856858 -14248761 -17546104 -13160558 -4253238 10710 125290
34644 125290 4479075 12574267 14380874 7513922 817376 -1292229 -3711857 -7043840
34636 -7043840 -4337305 3880194 6660594 1168327 -1078914 5356841 8546374 -775536
34628 -775536 -12204172 -12318938 -6428612 -8223173 -16527336 -18547876 -11003109 -2964282
34620 -2964282 -553316 -1919390 -5288232 -10045372 -11390959 -4936951 4381441 7631312
34612 7631312 4702582 2858028 4526217 5663710 4334705 1972396 -1868978 -7254331
34604 -7254331 -8890248 -2565907 6071932 8640972 6876645 8061329 10982168 8618225
34596 8618225 2555116 1164948 3881515 1442476 -6757214 -9868064 -3697512 1964537
$$ packed form
34652a038300o064135k754423m391903l297343M385546Q907320M263948J14580
34644A25290M353785Q095192J806607o866952o696546k109605k419628l331983
34636g043840K706535Q217499K780400n492267k247241O435755L189533r321910
34628g75536j1428636j14766N890326j794561q304163k020540P544767Q038827
34620b964282K410966j366074l368842m757140j345587O454008R318392L249871
34612G631312k928730j844554J668189J137493j329005k362309l841374n385353
34604g254331j635917O324341Q637839K569040j764327J184684K920839k363943
34596H618225o063109j390168K716567k439039q199690l110850O170552N662049
$$ plain form
34588 1964537 -657214 -6567818 -9580151 -12696137 -18870664 -21981288 -16682227 -9147835
34580 -9147835 -8122226 -11385101 -10562990 -4496814 1453452 5615037 10212914 13781974
34572 13781974 12482107 8316054 7709411 10999624 10432669 939486 -12176418 -19073116
34564 -19073116 -15938692 -7668333 -1801615 -1427649 -3578420 -3917500 -2401528 -3011388
34556 -3011388 -7695677 -12691907 -12410707 -5869025 2024347 5045427 1165657 -5525770
34548 -5525770 -8303727 -4304293 2731017 7205781 7665313 5966364 2804079 -1587728
34540 -1587728 -3556701 1339482 10884254 16641922 14016464 7748539 5142398 7423226
34532 7423226 10110195 8809551 2437885 -6550887 -13227812 -13865941 -9786062 -5197555
$$ packed form
34588A964537k621751n910604l012333l115986o174527l110624N299061P534392
34580i147835J025609l262875Q22111O066176N950266M161585M597877L569060
34572A3781974j299867m166053o06643L290213n66955r493183j3115904o896698
34564a9073116L134424Q270359N866718L73966k150771l39080J515972o09860
34556c011388m684289m996230K81200O541682P893372L021080l879770o691427
34548e525770k777957L999434P035310M474764M59532j698949l162285m391807
34540a587728j968973M896183R544772N757668k625458o267925k606141K280828
34532G423226K686969j300644o371666q988772o676925o38129M079879M588507
$$ plain form
34524 -5197555 -1304692 3529824 7833293 6958306 612280 -5274966 -6832408 -6828471 -7818375
34515 -7818375 -6726479 -989873 5153309 6209385 3187609 253997 -2341421 -5753806
34507 -5753806 -6791106 -2299677 3126257 2085199 -3834819 -5576135 -454873 4110935
34499 4110935 3147092 1996234 6586823 12507513 10945787 1904675 -5931443 -7436955
34491 -7436955 -6122627 -5958365 -4686744 940340 7723384 9085710 3716506 -3865432
34483 -3865432 -10450220 -16060012 -18392145 -12634788 -509913 7175690 3491505 -4032369
34475 -4032369 -3770876 2868855 4897523 566618 186369 7838186 13111771 7666567
34467 7666567 -914261 -1151163 5006759 7835817 6476655 7582098 10951785 9389802
$$ packed form
34524e197555L892863M834516M303469q74987o346026n887246j557442L937r89904
34515g818375J091896N736606O143182J056076l021776k933612k595418l412385
34507e753806j037300M491429N425934j041058n920018j741316N121262M565808
34499D110935r63843j150858M590589N920690j561726r041112p836118j505512
34491g436955J314328J64262J271621N627084O783044J362326n369204p581938
34483c865432o584788n609792k332133N757357J2124875P685603l684185p523874
34475d032369K61493O639731K028668m330905l80249P651817N273585n445204
34467G666567q580828k36902O157922K829058j359162J105443L369687j561983
$$ plain form
34459 9389802 2168473 -3484615 -5273756 -8512786 -13613786 -12850632 -4553382 435790
34451 435790 -5970017 -15933280 -16492519 -7312596 1404931 4312202 4644351 4755540 2533313
34442 2533313 -2107014 -5209093 -5612697 -7639914 -13692894 -18509480 -14701946 -2198903
34434 -2198903 10775582 15844456 12127664 5750377 2649737 2986500 3330138 2652424
34426 2652424 2861052 3601169 1352117 -4059368 -6670574 -2218410 4828717 7134003
34418 7134003 4635767 2983173 3788637 3336992 662113 -316893 1831217 3065536 662461
34409 662461 -2815438 -5082310 -7877175 -11580758 -11764324 -6015188 471438 1657725
34401 1657725 -757016 -1350264 -198950 -1263819 -3705496 -2363888 3172992 6784748
$$ packed form
34459I389802p221329n653088j789141l239030n101000P63154Q297250M989172
34451D35790o405807r963263n59239R179923Q717527K907271L32149J11189k222227
34442B533313m640327l102079m03604k027217o052980m816586L807534J2503043
34434b198903J2974485N068874l716792o377287l100640L36763L43638o77714
34426B652424K08628P40117k249052n411485k611206M452164P047127K305286
34418G134003k498236j652594Q05464m51645k674879r79006K148110J234319k403075
34409F62461l477899k266872k794865l703583j83566N749136O486626J186287
34401A657725k414741n93248J151314j064869k441677J341608N536880L611756
$$ plain form
34393 6784748 4284579 -1815568 -7239045 -10788703 -13089257 -14899145 -17462244 -20182455
34385 -20182455 -18021322 -7052391 6781012 11421401 3446221 -7713239 -13181251 -14747169
34377 -14747169 -16977016 -17149324 -10862616 -2132658 1140401 -1077389 -2109293 307526
34369 307526 2248038 2168702 3181134 6370448 9160115 11059985 14034047 16436721 14169594
34360 14169594 9309805 9426911 15484658 18603540 13241524 5893874 4783159 7689614
34352 7689614 7382100 3854201 2773069 5030176 6289727 5349184 4907240 4501196 616719
34343 616719 -5311237 -6593948 -1343047 3758814 3136074 236718 1531041 6978385
34335 6978385 11531812 13304826 14674784 16086549 14071996 6839023 -1813732 -6526593
$$ packed form
34393F784748k500169o100147n423477l549658k300554j809888k563099k720211
34385b0182455K161133J0968931J3833403M640389p975180j1159460n468012j565918
34377a4747169k229847j72308O286708Q729958L273059k217790j031904K416819
34369C07526J940512p9336J012432L189314K789667J899870K974062K402674k267127
34360A4169594m859789J17106O057747L118882n362016p347650j110715K906455
34352G689614l07514l527899j081132K257107J259551r40543m41944m06044l884477
34343F16719n927956j282711N250901N101861o22740k899356J294323N447344
34335F978385M553427J773014J369958J411765k014553p232973q652755m712861
$$ plain form
34327 -6526593 -6394756 -4571688 -2866043 288635 5721089 10194738 10058561 7137376
34319 7137376 7308410 12471367 17476701 17135698 13101309 10450135 10049808 9077609 7782917
34310 7782917 9726484 14224658 14431557 6457820 -3905344 -8333515 -7118885 -7460444
34302 -7460444 -11357692 -11591498 -2199821 11800870 19368808 15716512 5563390 -4249326
34294 -4249326 -10412636 -11551991 -6847605 896627 5069907 2155981 -3771923 -6943127
34286 -6943127 -7124553 -6360860 -2196031 8055280 17682282 15029564 94244 -12343553
34278 -12343553 -11221756 -3037839 -509095 -4460554 -6195265 -2985117 -162457 581366
34270 581366 3885761 10421065 13649305 9876392 3531719 -724263 -3632121 -5694203
$$ packed form
34327f526593J31837J823068J705645L154678N432454M473649j36177k921185
34319G137376J71034N162957N005334l41003m034389k651174m00327r72199j294692
34310G782917J943567M498174K06899p973737j0363164m428171J214630l41559
34302g460444l897248k33806R391677J4000691P567938l652296j0153122r812716
34294d249326o163310j139355M704386P744232M173280k913926n927904l171204
34286f943127j81426P63693M164829J0251311R627002k652718j4935320j2437797
34278a2343553J121797Q183917K528744l951459j734711L210148K822660P43823
34270E81366L304395O535304L228240l772913o344673m255982k907858k062082
$$ plain form
34262 -5694203 -3771995 1949449 5034220 2756518 2111384 8676647 15689317 13276826
34254 13276826 4166538 -174900 2781427 3548425 -3668603 -11901736 -11818061 -4092254
34246 -4092254 3061098 3913210 -1137233 -8284834 -13014236 -12381268 -7281281 -1124735
34238 -1124735 4258169 8762959 10336645 5976263 -2312590 -7815668 -8077854 -8560847
34230 -8560847 -13565400 -18332667 -15656555 -6890055 96497 2227587 3801179 7763346
34222 7763346 10982675 10270262 7699451 6480948 5372627 1401738 -4075998 -6723748
34214 -6723748 -6344391 -8089476 -14546305 -19876068 -15737072 -2449463 9611607 11216004
34206 11216004 3984798 -3381167 -5935675 -5763263 -6033880 -7004903 -8601225 -11891534
$$ packed form
34262e694203J922208N721444L084771k277702o45134O565263P012670k412491
34254A3276826r110288m341438K956327P66998p217028q233133Q3675P725807
34246d092254P153352Q52112n050443p147601m729402O32968N099987O156546
34238a124735N382904M504790J573686m360382q288853n503078k62186m82993
34230h560847n004553m767267K676112Q766500O986552K131090J573592L962167
34222G763346L219329p12413k570811j218503j108321l970889n477736k647750
34214f723748L79357j745085o456829n329763M138996J3287609J2061070J604397
34206A1216004p231206p365965k554508J72412k70617r71023j596322l290309
$$ plain form
34198 -11891534 -15535497 -14930914 -8419261 -1235937 753729 -958303 -214351 4407207
34190 4407207 7683958 5529904 492837 -2076804 -617484 1717461 1569548 -351524
34182 -351524 333727 6343150 13907450 15807327 10599523 5512794 7024928 11847878
34174 11847878 12304014 8221849 6561677 9428483 10127618 3924448 -3610162 -3746125
34166 -3746125 3638369 10030175 8288105 -469405 -8694314 -9262701 -2240651 4148472
34158 4148472 2020574 -6018912 -9510963 -4292646 2026151 2329047 983947 5564818
34150 5564818 12658875 11513812 289194 -10837702 -13680646 -10502060 -6332102 -1530116
34142 -1530116 3590995 4463090 -726426 -5147343 -1978286 4426162 3863615 -4718014
$$ packed form
34198a1891534l643963O04583O511653P183324J989666j712032P43952M621558
34190D407207L276751k154054n037067k569641J459320K334945j47913j921072
34182c51524O85251O009423P564300J899877n207804n086729J512134M822950
34174A1847878M56136m082165j660172K866806O99135o203170p534610j35963
34166c746125P384494O391806j742070q757510q224909n68387P022050O389123
34158D148472k127898q039486l492051N218317O318797L02896j345100M580871
34150E564818P094057j145063j1224618j1126896k842944L178586M169958M801986
34142a530116N121111Q72095n189516m420917L169057O404448n62547q581629
$$ plain form
34134 -4718014 -11412489 -8936085 -682025 6576966 10956866 12812536 10095231 2132676
34126 2132676 -5834354 -7977580 -5536875 -3536489 -2043262 2327492 7219277 5590033
34118 5590033 -2067152 -5406975 739596 6648616 841520 -12403060 -18264086 -11650849
34110 -11650849 -2204095 1068183 155360 408388 1719005 2315138 4111813 8203779
34102 8203779 10407523 7505956 3713662 4624589 8048205 7321721 1394306 -4680257
34094 -4680257 -7624257 -8166134 -6594247 -2314975 2413613 3886401 2047642 -729071
34086 -729071 -5060110 -12779317 -20163937 -19970583 -11722698 -3690688 -2197641 -4188353
34078 -4188353 -2989536 3161746 10944193 16265575 16368475 11219144 4702169 1062727
$$ packed form
34134d718014o694475K476404Q254060P258991M379900J855670k717305p962555
34126B132676p967030k143226K440705K000386J493227M370754M891785j629244
34118E590033p657185l339823O146571N909020n807096j3244580n861026O613237
34110a1650849R446754L272278r12823K53028J310617N96133J796675M091966
34102H203779K203744k901567l792294R10927L423616p26484n927415o074563
34094d680257k944000n41877J571887M279272M728588J472788j838759k776713
34086g29071m331039p719207p384620J93354Q247885Q032010J493047j990712
34078d188353J198817O151282P782447N321382J02900n149331o516975l639442
$$ plain form
34070 1062727 -702439 -4557779 -9211670 -8686466 -3025753 -870021 -6910913 -13729458
34062 -13729458 -12505503 -6193107 -4219114 -7944854 -10156137 -7472152 -4489579 -4649178
34054 -4649178 -4680257 -1195895 2707304 1572634 -4356673 -8620923 -5605586 3334970
34046 3334970 10785950 10370508 3330952 -2733199 -2208369 2936740 6712628 6090445 2862425
34037 2862425 722768 2409920 7707089 12614946 13026633 10598017 10999849 14167658
34029 14167658 11929338 133525 -12299446 -13734260 -5480506 1331396 2185974 2863827
34021 2863827 6990675 10232503 9462112 8339061 9251657 7712877 691100 -5822929
34013 -5822929 -4353272 3215623 8754159 8870642 6914544 6379623 8048204 12071906
$$ packed form
34070A062727j765166l855340m653891N25204N660713K155732o040892o818545
34062a3729458J223955O312396J973993l725740k211283K683985K982573j59599
34054d649178l1079L484362L903199j134670n929307m264250L015337Q940556
34046C334970P450980m15442p039556o064151N24830N145109L775888o22183l228020
34037B862425k139657J687152N297169M907857M11687k428616M01832L167809
34029A4167658k238320j1795813j2432971j434814Q253754O811902Q54578O77853
34021B863827M126848L241828p70391j123051R12596j538780p021777o514029
34013e822929J469657P568895N538536J16483j956098n34921J668581M023702
$$ plain form
34005 12071906 17331968 19595339 15411810 7390857 980711 -3201269 -8359234 -12991981
33997 -12991981 -10179457 1776240 13516212 14467286 5926837 -657318 2077856 9310487
33989 9310487 11252798 4963260 -3642637 -7798482 -6792533 -4801440 -5266208 -7563046
33981 -7563046 -8159627 -4466399 1641368 4461521 545950 -6015411 -7364576 -1474704
33973 -1474704 5745341 9140579 10078764 10646285 8123427 1166936 -3685989 -69031
33965 -69031 6972777 7393576 1823191 -341283 1707400 -2034652 -13923949 -21669837
33957 -21669837 -17004297 -8879411 -7800549 -7975170 1469680 15650265 20243958 14558202
33949 14558202 11791920 16520808 17979033 9296092 -717726 -1312567 5594812 11267558
$$ packed form
34005A2071906N260062K263371m183529q020953o410146m181980n157965m632747
33997a2991981K812524J1955697J1739972R51074q540449o584155K735174P232631
33989I310487J942311o289538q605897m155845J005949J991093m64768k296838
33981g563046n96581L693228O107767K820153l915571o561361j349165N889872
33973a474704P220045L395238R38185N67521k522858o956491m852925L616958
33965f9031P041808M20799n570385k164474K048683l742052j1889297p745888
33957b1669837M665540Q124886J078862j74621R444850J4180585M593693n685756
33949A4558202k766282M728888J458225q682941j0013818n94841O907379N672746
$$ plain form
33941 11267558 11816918 7705082 -368670 -8355786 -8724212 -523051 6410449 4264795
33933 4264795 -1320047 -81136 7569394 12355641 9802937 3738104 -1913058 -6878646
33925 -6878646 -10613404 -11438107 -9972544 -8463054 -7112733 -5291720 -4636556 -5989929
33917 -5989929 -5479446 257762 6774770 6791102 1597731 -61400 5244119 11700789 14395690
33908 14395690 15383976 16593407 14395186 6674276 -365299 794371 7876611 10904042
33900 10904042 4996464 -3727043 -6175308 -1197430 3635690 1398359 -6259183 -12216835
33892 -12216835 -13511850 -13637340 -14292080 -10757594 -309935 9759535 10253931 3529968
33884 3529968 38723 2360577 2524257 -3625633 -9819671 -10701102 -9774392 -10438138 -8353875
$$ packed form
33941A1267558N49360m111836q073752p987116l68426Q201161O933500k145654
33933D264795n584842J238911P650530M786247k552704o064833n651162m965588
33925f878646l734758q24703J465563J509490J350321J821013O55164j353373
33917e989929N10483N737208O517008J6332n193371j659131N305519O456670K694901
33908A4395690R88286J209431k198221p720910p039575J159670P082240L027431
33900A0904042n907578q723507k448265M977878M833120k237331p657542n957652
33892a2216835j295015j25490o54740L534486J0447659J0069470M94396o723963
33884C529968l491245K321854J63680o149890o194038q81431R26710o63746K084263
$$ plain form
33875 -8353875 -286353 7400578 8002982 5801773 8408534 13060873 11449908 4731614
33867 4731614 1992709 4871986 5255637 -703568 -6845516 -7573820 -4680970 -756064
33859 -756064 5128591 11376470 12115821 6307944 998956 367364 -973068 -7587964 -13488150
33850 -13488150 -11096484 -4598737 -4768453 -12878469 -18875606 -15539820 -6818470 -804490
33842 -804490 -469919 -3218550 -5131663 -3862432 -457298 779132 -3002090 -8479157
33834 -8479157 -9375368 -4693367 -404975 -2053754 -8327912 -12827243 -10404044 -1944301
33826 -1944301 5162102 2552831 -9741382 -20414322 -17773294 -3543479 8794292 9948917
33818 9948917 3849332 -771485 -1755550 -2385841 -3552089 -2891885 14366 2568400 2960138
$$ packed form
33875h353875Q067522P686931O02404k201209K606761M652339j610965o718294
33867D731614k738905K879277L83651n959205o141948p28304K892850L924906
33859g56064N884655O247879P39351n807877n308988o31592j340432o614896n900186
33850a3488150K391666O497747j69716q110016n997137L335786Q721350O013980
33842h04490L34571k748631j913113J269231L405134J236430l781222n477067
33834h479157q96211M682001M288392j648779o274158m499331K423199Q459743
33826a944301P106403k609271j2294213j0672940K641028J4229815J2337771J154625
33818I948917o099585m620817r84065o30291j166248O60204K906251K554034L91738
$$ plain form
33809 2960138 1607020 -671991 -2930958 -3352948 -1276551 832608 432591 -1235431
33801 -1235431 -1850891 -3064969 -7823173 -13238321 -12535141 -5726389 -1934292 -7118299
33793 -7118299 -14610555 -13406453 -2845223 6709056 6469298 -2589355 -13301870 -18863248
33785 -18863248 -15723545 -5254092 5595496 8931198 3283863 -5492596 -10937548 -11069783
33777 -11069783 -7274291 -2236229 380798 -1573695 -5221150 -5473833 -2360330 -835118
33769 -835118 -1969784 -564734 5144966 8099768 2842620 -3949324 -1475403 9453628
33761 9453628 17334085 16037535 11454155 10621080 12125588 10968436 6818263 2615451
33753 2615451 -891616 -4150001 -4844853 -180821 7194581 9978871 4695004 -3009777
$$ packed form
33809B960138j353118k279011k258967m21990K076397K109159m00017j668022
33801a235431o15460j214078m758204n415148P03180O808752L792097n184007
33793g118299p492256J204102J0561230R554279k39758r058653j0712515n561378
33785a8863248L139703J0469453J0849588L335702n647335q776459n444952j32235
33777a1069783L795492N038062K617027j954493l647455k52683L113503J525212
33769h35118j134666J405050N709700K954802n257148o791944K473921J0929031
33761I453628P880457j296550m583380q33075J504508j157152m150173m202812
33753B615451l507067l258385o94852M664032P375402K784290n283867p704781
$$ plain form
33745 -3009777 -4271942 1925114 6533895 1625500 -8442127 -11892551 -5252879 2534558
33737 2534558 4169705 4152266 8305926 10423112 538954 -16657794 -24489525 -16580976
33729 -16580976 -4767596 -1147265 -3240633 -3027765 -864412 -1605816 -3712511 -1853137
33721 -1853137 3275718 6175931 5442862 4204442 3321118 928607 -2043511 -1949532 1886829
33712 1886829 5848883 5872380 -369204 -12581952 -25186044 -28824886 -20010773 -6752321
33704 -6752321 966058 3444975 7490127 13272299 13546172 5409942 -5569924 -13869578
33696 -13869578 -18965120 -20534981 -16751320 -10075781 -7230506 -9420681 -9202984 -1881651
33688 -1881651 5999487 5802980 -17697 -1388914 4453445 9043905 5123648 -2851437
$$ packed form
33745c009777j262165O197056M608781m908395j0067627l450424O639672P787437
33737B534558J635147j7439M153660K117186r884158j7196748p831731P908549
33729a6580976J1813380L620331k093368K12868K163353p41404k106695J859374
33721a853137N128855K900213p33069j238420q83324k392511k972118R3979L836361
33712A886829L962054K3497o241584j2212748j2604092l638842Q814113J3258452
33704f752321P718379K478917M045152N782172K73873q136230j0979866q299654
33696a3869578n095542j569861L783661O675539K845275k190175K17697P321333
33688a881651P881138j96507n820677j371217N842359M590460l920257p975085
$$ plain form
33680 -2851437 -4498902 2979604 11604254 13134505 8792799 5791445 6930022 8572730
33672 8572730 8462844 9414754 12903056 14640408 10806334 4140582 -1050034 -5504708
33664 -5504708 -10599561 -11769867 -4581928 5295942 7491840 1737950 -1813435 2266768
33656 2266768 8323317 10372907 10313723 11756551 13303720 12444615 10323600 9006976 9117271
33647 9117271 12173355 18817807 23085992 17061631 4479585 -18759 9302429 19777158
33639 19777158 17946719 7378962 -359039 -3662595 -7727548 -10306492 -5186520 3271100
33631 3271100 3974484 -2427779 -3039320 6914338 16611810 17212210 14389969 16036204 18300281
33622 18300281 13853715 6309444 4992476 9443186 10417570 5228934 1415725 3402567
$$ packed form
33680b851437j647465P478506Q624650J530251m341706l001354J138577J642708
33672H572730j09886R51910L488302J737352l834074o665752n190616m454674
33664e504708n094853j170306P187939R877870K195898n753890l551385M080203
33656B266768O056549K049590n9184J442828J547169q59105k121015j316624J10295
33647I117271L056084O644452M268185o024361j2582046m498344R321188J0474729
33639A9777158j830439j0567757p738001l303556m064953k578944N119972Q457620
33631C271100P03384o402263o11541R953658R697472O00400k822241J646235K264077
33622A8300281m446566p544271j316968M450710R74384n188636l813209J986842
$$ plain form
33614 3402567 5041625 24571 -7466527 -8965475 -4261923 -597961 -1000454 -719730
33606 -719730 3565592 7514234 5728474 30703 -3682390 -4150453 -5021041 -7487831 -8123983
33597 -8123983 -4979437 -1494635 -2291482 -7436306 -12205381 -11260099 -3367014 6374164
33589 6374164 10579035 8505316 8289119 15807911 24458763 23202791 12778882 4597296
33581 4597296 3505690 2349408 -3868179 -9664612 -9965192 -8578272 -8890930 -6379872
33573 -6379872 919652 4377311 -1949459 -8901768 -5996612 -17014 -4540099 -16056420
33565 -16056420 -17764976 -5792039 5557826 6435638 3136896 3276937 4466192 3726982
33557 3726982 4552948 7269457 4504085 -5551718 -12210816 -7429360 1732742 4850525
$$ packed form
33614C402567J639058n017054p491098j498948M703552L663962m02493K80724
33606g19730M285322L948642j785760n697771l713093m68063q70588k466790o36152
33597h123983L144546L484802p96847n144824m769075R45282P893085R741178
33589F374164M204871k073719k16197P518792Q650852j255972j0423909q181586
33581D597296j091606j156282o217587n796433l00580J386920l12658K511058
33573f379872P299524L457659o326770o952309K905156N979598m523085j1516321
33565a6056420j708556J1972937J1349865Q77812l298742J40041J189255p39210
33557C726982Q25966K716509k765372j0055803o659098M781456R162102L117783
$$ plain form
33549 4850525 3333616 4067817 6157611 5159244 3962105 7631408 11988553 9080516
33541 9080516 1261931 -1296925 4222503 10750308 13284087 13840391 14241275 12648973
33533 12648973 8444531 3699846 -677114 -4441834 -4890091 -952590 1491922 -3283642
$$ packed form
33549D850525j516909P34201K089794r98367j197139L669303M357145k908037
33541I080516p818585k558856N519428O527805K533779N56304M00884j592302
33533A2648973m204442m744685m376960l764720m48257L937501K444512m775564
$$ [...]
##END NTUPLES=NMR SPECTRUM
##END=
