##TITLE=1H_x2401-2
 aceton-d6
 8 sc, 
 9.2.2023
##JCAMPDX= 6.0         $$ Bruker NMR JCAMP-DX V2.0
##DATA TYPE= NMR FID
##DATA CLASS= NTUPLES
##ORIGIN= UXNMR, Bruker Analytische Messtechnik GmbH
##OWNER= root
$$ XWIN-NMR		Version 3.5
$$ Thu Feb  9 15:37:02 2023 Russian Standard Time (UT+4h)  she@DPX200
##.OBSERVE FREQUENCY= 200.13135
##.OBSERVE NUCLEUS= ^1H
##.DELAY= (6, 6)
##.ACQUISITION MODE= SIMULTANEOUS
##.ACQUISITION SCHEME= undefined
##.AVERAGES= 8
##.DIGITISER RES= 18
##SPECTROMETER/DATA SYSTEM= spect
##.PULSE SEQUENCE= zg30
##.SOLVENT NAME= Acetone
##.SHIFT REFERENCE= (INTERNAL, Acetone, 0, 15.7039)
##AUDIT TRAIL= $$ (NUMBER, WHEN, WHO, WHERE, WHAT)
$$ ##TITLE= Audit trail, XWIN-NMR		Version 3.5
$$ ##JCAMPDX= 5.01
$$ ##ORIGIN= Bruker BioSpin GmbH
$$ ##OWNER= she
$$ F:/spectra/data/she/nmr/H-F/1/audita.txt
$$ ##AUDIT TRAIL=  $$ (NUMBER, WHEN, WHO, WHERE, WHAT)
(   1,<2023-02-09 15:34:42.51 +0400>,<she>,<DPX200>,
      <created by zg, POWCHK disabled, PULCHK disabled
       configuration hash MD5:
       00 E9 B6 7A A2 85 ED C7 34 08 36 98 17 FE 4E 26
       data hash MD5: 16K
       EE B6 57 5A 4B 82 80 9B 5E E4 57 3A ED 09 0F D4>)
$$ ##END=
$$ 
$$ hash MD5
$$ AC 15 BA 68 CB 49 49 B7 5E 75 87 E8 EB AA C8 20
##$RELAX= 
##$RELAX= 
##$RELAX= 
##$RELAX= 
##$RELAX= 
##$RELAX= 
$$ Bruker specific parameters
$$ --------------------------
##$DU= <F:/spectra>
##$EXPNO= 1
##$NAME= <H-F>
##$PROCNO= 1
##$TYPE= <nmr>
##$USER= <she>
##$AMP= (0..31)
100 100 100 100 100 100 100 100 100 100 100 100 100 100 100 100 100 100 
100 100 100 100 100 100 100 100 100 100 100 100 100 100 
##$AQSEQ= 0
##$AQ_mod= 1
##$AUNM= <au_zg>
##$AUTOPOS= <>
##$BF1= 200.13
##$BF2= 200.13
##$BF3= 200.13
##$BF4= 200.13
##$BF5= 200.13
##$BF6= 200.13
##$BF7= 200.13
##$BF8= 200.13
##$BYTORDA= 1
##$CFDGTYP= 0
##$CFRGTYP= 5
##$CHEMSTR= <none>
##$CNST= (0..31)
1 1 145 1 1 1 1 1 1 1 1 1 1 1 1 1 1 1 1 1 1 1 1 1 1 1 1 1 1 1 1 1 
##$CPDPRG= <>
##$CPDPRG1= <>
##$CPDPRG2= <>
##$CPDPRG3= <>
##$CPDPRG4= <mlev>
##$CPDPRG5= <mlev>
##$CPDPRG6= <mlev>
##$CPDPRG7= <mlev>
##$CPDPRG8= <mlev>
##$CPDPRGB= <>
##$CPDPRGT= <>
##$D= (0..31)
0 1.2 0 0 0 0 0 0 0 0.06 0 0.03 0 0 0 0 0.0002 0 0 0 0 0 0 0 0 0 0 0 0 
0 0 0 
##$DATE= 1675942482
##$DBL= (0..7)
120 120 120 120 120 120 120 120 
##$DBP= (0..7)
150 150 150 150 150 150 150 150 
##$DBP07= 0
##$DBPNAM0= <>
##$DBPNAM1= <>
##$DBPNAM2= <>
##$DBPNAM3= <>
##$DBPNAM4= <>
##$DBPNAM5= <>
##$DBPNAM6= <>
##$DBPNAM7= <>
##$DBPOAL= (0..7)
0.5 0.5 0.5 0.5 0.5 0.5 0.5 0.5 
##$DBPOFFS= (0..7)
0 0 0 0 0 0 0 0 
##$DE= 6
##$DECBNUC= <off>
##$DECIM= 32
##$DECNUC= <off>
##$DECSTAT= 4
##$DIGMOD= 1
##$DIGTYP= 9
##$DL= (0..7)
0 120 120 120 120 120 120 120 
##$DP= (0..7)
150 150 150 150 150 150 150 150 
##$DP07= 0
##$DPNAME0= <>
##$DPNAME1= <>
##$DPNAME2= <>
##$DPNAME3= <>
##$DPNAME4= <>
##$DPNAME5= <>
##$DPNAME6= <>
##$DPNAME7= <>
##$DPOAL= (0..7)
0.5 0.5 0.5 0.5 0.5 0.5 0.5 0.5 
##$DPOFFS= (0..7)
0 0 0 0 0 0 0 0 
##$DQDMODE= 0
##$DR= 18
##$DS= 0
##$DSLIST= <SSSSSSSSSSSSSSS>
$$ [...]
##$SUBNAM2= <"">
##$SUBNAM3= <"">
##$SUBNAM4= <"">
##$SUBNAM5= <"">
##$SUBNAM6= <"">
##$SUBNAM7= <"">
##$SUBNAM8= <"">
##$SUBNAM9= <"">
##$SW= 18.05172834244
##$SWIBOX= (0..15)
0 0 2 0 0 0 0 0 0 0 0 0 0 0 0 0 
##$SW_h= 3612.71676300578
##$TD= 16384
##$TD0= 1
##$TE= 0
##$TE2= 300
##$TE3= 300
##$TEG= 300
##$TL= (0..7)
0 120 120 120 120 120 120 120 
##$TP= (0..7)
150 150 150 150 150 150 150 150 
##$TP07= 0
##$TPNAME0= <>
##$TPNAME1= <>
##$TPNAME2= <>
##$TPNAME3= <>
##$TPNAME4= <>
##$TPNAME5= <>
##$TPNAME6= <>
##$TPNAME7= <>
##$TPOAL= (0..7)
0.5 0.5 0.5 0.5 0.5 0.5 0.5 0.5 
##$TPOFFS= (0..7)
0 0 0 0 0 0 0 0 
##$TUNHIN= 0
##$TUNHOUT= 0
##$TUNXOUT= 0
##$USERA1= <user>
##$USERA2= <user>
##$USERA3= <user>
##$USERA4= <user>
##$USERA5= <user>
##$V9= 5
##$VALIST= <valist>
##$VCLIST= <CCCCCCCCCCCCCCC>
##$VD= 0
##$VDLIST= <DDDDDDDDDDDDDDD>
##$VPLIST= <PPPPPPPPPPPPPPP>
##$VTLIST= <TTTTTTTTTTTTTTT>
##$WBST= 1024
##$WBSW= 4
##$XGAIN= (0..3)
0 0 0 0 
##$XL= 0
##$YL= 0
##$YMAX_a= 246819
##$YMIN_a= -213402
##$ZGOPTNS= <>
##$ZL1= 120
##$ZL2= 120
##$ZL3= 120
##$ZL4= 120
##$ABSF1= 10
##$ABSF2= 0
##$ABSG= 5
##$ABSL= 3
##$ALPHA= 0
##$AQORDER= 0
##$ASSFAC= 0
##$ASSFACI= 0
##$ASSFACX= 0
##$ASSWID= 0
##$AUNMP= <proc_1d>
##$AZFE= 0.1
##$AZFW= 0.1
##$BCFW= 1
##$BC_mod= 2
##$BYTORDP= 1
##$COROFFS= 0
##$CY= 11.3945322036743
##$DATMOD= 1
##$DC= 2
##$DFILT= <>
##$DTYPP= 0
##$F1P= 2.36226072786647
##$F2P= -0.459571619588291
##$FCOR= 0.5
##$FTSIZE= 0
##$FT_mod= 4
##$GAMMA= 1
##$GB= 0.15
##$INTBC= 1
##$INTSCL= 1
##$ISEN= 128
##$LB= 0.24
##$LEV0= 0
##$LPBIN= 0
##$MAXI= 10000
##$MC2= 0
##$MEAN= 0
##$ME_mod= 0
##$MI= 1.114404
##$NCOEF= 0
##$NC_proc= 0
##$NLEV= 6
##$NOISF1= 3.799351
##$NOISF2= 2.8
##$NSP= 1
##$NTH_PI= 0
##$NZP= 0
##$OFFSET= 15.70392
##$PC= 1
##$PHC0= -19187.5
##$PHC1= 6.00078
##$PH_mod= 1
##$PKNL= yes
##$PPARMOD= 0
##$PSCAL= 0
##$PSIGN= 0
##$REVERSE= no
##$SF= 200.130013532006
##$SI= 16384
##$SIGF1= 3
##$SIGF2= 2
##$SINO= 400
##$SIOLD= 16384
##$SREGLST= <1H.CDCl3>
##$SSB= 0
##$STSI= 0
##$STSR= 0
##$SW_p= 3612.71676300578
##$SYMM= 0
##$S_DEV= 0
##$TDeff= 0
##$TDoff= 0
##$TI= <>
##$TILT= no
##$TM1= 0
##$TM2= 0
##$TOPLEV= 0
##$USERP1= <user>
##$USERP2= <user>
##$USERP3= <user>
##$USERP4= <user>
##$USERP5= <user>
##$WDW= 1
##$XDIM= 8192
##$YMAX_p= 0
##$YMIN_p= 0
$$ End of Bruker specific parameters
$$ ---------------------------------
##NTUPLES= NMR FID
##VAR_NAME=  TIME,          FID/REAL,        FID/IMAG
##SYMBOL=    X,             R,               I
##VAR_TYPE=  INDEPENDENT,   DEPENDENT,       DEPENDENT
##VAR_FORM=  AFFN,          ASDF,            ASDF
##VAR_DIM=   8192,          8192,            8192
##UNITS=     SECONDS,       ARBITRARY UNITS, ARBITRARY UNITS
##FACTOR=    0.0002768,     1,               1
##FIRST=     0,             0,               0
##LAST=      2.2672688,     0,               0
##MIN=       0,             -213402,         0
##MAX=       2.2672688,     246819,          0
$$ Real data points
##PAGE= N=1
##DATA TABLE= (X++(R..R)), XYDATA
$$ [...]
1264c07p51P54J769j393p11k41J506M62j441o37P38J444p72j300J67J173N66j053
1282b7j340J469N98K94k344R98N93O94p60j609J597J48J107k894R91Q45M95o70
1300A85j605J702j42J150k204j25J719q4K7k491K433l79P81j471p77K172p19J013
1318A185l348K686j94N58j337q40K248r44J171k972J815N54J01q22j463K636r43
1335I1P93k188Q45J388o94J61k359L070j006P30j957M56J771r97M20k439K863
1352I48o66M04j601J38J820p95J11j924J994L54m98q45m66K137q94Q4j573J281
1370IR94q48n20q40K342q68n3j368J122Q55m70q31n29J694Mp46r57R13Q64k53
1390E14j234J25Q44P47j185o11N18J044q4j493K41Q53O48r89q93R89K93O14j685
$$ y = [-307, -1058, -304, 1465, 72, -639, -880, 626, 1088, -353, -990, -252, 1192, 420, -880, -713, 460, 1026, -27, -1367, 102, 700, 994, -1350, -352, 241, 935, 175, -1434, 163, 311, 1418, -1476, -485, 360, 855, 185, -1420, 282, 140, 1290, -914, -1039, 680, 596, 623, -1868, 565, 186, 967, -504, -1281, 891, 172, 1185, -2163, 523, 329, 887, -450, -1290, 958, 14, 1185, -1787, 28, 582, 683, -139, -1602, 1034, 91, 884, -1304, -459, 929, 235, 396, -1963, 1107, 101, 831, -1126, -670, 1101, 104, 524, -1915, 948, 282, 686, -915, -777, 1043, 248, 359, -1565, 429, 783, 285, -560, -1026, 1111, 217, 301, -1272, 9, 1003, 155, -365, -1205, 1137, 269, 216, -1152, -30, 825, 355, -476, -1005, 689, 693, -53, -1010, -97, 767, 514, -720, -595, 249, 996, -189, -800, -282, 762, 678, -815, -574, 279, 927, -62, -955, 34, 327, 941, -744]
1409g44R2Q55N94l58k053K199o20J139k058O11L89L68O38k987K425m98J363k600
1427a245Q00J112j000J632k904J880n73J895k240j045L414k302J738k990K870
1442A042j776J592Ql427M105j917K210m716M184j028q46J952l358L097k258L989
1458B853n393K008K518k867J605k733M385m649M341k259k100M151k077J729n539
1473d027P545m626R04J060k332K609k551N185q403O233l23j943L93p92L924o570
1489c714P579n934J126K339p79n01l993R297q682M256j121nL7m63M267r904J0176
1506C981m169K00j886K889R05o130R227q812M643o95J795m078nP907j0555O905
1522B122l205K431l267L344O21q168J1678p053J898l333O496m031k731Q363r820
$$ y = [-744, -652, 203, 797, 439, -1614, 585, -35, 1104, -954, -343, 46, 414, 1052, -1935, 490, -8, 1355, -1245, -445, 667, -333, 1299, -1605, 275, -298, 1597, -643, -1688, 1726, -576, 1162, -1828, 1042, -734, 858, 866, -2561, 1544, -373, 1837, -2879, 1305, 277, -569, 1383, -1975, 1122, -1136, 2853, -2540, -532, 1986, -881, 724, -2009, 2376, -2273, 2068, -191, -2291, 1860, -217, 1512, -4027, 3518, -1108, -204, 856, -1476, 1133, -1418, 3767, -4636, 1597, 1274, -669, -276, -1068, 2856, -3714, 3865, -2069, -943, 1396, 617, 116, -3877, 5420, -3262, 994, -127, -132, -95, -558, 3709, -6195, 3981, -188, 12, -1874, 1015, 1920, -4210, 5017, -3795, 848, 153, 1948, -2130, -2135, 5772, -4783, 2122, -1083, 1348, -1919, 1425, 2046, -6122, 5556, -1497, 401, -2932, 3564, -467, -3198, 5165, -4655]
1537d655O734k876L911p756N522L551r692Q065m380L961o089P552m682l391R976
1552E751q237L013l833Q997r256K727M716q240O855l706M816j0192J0839k455
1566A795o185O894l594L567p218J0503r330K173N730o579K210k432Q751j2083
1580e798P586k2m744M896k521L152r139J3186p861j516M627j841J124n249J0400
1595F280j1846O994R11l866L89N48N917j2143J0667m300n51J517J1L78o082J2356
1611G180j0793K980J218P91k015j830P832j1380R488l303n68j736L723J524r316
1626f205J0890o501K384j493K712k792j730Q719j0444N132p94K298m431J854L668
1641C267q073Q719n087J295k369N279k578m693Q461o404L392k741L921m793K236
$$ y = [-4655, 2079, -797, 3114, -4642, 880, 4431, -5261, 2804, -1576, 2385, -3704, 3848, -834, -4225, 5751, -2486, 527, -3306, 5691, -3565, -838, 3878, -4362, 2493, -1213, 3603, -6589, 4250, 1795, -4390, 2504, -1090, 2477, -4741, 5762, -3568, -1395, 4335, -2244, -34, -2466, 6285, -5798, 1788, 1766, -2978, 1918, -603, 2549, -6590, 6596, -1265, -2781, 1846, 5, 1129, -4120, 6280, -5566, 1428, 2339, -1527, -1138, -590, 5327, -6816, 3851, -449, -1000, 517, 528, 906, -5176, 7180, -3613, -633, 585, 1376, -639, -2469, 5363, -6017, 3471, 168, -400, -2136, 1587, 3111, -6205, 4685, -1816, 568, -925, 1787, -1005, -2735, 5984, -4460, 672, -122, 2176, -2255, -401, 3267, -4806, 3913, -1174, 121, -2248, 3031, 453, -4240, 4221, -2183, 1209, -1532, 2389, -2404, -168]
1656a68L960p858N309j525K638n617M612j72l957N802m620K138k567N592n116
1671a549m46M839m415K710k847M076n174M448l41m112M005j244J767m950N481
1686B248k661m44K436k792J513j409M084n422K150J817k212J144j588K772l691
1701b055M102k388j073K298n98M59l095M448l002J202m4q78P26k78J916m046K922
1718F16l9n53l30j90J412j974K537k513O73Q43Jn47j327K852k154J315j158M18
1736a18K23K29J66k005K350o60O0q77N88M75n64O53j391R72L80k20p22q1J373
1755H31r45K99p67O24L34j91l78m99J292l81k14n73O03L61k29m37j54O32L07o95
1775a80j75J88O50k63n58N1L51N94r37J5O7O57k03o03J13K33O19o84m22M48L32
$$ y = [-168, 3792, -4066, 1243, -282, 2356, -3261, 1351, 1179, -2778, 3024, -1596, 542, -2025, 3567, -1549, -1995, 2844, -1571, 1139, -1708, 2368, -2806, 1642, 1301, -2811, 1194, -50, 1717, -3233, 2248, -413, -857, 1579, -1213, 300, -1109, 2975, -2447, -297, 1520, -692, 452, -1136, 1636, -2055, 2047, -341, -1414, 884, 286, 745, -2350, 2098, -904, 298, 254, -624, 102, -176, 1740, -2306, 616, 577, 24, -306, -496, 916, -1058, 1479, -1034, -361, 482, 483, -64, -1391, 1461, -693, 622, -536, -118, 105, 334, 500, -1505, 845, 185, 245, -632, -44, 431, -133, 520, -871, 101, 481, 261, -461, -542, 831, -114, 185, -582, 42, 376, 185, -193, -692, 600, 219, 5, -568, 35, 396, 167, -270, -424, 208, 515, -180, -355, -167, 483, 220, -338, -287, 64, 658, -279, -264, -197, 460, 257, -346, -233, 0, 619, -65, -487, -39, 293]
1796B93J67j022N25p9O19l90p04O21MP32j541P83j17O03m37n97O28k02R10j390
1816e94L70K51L80k16q87R32l56P59r80p0O06n4M11j498J277m53P27q88j48P09
1836B78k93P03j603J144k95O18p39l42Q14k92N71j272O94J46J77k16q48J147m60
1855f8O07j136M12M56j29J23j133J346n93O68j076L10M77p4N4j022J091k29L06
1874C90p47N2N93j39J18q71O62K32m8m44k68Q89l75K39q67N95K11M8m36l31Q42
1895C45k03N5p48N90J21J60n52j10M52K38k79m76L05L35Q9n56m9L37L14k97m28
1916c57K36K98J88n39j86M51J90l3q31P20j49M43o79NK23J98L12j285R59k12O15
1937E67j014L10K35j53N96j159O41j58Q35j009k34J052p18P00j086Q54n94Q58
$$ y = [293, 460, -562, -37, -116, 503, 113, -591, 30, 34, 766, -775, 8, -109, 494, 57, -540, 88, -114, 796, -594, -224, 27, 407, 191, -696, 236, -120, 639, -341, -411, 195, 141, 552, -946, 331, -122, 605, -283, -431, 278, -15, 688, -915, 229, -66, 552, -187, -529, 285, -7, 564, -708, -14, 132, 309, 93, -755, 392, -68, 539, -597, -185, 271, 142, 265, -868, 478, -115, 553, -523, -213, 264, 190, 244, -778, 313, 84, 390, -357, -305, 288, 149, 267, -604, 58, 290, 242, -202, -470, 419, 44, 283, -584, 11, 222, 270, -166, -497, 345, 142, 197, -551, 39, 160, 320, -232, -342, 110, 348, 69, -407, -102, 233, 322, -234, -283, 54, 368, 71, -357, -121, 177, 365, -174, -360, 91, 281, 248, -583, 137, -12, 431, -248, -243, -20, 178, 490, -795, 164, -48, 567, -447, -137, 98, -55, 541, -618, 23, -135, 700, -309, -543, 509, -209, 491, -595, 259, -335, 523]
1955E23k55j282J603p21Q55j810J702p71J22O33j396J125p18J662k479J246N16
1972E55p95N27r63J424j696K064j435n17J534p29N38j991K908k178R79J40j073
1989g08J044o87J855l605L053p10m21J00k00J114k235L241k987Q95P60j37n07
2006a35j149L308l511K242q77o7R1K10J136l802M434k233M29p32J174j94j728
2023a404L638m162K390l61P74k053P13K509m062L163j666Q74j123J712n13k762
2039b333M704l184J029j189K329j888k71K865m311L290j195J252l097K794N72
2054A367l435L460k092J353j934L106k632o50L765l345J167j166L082l652J751
2069A45J181l244L023j364J370l675M553j732j785K689j696J171k102L878m371
$$ y = [523, 268, -1014, 589, -132, 723, -1087, 615, -156, -34, 599, -797, 328, -390, 1272, -1207, 39, 555, -240, 287, -676, 748, -948, 1116, -319, -836, 698, -31, 507, -1484, 1424, -754, 225, 365, -708, 336, -351, 1504, -2101, 952, 242, -179, -79, -279, 835, -1400, 1841, -1146, -251, 509, 372, -135, -1284, 2024, -1487, 755, -122, -189, -98, 112, 1248, -2554, 1880, -353, 76, -656, 518, 324, -1404, 2234, -1928, 462, 101, 875, -1178, -465, 2044, -2018, 1145, -521, 353, -770, 942, 429, -2333, 2371, -813, 216, -973, 1356, -532, -803, 2062, -2249, 1041, -154, 1098, -1999, 795, 1367, -2068, 1392, -700, 653, -1281, 1825, -807, -1457, 2308, -1037, 130, -1036, 2046, -1606, 145, 1326, -1918, 1105, -259, 1111, -2564, 1989, 257, -1528, 1161, -535, 636, -1466, 2412, -1959]
2084a959J809J837k610P44l88K709m511L546p87j632K083p97N61k984N088l519
2100h10k9J610r25M07j390L430m814L486j63j462J57O20J504m127M341k361R9
2117d27P58J41o32j530M479m355J466L76J69q76n9K283m244M058j612j74o77J731
2135H75p4k903M059l005J359n17J009j666K59K783m021K254m59P58j660J222O08
2152H81k747L562k180M39q15K144j342j344L016k688J662j064J362k066J446J033
2168A299k888K187p50R51j969J942o84j039K245j900O46o85K048k126J28J641
2184A046j775J252j034J301j967J997m15j470J544n62P13j765K055j358K93P90
2200F45j155N24l04J362k034R71M70q06O05o26Q20j232J633r96m60R76l42K79
$$ y = [-1959, -150, 1687, -923, -179, -567, 2142, -2369, 1177, 390, -1242, 841, 44, 605, -2379, 2709, -810, -839, 771, -154, 253, -1137, 2293, -2521, 965, 802, -660, -503, 117, 1621, -2506, 1835, -526, -427, 331, 472, -160, -1690, 2789, -1566, -100, 276, 445, -431, -490, 1793, -2451, 1607, -5, -179, -856, 875, 801, -2102, 1957, -1048, 311, -206, 803, -863, -604, 2179, -1842, 412, -47, 711, -949, 273, 881, -1866, 1696, -484, -45, -860, 1284, -58, -1402, 1614, -1074, 588, -476, 886, -1180, 266, 1299, -1589, 598, -152, 799, -1170, 772, 88, -951, 1294, -606, 40, -645, 1403, -723, -595, 1046, -729, 523, -511, 790, -1177, 820, 405, -1065, 479, -83, 630, -1135, 920, -438, -145, 645, -510, 14, -290, 1072, -962, 9, 479, -327, 278, -348, 472, -760, 873, -123, -583, 393, 51, 330]
2218C30j173J620j213O62n9m73L18k0O46j458J052o7j49k2j89M09n17Q65r03Q9
2238b52N08j45o6n42R67p18N19m00k6K17N6J09p79Q04j84Q3l07Q6J78o8J38m49
2260b71K13L04j82j22j89M97k17N2k30K6L52k12K9l78N23j03n6k00O9K73j07j26
2282e5j03J74K29l13J1j20L51l4k66N2k6M54n40K16k09L74q5j92Nk7M42l97l2
2305i1pK11Q3l63J73j45L90j79k68J86j7L99p06M26k63M13k22j96J81j27N32p14
2327c04L26j53L65j87k41K47j44M10m61M0Q1J17J31n64M85k74M29m06l0J73n6
2348a6L58p32N55l32M90m40rJ61m4K92n84L50j31L00k21k10K91j23L07n02J95
2369d5R1L9K5m32N04l13M40n45J96M9J00K8m61M95k52L41m41J45L2J23J7l85K80
$$ y = [330, -843, 777, -436, 226, 167, -306, 12, -8, 638, -820, 232, 165, 16, -6, -195, 214, -303, 562, -341, -252, 256, 111, 45, -497, 470, -248, 271, -129, -155, 62, 118, 227, -552, 252, 68, 151, -156, -70, 108, 40, 178, -271, -58, 246, 64, -58, -247, 250, 33, 85, -145, -119, 233, 21, 50, -328, 195, 92, 36, -164, -95, 178, 71, -55, -158, 16, 245, -68, -57, -177, 174, 140, -126, -74, -100, 354, -186, 30, -179, 195, 110, -82, -77, -104, 338, -59, -91, -98, 113, 196, -167, 6, -139, 251, 72, -196, -10, -27, 372, -334, 92, -171, 242, 20, -176, 5, -122, 410, -304, 22, -131, 234, 47, -194, 53, -91, 319, -142, -102, -21, 96, 227, -337, 148, -126, 303, -103, -133, 40, -16, 342, -390, 165, -167, 323, -117, -126, 35, -9, 283, -301, 49, -82, 218, -3, -213, 78, -45, 262, -240, -45, 46, 85, 110, -322, 182, -131, 309, -236, -40, 9, 109, 137, -324, 171, -81, 260, -181, -36, -4, 119, 136, -249, 31]
2392C1K3J05k38n5K31p2J40l91K24L8J13k10j57L51j41J71m22L05p9K18k83l8
2414a36J57P2Lk98K21j4J77k72mP8J49o2j92P2R9J05j70j35J88L9P0l53K41n1
2438a6J82j86j13J43J0K28n63M21j80L02l64Q6K6nK79n17K82q9L52m11j6K91k32
2461i0K73l35J88j85L78j21m93O09k81L18o05N89l74J68K19n86M42k27O09j017
2481e21O66n8j47J86k93L32n13Q91p84qM90k23P3n33R57r32O21q5l99L47j15N67
2503E19j356J364o15R1l0pJ71n62J236j450P07O4Q1m21k6Q78j305J137n83K3l4
2524a18L96j3j191J768j142M06l45N40m32j75J163j787J281l98M50j058Q19L21
2542D85j253J420r95M77m84R94q69m42J627j438O35m84R20j116N90N94j642J546
$$ y = [31, 54, 159, -79, -134, 97, 25, 165, -226, -2, 36, 149, -61, -218, 133, -8, 163, -259, 46, -33, 185, -98, -136, 21, 93, 96, -202, 19, 5, 182, -90, -94, -16, 133, 71, -121, -49, 50, 155, -15, -150, 38, 77, 147, -206, 35, -16, 166, -20, -133, 10, 20, 248, -315, 106, -74, 228, -136, -50, -24, -29, 250, -267, 15, -74, 278, -133, -149, 142, -90, 183, -152, 36, -149, 229, 108, -385, 224, -57, 261, -344, 245, -129, 39, 258, -328, 114, -113, 496, -521, 145, 87, -60, 126, -167, 165, -348, 543, -241, -249, 241, 18, 91, -442, 515, -417, 204, 119, -280, 67, -48, 519, -837, 527, -88, 3, -27, -34, 137, -425, 811, -639, 68, 132, 213, -208, -234, 644, -661, 476, -107, -84, -118, 278, 265, -926, 842, -300, 106, -239, 301, -131, -306, 857, -930, 351, -47, 403, -655, 164, 485, -768, 652, -343, 134, -350, 644, -225, -667, 960, -478, 157, -327, 593, -523, 67, 661, -981, 565]
2560E65o79N53j366J593n14q08J337j094O50p21J422j687N81R47j279O13l89R91
2578G15j613J434l30r73J292n74L10j283K116j455RQ62p87M13n53J458k203J551
2596C89M4p78K84K9O69j653J916j162n8O75k51j32p04J947j955P54K54l79P3j22
2616a60R80k070K028p20k82jM76R0j271J922j580O16O5J88o61M5J357j912J169
2635B79k63J21m40N06J88j388J921j146J60k56Q77o37m99J451j555R70l79M88
2653C98j055Q29M57j421J171n04M00p57R43n42m56J280j078L31k81R10j020K15
2671a80P26j106Q97m77M84j021J162k68q04R30m42L63p65J082r36K53N52p09K41
2690a8j35P30j094O52P6m80M85l26L14p14J099p29j42M88k22J57n17Q69r65O78
$$ y = [565, -114, 439, -927, 666, 152, -656, 681, -413, 237, -484, 938, -749, -168, 779, -500, 113, -276, 715, -898, 536, 206, -767, 525, -49, 261, -1022, 1094, -361, -352, 510, -277, 136, -417, 1041, -1162, 389, 433, -345, -61, -32, 637, -1016, 900, -262, -320, 355, 104, -28, -732, 1215, -740, 14, 268, -111, -38, -160, 820, -1250, 778, 58, -224, -225, 251, 341, -930, 992, -588, 28, 93, 281, -380, -335, 1022, -890, 279, 16, 137, -303, 203, 391, -997, 924, -222, -62, -318, 559, -78, -577, 874, -681, 289, -90, 398, -657, 172, 629, -792, 379, -125, 275, -482, 461, -81, -537, 743, -335, -4, -285, 625, -395, -180, 546, -560, 337, -140, 344, -677, 485, 217, -587, 343, -99, 264, -501, 581, -355, -102, 450, -259, -18, -153, 577, -517, 135, 211, -269, 216, -110, 204, -510, 589, -140, -282, 206, -16, 141, -376, 493, -472, 206]
2710B06q3k92Q3Q8L62q65P57l02L3O4q1P8l04P10p07J87J59l0j5k57N29o37O07
2733B90l43l3M3J40P0n28O24l71K18j73Q4p7J7K86m78K37J1P4j55l0K16k51L03
2756A74k98R0L6Q2o8k11L62k48K04k31J39o3J27l8k06J94PJ2j33M4O9j7K2j28
2780g9M7J22p4l6r5K02q9M5j27N1R7k3o6o9J38nl8o1J2Q4J9j18K1J2J59k10R4
2807A3q6J54n9l5j8j6K08k09O1p2J50n2o0J3m3J65j02o7K2N7Q9k50J78j19J72
2832I4j00m4L5k9K08l14J92j42K18j47pK7k2J68k34R5n0J51o6j17J25p6J63j86
2856e8L2K2L9Q9k64K37j69K43k44Q4j6K4R3k49K02j31J98j96M3J4J8P2j82R7j0
2881a2O9n8j03J41o7J48k18R0KP2k4j63K04j10J58k27J31n2J01m1j14R1J4N8j50
$$ y = [206, 123, -169, -86, 2, 364, -501, 256, -46, -13, 51, -30, 48, -256, 454, -253, -66, 93, 63, 48, -209, 320, -317, 290, -53, -86, -43, 97, 167, -361, 263, -108, 110, -63, 21, -56, -39, 247, -231, 6, 17, 91, -64, -94, 122, -129, 174, -124, -34, 2, 84, 16, -195, 167, -81, 123, -108, 31, -32, 95, 57, -149, 45, 52, 64, -69, -25, 44, 27, 49, -79, -32, 90, 16, -20, -115, 87, -2, 43, -84, -33, 64, 41, -25, -94, 44, 39, 1, -60, -48, 36, 55, -63, -42, -30, 129, -81, 13, -73, 81, 22, -13, -31, -47, 161, -48, 13, -59, 91, 39, -21, -8, -51, 114, 12, -55, -33, 24, 113, -137, 41, -78, 94, -6, -50, -15, -44, 164, -150, 42, -100, 118, -29, -36, -9, -31, 137, -97, -2, -52, 99, 33, -84, 41, -35, 128, -58, -26, -4, 35, 124, -140, 97, -72, 171, -73, 11, -5, 19, 112, -137, 65, -66, 132, -64, -21, -7, 11, 83, -99, -2, -12, 57, -1, -104, 37, -30, 118, -100, -10, -8, 64, 40, -123, 81, -29, 129, -98, 33, -19, 82, 41, -73, 18, 32, 90, -60]
2906f0M7L8K4j9p9L8M5J8o6o5J41m2K1j22R0k0O9r2j4L9O2l8r5P6J6N8j47R3p0
2935e4J61j24J7o1J11L7j47N9k0J20j31L1l9L8J03j42K7l3J52r4j01J58j23J84
2959A29k29J58j71J87Rk20J82j05K44l76L02j80Q5O5j56R9j29L41l81J19Q6o7
2981hQ5k04K93l75M10j97j12J41k0J80n04O03m30K17p5jj4j00M50o79M57j25R0
3004H2j69M4K04m56O19m69J14j2J82r5l65P12o65M33k44J90k38J32L51q26P52
3025B76l58K58m54M50q7l75O84o40L24k13M80n51M9N59p20M97l29L90n78N60o3
3046A59o32Q21m59L10o33Q70o12jN29o32L82k99O90j021O70J10n13L87k49M05
3066B82p53R47n86j81O12l86J77n39J052j046M92J72m63K98j91O17j235J185m16
$$ y = [-60, -13, 25, 49, 30, -49, -11, 34, 52, -14, -79, 62, 20, 41, -81, 9, -11, 58, -34, -48, -9, 53, 15, -80, -4, 12, 70, -77, 16, -54, 107, -17, 0, -61, 50, 87, -60, -1, -21, 99, -32, -1, -40, -2, 101, -41, -14, -47, 105, 11, -90, 68, -55, 129, -100, 58, -113, 74, 83, -137, 45, -60, 184, -192, 110, -70, 15, 80, -76, 23, -106, 235, -146, -27, 59, -8, 77, -127, 166, -209, 201, 4, -108, 33, 13, 193, -311, 292, -138, 79, 4, 3, -11, -111, 339, -340, 117, -8, 82, -87, -43, 161, -295, 324, -145, -31, -43, 139, 44, -321, 391, -274, 159, -85, 105, -133, -1, 350, -476, 276, -82, 176, -278, 172, 85, -290, 394, -246, 78, -135, 345, -206, -157, 402, -318, 179, -150, 240, -338, 222, 159, -473, 348, -111, 199, -434, 436, -176, -177, 352, -280, 102, -197, 493, -528, 142, 252, -261, 126, -123, 282, -471, 476, -110, -291, 321, -65, 112, -427, 625, -421, 71, 243, -220, 78, -113, 504, -731, 454, 38]
3085C8k01J79kJ91p33J188j055L35K20j00j60j91R39j255Q79k59q5LJ40K47j054
3106g36J399q71J99j03L39k35l60J053j266P95k04J95n44L63M78j129J052n79
3124a54K62l22N00k52n73J224j046M47k89N70o07J02O71j163R77m56L58p49Q10
3143C10r9p41R71o60L89m82P88p38L4P66q93M72l04O29q65N70J08o85P78m69L48
3164B27p34J029o24j62N81m99L45m48P83r88O08J51n38L11j49M83q78Q33l75j75
3184b19M34k93J76n01R50q47K40K30k56J68k70N92r12Q32k93j48J13M3J92o44
3204d13Q11n89K01O3m6o4j41O16p87M55q8J9o9k4K66n65O95m78J18o3K26j01k80
3227b38N49n51L85k14J39j95J47K07n14M31j89J43j97J51Ok30M38m22J85q9K24
$$ y = [38, -163, 16, 14, 205, -528, 660, -395, -60, 160, 60, -100, -291, 648, -607, 272, 13, -72, -69, 71, 318, -736, 663, -208, -9, -112, 227, -8, -368, 685, -581, 214, 10, 205, -339, 24, 502, -627, 425, -154, 108, -214, 286, 34, -539, 685, -361, 86, -203, 367, -240, -138, 533, -630, 347, -109, 249, -500, 310, 211, -530, 441, -219, 170, -312, 476, -262, -228, 538, -355, 117, -187, 442, -423, 147, 255, -430, 348, -121, 227, -507, 522, -102, -264, 317, -182, 163, -285, 498, -490, 118, 269, -269, 42, -107, 376, -502, 331, -44, -219, 215, -78, 98, -403, 547, -300, -60, 170, -86, 82, -188, 404, -508, 324, 31, -117, -4, 39, 231, -413, 398, -191, 10, 73, 27, -37, -178, 438, -349, 106, 18, 37, -32, -56, 210, -355, 340, -138, -20, -83, 143, 42, -238, 311, -240, 145, -69, 70, -125, 22, 229, -285, 146, -43, 100, -97, 54, 60, -170, 268, -154, 31, -58, 166]
3248A66k20m6K87l43L20k55J78k08K50p8k19K75j48J27k12K02j30M1J22k30J42
3269B1m3J25k01Q4P3j28J56j91J52j13J91j72k6J34p5Q0j43J53j23J20p1o5Q6
3292B4J1J2j04O3J8j3K5q5N8mL3r3J4R0o2K4p9P6j7N1p8%O3J1p1NK4K7j5j5k9
3323c6N2O4j01J1oR5q1Rl0L3N3p1ooQ1n2l4J2J4M4o1jj1M8K6j10Q1m8R9j19N3
3354Bl2M8K7j07O8n1J26j26M0rM5K7q2J4lQ5o8l7N7k9O9j06N9k3O0m2o6Q7n4J03
3384H2j52Q6n3Q8m0n7L3J6L7j05N0J2K6mo5K4K1L3m7k9O5j1K6p9N0k3O8o0k5L8
3414EL3j3n3L8J5J9n6K0l3Q6n2j4m1R0jp3K6j7O7n8J4n0N5M3q6K1jQ7q9rL3n2
3446d6J25j16P4j13J76q8o4Q2m8J07j83J87j73J47k2p2L2k9J70k75J82p6K9M3
$$ y = [166, -54, -100, 187, -156, 164, -91, 87, -121, 129, 51, -168, 107, -41, 86, -126, 76, -54, -13, 109, -121, 21, -22, 103, -98, -14, 59, -69, 87, -104, 48, -65, 126, -46, -72, 62, -13, 67, -76, 77, -46, 74, 3, -62, 24, 35, 47, -57, 6, 24, 11, 36, -49, 9, 5, 38, -55, -41, 49, -13, 11, -68, 8, -9, 42, -36, -36, 27, 38, -33, -28, -4, 23, 8, -7, -36, 16, 80, -21, -10, -16, 79, -2, 7, -23, 10, 63, -8, -14, -20, 61, 9, -25, -13, 1, 45, -16, -17, -28, 20, 46, -64, 17, -31, 68, -51, 2, -30, 18, 45, -62, 6, -45, 81, -45, -5, -14, 31, 58, -24, -10, -13, 72, 4, -33, 24, -5, 64, -42, 17, -6, 54, 12, -54, 33, -21, 82, -70, 16, -37, 51, 11, -46, -13, 3, 40, -65, -15, -3, 23, 19, -46, -22, -1, 32, -15, -44, 21, 10, 36, -43, 7, -16, 52, -8, -33, 5, 38, 25, -28, 10, 25, 44, -12, 8, -25, 61, 9, -5, -46, 44, 43, -30, -4, -21, 46, -12, 2, -48, 7, 50, -36, -15, -16, 71, -18, -27, 6, -46, 79, -37, 37, -76, 100, 12, -52, 30, -18, 89, -94, 93, -80, 67, 45, -27, 5, -24, 146, -129, 53, -23, 6, 49]
3470D9r0R4j95L21k57N8K1J0M5k05L14l41L08j54J1l3L3J83m13L94k43J65j33
3493e8Q3Rj86M10m38K45j10J74j68n7L13m54M38l07J95k15K43Rm07N38m06K95
3515A46l18L51k70JL63n36L79k46L68m97K99J15l96M64l83L22m29N47l34j70N12
3536B88m58L45m35N92n90L28J42m74M23k72M30p48P12k57k07L62k98K78m87P90
3556D64p41K09K72l16J67k88O65q79P04k29j92K39j14K89p72R93o63J60R2o7N1
3577D4l16P93j002O33p6o5r9J8M48r00R43n60J07mJ55k9n47J044r28M58j82K06
3599A41k72K9N57j041R13l94J75l79M29K9o65R43p30L48k24M58m87p2P55r20O03
3620A96l40M12n92M61J08p27Q75n33L22n52P65m72j84O67o95M35l36O01q21M68
$$ y = [49, -41, 53, -142, 179, -78, -20, 1, 11, 56, -149, 165, -176, 132, -22, -11, -44, -11, 172, -241, 153, -90, 75, -58, 25, 34, -152, 258, -180, 65, -45, 129, -39, -96, 217, -237, 201, -106, 89, -126, 117, 126, -281, 257, -149, 146, -172, 179, -91, -90, 273, -263, 116, -130, 238, -259, 40, 155, -241, 223, -160, 162, -267, 280, -54, -224, 288, -170, 175, -260, 332, -258, 70, 212, -262, 161, -111, 319, -429, 283, 26, -181, 181, -117, 161, -326, 464, -277, -68, 204, -112, 55, -233, 432, -447, 257, 28, -164, 75, -39, 250, -522, 471, -192, -32, 60, -7, 44, -272, 521, -481, 152, 76, 11, -88, -70, 378, -522, 421, -139, -32, -36, 119, 90, -457, 587, -341, 117, -65, 141, -131, -102, 455, -586, 327, -67, 108, -271, 158, 187, -478, 465, -265, 83, -141, 317, -170, -242, 513, -407, 196, -144, 268, -324, 137, 245, -482, 393, -140, 182, -370, 395, -77, -261, 406, -289, 146, -190, 411, -410, 58]
3640E8K75o93N36l09M38p38P90l71l00O47m66K48n09R11q29K75K68m49L47k91
3660a62N56r14Q37k37l01L35j59K80o50Q86p11J97K33k41O6k63P53r38O00j02
3680F5j32R5p7L17p65R34n64P6M4P0Ml88P49p99M93r9Mj38M5M10p79O98l46J13
3704C0j00J35L2m30P62o62K82j22K29k07r5M63o29N36k96J62k53K66N2m61N58
3725B52l89K42k32K55j95o8M21n24L17j85K79l37J54J43l48M13l10K10k86L69
3745A81j99j45L26k72K10k25K67k64J56R3k86K46j24J84l07K56p3j00K05k20J45
3766E4j60K72k54L9J35j26J15j71J91k21K03o8r8J24n5Q1j88J94j09L8M4r7Q9
3789C2p2J34j84J09J3m6N0p9R0r4J38j28K3N3Lk0p0J00p0M6k7l5M1J4Jq8P1Rk6
$$ y = [58, 333, -360, 176, -133, 305, -433, 357, -14, -314, 333, -133, 115, -394, 517, -312, -37, 231, -218, 129, -162, 394, -520, 317, 80, -221, 114, -45, 235, -415, 471, -240, -43, 190, -51, 15, -248, 505, -433, 167, 65, -67, 28, -49, 268, -497, 437, -127, -51, -7, 63, 67, -321, 428, -371, 122, 23, 27, -111, -66, 344, -435, 263, -83, 30, -70, 65, 97, -333, 429, -233, 49, -73, 156, -51, -146, 317, -312, 224, -72, 90, -163, 103, 155, -306, 252, -137, 105, -127, 128, -67, -135, 286, -238, 79, -106, 173, -164, -10, 133, -215, 198, -112, 98, -188, 181, -18, -163, 163, -109, 101, -124, 143, -121, 35, 128, -158, 88, -36, 148, -159, 97, 24, -76, 129, -91, 54, -106, 166, -88, -49, 86, -40, 75, -96, 95, -126, 77, 9, -89, 35, -20, 61, -127, 67, -42, -4, 40, -57, 32, -40, 94, -90, 19, 32, -14, 36, -43, 47, -47, 91, -37, -14, 39, 42, 22, -48, 52, -18, 28, 1, -34, 7, 21, 22, -66, 5, 14, -12]
3818a2Om0O2k2L1p6M1M5m6Jk3O0j0lj7k1N5pl3oK5K8o0K9l0N6j5l6J0lO8p1K2
3851Hk8M6j6j6%rN5n7pQK7Qm7K7k8O5m9rJ4J1L3q1O1n8Q7l3l3J9LO2r1L7k4M7
3885C2rm3L3j1M9o4PJ6J4nm8M5k7N4n7oK0K5pn1M0j8M3m5loL8jn0K7J2K1m3NL
3920a0L0jj8k2L9J9n8J0J7L5l0Ll0LP4o7Lk6P8n6nK1l8P0o7M9q7J20k8o5L4k0
3952b3R0j30J14q9M8J5m8L6o6J76j98R4j4JK4p1J20j87K21j37K1j7N6K0j53K28
3978A31k19J62r1M3n4j4K00l08K29j33J28j32N8N9k11L16k77J68j41J85j13j03
4000a17K76l06K57k11K10k17J51Q3l12L25k18K21l12L00j30r5K85l17K34k45L88
4021B50m15J26J74k68K39k37L23m43M29j67j68K74j94K21m19N44m23J42J25k23
$$ y = [-12, -6, -46, 16, -6, 25, -51, -10, 35, -11, -10, -33, 27, 17, 14, -3, -24, 31, 24, -9, -15, 10, 38, -22, 7, -23, 33, 18, -18, -8, -11, 57, -14, 8, -20, 26, 10, -6, -6, -15, 40, -17, -24, -16, 11, 19, -28, -1, -29, 36, -13, -22, -8, 3, 36, -45, 16, -42, 45, 12, -21, -2, 1, 63, -28, 9, -15, 32, 23, -20, 13, 2, 51, -13, -6, 10, 24, 19, -29, 16, -11, 43, -14, -20, 0, 25, 18, -33, 7, -11, 32, -13, -16, -22, 16, 15, -35, -8, 4, 25, -18, -13, -10, 20, 19, 1, -21, 18, 37, -21, -11, 6, 41, 11, 14, -16, -13, 61, -6, -3, -29, 49, -7, -12, 9, -29, 41, -26, 23, -64, 56, 28, -37, -3, -23, 67, -63, 51, -38, 10, 25, -23, 13, -53, 123, -75, 19, 5, 6, 30, -41, 79, -108, 113, -24, -3, -20, 36, 56, -97, 131, -88, 74, -17, 26, -28, -42, 158, -150, 79, -54, 74, -58, 0, 59, -152, 164, -113, 55, -86, 99, -14, -117, 159, -147, 110, -101, 109, -108, 43, 126, -186, 139, -79, 142, -170, 130, 0, -95, 190, -127, 107, -138, 250, -165, -39, 135, -133, 106, -131, 192, -251, 178, 11, -157, 117, -77, 144, -275, 269, -154, -12, 113, -110]
4041a10J78k25M73o32M37n7j31J02j19L08n62O72m60P2J19m5O2l63O75o91M24
4062A27j18k4j0m6L92p55P32l75J01j06J27P3m59P74p07L40j10J98k49p9N72p90
4084c92O17l35K24k86K68R8o14P96n51K96l24M31k67j66O21p77N35k82L75n39
4104b72L13K54o70O58m45L54m94N94l01l00O92n98L55m18O47o24K22L14o13N19
4124A87l31M39p11O68j71l59N08l78L33n14P49o64J52L62m27K48l01O37q28N83
4144A82p6l05L37k04L07o93Q73n41RK29j79J63l87P33q53N23Qk10O7p5M35p97
4166d54P82m20L1P8J7N8m57Q30p33L10k9M7q5j21N08p80O81k87N1j31J78J21n49
4189c54P12n46K61j33K05k03j18N66o95M25j89K11k91J72J64n19O04l84J85k64
$$ y = [-110, 68, -157, 316, -316, 121, 64, -67, 35, -84, 224, -338, 334, -126, -54, 65, 20, 82, -281, 394, -297, 127, 9, -15, -25, -71, 321, -434, 298, -77, 24, -82, 45, 118, -341, 433, -274, 66, -44, 154, -95, -174, 398, -392, 225, -110, 114, -172, 96, 194, -420, 376, -175, 121, -203, 228, -39, -205, 416, -361, 174, -108, 267, -272, 41, 295, -375, 283, -162, 192, -302, 292, -9, -309, 383, -215, 140, -278, 369, -255, -33, 281, -332, 187, -144, 295, -416, 252, 81, -278, 230, -148, 185, -329, 420, -244, -92, 270, -157, 91, -210, 427, -401, 182, 106, -199, 138, -66, 241, -452, 421, -120, -111, 118, -61, 102, -285, 448, -405, 118, 126, -84, -17, -92, 343, -454, 328, -92, -61, 17, 34, 92, -365, 465, -268, 42, 13, 60, -25, -146, 362, -418, 263, -24, 27, -104, 74, 195, -354, 358, -188, 73, -60, 145, -58, -176, 390, -305, 120, -69, 142, -149, 23, 187, -332, 272, -112, 73, -191]
4209a91L75j85k21N02m95L31k34K95l62J86K15m67L93k36K48l53L51j29k02M05
4229B26l55K16k45M01l65N7K34l29K76k20K68l79L37p3j95K45j76K03l24L79k84
4250a03P2J43k07J36j54L12l86K35pj09J26j11J59k71L42k17j0J01o2Q0k02K93
4272A60k77J69k3o9O3o1J73k91K48j16K0K5m7O0j33K29k31Q8K3JPq1J51j89J68
4297F7q8oK4OM7j53J72j02O2m2RJ8k1Q1j42R2nPk7j1N5p1Q1o9JK9jjp1J11o7K4
4329Ik4jK8j4J6p8Q1oj9mj8M4l3J6j8J0L8m5J9k2N6m1MRk1N3m8J6l1N5j2k0Oj4
4363iL6l5J1j6K1K6o3L1l4N6l4kjkM8o6L6k9O3l5j5K%L8m8K1k0L4j2k1K6j5N3
4396D5n3J3j4K6J6n8N4m5N8o1L0j1J1J9o1K9j1N2n7J0%J3lj0opM8k8k2K1QLl0
$$ y = [-191, 184, -1, -222, 280, -215, 116, -118, 177, -185, 1, 216, -251, 142, -94, 154, -199, 152, 23, -179, 226, -129, 87, -158, 243, -122, -65, 169, -160, 116, -104, 164, -215, 122, 49, -146, 99, -77, 126, -198, 181, -103, -31, 112, -95, 41, -113, 199, -187, 48, 41, -68, 58, -53, 106, -165, 177, -40, -50, 51, -11, 69, -133, 160, -117, 52, 29, -40, 23, -38, 135, -156, 92, -24, -4, 21, -26, 34, -99, 130, -101, -13, 10, 11, 18, -63, 88, -101, 67, -21, -27, -3, 3, 50, -103, 69, -33, 29, -13, -4, 14, -7, 74, -68, 24, 19, 26, -1, -12, 43, -28, 53, -16, -15, 14, 13, 12, -59, 52, -15, 9, -15, -16, 12, -2, 14, -64, 17, 11, -8, -12, -30, 14, -19, -3, -21, -11, 27, -18, 1, -21, 35, -6, -2, 7, -14, 39, -9, 7, -24, 31, 19, -1, 5, -9, 27, -8, 3, -13, 8, 34, -29, 2, -32, 24, -10, -12, -13, -15, 33, -33, 3, -26, 37, 2, -13, -11, -11, 27, -21, 0, -20, 14, 2, -19, 7, -8, 45, -8, 5, -9, 17, 33, -25, 29, -16, 42, -19, 11, 0, 11, 30, -31, -2, -13, 39, -18, -8, -8, 5, 2, -8, -14, -21, 27, -1, -23, -2, 6, 9, -21]
4429b1L0l4L9j1qpL1J3o5N5k9M2m7L7m4L9K2n2J4j8R1j14O6l2J7J0k9K3o7J23
4459G4r2lJ4J2J7o6J03j42J22m4j3jmR6j74J76j19Q9q2O3k5n6J74j96J22q7J17
4486G5r2j0J16j79J76j21Q2j13J15Nj73K19j85J62j74J81j30lJ72k43J95j67K36
4509A44k78J63K6j57J95j70J72k56L01j74o8K07j71J56k27L11l17J85M3j87J83
4530H1j75K96m39L92j64l6J09j11J37k93M60m01J47L3l5K5j72L82m65L47j21m4
4552d7M0k3K00m59N23l46J39m6M0Pk15M95n63L64j26J12j76L3K75n05N13l26J44
4575E3j45K08m5l41N81m86K68j88K32k32nL77n88M71k59K53l78L17J3l81N24m04
4597a55K62k90M23l54l5M13m52K83k37L90m87L11R9m22M29k75K82m79N58k97j28
$$ y = [-21, 9, -25, 14, 3, -5, -12, 19, 32, -33, 22, -7, 35, -12, 25, -19, 20, 42, -10, 4, -14, 77, -37, 29, -3, 14, 24, -5, 18, -49, 74, -18, -21, -7, 5, 22, -44, 59, -83, 39, -5, -18, -19, -23, 73, -101, 75, -44, 45, -37, 26, 1, -55, 119, -77, 45, -42, 75, -17, -27, 89, -90, 86, -35, 47, -66, 49, 54, -119, 100, -85, 77, -97, 84, -46, -49, 123, -120, 75, -92, 144, -134, 29, 55, -102, 93, -77, 95, -161, 140, -34, -102, 105, -66, 90, -137, 174, -143, 42, 85, -102, 81, -94, 202, -237, 155, -9, -45, 64, -47, 90, -203, 257, -144, 3, 36, 1, 26, -146, 236, -229, 118, -3, -47, -7, -30, 170, -289, 234, -112, 27, -19, 21, 28, -187, 308, -255, 109, -17, 95, -81, -48, 227, -278, 235, -91, 53, -92, 116, 71, -270, 311, -175, 93, -95, 137, -95, -100, 277, -311, 160, -99, 154, -224, 93, 106, -275, 249, -155, 107, -183, 240, -114, -149, 264, -188, 95, -142, 248, -239, 72, 171, -251, 178, -97, 185, -294, 264, -33, -161]
4618a61L75l56K67l33N50o19L09J33l14K34k04L85o16N95k59j44K75j73J85m57
4638c28O87n68J85J33j87J36k35N27p35N70j53q8O1l7K44n60O93m92J44L3L0k2
4660C8k59N93o57L88q1mn4j0L01o23O36l48R1r0J35L1l72O24n79L37j52J61k11
4683a05J1L83n83M60k53J69k13K00M3l91N65m20J93j69K74k05j02M21n12L79k38
4704i3K55l36K35R2l85M05k77K21k87L23j98q9L35l42K05j94L10l39J42J57l21
4725a81K94j94K06l28L39j11j72K81k20J72k63L73l24J23J18j99J49j31K43l40
4745a65K59o8r3J41j28J27k14L10k26J4J18j20R9j59K63l10K18m0o4M4l9J29k50
4768a54K69j61L4K7k3J7p7J88k06R4Rj1J5o3J30j86J93r9kNJ5M7j48J90j51Q8
$$ y = [-161, 214, -142, 125, -208, 342, -277, 32, 165, -149, 85, -119, 266, -350, 245, -14, -158, 117, -56, 129, -328, 359, -209, -24, 109, -78, 58, -177, 350, -385, 185, 32, -56, 5, -32, 212, -348, 345, -147, -3, 30, 60, 38, -221, 372, -285, 103, 22, 18, -36, -46, 255, -368, 268, -80, 11, -79, 56, 87, -285, 339, -240, 97, -55, 106, -105, -94, 289, -294, 166, -87, 82, -131, 69, 112, -279, 286, -134, 59, -110, 164, -41, -143, 278, -234, 145, -93, 162, -174, 61, 153, -232, 173, -104, 117, -170, 153, -45, -134, 201, -141, 64, -130, 180, -159, -17, 140, -181, 113, -81, 125, -203, 136, 25, -147, 134, -86, 86, -177, 196, -128, -5, 113, -86, 63, -68, 175, -165, 94, 26, -67, 74, -54, 73, -141, 169, -57, -43, 75, -45, 54, -105, 158, -152, 66, 26, -38, 6, -33, 96, -154, 115, -46, -12, 15, -8, 9, -68, 120, -86, 8, 17, 6, 21, -42, 88, -98, 95, -4, -6, -1, 14, 61, -87, 103, -48, 40]
4794D0m9K7l3PQ6j50J06m2K3l4LM2p9R6o1J2J0rPn6J12j10Q1n1K0%J5J5p7P2k2
4825AJ0k2L0j3qK6k6qL3j9Mk4M8n5M1l0lL6k2K3o1O7m2Nj4J6kjOk3K3K4m0J3j2
4860a9M0k6Rpj7N7n5L8m0O3n1K0j7PK1l3J9l2M4k0mmoL2l0Rkj4N1p1N4n3O0n3
4894c0M1j3mL2o0N0n8Q0o1L2k4K4J3l2K0k5K4Kj6K9k9M1m4J7k1K5Rm1L9m3O1p6
4926c8O7n7L6j5J%j4M1m4J6oJ6j2JloJ8Mk5K1oJ3l4L6l0L4j4J3k7K7J7n9M2j8
4960eM5p3P1o0M2j5Ok0j2P2q9M7j4J5k0J1Pn1P1m0mJ0J0J1p4J01q8P5n2N3n8J6
4992a2P5j17J04q4Q9j05Q9k6m6R1p5L5n5R6p3k5R1q8P3q8J14j39Q4K9j22J30r8
5019e3J32j95J93j25J1P2p1O8j12K03k21J19%m6M1n5J32k12K05r0l2O4m8J11k30
$$ y = [40, -9, 18, -15, -8, 78, -72, 34, -8, 15, -19, -16, 26, -53, 43, -18, -6, 4, -5, 2, -54, 58, -52, 29, -22, -2, -2, 13, 28, -49, 23, 1, 11, -11, 19, 6, -2, 24, -2, -10, 23, 4, 8, -16, 32, -23, 18, -12, -15, 21, -1, 22, -39, 28, -14, -9, -23, -7, -9, -10, -4, -27, -4, 20, -20, -7, -19, 21, -5, 4, -3, -20, 37, -18, 20, -20, 43, -8, 12, -5, 2, 23, -10, 9, -23, 21, 1, -3, -7, -13, 19, -11, -2, -4, -18, 33, -38, 16, -37, 23, -30, 11, -2, -6, 26, -34, 16, -42, 38, -23, 9, -15, 9, 22, -10, 10, -15, 9, 11, -5, 24, -5, 36, -8, 9, -12, 13, 22, -19, 20, -23, 38, -38, 29, -28, 8, -7, -6, -6, -20, 21, -23, -7, -13, 3, -9, -8, -11, -17, 1, 5, -20, 1, -5, 8, -26, 10, -20, 14, 0, 13, -14, 13, 30, -29, 13, -5, 40, -33, 38, -22, 20, 5, 11, -9, -21, 51, -38, 9, -5, 10, -10, 1, 8, -43, 28, -12, -16, -6, 4, 15, -59, 42, -46, 29, -23, 30, -28, -12, 63, -54, 50, -34, 55, -50, 39, 13, -33, 58, -17, 18, -37, 59, -14, -39, 52, -36, 37, -51, 63, -76, 8, 37, -85, 45, -53, 79, -116, 77, -48, -37, 35, -36, 32, -80, 123, -98, 21, 21, -25, 16, -39, 93, -119, 86, -4, -36, 28, -20, 91, -139]
5044a39K92k22Q4Lj5J2j02K58l30K39r9M3n4L0Q3k28K74j93O3m3Q5k8j40K84k85
5069a28J66o2O7q6%J96l42L10j83J39j75J66k6j82L07k76J70j43K11j97K4J92
5091A48k81K17j43J52k11J64M2k63L03k05J59k38K97j80n4K34k62J85j83K96l43
5112a66K06L3j84J67j01J44k71L14j73o3J94j42R6j94L32l01J07J20k09J52j33
5133g2K68m26L59j14q1R0n0J07k77M11l34J13L1k4j9r1K85l62K35k7p8M9j6J52
5157A29l55L93k31N4MM8j8j70L69l93K36p8P1j34O6J48l21K98j52O5r2J16k2j74
5181a43L13k64J13o3J12j13l7K40l41K74j38J17j89J59J2k12K82k08J46j72K28
5202A16j75nJ88k15J34r4J50j87J03P1j99K08j37J19j93K14q8r5J92j81J31j51
$$ y = [-139, 153, -69, 15, 18, 3, 15, -87, 171, -159, 80, -19, 24, -30, 0, 83, -145, 129, -64, -1, -44, 41, 13, -127, 157, -128, 38, -24, 43, -43, -43, 153, -189, 121, -62, 77, -98, 68, 42, -140, 167, -109, 61, -82, 129, -68, -44, 148, -133, 84, -59, 93, -118, 46, 88, -175, 128, -77, 82, -156, 141, -39, -93, 141, -121, 64, -119, 177, -166, 40, 73, -111, 56, -45, 99, -172, 142, -31, -94, 100, -42, 54, -140, 192, -109, -2, 118, -91, 61, -72, 196, -230, 129, 15, -66, 24, -26, 81, -196, 215, -119, -6, 25, 1, -18, -109, 176, -186, 49, 22, -56, -7, -23, 129, -226, 167, -64, -10, -6, 42, 24, -146, 223, -170, 66, -12, 59, -75, -9, 139, -182, 116, -36, 29, -63, 53, 31, -143, 170, -94, 19, -44, 68, -45, -82, 158, -183, 91, -47, 70, -119, 40, 52, -160, 122, -86, 60, -112, 116, -59, -64, 124, -91, 43, -51, 99, -88, 15, 86, -113, 95, -42, 77, -116, 98, 10, -85, 107, -74, 57, -94]
5224i4K33k48J21M4j33R7o7J31k13J98p0p0J19p4N4j36K03j52K7R0j20J00j12
5247g2J82k35J83n1m7O1l3P8j61J93j29N0Mj8On4J31j55Q2Kk8J7n1J06j53J51
5273E9p6JJ9k3N3j17J68j59R8l6K5m3J8N8j07J03m2Qk0K8nm5P7n3QJ8j2J9n9J09
5303G2j03P0m4K7k8RK2p4P8o1M2m3N2l9J0K1k1KJ5j5Lj4M3m2L1j3j0J4pK8o3P5
5335C7n7L7k1L0l4J4Qk6J6J9k6J4j6K9j6NJk6L5m8M8m4M5o1N7l2J2lrK5k8J7l
5368ankJ1qJ2j1K2k9K9m3M1m5N3l3L2j1k1K1k8M7m9N1m8K5k6K2rJ5rj5nK0k7M0
5402A6l6L1l0K5qj9L0m8O2o6Q2o7M7l4J8mj3L0l3L2k7K0LKmn%MkRl6M6n0M2l7
5437b0L5l0K2p%%j5L1l8N0n0M9l9J2j7K0j5J8j7J4mnQNj3MJ9j5J0j2K4m5M6l1
$$ y = [-94, 139, -109, 12, 56, -77, 20, -47, 84, -129, 69, -1, -71, 48, -26, 28, -108, 95, -57, -30, 60, -60, 40, -72, 110, -125, 58, 7, -40, 21, -12, 66, -95, 98, -31, 19, 23, 5, 11, -43, 88, -67, 15, 17, -11, 6, -45, 61, -92, 59, -17, -16, 3, -20, 33, -84, 84, -75, 23, -13, 12, -31, -13, 45, -62, 41, -1, 7, -13, 15, 10, -35, 42, -11, -3, 15, 3, 22, -37, 72, -31, 39, -5, 22, -6, 3, 25, -49, 29, -32, 10, -33, 19, -20, -10, 11, -10, -8, 7, -8, -5, -19, 24, -18, 13, 0, -10, 4, -3, 25, -38, 37, -20, 17, -4, 26, -8, 6, 14, -12, 4, 23, -3, 11, -5, 24, 8, 13, 14, -12, 23, -25, 23, -21, 24, -37, 20, -12, 0, -3, -12, 13, -15, 2, -1, -6, -8, 3, -5, 7, -4, 18, -11, 18, -25, 16, -29, 24, -9, 23, 12, -9, 12, -16, 31, -18, 33, -15, 10, -16, 6, -3, 12, 3, -12, -17, 3, -24, 16, -20, 11, -19, 6, -2, -21, 9, -39, 23, -43, 39, -28, 19, -15, 3, -1, -14, 16, -17, 15, -12, 8, 11, 13, 9, 4, 4, 8, 6, 15, -21, 25, -25, 17, -20, 15, -15, 7, 0, 0, 0, -15, 16, -22, 28, -22, 27, -12, 0, -17, 3, -12, 6, -11, 3, -1, -6, 2, 7, -6, -2, 17, 2, 12, 0, 24, -21, 25, -6]
5471fL2m7N4m8L0kqOj7L8n6M9m2K4k9M0l9OJ4rj1L0%nk4M0m8L0j3Nj5J5L9o6P8
5506D5q4P7p2P1m9J5J9k2K6m4O5p1N7k2qJ2j0Ol0M0Jn6N7m8M7p3J03q9K7K6m4
5537b8L8m9J00j48J46q6L4j8K1Po1J00p7K4J2Mqm4J05j22Q4j1j4Mk0Q0j60J72
5565H5j20O5o3O6k5n9J21j17P5o8Q2q7L3M9r4Q7m7K7m5N7J4j14J51j19Q4q7J12
5592F3p4l0J27j50J25r8J25j69J30k3p4R8o0O0j19J51r0k4R1q6N3q7J36j36N5
5617fN6j18J09r8J46k15K03r7j3O0m6O0j39K03j79P8K2k8Ll1J18j66J25ro1L7
5643A4j6P6j80K13j36L6K6l6K8q9K00k40J71p4L4n7L2O1j73J77r8K7k3N1qj01
5669h5J89j53O0j9L1k9m1J56k26K00j16P6p7P2Lj21J80j44Q2p1J04j01RR6j24
$$ y = [-6, 26, -21, 33, -15, 15, 13, 5, 11, -6, 32, -24, 25, -17, 7, -22, 18, -21, -15, -1, -10, -21, 9, 9, 4, -20, 20, -28, 2, -11, -6, -21, -6, 33, -33, 45, -39, 38, -34, 37, -12, 3, 22, 0, 26, -18, 47, -24, 33, 11, 3, 15, 5, 11, -19, 21, 22, -34, 23, -25, 22, -51, 52, -37, -10, 16, -28, 10, -39, 61, -87, 59, -27, 7, -11, 10, 17, -44, 56, -21, 3, 15, 19, 11, -33, 72, -50, 34, 23, 9, 13, -7, 73, -87, 85, -35, 30, -33, 33, 8, -51, 70, -47, 28, -40, 42, -45, -12, 37, -57, 30, -17, 10, -35, 22, 36, -78, 73, -46, 38, -49, 63, -11, -41, 86, -64, 61, -37, 88, -81, 49, 26, -48, 50, -10, 50, -69, 82, -8, -32, 59, -27, 26, -61, 75, -61, -6, 50, -68, 41, -57, 89, -126, 77, -20, -33, 27, -19, 41, -98, 105, -74, 4, 26, -2, 1, -30, 88, -78, 47, 38, -23, 14, -2, 74, -106, 107, -29, 7, 33, -3, 25, -64, 136, -104, 67, -7, 27, -30, 2, 63, -110, 67, -31, -4, -27, 24, 16, -85, 104, -49, 11, -8, 23, -6, -47, 109, -117, 83, -33, 43, -34, 38, 41, -80, 100, -44, 38, -33, 71, -30, -21, 75, -49]
5694d9Q1m0N1p1L6M3j34J34p8N2q6J13n1o2J35j49J14r8J31j49R2J8q1P0m1O2
5720D3j00J14m8m2P3m2K4n0R0o9qP7r9P0p0J10j38J09l6l7O0m7N9j22J48j15L7
5747iMnj2pP1r4N3Om1M3k8N5r7J13n9QJ3k6L9p7J24j27R1l4J5l1J5L5p8P0l5J1
5779FO%mk8N6m9nK3j1Qm7Q7r6P2l4K2l0J5K5o7P5o0M7l8M9m8K5K0k8JJ7j0%kL7
5814C4n2M2j8nmMK3m6N6n2L6m3N0m8K7jk0K0j3RlLj3OQj0j3K6k0J8k9N6o7M8j9
5849a0K0j9J1J8l1K7j3J4k4K1k2K7j5Jj0K1k0K0k9L0k9K3j4rPj8K6k3L7l2K7k9
5881a7J0j0K9k3MJK1k4J0oJLJ0J1j6J7l7M4m7N5n5L9k3K1j4oRk5L1l2L0k0J8q
5915APk3PKJ3k6K0k0L2l9L2k8K6oj4K7j8K1l4L8m0L8j8K3k2K0rJ2j7OmjnJ3j9
$$ y = [-49, 32, -8, 43, -28, 8, 51, -83, 51, -27, 25, -61, 52, 1, -61, 74, -75, 39, -59, 72, -77, 15, 33, -48, 22, -19, 43, -57, 57, 9, -33, 40, -2, 22, -28, 62, -7, -15, 62, -37, 33, -37, 73, -65, 44, 8, -29, 31, -16, 43, -79, 69, -46, -9, -5, -10, -22, -29, 42, -52, 1, 7, -34, 9, -19, 36, -61, 52, -7, 1, 14, -12, 27, -50, 74, -53, 38, 4, 19, -12, 3, 38, -40, 30, -5, 6, 12, 12, 8, -20, 36, -13, -18, 5, -6, 2, -45, 42, -54, 18, -16, 6, -24, -9, 16, -51, 24, -36, 11, -27, 22, -26, -1, 19, -9, -8, 9, -1, -1, -3, 34, -18, 24, 6, 1, -3, 1, 24, -22, 34, -18, 18, -25, 25, -23, 4, 3, -17, 3, -10, -1, -4, -1, -14, -8, 0, -10, -23, 3, -17, 1, -28, 28, -39, 9, -10, 10, -9, 2, 20, -11, 16, 3, 17, -7, 14, -8, 19, 4, 5, -5, 16, -4, 16, -13, 17, -12, 11, -3, -12, -5, -23, 3, -20, 17, -15, 12, -17, -7, -17, 12, -11, -7, -6, 15, -9, 1, -5, -4, -1, 9, 20, 4, 21, -16, 28, -19, 36, -19, 20, -3, 18, 4, -2, 7, -18, 13, -19, 11, -9, 9, 1, 8, -15, -8, -6, 7, -19, 1, -19, 13, -26, 6, -22, 4, -2, -16, 11, -7, 14, -20, 18, -22, 16, -2, 21, -1, 19, 10, 22, 5, 11, 7, 6, 1, 14, -5]
5950eMJ5l2L0l6M4m5L4m6N1l0K3l4J6Rj2J7k0J9k8M6l4K6k6K5k4J6j7K2k1K3j2
5982bRj5J7kPmj0J5j9L2n3N1m4L9m3M2l2OJ8k3J6j1K8m2K1j2%QJ0j4jJ0Jk7N3
6017B9n0L7l6N0m6K1J9m8M8l3O2q2O3m1J8rJ6j7l2O0m2J6QrJj6M9p2M2lk4L5l6
6050b2O0r5J13j00M9k2L5km5Q3r7P4m4M6n6K5K7o7O4k1Rj5KM3q6J07q2M0m5M1
6080A9k7k1P4j07J00p5P8r8P9j3n7P6n9L7n3P3m2qO1p7N5l6O1o7M0L3r9J00q6
6109c9J04j33J34o9j4N8o4M7q3J38j26N7J2m7K9k2O8j08P7j0m7N9m1O1j21J31
6135E1r3L2Pk7L7p1J41j58J28n9K0k4J7M7j27J44q6K6j1L4j5o5J26j27O4KNk2
6163dk1J13j92J70r6N8o2N3lr1J51j39R4p8R8r7J9P9j15Q6l2L2o3N1L0j11J36
$$ y = [-5, -1, 14, -18, 12, -24, 20, -25, 9, -37, 14, -16, 7, -27, -11, -2, -14, 3, -17, 2, -26, 20, -14, 12, -14, 11, -13, 3, -14, 8, -13, 10, -2, 7, -8, 9, 7, 14, 10, 0, 15, -4, 28, -25, 26, -18, 21, -22, 20, -12, -6, 12, -11, 5, -6, 22, -20, 1, -11, -11, -3, 7, -7, -8, 2, 3, -24, 29, -21, 16, -20, 30, -16, 5, 24, -24, 24, -9, 53, -29, 34, -7, 11, 2, 18, 1, -31, 29, -13, 3, 11, 2, 3, -13, 36, -36, 6, 3, -21, 14, -22, 38, -57, 56, -44, 5, -17, 18, 16, -29, 54, -43, 31, -13, 33, -23, 2, 29, -38, 26, 5, 14, -1, 1, 44, -42, 65, -17, 23, -22, 19, -8, -29, 45, -62, 38, -37, 41, -57, 22, 9, -48, 28, -31, 6, -47, 26, -16, -24, 37, -40, 15, -21, 40, -27, 13, 46, -53, 47, -39, 65, -68, 66, -3, -17, 41, -23, 24, -59, 79, -47, 10, 22, -25, 4, -18, 50, -58, 19, 9, -38, 21, -20, 41, -80, 51, -42, -10, -3, -30, 7, -64, 77, -81, 47, -12, 8, -16, 1, 48, -79, 65, -21, 5, -6, 28, 13, -52, 74, -53, 11, 13, 18, -4, -25, 88, -104, 66, -30, 28, -34, 19, 16, -75, 76, -63, 31, -47, 51, -46, -27, 52, -63, 23, -9, 23, -40, 11, 41, -70, 66]
6190F6j06P0p9R0l2n4J28j39J07r4J22j22O2Op0P2m1N9j04J10n0l7Q1p0M3o7Q6
6217C7p8J3O1r7J02q1J00j39J13l1m7O9n0P9j12J34j15N0J5k7K6m0O9r0O5kl6
6244a2L8m4N7q5R7n5%K3l4M5q7J28j17O7k9MnqN6r1P8l7oOR%l0O8n3J1K8l2K2
6277A2m0Q1j04R3n0J7j2MM3q3R7o5L0l4M3l0mL3n5K6J0Mk7LK9p6P7l5jKjL6o3
6310d0P5o8N5m6L6l1J7K5l8K5j2J2j5K1k2lK4lj2J5j0J1l1M8m7L7l4L0k8K2ml1
6342b2M8l9J8k9L1k4MJ1lj1J4nOj5J5k2K6j2QkoK3l9N2k7K1k4J8j9K1mojJj4J8
6378A1oPj9PPrK0l5L7m5M7m6K8l0L1j8N%j6L5l2L4k7K2j3J4%mj0K1j0Oj1K2k7
6413dK0j2PloJ1j6L0l7L9n1M0l1K6k1PmnJ7plPj3jqJ2jJNj7L3l0M7n4L6k1K4j4
$$ y = [66, -40, 30, -49, 41, 9, -45, 83, -56, 51, -43, 79, -43, 19, 25, -45, 27, -14, 45, -59, 51, 1, -36, 45, -25, 18, -49, 37, -41, -28, 33, -64, 38, -43, 57, -82, 31, 0, -47, 22, -28, 51, -61, 73, -42, 8, 23, -4, 22, -18, 51, -39, 26, 24, -12, 26, -18, 39, -46, 51, -4, -4, 19, -15, 30, -57, 71, -46, 21, -8, -4, -9, -17, 39, -52, 26, -11, -17, -11, -2, -2, -32, 36, -17, -6, 22, -10, 12, -28, 53, -51, 42, -8, 9, -3, 1, 44, -39, 58, -7, 23, -11, 32, 2, -2, 31, -24, 2, 12, 16, -11, -8, 21, -55, 22, -13, -14, -12, -13, 23, -40, 35, -33, 22, -24, 12, -19, -2, 23, -15, 10, -2, 10, -5, 16, -6, -9, 15, 12, 0, 15, 5, 16, -15, 33, -14, 23, -11, 19, -9, 13, 9, -22, 26, -13, 5, -24, 7, -17, -13, -2, -5, -16, -2, -7, -1, -16, -1, -23, 3, -9, -1, -3, -9, 14, -25, 27, 0, 21, -3, 15, -4, 17, 13, 7, 6, 7, -7, 11, 5, 12, -7, 0, 7, -2, 18, -17, 20, -25, 22, -24, 4, -26, 5, -13, -8, -8, -24, 11, -21, 13, -14, 8, -5, 9, 9, 5, -5, 16, 6, 12, 1, 23, -4, 16, 4, 11, 8, 2, 13, -3, 27, -10, 29, -22, 18, -13, 13, -8, -1, -5, -10, 7, 0, -3, 4, -9, -10, -18, -6, -7, -6, -1, -18, 15, -15, 32, -22, 14, -7, 17, 3]
6451CJ0pj1L0l0K0j7K6k4JLJ2j4Qj0%j3K7l1K7j9PqMJ7k3K5m1N3n5N0m0K1j3J3
6486Aj0PRpJ5k0J1j7J1MkNLj1J7j6K1l1M3m0K5k8K6k2PQl6L7l6M3n1M9l1J9mo
6522gnj0M2m1J1Oj3K1j5L6n5L6J1l4L6k6M3p6Q1n6K4oKJ6l6O7p1M9l3J2j4LJ9
6555A7m9N1k1pJ0JK2p2Q5o8L9j5Qpm0J03j16R6p0N4n0N7qn2O7m4M0m0M8l9rN4
6587D5p7N5m2N3n0J7M5j05J17q7P4r8R1n1k2P0p4N6p9J11r7N4J2n4M2l3M9p2O3
6616A3Mn8P5o5O9r7J30q8KM7n7O8q7J38j60J01l4KK2l6O6j14J15p1OJ8j7J6o2
6645e4J01j10O2Mj9K8n0R7j51J41p1K7j9J1L0r7J45j28Q1l8L9m1rQ3j04P5l7K5
6673B1k5MN4j26J45j02N1n5N5j1o4J22j46J10q7R5r3M9L6r1Q9n8M5o5P4k3m2P9
$$ y = [3, 13, 6, -5, 25, -5, 15, -2, 24, 0, 1, 4, 16, 2, 10, 0, 0, -13, 14, -17, 10, -9, -2, -10, -6, 11, -12, 13, -28, 25, -30, 20, -20, 1, -12, 1, -9, -2, 7, 0, 15, -5, 6, -11, 0, 4, 2, 7, 10, -1, 16, 0, 21, -10, 33, -7, 18, -10, 16, -6, 1, 9, -27, 10, -26, 17, -34, 15, -16, 3, -1, -7, -12, -22, 20, -21, -10, -4, -17, 4, -11, 25, -30, 6, 17, -17, 19, -7, 36, -40, 41, -15, 9, 3, 5, 21, -15, 52, -19, 30, -3, 9, -5, -2, 17, -32, 19, -2, -9, 1, 2, 24, -48, 37, -31, 8, -7, 1, -6, -46, 57, -59, 37, -33, 21, -29, 28, 20, -32, 35, -9, 31, -9, 39, 0, -9, 45, -32, 23, -19, 34, -16, 1, 46, -59, 58, -29, 45, -53, 38, -13, -35, 35, -39, 17, -62, 49, -48, 6, 18, -36, 6, -27, 22, -50, 13, 17, -41, 34, -31, 38, -59, 71, -17, -15, 32, -25, 43, -44, 94, -66, 35, 1, 3, 25, -11, 55, -59, 56, -15, -9, 9, -8, 8, -54, 47, -63, -1, 3, -16, 12, -38, 59, -92, 49, -22, 5, -14, -3, 27, -70, 75, -53, 28, -10, 29, -12, -21, 62, -42, 33, -4, 21, -4, 0, 54, -72, 73, -29, 22, -33, 22, 11, -53, 69, -77, 33, -54, 41, -52, -3, 33, -58, 31, -27, 18, -47, 27, 4, -38, 41]
6701D1q3P4o7P8n8j6Q8j19J01p4Q7j13R6oo8P8o9P6r5J19j05L1J9m0L5m4P9r0
6729d5N0Ln5O9n9P4j06J02n1pN5p1O4q2J29j31P3j1KLk6O5j01J02n4LJ1mJ0m8
6759c6P5o7L2J7l6L9o7R8j09P9l7J7j9LM3r1J04r0O0l5L7j6k0M9o5L8q%jrN4q1
6791d2Q4n1J4oOK5o2Q6q2O5o0N9n4J9L1o6N0j4Ok0K7km0M5k7%kNJ1m3O6p4N7l6
6825b5L4l1K5Ol7N0m0M6m3L7k1NRooJ2plLJ7l8K9k5J8jlJ7m6N9o1M9n6M5l4J8
6860dPj6Qj2K1j5J2nj2J6rQPk5K3k8M6m2M3k3J5k9J5Qj7L2l1K4k4J9j9jK3j8N
6895BJj8J9j5K5l3K8k4J0j4%J9l1M8m6M2l1L6m1K7k1ML2k4J3j4OKoK1j7kJ6rJ2
6930A7oJ2l9L4l9M7k9J5j9mK0k5K2j7L0l0PrLNP%nlNj6K2l2L6k8L3j4R%j5L0k9
$$ y = [41, -42, 32, -35, 43, -15, -31, 57, -62, 39, -35, 52, -61, 35, 29, -39, 39, -30, 46, -49, 70, -35, -4, 15, -25, 10, -34, 45, -45, 5, 8, -47, 22, -37, 37, -69, 33, -18, -25, 30, -41, 23, -59, 70, -61, 12, 1, 3, 6, -20, 45, -56, 46, -8, -5, 6, 2, 12, -36, 39, -28, 4, 21, -15, 24, -43, 55, -54, 25, -12, 5, -14, -11, 32, -59, 45, -45, 15, -20, 17, 1, -19, 30, -35, 3, -5, -5, -6, -15, 39, -42, 42, -9, 5, -1, 5, 30, -32, 54, -28, 37, -23, 36, -18, 1, 32, -34, 16, 2, 8, -12, 15, 13, -27, 18, -9, -9, -11, -6, 5, -38, 28, -46, 11, -25, 9, -22, 3, 9, -28, 22, -18, 28, -15, 22, 1, 6, 15, 9, 3, 15, 8, 5, 8, 25, -13, 16, -9, 9, 8, 5, 22, -24, 35, -26, 23, -33, 12, -22, -4, 3, -13, -5, -17, 4, -11, 1, -4, -16, 0, -9, -1, 6, -19, 4, -24, 22, -20, 23, 0, 15, -14, 1, 9, -8, 24, -7, 17, -7, 12, -7, -8, 15, -3, 2, 3, -15, 4, -11, 14, -19, 9, -15, -5, -19, -19, 0, -31, 17, -29, 13, -18, 18, -23, 4, -17, -13, 19, -5, 8, -6, 0, 2, -4, 17, 0, -2, 14, 5, 17, 11, 23, -16, 18, -21, 26, -3, 12, -7, -11, 9, -16, 6, -11, 19, -11, -4, -13, -10, -5, 2, 2, -3, -6, -1, -17, 5, -27, 9, -19, 14, 0, 9, 9, -6, 24, -5]
6967eL0m4M6l3J0KNkj5L4k6LJJqJMj1NLj6J2j0K3l8L8l7K4j5K2nj1L4n0M5k9K5
7004A3k8K6j0rJ7oJ0j2P%qL1k6J6j8Qj2RRm3N1m2M8n6N3m1OJ4k0K2k6M1n0N1l1
7039fjLkK6m2L6mj6K8l3L1n3Q0n5K2jnJk9N9p5P6n7L9l3J7J7m4N1m8K9k0J1rk4
7074c1O2n9L5j1%j2J0L8q6Q8o4M0l9M8k1k4O0o0N7o1Q0p4L4L3n8L9k7L8n6N9j6
7105B2n3O5n9N9p4Q5o7K0L3o0N3o3R0j20Q8l7kK2k2M8p7R8o1LJ5j9L2o2R2q4N6
7136B1ol1M0m7R2j30J31q6K3rNL1q9J32j16N6k9L5l3j6P5j10Q9l7Qj4j1O0j08
7165g4J34r7O1m2L4jo2J14j25R5o8O0n9K5M4q7J00p4N4n8O4k6n8J06r6N8m1N1
7193C2m3lO7j22J17q5P5r7P5j2n3Q5q6Q6r0J04q3L0L2p0N4m0O9q8N9Kn9Q0o0O3
$$ y = [-5, 25, -19, 27, -6, 4, 6, 11, 9, -6, 28, 2, 5, 6, 7, -1, 0, 4, -7, -2, 1, -15, -3, -13, 10, -28, 10, -27, -3, -18, 4, -1, -12, 22, -28, 17, -12, 13, -15, 11, 1, -8, 9, 3, 13, 1, 8, 8, 0, 31, 5, 21, 3, 11, -1, 8, 17, -26, 25, -17, 31, -25, 28, -13, -7, 7, -13, 9, -17, 24, -26, 25, -6, -7, -4, -6, 20, -22, 14, 10, -6, 22, -11, 20, -33, 47, -8, 14, 13, 8, 9, -20, 39, -36, 40, -17, 22, -11, 6, 23, -21, 30, -18, 11, -9, 2, -7, -31, 31, -28, 7, -4, -4, -16, -6, 32, -54, 34, -30, 10, -29, 19, -2, -26, 34, -26, 31, -30, 50, -24, 10, 43, -15, 24, -3, 35, -21, 38, 22, -31, 34, -25, 34, -40, 45, -22, -2, 31, -29, 24, -39, 51, -69, 19, -18, -20, 2, -20, 28, -49, 49, -12, -9, 6, -13, 19, -43, 49, -35, 21, 15, -16, 24, -23, 69, -61, 70, -16, 7, -2, 3, 34, -55, 77, -39, 17, -12, 23, -10, -26, 49, -61, 28, -9, -1, -15, -26, 34, -74, 60, -37, 24, -18, 16, 15, -47, 67, -58, 37, -31, 29, -30, -5, 39, -48, 52, -22, 32, -26, 38, 12, -46, 60, -36, 22, -19, 32, -11, -14, 53, -69, 48, -37, 38, -59, 16, 4, -49, 36, -50, 36, -54, 50, -33, -3, 29, -41, 13, -27, 42, -46, 13, 15, -44, 36, -24, 39]
7223C9r2R7n1j1O0p0O8q7J27j32P5qk7K2k6N2q5Q4m0qK6k4K8o7R7r0L1J4k9L1
7253Dl7P8j09R8n1J2QpM0q5J07r3M4j0J7j2j9P0p6L9j1nrnN1q5P9n8J7OoK5o7
7286e0Q9q3O4m8L5l9K5K1o0O2l1K0k6J9Mk7L7l4K8j0J3qk2O5o9M9m3M4l4K3J1
7317B5n2O6n6L7l6M2l5NJ4k8J6pJ3k7J1K6m4L4k7K2k5K7ll2N0m4M3m2M0m0K8M
7349Ej0J0j3J4j6J3jrK2j2Lkj0J7k9M0l7M0m0L5k6Knj4K4j8K9m2L9k1rJ9qP%o
7385iQj1K7k8L7l4K8j9J5Kk1M3n1N1n8M5l0J7npJ1j4J4j7KoONk1J4%jLk3M1l8
7421b4M4m3K6l1K7j1KJ8k9L1k7N0l9J7rLKm%jP%k2L1k3J4k9K1%oKj9L4m1L5l6
7457c0L5k3J0kkJpJ6j4J2j0jOjJ1j2J1MnJ7j9J4l0N0m4K4lOqj3L5m5L2k4OqJ5
$$ y = [39, -53, 44, -7, -18, 42, -28, 40, -47, 80, -52, 23, 15, -12, 10, -16, 36, -49, 35, -5, -13, 13, -11, 17, -50, 47, -43, -12, 2, -27, 4, -33, 45, -64, 34, -17, -5, 3, -4, 36, -49, 58, -35, 9, -1, 16, 4, -15, 55, -21, 18, 7, 2, -7, -12, 39, -46, 33, -25, -8, -2, -8, 17, -50, 39, -44, 20, -28, 7, -32, -7, 14, -46, 16, -15, 5, -21, -2, 2, -25, 12, -22, 6, -4, 9, 1, -21, 44, -25, 24, -19, 25, -9, 14, 25, -27, 39, -17, 20, -16, 26, -9, -4, 10, -18, -2, -9, 4, -23, -12, 14, -30, 4, -23, -1, -26, 1, -2, -34, 16, -28, 15, -27, 13, -27, 1, 5, -5, 5, -8, 6, -10, 3, 2, -7, 15, 3, 6, 4, -6, 11, -18, 22, -15, 25, -15, 20, -6, -4, -9, -23, 1, -17, 12, -30, 9, -12, -21, -2, -10, -3, -3, -9, -1, -12, 15, -13, 24, -10, 18, -1, 14, 16, -5, 38, -13, 38, -20, 25, -5, 12, 7, 0, 11, -3, 11, -6, -4, -10, -4, 1, -20, -6, -6, -7, -4, -27, 14, -24, 20, -23, 3, -28, -1, -12, -10, 8, -21, 10, -17, 33, -6, 11, 2, 5, 7, 3, 3, 2, 9, 9, -13, 18, -5, 9, -20, 1, 1, -5, -3, -22, 12, -29, 6, -30, 5, -18, -8, -10, -12, -11, -18, -2, -16, -4, -14, -15, -9, -10, 1, -11, 0, 4, -1, 16, -3, 11, -19, 31, -13, 11, 8, 14, 6, -7, 28, -17, 15, -9, -3, -11, 4]
7494Dmj1J3jjr%k%J9l2K3j9J7j3kK8m0L7l3M5l7M0l3lL0k8J0mJ2nRmK%oJ5j8P
7533FJ1k9L3l1L7m1L4m2K3opK0l4N0o3N8l8J3nJMk1M7m0J9%LLj7L2m3L8j4OJl
7569EM0p3P0n9M3m7L2ol0M9n6N0m9N1m1K0J0l6M0l8L3l1K1Mm7O4m7M5n5N3k3l
7601a1L5n3N0n2P5q3P5l9j2L3k8M1o1O4m4QL8m8L0m2N3m8J9J4l2K8m7P1r6Q9o0
7632c3J9J4k1K7o1R0q5O2j9Oj1qM4o1N9j1j0Qj1L1o5Q2o3L4k1J7Jl6Q3r2Q0o7
7664a8M2l8K4J2n9P3o0K6k2L0j6k3O0o6L9j6K0k4OM2q6R2p4O5n7M6nm5Q0o9N5
7695C4o8P9o0K0J7l6M3l1K6n0M7Jn4N9n0N3o8O2m1ML7o2M7m8P3r0O1k1qK2k4M0
7727A4o2P2m6J2K1k7L6m3N9n2J4K8m2M2m5P7r1O9m1J1Nk0L8p2Q5q1M7j0Rj0j3
$$ y = [4, 0, -11, 2, 1, 0, -9, -9, -11, -11, 8, -24, -1, -20, -3, -16, -18, 10, -30, 7, -26, 19, -18, 22, -11, -14, 16, -12, -2, -6, 6, 1, 10, 6, 8, 8, 2, 17, -1, 6, 17, -12, 21, -10, 27, -14, 20, -22, 1, -5, -12, 8, -26, 24, -39, 19, -19, -6, -11, -10, -6, -27, 20, -20, -1, -1, 2, 5, -12, 20, -23, 15, 1, 7, 8, 5, 45, -28, 42, -17, 26, -21, 11, 5, -25, 24, -32, 18, -31, 20, -21, -1, 9, -27, 13, -25, 8, -23, -2, 2, -45, 19, -28, 17, -38, 15, -8, -11, 24, -29, 21, -31, 44, -39, 36, -3, -15, 18, -10, 31, -30, 34, -10, -2, 36, -12, 18, -24, 29, -19, 0, 14, -18, 10, -37, 34, -62, 27, -33, -14, 0, -21, 6, -55, 35, -50, 12, -7, -1, -12, -20, 24, -37, 22, 11, 1, 9, -2, 29, -36, 46, -17, 17, -4, 13, 14, -22, 61, -31, 49, -18, 24, -14, 10, 22, -37, 36, -24, 2, -20, 10, -6, -29, 31, -35, 4, -12, 8, -16, -10, 32, -54, 38, -36, 29, -28, 18, 13, -32, 48, -21, 34, -34, 45, -15, 5, 22, -14, 29, -2, 24, -26, 21, 22, -32, 27, -23, 30, -38, 24, -17, -13, 24, -38, 9, -39, 34, -56, 5, -16, -24, -2, -26, 14, -48, 24, -22, -10, 11, -16, 20, -23, 36, -16, -2, 26, -16, 26, -19, 58, -33, 36, -5, 6, 11, -9, 29, -43, 42, -39, 8, -2, 7, -3, -16]
7758a6K5m2M5j5j2J6k5M7o1O1m5PJ3JJk4O2p4O4m3L7k9JL4m5L5k1J9k6K4mk5M0
7791B5l6J6%j1J0l3N2o6O5m4K7k6J8Ol4N3m4L1l0L7k7jJ4qK3k2MlPPk4L2j9J2
7825A1j1PJ7l7N1n2L5k4K6l3J5Pk5J5j8K9l9J3QqJ0kkkJlkK3k7K3j6K0k5K6qj
7861BJ6k4J4j1K3j1LnkJRKnrJ5l2K7j6J6j0oJ7k4K7m3L0k2L2k7PKnRpJ1j3MQq
7900e%J0mLlRk5L4k4L0k7K4k6J8lj1K1l0K3l4L0k1J7qKoNOnj1J7k0J8j5QnkLl
7939a0J5l0M0l6L5l2L2k2J3J0j3NjQoj0J9j5MNlOrJ5k8K8l7L0l2K6j5jKqRj5J8
7976cj9J7k1K3j0PlMrOLPqJ4j6J9rJJ4k0J1k5L7l8M2l5K9j9RrJQk6QoNnRKrRK
8018cj0PpJ2j8K7j4jj1J7j1ROk0L3k6K2k3K7l0J7pMQj9K0j1jQqQoLknMj5J4k2
$$ y = [-16, 9, -33, 12, -3, -15, 1, -24, 23, -38, 23, -22, -15, -2, -1, 0, -24, 38, -36, 28, -15, 22, -7, -6, 28, -17, 18, -3, 16, -10, 14, 10, -15, 25, -11, 5, 5, -6, 4, -29, 23, -43, 22, -22, 5, -21, -3, 3, -31, 22, -22, 9, -21, 16, -11, -12, 2, -6, 17, -5, -1, -4, 3, 10, -14, 18, -1, 11, 0, 7, 24, -13, 38, -14, 21, -3, 23, -10, 5, 12, -13, 2, -16, 13, -26, -13, -5, -13, -3, -5, -7, -9, -8, -11, -13, 10, -17, 6, -10, 10, -15, 11, 3, 2, 18, -6, 8, -3, 20, 9, 12, 7, 5, 6, 15, 17, 12, 3, 18, -14, 13, -3, 13, 3, -3, 14, -10, 17, -26, 4, -18, 14, -13, -6, -4, -9, 0, -7, 4, -9, -5, 3, -5, -5, 5, 1, 4, 1, 10, -15, 19, -5, 25, -2, 22, -4, 14, 11, 0, 21, -9, 14, -20, 10, -11, 6, -2, 0, -6, -1, 5, 0, -11, 6, -14, 4, -11, -3, -8, -10, -7, -10, 5, -25, 15, -21, 14, -18, 14, -8, 5, 15, 2, 7, 6, 14, 8, -2, 17, 2, 6, 11, 8, 14, 5, 20, -8, 20, -17, 13, -19, 7, -8, -9, -7, -15, -6, -21, -3, -22, -5, -26, -3, -13, -6, -9, -5, -14, -8, -5, 2, -6, 8, -8, 11, 2, 3, 17, -3, 8, -17, 20, -18, 24, -11, 18, -1, 8, -1, 0, 8, -18, -10, -16, -11, -16, -7, -5, -14, -5, -3, -13, -6, -13, -1, -19, 8, -6, -7, -18, -1, -12, -3, 3, -17, 16, -10, 12, -11, 16, -14, 3, -4, 0, 8, -11, 9, -2, -3, 5, -3, 5, -1, 2, 0, -5, -1, -16, -2, -24]
8057b4K2k5K9j3Qj0qJ2oJ9k4K6k4J2KJ7qj7J5JkQj1J9l0L5k5J4j4J0mrJ8l1L7
8092A9k1J4k5J3mjqMLj3JRKJ2k1NrJ6j1JK4l2L7l8L2l7L9j0PJj0J1j9L2l5L5k0
8129CJ4k7KJ1j4J3j0nJ6nJ1l0L3l0RKj8K5l9N7m9M4l2J7k4K2J0k9L2k7J6j0%J2
8163@nK3k3J4lj0Qj0K9m3L2k0J9j2J1nj8K7k9L1l4K5k0K0Nm0L0k0
$$ y = [-24, -2, -27, 2, -11, -3, -13, -21, -9, -15, 4, -20, 6, -18, -6, -4, 13, 5, -12, 3, 4, 2, 10, -1, 18, -12, 23, -2, 12, -2, 8, 4, -5, 13, -18, 19, -2, 12, -13, 0, -4, -5, -13, -9, -6, -19, -18, -9, -7, 5, -16, -11, -20, -4, -15, -14, 10, -22, 15, -23, 9, -28, 11, 1, 8, 9, -1, 10, -9, 23, -12, 23, 3, 17, -10, -8, 3, -11, 2, -8, -13, 3, -2, 9, -21, 12, -18, -9, -7, -25, 0, -39, 18, -31, 13, -19, -2, -26, -4, 6, -23, 9, -18, -2, -12, -12, 0, -5, 18, -5, 9, 6, -4, 4, -6, 23, -20, 12, -8, 11, -1, 10, 5, -13, 14, -15, 16, -18, 7, -13, 7, 12, -28, 2, -18]
8191a8
$$ Imaginary data points
##PAGE= N=2
##DATA TABLE= (X++(I..I)), XYDATA
0@%%%%%%%%%%Qj6J6k4L2m0M8n6P2q8J11j35J60j92K27k67L13l67M28m95N69o52
32c48P46q50R63j090J230j381J548j733J936k158K400k663K952l265L609l985
48b089M392m840N330n864O453p105P829q634R533j0550J1706j3035J4581j6408
62h701J8606k1309K4736k9253L5548m5158O2753j44635K59899j60602k5254J4405
74a8965M9502J9089k23325M20518m30699K26432l8310O4370j49729K9432K40164
85A88479l87689L17652j58408O1821q5023J30459j4742k51086L97306k80844J07685
96B5610r4713J67444j41011k6508K34978l31933K38552r0646R6116k03037J61393
107C6245O6991k54914K62069j70751J10231j34922J95192j47272o2764K50482
$$ y = [0, 0, 0, 0, 0, 0, 0, 0, 0, 0, 0, 8, -8, 8, -16, 16, -24, 24, -32, 40, -48, 63, -72, 88, -104, 123, -144, 169, -198, 230, -265, 304, -348, 398, -452, 511, -579, 651, -730, 818, -915, 1021, -1137, 1263, -1400, 1552, -1713, 1896, -2089, 2303, -2537, 2793, -3071, 3382, -3723, 4106, -4528, 5005, -5545, 6161, -6874, 7707, -8701, 9905, -11404, 13332, -15921, 19627, -25531, 37222, -107413, 152486, -8116, -33370, -18965, 30537, 49626, -173699, 246819, -183880, 42552, 4242, 68612, -81117, -51685, 188479, -199210, 118442, -39966, 21855, -63168, 67291, 52549, -198537, 198769, -82075, 25610, -69103, 98341, -42670, -69178, 165800, -166133, 72419, -18227, 77889, -125148, 36245, 103236, -151678, 110391, -60360, 49871, -85051, 110141, -37131, -99895, 150587]
117A50587k32350J12353j00787J86475k07389R9413P3944k02222J95043j01206
127b6139R2473j99091K29357p7970j03836J58490j19743R2244j22308J89441j99989
138h7071P2848R8797j40333P0065o1049J47827k01699J52523m1676o5504J04081
149D8809o3984N0498j36878K10023j42471O889N6101m6371M1357p2039J32724
160H4658j79016J32498r197n5732J9414m219P7887j51140J46733q8949K0103K4914
172A7954j7554M283o3273J48762j42653N7940o915R986n719k4003O7821j17601
184g0972J26169o2507J439j3310L3203J5625q3757J00586q1407N4718k3625J2931
196I093k4403j310P1511r9802N8780k5926L3751l3457R340J6174m8441P7766o2218
$$ y = [150587, -81763, 30590, -70197, 116278, -91111, 8302, 82246, -119976, 75067, -26139, 66334, -132757, 96600, 18630, -85206, 73284, -46459, 45785, -76523, 112918, -87071, -14223, 84574, -55759, 14306, -46743, 101084, -100615, 51908, 10232, -55272, 48809, -15175, 35323, -101555, 108468, -34003, -27114, 28987, -17384, 23973, -48066, 84658, -94358, 38140, 28943, -26789, -7375, -11594, 66293, -84847, 61886, -27063, -6960, 17954, 400, 4683, -58590, 90172, -52481, 5459, -1456, 8530, 2811, -21192, 46629, -70972, 55197, -7310, -5871, -19181, 14022, 29647, -54110, 46476, -34931, 19787, -3838, 9093, -15310, -16620, 54891, -44911, 13869, -12057, 21694, -11763, -2423, 13751, -34690, 43076, -19142]
209a9142K1300k0978M4077k1943k9246M8988m4869M5442l6350K1411k7964K8518
221I244J3288n1356L8062j7413K9552l7404J9643o342l504K9283m0658J9412j1946
234a0139L3313l1168k378J7158j2029K1242k9804J7705j4759K6671j3493j6840
246a4521J7652l180J3760k6987J4535n131J1697k186j7228J0772J861J1940k2013
259i029L432P157L886j61j5812R484K178R362j5226l264R374M792j286j4205O703
274b615N356N732j1728m378P491P413m197r372J052R375K947q744o132O715R456
289H371o281p094j069J0539J794p229o179M594J0922n254q707l17R645L796j0055
304b524k480J178J1913m559q381j182Q172P089j2744q35J35J2212n115o708j919
$$ y = [-19142, 2158, -18820, 25257, 3314, -25932, 23056, -21813, 23629, -12721, 8690, -19274, 9244, 22532, -28824, 9238, -8175, 21377, -16027, 3616, -2726, -6230, 23053, -17605, 1807, -10139, 23174, -7994, -10372, 6786, -5243, 15999, -13805, 3900, -10859, 15812, 2319, -14521, 3131, -49, 13711, -13276, 1259, -3872, 7825, 5639, -11589, -817, 1044, 12984, -9029, -5597, 1560, 5446, 5285, -10527, -1043, 1135, 10497, -4729, -7993, 1381, 6173, 4887, -9318, -2615, 2741, 8473, -3255, -7633, -142, 7271, 3074, -6298, -5246, 4129, 7076, -1668, -7800, -1085, 8371, 2090, -5004, -6073, 4466, 6260, -969, -7148, -2554, 8368, 3114, -5593, -5910, 3735, 7531, -2524, -5004, -3826, 8087, 3528, -4853, -6035, 2137, 9226, -3518, -4353, -4218, 7994, 2879, -3829, -5748]
319e748O811P945j0881l551J847J0700l237q451l12N491P328q279n877L103Q577
334E466L77j1384R37N159P105p614n960K762P935J199j0269j744P249N632o065
349G85o908K844Q325p88n767o374J0101L109k608r592L384R414l221k682q386
364h364J0782J663n15r298j61J3416n373j863q867J1284J811l320k537q069J8036
379H625p067P46j2966J2946N271j0620M756j1958J9423j0417O854j5651P811J4040
393A1793j5991N549j2317K2765j5229O701o433n199K1299j6547P550k0022K9826
406A3745j2576o119P806j2165K2327k1323K0146l0544K5958K967j8602R444j0904
419i840K9502l5805K8096k1367O682J4794j7154Q242k2600M6666l9653J2099Q62
$$ y = [-5748, 1063, 9008, -1873, -5424, -3577, 7123, 3886, -4565, -4877, 614, 7942, -337, -6214, -3111, 5466, 5843, -5541, -4604, 555, 7660, 46, -5914, -3152, 4783, 5982, -4287, -6031, 1218, 6850, 785, -6123, -3279, 5046, 4258, -1509, -7883, 2218, 5327, 2719, -6873, -3489, 5925, 2704, 22, -8364, 2418, 4081, 3566, -5732, -5893, 7523, 2150, 287, -8580, 2704, 4515, 1195, -1342, -9411, 8625, 1558, 2304, -10662, 2284, 7555, -3065, 1691, -10267, 9156, -1261, 5593, -10058, -2247, 11793, -4198, 1351, -10966, 11799, -3430, 3271, -3162, -8361, 12938, -3609, 3941, -16081, 13745, 1169, -4950, 2856, -9309, 13018, -8305, 11841, -18703, 7255, 10222, -8380, 1064, -9840, 19662, -16143, 11953, -9414, -2732, 12062, -5092, 3150, -19450, 27216, -12437, -338, 524]
432E24m058J3026j9925K7167m4880M9022j9228r092M864R94K0642m5434M9976
445B3598m2152K4953j221n827k626j2543N1850o4376L7827j4473J1182p744k889
458d441K0231m9418O8267m6233R898p554K2069n140l5839O1164o1526M5121k1059
471d460J2732k4579J4230L6903p5545O1523l0959K5387l2886K8890n888l5815
483c0467P1816o4090K7335j9977M4607m2464l835M9606o4148N3710l3950K8288
495A6431m6538M9153O19o0663O7725l8191K9752m8418N9672m2630l493N4338o5156
508b7399L4420k3007N6926p7816M0352J9400n0380M7745l3159L3103o0854Q1440
520D0771m4720k6309N6200l4049K1399m7492P8762p8346L7828K0942m9622K9018
$$ y = [524, -3534, 9492, -10433, 16734, -28146, 20876, 1648, -7444, -2580, -1586, 19056, -26378, 23598, -18554, 6399, 5178, -649, -3275, -15818, 36032, -28344, 9483, -4990, 6192, -1552, -4441, 15790, -33628, 34639, -11594, -1696, -9250, 12819, 7679, -28160, 33004, -28522, 16599, -4460, 8272, -16307, -2077, 34826, -40719, 20804, -10155, 15232, -17654, 11236, 5348, -30467, 41349, -22741, 4594, -15383, 29224, -13240, -17075, 32531, -31617, 22093, -11857, 16431, -30107, 19046, 19665, -40998, 26727, -11464, 18288, -30130, 29542, -13088, -16581, 37757, -27399, 7021, -15986, 40940, -36876, 3476, 22876, -27504, 20241, -12918, 20185, -40669, 40771, -3949, -30258, 25942, -8107, 13292, -34200, 44562, -33784, 4044, 24986, -24636, 4382]
532D382j2860M9979r6262Q2198k1335k3064K8237j6746J9892n5102R5060q1910
544b7531J5548K9352j6091j215k6074P3020r2406O7916j6047k0340J0789P975
556D896K3457q5048J00164n4461O883L697P307o195k9555Q3860r8875N0309J071
569G510L204k8139R414M6710q6991Q2566m3584P330j0145L2868j3058n4153R5714
582D9246p1959K9209j7452L0081l3878M650N2536r0181O7787k1552J7772m6940
594c0681M3385P734n9120P3480n2523K4256k3779M8872m5842j1254O6727o5263
606b4008L3148k3965M0660n1903L4554J3123n9426O0600k7198J9354n0057O3242
618B8124k7260k3211M8384m3522K6135k4456M9791o4339K7608K9778m6640K5749
$$ y = [4382, -8478, 41501, -54761, 27437, 6102, -16962, 11275, -5471, 14421, -40681, 54379, -27531, -11983, 17369, 1278, 63, -26011, 47009, -45397, 22519, 6472, -13868, -3079, 4896, 28353, -56695, 43469, -10992, -4109, -412, 6895, 700, -28855, 55005, -43870, 6439, 7510, 10714, -17425, -8011, 38699, -48292, 34274, -9310, -1980, -12125, 20743, 7685, -46468, 49246, -22713, 6496, -10956, 19125, -14753, -10103, 42433, -47748, 20039, -1513, 16259, -30681, 12704, 20438, -38682, 34798, -17725, 6531, -17248, 31624, -14218, -25472, 41255, -24008, 9140, -14825, 25835, -26068, 8486, 21609, -37817, 22783, -4415, 14939, -35118, 28124, 864, -22347, 26037, -17485, 8650, -15806, 33985, -30354, -2746, 27032, -19608, 6141]
630F141j7424L6617n6508N3190k0382k3978M0875k1579J2002m0266O6129m8543
642a3726P465J8906k3463J7643j7939L8682o2039M8531l685k1077J0985m553K2563
655A8293m4798N1374l6891N916J6448r573j232j8981N0227m9807K2495j723l782
668b034L389m767J9144m3746M8152k0727l043j363Q662N004k6046L6900l5423
681a5898K0536j728L56j0590Q93K7451l8421K4329j1162Q570p135M679K551k1213
695a6782L5214k4333N983p281J5660p047j0166J9342k2670K0962j0984N731j2809
708i180J1819P574k1477J6140r577J1337j0924P609n957k555J6741j7387N647
721a90m576J3447j1104o52O076q124J2265j0144M232p859J2886l372q858P158
$$ y = [6141, -11283, 25334, -31174, 22016, 1634, -22344, 18531, -3048, 8954, -31312, 34817, -13726, -6261, 12645, -10818, 6825, -11114, 27568, -34471, 14060, 10375, -10702, 283, -4270, 18293, -26505, 24869, -12022, -6106, 10342, 769, -463, -19444, 30783, -19024, 3471, 1748, -2034, 1355, -3412, 15732, -28014, 20138, -589, -3632, -4995, 3667, 8671, -17375, 19525, -15898, 4638, 2910, 3266, -7324, -6431, 21020, -17401, 6928, -4234, 4336, -2799, 1880, 4431, -16782, 18432, -5901, 82, -7199, 8461, 1414, -8752, 10590, -12080, 8882, -2102, 3629, -9180, 2639, 10213, -11264, 4876, -4701, 6636, -4288, 3321, -2636, -5191, 11550, -5837, -190, -4766, 8681, -2423, -3075, 3001, -5123, 7142, -3002, 1230, -6629, 6257, 2885, -5973, 1185]
735A185k786P196r369N217n202N639K861q822K810J30P181q718J119J041R71L422
751C875o762J904r95P151n482k943K734J822K015o084J651K3M775l070l497J360
767a523L436P98m289j019K692K729j782l709P10M285l26k588k602L529K082j166
783A257l478l30N001m34k607k325K814K995k488j334k385N754l67k388k527K029
799h13M705m459L09l271N990p87j556k667R22N858m489l76k654N498j80k557j028
816a555p21O232l725j002k258M289J872m673Q10j988O645l760o95k184L137L241
832C665n201Q09j976O405l226j314j411K263L560m589j90r68N003j309l096m4
848a619J141M142m403p39l18L901K3m026N28O46M209l871j155k36L680J77l434
$$ y = [1185, -1601, 5595, -3774, 1443, -3759, 1880, 4741, -4081, -1271, -1141, 6040, -2678, -1559, -518, 453, 3875, -2887, -983, -1978, 5173, -309, -3252, -518, 1304, 3319, -2765, -1114, -1091, 3684, 614, -2883, -1523, 1913, 2711, -1578, -2597, 95, 2824, 1042, -2667, -1957, 2328, 2002, -586, -3188, 341, 2423, 1257, -2221, -2551, 2450, 2016, -591, -2916, -102, 2893, 405, -929, -3314, 2440, 2073, -315, -2842, -813, 3892, -567, -258, -3529, 2461, 1674, 118, -2549, -1627, 4231, -258, -634, -3288, 2210, 2030, -527, -1555, -2276, 3956, 231, -771, -3029, 1260, 3132, -1541, -731, -2719, 3926, 166, -529, -2713, 424, 3665, -1536, -727, -2703, 3702, 476, -838, -2249, 14, 3574, -1015, -1205, -2173, 2830, 1521, -1575, -1619, -478, 3664, -739, -1478, -1796, 2105, 2128, -1898, -1370, -724, 3485, -386, -1541, -1777, 1903, 2080, -1354]
865a354n55J748K838k281k363M65L153J96k477j950K943J559o71l651R82L157
881A739r2j997k377L260J098m01k895o63M540q91j111l533M089J189j765n20k827
898c157N780k238J323n799M370K640l414L67l208O751m464L341n204J449M961
913C498l624L35m986R559n548J029r40j648N783m652M126r880J1185k576l172
928a511Q78j511P202r546R668j0967O982J765l288q00l490J3312j4297Q054m536
943b085K191J465k223L676j2177J7989j0499Q18j401L700J928r549J3925j6442
957h684J3316m010M06n195K738J1223j9807J5651r594P219n514M868k221r358
971h962K1614j8627O747m993J1032q860k371J3143j9509J8554j0066N742j2081
$$ y = [-1354, -1909, -161, 2677, 396, -1967, -1502, 1651, 1847, -630, -2580, 363, 1922, 1251, -2400, -1418, 1739, 1647, -350, -2727, 533, 1631, 1230, -1665, -2328, 2212, 1321, 210, -3323, 766, 1955, 190, -330, -3157, 2623, 385, 1708, -4091, 279, 2919, -495, -128, -3336, 3415, -1049, 2292, -2912, -1463, 3498, -126, 209, -4777, 4782, -766, 263, -677, -2325, 3458, -1194, 2932, -6948, 4237, 1661, -1511, -633, -2144, 5058, -4488, 5180, -5787, 1195, 2960, -328, -1128, -4618, 8694, -5603, 2451, -2085, 106, 1571, -652, 3024, -9153, 8836, -1663, -845, -2246, 1454, 3382, -6167, 7758, -8684, 4632, 622, 1028, -4167, -1429, 9794, -10013, 5638, -3956, 3263, -2251, 2617, 396, -8962, 12652, -5975, 772, -4221, 6811, -2049, -4420, 8723, -10786, 7768, -2298, 3444, -8637]
984h637J3494J920j8804K0516j3927J1123j2359J4475j2792j99J8405k2465J1530
997B280p284J6401k0864J0542N242j6453J8738j2287Q306j6749K4282j1934j0421
1010a0201J8880j3172R875j4445K1253k3049J1939Q846j9456J1718n642J6274
1022A2820k8514K4003p123q197J4107j0002O285j6214L1073k6786L571J2028r187
1035b136M140r915K2405l0779K4737m383j1367P641J88R939k9276L3414j9425
1048d817K886N082l260K47r945K9586l5065J6980J758k176m299j95J5447k9661
1062a7432L0798j5343j729J483Q135j917k0526L3619k5803J0624k606M336q332
1075d693J015K0123l4331K4575o342L500j1848J1251L344k1151K9522k1720O541
$$ y = [-8637, 4857, 6777, -12027, 8489, -5438, 5685, -6674, 7801, -4991, -5190, 13215, -9250, 2280, -5004, 11397, -9467, 1075, 6317, -10136, 8602, -3685, 4621, -12128, 12154, 220, -10201, 8679, -4493, 5382, -9063, 12190, -10859, 1080, 9926, -9530, 2188, -3454, 12820, -15694, 8309, 1186, -7011, 7096, -2906, 3379, -12835, 18238, -8548, -4977, 7051, -2136, 2004, -7911, 14494, -16285, 8452, 4069, -7298, 343, 531, 10470, -18806, 14608, -4817, -1931, 3151, -109, 138, -9807, 19779, -15286, 1694, 3452, 1276, -3023, -3218, 12229, -17432, 13366, -1977, -3706, -2223, 5912, 3995, -16531, 17088, -8715, 1909, -697, 3639, -4693, -3678, 16445, -17886, 6689, 347, 3847, -8001, 3250, 6594, -14557, 14965, -6755, -214]
1088b14l705J4376j4731n761K5886k6379J4887p727J0007j5903J2819O151k5890
1101a6184K5229j0615O650j6446K0449r005q855K0872k0068J0149o804J6890k2763
1114a0501Q427J2742j9304J2670p755J0764j7888J9750p264j2597J9258r419M115
1127B998j3782K2880j7407K593J0081j3638Q160m738J3622k4195J7944L81j0117
1140e218P081l908P582j5310K0761j5697L14R911n493J69p882J9473j9950J0375
1154B208j74n120L808j258P576j9672K0812q059j841P26J508K548r957J6366j6885
1169g414Q183J446p75m082p18J1972j6097J1483n453J293l46K145N78j0693J6677
1184H199j0423K185k201M706k131l547R148j2697R940k913J512n942M582M409
$$ y = [-214, -3919, 10457, -4274, -10035, 15851, -10528, 4359, -3368, 6639, -9264, 3555, 9706, -16184, 9045, -1570, 5080, -11366, 9083, 78, -8777, 12095, -7973, 2176, -4628, 12262, -10501, -2074, 10668, -8636, 4034, -3721, 7043, -10845, 8905, 1641, -10956, 8302, -1117, 2998, -10784, 12096, -5311, -2718, 7363, -6275, 1885, -2853, 10769, -13426, 4518, 4899, -5218, 1863, -2045, 5537, -9773, 10988, -4709, -4395, 5516, 23, 192, -7690, 11783, -8167, 2208, 2034, -3086, 722, -536, 7040, -12632, 8180, 121, -1720, -994, 514, 3062, -6895, 9471, -7414, 769, 2215, 1440, -2642, -3360, 8612, -7485, 3998, -1455, -162, -508, 1637, 2215, -8478, 8199, -2224, -39, -2240, 2466, 335, -3212, 5936, -6761, 3179, 266, 1778, -4164, 418, 4827]
1198D827r987Q406n898M530l200L644l486k593R645q486L091l037N806m303L21
1213g20K873o308P735m364K008n109O339p00m455M196l428M259l663L081m160
1228b416K198L325m836J555j241M120l744J034k00j045L724l275O83j908M455
1243B429k100j667J355n72K358k639J054j888K933j18k183K45O95J756k151p1
1259e64p8J225N96j889j69P40J521j212j288P61Q34P07j836k63Q61J251r00j329
1277a032M29J340N6r14j226J528Q07n41j406P2K017q74J42k015J959K98R5j598
1295h63l22K467j001J1j783J770M39k91p21j238K753p55k23j612J290J390j558
1312b47M99k005L050j027K07j748P72K163k039O38k026L072j072J04j250Q2K426
$$ y = [4827, -5160, 3246, -2652, 1878, -1322, 2322, -1164, -3757, 5888, -2598, 493, -2544, 3262, -1041, -720, 2153, -4155, 3580, -784, 1224, -3885, 2454, 1754, -2701, 1495, -1933, 2326, -1337, 1744, -2416, -218, 3107, -1729, -174, -1415, 2705, -1039, -5, -205, -1250, 2474, -801, -118, -2026, 2429, 329, -1338, 17, -555, 1803, -836, 218, -1670, 1263, 1145, -1038, -793, -98, 1658, -493, -564, -642, 583, 1179, -710, -879, -139, 1382, 170, -1118, -357, 477, 1184, -652, -915, -54, 1197, 297, -1032, -603, 737, 793, -121, -1347, 181, 988, 447, -959, -887, 1130, 256, 398, -1617, 342, 640, 735, -863, -1185, 1282, 281, 292, -1491, 279, 718, 427, -294, -1532, 1221, 466, 243, -1369, -79, 1311, -247, 252, -1753, 1297, 270, 477, -1271, -499, 1664, -375, 263, -1763, 1309, 237, 341, -909, -827, 1599]
1329A599j753K76j719K472j11r59j97p64K833j871L77j593J856P56j714M32j323
1346a403L187j992L78j451J553R98j730L09j076K683j293k68q77R34J459j782
1362c71K9o08J996m95j020q9R0J992j833l6o25J880j97j280K4J45J687j383l04
1381c98n09J643K6j107n39Q59R31n93j067J96J066K74r49q24J063O06q6j477K86
1400e99J153J60p86r88J198M91k06q21o39J823l85O8k002J792N24o73k41j077
1418a208K286j324J334k715J581J014p48m30j292L134k221J373j673L45J500q11
1434A45M27l059M451j942n0n11N4J798k431L087m783M012n72l58j223o6L734m942
1452b229M029l520K242l46N06p06k797O406m985J754j573K259q57j208L390o084
$$ y = [1599, -154, 122, -1597, 875, 764, -195, -392, -1156, 1677, -194, 183, -1410, 446, 1202, -512, -80, -1403, 1784, -208, 170, -1281, 272, 1270, -460, -151, -1227, 1456, 163, -105, -982, -48, 1411, -371, -342, -950, 1046, 551, -469, -558, -468, 1524, -309, -345, -970, 910, 713, -567, -543, -398, 1289, -94, -398, -907, 736, 762, -345, -884, -25, 906, 313, -754, -558, 508, 782, -167, -991, 72, 678, 592, -885, -599, 554, 714, -72, -1060, 138, 629, 423, -398, -1037, 786, 401, 469, -1533, 259, 783, 110, -131, -1208, 1078, -246, 1088, -1627, -46, 968, 220, -210, -1502, 1632, -589, 784, -889, -544, 956, 145, 572, -2487, 1964, 22, -28, -539, -485, 1313, -1118, 1969, -2814, 1198, 626, 268, -955, -1021, 2713, -2229, 1800, -1720, 522, 176, 682, -24, -2821, 3585, -1400, 354, -1219, 1040, 183, -1025, 2365, -3719]
1468c719O187k580P27k876K966J745n803O036m989L893k656K998l445m08O320
1483D396p199L699k636M549m821K477J209n522P336m445J954m610P038l031l553
1498c159O296n613M505m206N770p478M149L557p304M490k594N633q561P281k845
1513g9k633O007m480K057n070J0062q356Q71M148m242L116l518O434j0140Q868
1528C045r98n245L773q30L850r548J1038p308J219L288k817L11l213J0578j2508
1543e365O081M96j592K15p70M717j0464J2304o309j228J582K031o1p431J2343
1558F549j0790N332m78J43k755O33Q099j3877R996l078J428l472L418R90q076
1573e938J2528r355K370r06M931m771k724J0040j1152P391l047K231n136N053
$$ y = [-3719, 2468, -112, 615, -2261, 705, 2450, -3353, 2683, -2306, 1587, -1069, 1929, -1516, -1924, 4396, -2803, 896, -1740, 2809, -2012, 465, 1674, -3848, 3488, -957, 997, -3613, 3425, 394, -3159, 3137, -2476, 2029, -2177, 3593, -3885, 264, 3821, -3483, 1007, -1587, 4046, -4515, 2766, -79, -2712, 3295, -1185, 872, -4198, 5864, -2492, -1621, 2527, -1715, 1401, -2117, 4317, -5823, 3045, 2047, -3198, 575, -255, 3595, -5953, 5085, -2223, -1004, 2284, -533, -222, -3435, 7143, -5365, 716, 1212, -380, -165, -935, 3782, -6682, 5622, -687, -1915, -333, 1698, 1637, -5794, 6549, -4241, 1091, 613, 756, -1999, -1366, 6733, -7144, 2852, -226, 1202, -2270, 1148, 2138, -5938, 6590, -2765, -395, -1301, 3630, -1141, -3865, 6175, -4977, 2414, -633, 1598, -3538, 1515]
1587A515K795j1410J1250n140K669n284O934l729l479J0017r999M389k103O420
1601D845q792K940N518q931P126m143L662o696Q439k886o313R275n218K846n789
1616d117Q900p498J613N326p897M549k085O062j0594P523M46n163M804l042L147
1631A974o280R459o877j023N772l575J173l897Q021q513M878P79m553L369q93
1646a86L516q995R149l335j536K195j192J387m072Q023q374K982K137j433r52
1661f86j109N656p591N959k388q78J110O82P69n941Q234m916J080m14R45m41j561
1678a490N019p281M933o49K08k414J527K453n057M963l393J246m07J716j625k223
1694b474N546m321J593j209J828j416K46J874m412M387j653O42k427K629J67k490
$$ y = [1515, 4310, -7100, 4150, -990, 1679, -3605, 3329, -400, -3879, 6138, -3861, 528, -1575, 4845, -3947, -1007, 4511, -4420, 2706, -1437, 2225, -4471, 3968, 1082, -5231, 4044, -1174, 1672, -4117, 4783, -2715, -1102, 4224, -3673, 876, -1209, 4853, -5741, 1782, 2228, -2935, 1869, -1173, 1974, -4306, 5153, -1724, -2747, 3025, -550, 623, -3274, 4747, -3766, 1112, 1891, -2662, 707, -186, 3330, -5665, 3484, 149, -1387, 808, -384, 1003, -3069, 4954, -3420, -438, 1699, 266, -686, -1795, 3861, -3730, 2229, -159, -1037, 73, 755, 1524, -4417, 3817, -1099, -19, -433, 512, 71, -1490, 3529, -3752, 1181, 532, 740, -1674, -147, 2306, -2751, 2212, -1181, 65, -342, 1374, -251, -2474, 3072, -1249, 344, -865, 963, -453, -207, 1667, -2745, 1642, -11, 631, -1796, 833, 1000, -1490]
1710a490K844k639J936j035J639k481M95K629k781J048j010J944j680R31j23j605
1726a378K709j492M62j731K556q88p96R66j215J642j107R43j947J636N10j308
1742d38K74k69J277j144N28o57J55J129r66j38l73J432o83m82K33j42R70q54Q2
1761f6n72J150j15p04m4K85O52n84k86n4N86K36o81k72N19L19q3q00L76K37M78
1782E77p83k57N31K41Pq19L39K88L16m29o42P35K03J0p74J63O43k56K42j123R72
1803A84n6L64r32j8R44m87L59j173J078k24M25p08l69J086l64J83j020Q57J46
1822B75j44o7q40J317n19L73j082N95O29o17L06j104J517p49N62j051L77P76n96
1841d2K42j040J338m47K03o28j7R86o68K74r45J020K9l00j02n26J368q88M11r91
$$ y = [-1490, 1354, -1285, 651, -384, 1255, -1226, -731, 1898, -883, 165, -845, 1099, -581, 350, 227, -1378, 1331, -161, 301, -1430, 1126, 238, -558, 408, -807, 835, -272, 671, -1276, 360, 870, -438, -164, -433, 844, -300, 228, -429, -274, 855, -111, -249, -622, 810, 127, -355, -122, -264, 706, -148, -66, -638, 512, 397, -307, -351, -66, 586, 2, -284, -338, 248, 484, -197, -469, 50, 369, 286, -514, -138, 99, 577, -206, -463, 68, 309, 316, -503, -164, 124, 440, 11, -631, 104, 307, 317, -457, -294, 349, 93, 335, -788, 184, 128, 492, -440, -458, 486, -1, 358, -815, 263, 39, 464, -244, -613, 473, 109, 292, -728, 129, 275, 131, 64, -776, 541, 22, 395, -687, -92, 537, -80, 226, -878, 639, -110, 452, -599, -222, 554, -42, 200, -840, 498, 51, 254, -374, -391, 595, -73, 201, -744, 276, 305, 5, -97, -623, 745, -143, 268, -723]
1861g23R46J52m39O1o30J337p79L10r02Q01K99m55o8m09R97l98j6m86K67P03o05
1882c7n7m12R37k47k42k03RQ15o22N0n58R72j93k24l63K79N05l47j69l24O97j0
1904B56k00m90M02L24n8m73o7M72J65l13l97L04L57o4l43l19O68K1r1o57M58L91
1926C46k97on88Q80l69M95j125N97M38k55j62n42J132p74O80q80K09N06q1q3j019
1947h98J578p20J46l07l1O07n98R58j929J697k80p8n36P0J209j735J756j766J080
1966B23k27N09p48p49K378k042R72q78R85n65J00P85k286K610j155L39j186J361
1984D26K44j821K391k426J821r73J265j875M20K229k948J786j276J786k021J611
2000F39l18j855L004j826P05j785K942j691p28K143k440K015j437K030l246K309
$$ y = [-723, 223, 375, -64, -3, -633, 704, -75, 235, -667, 134, 433, -22, -90, -499, 498, 100, 84, -402, -135, 568, -37, -94, -506, 431, 184, -58, -261, -252, 563, -59, -9, -567, 405, 212, -12, -375, -96, 409, 62, -107, -431, 266, 256, 56, -434, -32, 292, 234, -239, -306, 166, 331, 18, -379, -75, 282, 218, -125, -444, 224, 245, 154, -503, -45, 346, 49, 43, -545, 335, -34, 461, -664, -67, 371, 116, -46, -588, 544, -230, 450, -430, -221, 285, 204, 121, -898, 680, -40, 106, -201, -232, 375, -223, 735, -1194, 503, 223, 145, -391, -321, 888, -847, 909, -857, 223, -4, 505, -243, -992, 1386, -656, 316, -562, 423, -142, -42, 743, -1543, 1067, -88, 251, -935, 426, 670, -1151, 1240, -1186, 635, -338, 927, -948, -528, 1701, -1247, 539, -737, 1049, -972, 639, 321, -1534, 1470, -356, 349, -1436, 1506, -185, -913, 1230, -1210, 805, -632, 1398, -1848, 461]
2016D61Q77k782K024j204K037l241L411k097m99K451j863N57j689M019l838J155
2032b21J108j718J345j022K030m018M061r89j830J644n23J277l262M396l691J205
2048b08J309j433K8p25L763n158L157m19o58K95R6J014l698N123k934l22P18P59
2066G07m08k164M384m530K625k11k71j105Q39K467n188M328j781O06j055J615
2082H58o60k293M911m115J094j60J835k317r6L116m315L231j157M73j908K458
2098I55L57l936M381k345J122j688K558k107m08L533m122J923o51K187l532J938
2114A65J178l120K971j525Q34k239L628j850j889L419k037R21j730L096l257J392
2130d3J608l047J790n99J997l969L359p24j383J873j210P38j881L729l321L00
$$ y = [461, 1338, -1444, 580, -624, 1413, -1828, 1583, -514, -1013, 1438, -425, 132, -1557, 2462, -1376, -221, 887, -831, 514, -508, 1522, -2496, 1565, 576, -1254, 390, -133, 1144, -2118, 2278, -1413, -208, 1101, -332, -304, -1029, 2734, -2424, 733, 314, -344, -49, 47, 1061, -2637, 2486, -448, -770, -52, 707, 299, -1865, 2519, -2011, 614, 403, 132, -973, -134, 2333, -2855, 1473, -308, 298, -757, 858, 198, -2095, 2816, -1299, -205, -365, 1470, -847, -943, 2173, -2142, 1089, -68, 405, -1503, 955, 1312, -2624, 1757, -588, 534, -1154, 1404, -703, -1111, 2422, -1700, 223, -428, 1759, -1773, 165, 1343, -1777, 1194, -331, 503, -1736, 1892, 42, -1847, 1572, -465, 456, -1274, 1822, -1435, -43, 1565, -1482, 308, -291, 1706, -2263, 1096, 372, -1011, 862, -348, 390, -1491, 2238, -1083, -783]
2146g83J869j323L28r94K550l361K491j45j727J314j26J046l282L667j783j18
2162c77P97o00L36j132K954l534J623M66m47l73j20J613k683K612j294l52N43
2179C2M21o6j971L079k078O58j20J52k34k72J751k907K106m58K18r32O47O17j606
2198i63J964j587N59m0O58q25n69J884j614P59m56M38l96K36N83j750J791o74
2216bK41q44Q79M1q23J125j208Q04l13N97r79K29Q80r30M09l95N22l68L16j06
2236G5o66J098n23P8n12P33j53l39M34o39P15l49L03p14N32K49m37Q1j53M22k39
2257dQ9k44J1M56k86j28p3L38K9l49J66k23N19l18j6j74K84J63l82N2l5L42j55
2280F2j73j1J41K03k51j49J64O7J90n05K52n9L59l62j09K33m8K63n03K56j15L53
$$ y = [-783, 1086, -237, 91, -903, 1647, -1714, 777, 632, -1095, 219, 93, 1139, -2143, 1524, -259, -377, 420, -180, 156, -976, 1978, -1556, 67, 533, 86, -287, -407, 1206, -1477, 1135, -159, -511, 32, 453, 387, -1584, 1495, -583, 75, -45, 107, -127, -399, 1352, -1555, 551, 93, 311, -621, 26, 643, -963, 1001, -586, -27, -67, 591, -234, -803, 1081, -533, 226, -230, 208, -188, 48, 631, -1119, 672, -2, 239, -605, 274, 315, -508, 617, -591, 213, -100, 497, -482, -253, 627, -303, 106, -289, 233, -135, 181, 75, -591, 507, -16, 62, -450, 283, 130, -209, 225, -414, 301, -48, 255, -459, 73, 322, -115, -34, -187, 235, -4, 85, -159, -148, 308, 22, -106, -179, 159, 188, -161, 5, -218, 301, -17, -33, -207, 77, 240, -142, -90, -125, 217, 62, -111, -122, 19, 222, -29, -178, -14, 53, 243, -262, -10, -69, 290, -72, -181, 52, 4, 267, -236, 20, -95, 258]
2302B58k51k33K44M6J31l79R9J20J7J52n42M02j03K96m49K9L17k02K99o33N20
2323A38k65M31m46o0L33j13J80n27M28j33J87j46k75M29j66K23n03K77J31j14
2343IJ44n30O33l65M02n84K39J87j25J34n33O30l48L42m54J26K26j18R9m31M36
2364A19r2P2j74j58M72k88K14m81M08k6k8j6l06N61l61L01n67M67m3j2p3j99M01
2387A91j96J58l86K30J44r4p3j74L50j11J9j68rL10j98N9l22M72j90N9k19Q6K04
2410A42j30M2l18M13j16Q8l30K09Q4J2j45j08K18K8rk25R9J35Nj02j65K31M6l6
2434F8k08O6K21j40Q4l41L79j57K30m36J85J86j22M3l13M58l43L82m28Q8J79J3
2456I4o4l37N34k78J22j04r3K13j00K80p10O16q5m9j38j5L86n74P29q09M72r5
$$ y = [258, 7, -226, 18, 64, 195, -184, -85, 35, 52, 204, -338, 64, -39, 257, -192, -163, 154, -48, 251, -382, 138, -127, 304, -142, -202, 131, 18, 198, -329, 99, -34, 153, 7, -268, 161, -5, 218, -285, -8, 123, 9, 153, -377, 256, -109, 293, -291, -52, 135, 10, 144, -389, 241, -107, 235, -219, -93, 133, 15, 114, -317, 119, 27, 99, -75, -233, 239, -49, 165, -316, 92, 66, 38, 22, -284, 277, -84, 217, -350, 117, 74, 62, -11, -210, 191, -5, 153, -233, -3, 141, 47, -26, -200, 150, 39, 58, -110, -119, 191, -7, 52, -270, 202, 12, 71, -148, -62, 142, 12, 54, -264, 149, 33, 121, -209, 0, 84, 96, -49, -157, 61, 89, 80, -145, -46, 89, 94, -8, -173, 58, 104, 68, -140, -74, 147, 7, 91, -250, 129, -28, 202, -234, -49, 137, 15, 58, -255, 203, -140, 242, -186, -98, 81, 94, 30, -307, 227, -51, 71, -33, -126, 87, -13, 267, -443, 173, 88, 39, -99, -114, 272, -302, 427, -382, 90, -5]
2478eK41m07j08P60p92N24m36L68l20L53k9p14R87m66J08m03N78j71l87Q17j014
2499e16P42l31M93q68M45N69j027Q12o36O91p99R15o17l38J044p36K49n75J139
2518F56r95K61M94r13P52l63N92j342J288j19q28P79m67O13j107J553j398L59
2536a85O83o52J15m32J435j783J132j98m14M39j17L72j412J933j023k37M92j16
2554C2J67q56J694j938J101J42m29j56N4J159k097J815q65J29k4L22j43j051K127
2573A183j722M59M2L97n69j51J286k010J604m30m7n82Q46L16j780K046j276N50
2591A62m82R11r10k39J736j967R42l42Q24j278P46M63j506J615q11K50p61J384
2609G37o72r10J695j310O83n90J063j385O23R51j746J089m01Q35j592J451l66
$$ y = [-5, 236, -171, -279, 481, -311, 213, -223, 145, -175, 178, 149, -565, 422, -44, 64, -339, 239, 68, -319, 498, -516, 226, -105, 388, -480, -35, 534, -493, 319, -317, 374, -425, 490, -127, -465, 579, -157, 92, -483, 656, -339, -78, 416, -497, 255, -108, 484, -858, 430, 311, -517, 262, -205, 408, -699, 854, -544, -185, 498, -154, -39, -471, 964, -819, 313, 115, -299, 140, 23, 395, -1017, 916, -107, -344, 148, 32, 199, -657, 1037, -901, 200, 342, -87, -243, -189, 970, -1127, 688, -177, -48, -72, 250, 107, -944, 1183, -539, -80, -38, 359, -210, -361, 925, -1085, 519, 89, 42, -540, 306, 622, -1158, 888, -388, 162, -320, 591, -319, -558, 1178, -789, 153, -189, 635, -643, 103, 566, -940, 675, -136, 114, -647, 737, 65, -845, 850, -460, 223, -367, 696, -689, -66, 885, -861, 228, -173, 662, -930, 521, 155]
2626A55q02J252p76K82p65J670j457N7R80q98M39m34R86j554J291k8j030Q28j85
2645A1M84j455J775j065J3O13m77P0m23J456j809Q78J80l18pm0N90j286J475p25
2665f0k73M06J02nq83J501j245N27P5j73j19J7Q81j610J221l18M0l23L49J27q03
2686e66J244r91K48J0M01m77k42R54r94O19k76J52l00L44K21j006J067n19K60
2705A49m67N48k62k16P08q53M88j95M70p25L04L51n56M43l15K47l23M62k32l87
2725c61O77l92J89l57M78l15M4K60n34M65k19L19o04M62nk16J93k19K42k35L49
2746B21l71K7K84j81K8j78L13j95Q6kj93L00j57J15l14L60j18k9Oq8J83j22J43
2769A18k81J98N2n8q6J4R7k6k3n5j0J70j17l1m9J44kr8K1n4J84j12j0q6J51oo4
$$ y = [155, -647, 605, -171, 111, -654, 1016, -441, -384, 596, -302, 137, -297, 689, -865, 426, 398, -632, 196, 11, 495, -960, 815, -250, -237, 376, -101, -31, -454, 1002, -807, 71, 251, -67, -74, -114, 476, -810, 665, -60, -333, 73, 175, 170, -713, 788, -457, 70, 145, -28, -147, -130, 751, -859, 362, 44, 84, -239, 110, 237, -566, 678, -313, -65, -55, 346, -131, -373, 581, -413, 206, -70, 82, -218, 126, 347, -659, 408, -111, 149, -318, 230, -32, -248, 460, -393, 95, -100, 370, -355, -51, 300, -256, 187, -128, 119, -204, 258, 26, -361, 316, -76, 113, -244, 234, -81, -37, 223, -311, 154, -65, 254, -350, 112, 107, -109, 84, -135, 107, -128, 221, -150, -123, 161, -20, 8, -170, 143, -52, 34, 32, -161, 139, -18, 97, -217, 143, 25, -4, 2, -86, 97, -25, 118, -163, 35, 87, 29, -57, -43, 54, 28, 5, -50, -60, 110, -7, -38, -87, 57, 55, -43, -22, -76, 108, -4, -14, -100, 51, 45, -19]
2796a9m2M7N3K6j35N6J9J00j32l8Q6k4J16k15J23q4K10j75m2Q0J7O0j74R1l1R1
2822F4k8j38J13KQ6j98O0P4m2R3k34K21j43K22k55N7Q6l8R0k45K31j35J93j91
2846e5MP6JO1k05J54j6K8j8j33K03j34J59k60J54K4j8K1k05K74j83K01k70J42
2870EJ6J0kj52J96j08J21j66L8J03n4L2j50J57k6J0l6q6J83j12J16k44K11n1L3
2895D4o3m8J49j02J01k06J63lJ2j02K2P5rj2o2PR3m0l9p0J36j3m1n1L1Q5n4Jr4
2924i0J33k2J5j39J31NK9j14L5L0L0J5j26R6l7J15j95R6QN4o1o0Q1m7J00j04l2
2951e4P4J5L4k22K32q8M9m2n7J12j30K56l91K89j13J35j77J2J93k40K73k99J90
2974E1j04J83j29j82L67k50J42j93J98j05oK16m57M23j96K18m04K95N3l10L85
$$ y = [-19, -61, -14, 39, 65, -70, -14, 5, 105, -27, -65, 21, -3, 113, -102, 21, -63, 147, -28, -70, 10, 27, 87, -87, 4, -27, 64, 36, -102, 11, 13, 99, -99, -39, 35, -7, 86, -148, 73, -70, 152, -103, -46, 40, 2, 92, -153, 78, -57, 136, -55, -51, 25, 26, 87, -118, 36, 20, 48, 30, -103, 100, -34, 125, -135, 19, 43, 25, 46, -159, 115, -68, 133, -137, 5, 21, 31, 29, -123, 73, -35, 86, -80, -42, 61, 7, 39, -111, 46, 20, 30, -6, -92, 91, -21, 95, -149, 62, 11, 44, -19, -67, 82, -20, 81, -125, 38, 35, 47, -55, -33, 42, 33, 21, -41, -34, 59, 19, -20, -90, 46, 33, -8, -59, -28, 57, 3, 4, -90, 43, 21, 36, -103, 28, 33, 62, -52, -17, 13, 43, 58, -68, 28, -9, 106, -89, 7, 15, 69, 8, -52, 29, -18, 82, -22, -54, 20, 35, 69, -153, 79, -9, 40, -2, -59, 53, -77, 179, -212, 77, -36, 99, -78, -66, 127, -113, 160, -139, 51, -53, 130, 1, -181, 186, -64, 78, -115, 83, -22, -28, 188, -269, 154, -42, 176, -228, 67, 120, -190, 195]
2995A95l78L22l37M81m44L0L55l32J75k69M52m67L31Jl66M17k15K39n67O52k79
3016dj60L55l53L13l89O71q08M17J61l06J28j87N42q02P37l86n7K23n4O9n45R33
3038D98p14J81J08j05O1k14O47j033Q26j81j10j05J60K93q47J033p64K89n5K42
3058B10l10k28R37j023N38j94K33l38J84L51r53J040n26J28k98N13j39n96J067
3077E96r87N54l01M86p02K53O70j112P69l82M62p34P23j73o36J011o63K57m71
3096c80R05p35n3P44q79N99l78O13j019Q48N0q14P62l95M55q90J138p92k2O48
3116D05n85K29l99J019j190N74K00n17L94k54M99j036J166n05l24N10k39K78p75
3135e50J223j138M96K14l73Q9j54Q25j327J023k91j34R7M1J89q18J246r11J46
$$ y = [195, -183, 139, -198, 283, -161, -131, 224, -108, 67, -202, 250, -217, 114, 115, -251, 166, -49, 190, -377, 275, -4, -164, 191, -162, 151, -238, 433, -375, 42, 203, -103, 25, -162, 380, -422, 315, -71, -128, 95, 41, 110, -435, 498, -216, -35, 73, -32, 29, -185, 462, -571, 255, 74, -36, -141, 19, 312, -535, 498, -266, 23, -32, 210, -100, -328, 609, -414, 124, -70, 163, -175, 9, 360, -593, 447, -79, 49, -249, 264, 125, -471, 596, -391, 163, -138, 348, -354, -101, 569, -543, 226, -156, 306, -428, 295, 122, -514, 497, -166, 91, -380, 525, -210, -263, 481, -398, 201, -177, 436, -583, 265, 315, -499, 263, -132, 323, -567, 571, -221, -243, 405, -180, 49, -350, 669, -521, 53, 253, -264, 130, -124, 375, -661, 505, 0, -324, 186, -53, 225, -550, 673, -465, 31, 245, -128, -39, -193, 632, -695, 328, 37, -97, 0, 41, 230, -588, 658, -253, -107]
3154a07J61P7j18l64R53j146P97k17m4j51J98L69j063J128o42K48k24L20k03l26
3174c54R43j005M85j27L08m71J17M88q65Q00m20J84l22M60p1o16R10o71L76l51
3194b02M56m27P6N12q11N74k72L72o22M73J4m34N69m20K27l13N57m48r7N01m53
3215a68K75k99M44n08L56M6m13M12k19K85n44N82k95l1K17k56J86k18M54n50K54
3236A0J13j80Q7j32K86l93L92k03j01K24j14J19l58M71l35J41nq9J13j13K46m15
3258b36L39q1j3m4qJ23j96K54k40Q6O9k0l7j08K53k20J41r5J4N1k6O3k34K83j42
3283b4O3r6P8Nl6O8j52J38j1lr5M5P1p0K5m7J8O7o3jn3J48q9J2l9L1M1j6k5m8
3313e8J02k6k9k2N1lJ1n5K9j2P9r8LL6M4l2n9N8l3P7q7lJ0O5j4p8M0J9J6l6m1
$$ y = [-107, 54, 131, 13, -351, 602, -544, 253, 36, -8, -159, 39, 408, -655, 473, -169, 79, -145, 175, -28, -354, 589, -416, 69, -58, 250, -221, -104, 384, -481, 319, -101, 83, -239, 221, 150, -466, 444, -227, 149, -202, 254, -173, -97, 415, -396, 178, -94, 278, -344, 129, 143, -291, 278, -142, 85, -228, 329, -119, -216, 285, -168, 107, -192, 252, -256, 100, 146, -267, 145, -74, 211, -333, 249, -46, -77, 140, -116, 70, -148, 306, -244, 10, 123, -57, 30, -102, 184, -209, 183, -20, -121, 103, -11, 108, -250, 221, -114, 27, 22, -67, 46, -67, 179, -236, 103, 22, 9, -35, -43, 80, -116, 138, -102, -16, 53, 33, -4, -112, 141, -79, 62, -33, -19, 32, 6, 69, -165, 118, -24, 39, -57, 21, 26, -10, 58, -94, 44, 33, 30, -65, -20, 51, -19, 6, -41, -23, 44, -19, -20, -73, 75, -14, -2, -41, -10, 31, 15, -10, -58, 44, 18, -11, -33, 18, 15, 26, -29, 0, -12, 67, -31, -28, 8, 52, 20, -39, 19, -14, 63, -24, -27, -17, 48, 34, -44, -4, 15, 31, -5, -46]
3344d6O6j9N4j27N9K1K5k9o0R6n9R1j43P1qN0m1n5J07n5N8r8L0K2J0Pq1Q0k0K6
3374C2n3j4P1l2M5j27J20n0O0p8rP1m4N4j20R7j7L7p8MM3Qll9J1N3j8j7n2Q7j7
3405B5j6k6J3L6k5J1o6P0NJ0q7O4LK1n2KJM3j1o9L0K8M4j11N1nM0l4k6J8nQ2r8
3438c4kL9J7mq1J19q7R4o0l0L7J2P5k04J83r8R2j08O3No9J64k30J58r6J48j62
3465e9JJ47j60J54j67J29j18J29jk14K77j78J51k38K39j22k4K00l02K45j90L02
3487B01l72K00P0j82J77k15K76l39L69k15q8K44j72J61l31M64l80J53P1k19K15
3508H8k00L75n98N08j55p5Q1r5K41m59O22n34J90P5n3J2k58N85o33M33j58j8K2
3531dm0L03o84P56m28J25r8J22O7m10P35p92M72j39J44k62K4N02q04O67l79K20
$$ y = [-46, 20, 1, 55, -72, -13, 8, 33, 4, -56, 40, -19, 72, -71, 0, -8, 42, 1, -54, 53, -2, 56, -42, -12, 10, 20, 27, -54, 26, 6, 32, -21, -35, 36, 4, 49, -78, 42, -8, 52, -26, -35, 36, -8, 46, -74, 23, 6, 43, -35, -31, 12, 20, 17, -22, -11, 42, 24, 7, -45, 42, 25, 9, -17, -4, 32, 7, 18, -48, 22, 27, 37, -50, 14, 17, 38, -14, -12, -11, 32, 21, -48, -18, 10, 54, -57, -6, -11, 29, -5, -31, -13, -18, 64, -34, -36, 3, 20, 16, -65, 54, -33, 61, 1, -29, 8, 20, 95, -109, 74, -24, 68, -40, 23, 28, -41, 123, -107, 51, -45, 103, -59, -58, 89, -71, 83, -84, 45, -73, 56, 55, -159, 118, -60, 91, -147, 92, -30, -54, 146, -156, 89, -101, 201, -171, 29, 99, -83, 94, -121, 155, -184, 185, -30, -118, 126, -46, 115, -216, 248, -132, 21, 92, -127, 88, -112, 263, -335, 173, 18, -57, 24, -71, 170, -289, 333, -201, -11, 64, 11, 23, -235, 350, -283, 150, -8, -26, -4, -44, 259, -425, 331, -97, 28, -70, 52, 119, -291, 444, -348, 124, -15, 129, -133, -109, 393, -411, 256, -123, 97]
3553I7k55K91j0n41Q46o40L06k77M15l18r9N82q05O40l47L49n81M80J11o43P17
3574C18n10L80m78O38m68j27O72o69L53l47O45p28L65K30o41O16l79M00p53Q55
3594C72l37l33N89m62L54n42Q54q73L46L31n35K91k35O30r79Q16k43k93M02k05
3614e2K44o94J048p78J28K62k01J21l54P95j049P70j51j93N5J6L86r19J035o43
3634a74J46N7M8o4l88R68j010M96o9Q0k05ON18r70R50m76Q7j67L26J3o49R78q15
3657c14M39k26K93l48J8O32r66O90k96K70m59L84O4o20Q63o07K76l25N67m22j73
3678b60O61p06M83l57M46n86M24J34o40O25l50L40n56O19l35j56N19n17L01k96
3698b07N82o59K60K55m51L67k91L88n94O19k31k65M15k64K42m74O35n13J78J68
$$ y = [97, -158, 133, 123, -418, 428, -212, 94, -183, 232, -86, -185, 397, -408, 232, -115, 234, -347, 133, 244, -399, 318, -192, 188, -290, 348, -120, -247, 425, -244, 109, -238, 407, -321, 44, 274, -367, 249, -130, 270, -483, 372, 35, -298, 291, -171, 183, -359, 495, -378, -32, 299, -236, 55, -180, 450, -529, 287, 44, -249, 153, -52, 192, -502, 546, -232, -104, 158, -43, 78, -276, 519, -530, 240, 89, -104, -49, -33, 353, -566, 469, -174, -28, 29, 77, 13, -375, 593, -417, 79, 10, 90, -115, -109, 409, -561, 389, -87, 0, -167, 159, 172, -477, 501, -314, 125, -101, 192, -156, -138, 494, -472, 218, -78, 192, -267, 117, 181, -439, 424, -183, 93, -232, 335, -87, -260, 401, -305, 178, -179, 267, -319, 105, 239, -401, 224, -126, 214, -342, 277, -58, -214, 305, -212, 89, -207, 375, -284, -24, 231, -220, 147, -144, 244, -350, 269, 38, -227, 188, -76, 166, -308, 327, -186, -8, 160]
3718A60l01K08j98M34o34M67r3j49J69j49K28m21N73m30O5J45q5O5k66M78n00
3739b34L32p9p6O1l1K09m61M76k51P9l4K3M2j93L64l98K08j2J7p2n3K56l36K99
3763A36j92N3nL8K2k37L49k49J26j01R5m2m1J51k60K34q5N8j10M9P8j47J61j53
3787g2J01l8N9p5m5J76j63R6q5Q5m9K5J1j00J38p0L4q9Q0j4l0L7o5P8r%o3L1O2
3816D6p7K5j1K2Jj4nl0R4n8j0j1N0j0k1Rk6O1om7nL1K8m9jJ5ML0n2PpO2n3j7K0
3851eJ1K4o4L0j4M2k9l6M4mK1o0L3MKJ9n4L9qM3p2L0J7LJ7o8N7k8N1n7oL3mJ7
3885B8o8N1nK2l4j4M4j2J4o0L4nJ8j7m6O3j6K4o4M5LJ7l0k5M0QJ8o8K7K5Qn0K1
3918dMOQl3MK8M2o5k0M3Pj3l4K7k4O3m8k1K3K0Rr4J00n5O4o0RKqR1j50R4l4N9
$$ y = [160, -141, 67, -131, 303, -331, 136, 43, -106, 63, -86, 142, -279, 294, -136, -71, 74, -11, 54, -212, 266, -234, 98, 19, -57, 4, -27, 182, -279, 197, -54, 25, -9, 14, 56, -137, 227, -171, 37, 25, 42, -30, -83, 173, -163, 136, -56, -3, -8, 30, 52, -185, 164, -85, 41, -60, 35, -7, -48, 103, -157, 77, -8, 50, -60, -11, 67, -80, 81, -72, 29, -9, 50, -25, -70, 106, -57, 39, -46, 39, -10, 15, 26, -74, 64, -6, 28, -61, 19, 5, -25, 12, -53, 25, 16, 16, -47, -16, 46, -31, -6, -17, 5, 6, -8, -13, -43, 51, -7, -17, -28, 22, 12, -9, 0, -26, 35, 29, -18, -23, 8, 36, -13, -14, 1, 5, 35, -17, -10, -17, 45, -8, -25, -5, 6, 30, -34, -4, -18, 24, -5, -41, 3, -1, 20, -40, -7, -3, -1, 18, -36, 3, -5, 38, -34, -4, 13, 16, 33, -35, 22, -6, 45, -12, -18, 15, 11, 28, -40, 11, 6, 28, -6, -20, 24, 12, 26, -34, 0, -5, 13, -4, -50, 13, -3, 21, -43, 2, 5, 22, -8, -33, 7, 15, 33, -35, -8, 17, 25, -25, -4, 0, 6, 14, -19, -15, 13, 55, -10, -30, 13, 20, 7, -27, 0, -24, 39, -9, -30, -7, 13, 22, -72, 28, -27, 37, -23, -14, -12, -20, 71, -79, 15, -19, 40]
3952D0q6K9M7q4J31j24P0o3J08p3o1J33j06J10j32J21j07P6M5j68J66j11J40k21
3976a20J78n4m5J21j44J30j74K51k37O4R5j16J07j68K47k80K23p9q4J41r5J63
3998A24l36L82k43P2L2p8J03j75L54m47K88m8j4k1p0K71m10M19k90Q8j0N9K0l04
4022b34N04m41K49j37J13r4n9L41n45M74k46J67k39J88R1l90N33m56K78k08K89
4043A78k44j02M79n50L77k65L23l81K44J30m97N60l60K65m24N04k30j99M75m96
4063b13L62l38M85n58K55K52m91L95l03M14o05N80k25k44M65l40K52m93P49o14
4083b15J56K41l45K77l03N59q01O44j19k63K69j91L57o86Q41o01J09K27j94J06
4103F8l61Q02r09N27o3j25O8j05M34q55R01m67J6M2O1J07n40Q81q34M42p4M2j33
$$ y = [40, -46, -17, 30, -54, 77, -47, 23, -40, 68, -5, -66, 67, -39, 71, -61, 60, -47, 29, 74, -94, 72, -39, 101, -120, 58, 4, -41, 80, -64, 66, -108, 143, -94, -30, 65, -51, 56, -112, 135, -145, 78, -1, -85, 56, -39, 124, -212, 170, -73, -1, 31, -47, 56, -119, 235, -212, 76, 28, 14, -7, -77, 194, -216, 203, -87, 1, -9, 50, 70, -234, 270, -171, 78, -59, 54, -40, -99, 242, -303, 171, -75, 92, -147, 41, 132, -258, 275, -181, 97, -111, 178, -66, -168, 311, -239, 138, -127, 196, -185, 59, 189, -308, 252, -108, 157, -267, 237, 7, -192, 283, -213, 149, -189, 296, -262, -7, 245, -246, 149, -154, 260, -345, 235, 10, -234, 231, -109, 143, -350, 399, -215, -59, 182, -163, 114, -189, 370, -431, 213, 94, -169, 100, -91, 266, -420, 421, -180, -71, 156, -38, 68, -293, 509, -400, 127, 64, -61, 7, -98, 336, -519, 382, -85, -69, -27, 34, 141, -399, 482, -352, 90, 16, 58, -75]
4126g5o7N91r25P49l46J36j83K00Q7o08R09o85K74j73L26k64j85O78q21N92k93
4147h3K50m03K90K25p07P48m70K90l69M60k66k44O89o84L83k71M65n52K29L00
4167B80o34N79l47L14n30N95j97l55N75m26L00m18O04n47J46L30n02L47k56M56
4187C14o62N15q6k79L67k69K42m52O58m90L3K74k45J54k75N22o25M17k7k19J75
4208D2q9K86n99O26l43K8J16q3R4k96N70o10L04J1n3kr1L29n22N03k67J9J8M8
4232C9O7l65N21m20J99o6N8m9r3L56n14L86j54Q8j35P9J22l24M07l27J56r1J53
4255I3j14j12L29l36K35j48J26j45R2R9l06L21j89J25j62J56l6j13K26k55J81
4276F7j18J62j83M5J23j96J70j33J23j32J17l9j11J97j37Q3j17J37p3pQ0j38J34
$$ y = [-75, -142, 449, -476, 273, -73, 63, -120, 80, 167, -441, 468, -217, 57, -116, 210, -54, -239, 439, -382, 210, -83, 167, -236, 54, 279, -428, 320, -150, 140, -229, 231, -35, -279, 410, -274, 109, -162, 303, -249, -20, 280, -354, 225, -122, 192, -338, 257, 60, -295, 280, -146, 154, -264, 340, -207, -61, 269, -233, 114, -142, 314, -348, 167, 81, -198, 169, -100, 142, -310, 348, -142, -109, 165, -80, 74, -201, 321, -304, 113, 86, -133, 42, -47, 239, -360, 266, -77, -49, 67, -16, 78, -218, 352, -258, 46, 57, 4, 2, -89, 240, -282, 221, -46, -27, -9, 39, 106, -259, 262, -158, 41, -25, 33, -16, -109, 247, -267, 119, -35, 53, -82, -3, 119, -205, 202, -125, 31, -60, 93, -21, -133, 196, -140, 95, -53, 73, -72, 20, 119, -187, 134, -55, 70, -92, 64, 28, -85, 141, -114, 67, -51, 111, -72, -27, 96, -100, 70, -63, 60, -72, 45, 6, -105, 92, -45, 38, -79, 58, -15, -22, 58, -80, 54]
4299E4q2R5j44J04J6q5R1j01R1n7P4p9LR3r0L2m9R1o2J8J7q3R7m8K2o3P9j2m7
4328b5M1n2P2m7K7m2K0M6o1J4MJ7j4MLj5N6n2qOK5J3n9N9n1N1k1qqRL8n8K2lJ7
4363B0jl4J5qL7m7OJ2pK5m8N1m5N9n0jJ2J4Qo3O0l6O4n0pK8nJ8m9L6j4J6mk6L2
4398A8j5M9p4L7rJ6j9l4M5k6O1q0L0rL0k7k1L8j6K4l7J4j4K3rk7L7R%l1K6JlJ7
4432B4l9K6kL9p7M5mJ1pj4K0m4P8p9K4nL7n1JL9m9O6o6L4m3O2rp4P4l7N4q6P3
4465B1k8j7Q1j11J05q9J24j55Q8K3p9R3j00J15j67J96j06j7N8l6O2j49K06j76
4489e8Q5rn1O6q7J81k74K14p8lK4o0J35k38L18k64J11j7K6%j43K98l38K58j35
4514c9O2n2K2J43l36L57k20J11j04R6L1k18L70l82K41j37J59j69QK44l93L50k33
$$ y = [54, -28, 67, -77, 27, 43, -42, 49, -52, 39, -18, 56, -23, -20, 73, -17, 15, -34, 57, -5, 13, 30, -53, 44, -4, 18, -45, 34, 22, -25, 16, -36, 36, -11, 16, -26, -6, 40, -21, -7, -3, 14, 0, 4, 7, -8, 48, -4, -12, -6, 19, 32, -27, 32, -19, 32, 11, 3, -5, 4, 42, -16, 6, 3, 20, 19, -15, 0, -8, 29, -18, -12, 0, -7, 18, -30, 21, -24, 35, -15, -16, -4, 10, 18, -45, 15, -21, 43, -7, -14, 14, 9, 27, -22, 14, 0, 16, 12, -14, 18, 3, 52, -22, 15, 6, 22, 3, -31, 14, -12, 49, -31, -1, -10, 20, -7, -28, 10, -6, 18, -19, -5, -19, 4, -5, -32, 5, 14, 14, -17, 9, 10, 7, 24, -15, 11, 9, 48, -29, 16, 12, 23, 16, 2, 22, -22, 56, -23, 1, -4, 33, -18, -17, 22, -27, 39, -27, 7, -36, 26, 17, -57, 17, -20, 34, -52, 21, -7, -24, 57, -54, 51, -38, 86, -69, 19, 42, -37, 56, -44, 71, -96, 100, -6, -23, 35, -1, 61, -88, 118, -58, 27, 18, -33, 33, -54, 127, -147, 67, -11, -14, 10, -50, 85, -153, 165, -99, 12, -5, 21, 21, -122, 176, -162, 96, -39, 23, -29, -7, 136, -200, 157, -63, 48, -56, 40, 71, -147, 223, -159, 82, -55, 104, -65, -57, 187, -206, 144, -89]
4537h9J98k38K19l5k59L86k87J90k43L14k21k6K88l81K93k13K74l60K33P9l21
4558a99L56k66K71l80M33k88n8L28l04K12k85M56m90K53J00k84K41j80K94n11
4578c01M99j76j42K20j78K08l97N84n33K12J11j54Q3k04M77o44N27k11l7P3j4
4599CJ58m97O73m51J08K9J2lk27N60o66M27j01Pj06L8L11o48O68m01J48j16J94
4622A20p3l20O61o43L37j61K23k62L8L71o37N56k84J67k86L08J1m49O31m83K90
4643A15k62L62l15l4M57n89M17k79L59m57L23N6m35N08l33K50l86N09l13j24M25
4664B54m12K68k76M21m97K69J74m32L56k30L36n40N29k31j45L23k68K08l53N76
4684C30n17J62J57k31J70j91L77n43M60j15j76J95j21K12m40N50m03R8J18j36
$$ y = [-89, 109, -129, 90, 55, -204, 182, -105, 85, -158, 156, -65, -91, 197, -184, 109, -104, 170, -190, 43, 122, -199, 157, -109, 162, -218, 215, -73, -131, 197, -107, 105, -180, 276, -214, 39, 139, -145, 96, -84, 210, -301, 198, 22, -120, 100, -78, 130, -267, 317, -216, -4, 107, -47, 36, -168, 309, -335, 192, -19, -56, 17, 3, 161, -336, 337, -114, -6, 23, 35, 32, -195, 365, -301, 126, 25, 32, -74, -36, 275, -373, 295, -106, 42, -74, 120, 47, -273, 388, -255, 82, -79, 144, -118, -80, 291, -346, 210, -74, 93, -193, 115, 126, -323, 308, -175, 115, -147, 215, -100, -134, 323, -266, 151, -128, 231, -226, 97, 153, -282, 226, -107, 143, -243, 266, -47, -171, 254, -158, 110, -166, 255, -242, 27, 201, -231, 125, -105, 231, -309, 220, -11, -156, 167, -101, 107, -246, 330, -187, -25, 132, -99, 71, -120, 257, -286, 174, 59, -117, 78, -43, 169, -271, 279, -124, -26, 92, -44]
4704d4Q3k13M78n73L72p4n9K8m4K09m26M82k87L3L7K8Pk34M38m18K36m7om0k8
4729f2K77m67M05k00P5o6P1M7k55M11l68J74q2J39j28n0K44l24K50j34Q3j11J02
4752C1N8k62L10k07J12j15J34o7q3K42k79J82j17J63k06J02Q0j69J72j28R4j24
4774g7J63r2p5J78j45Q1q8J23j06L0Q6j72J57r0J01j49J30k8p1R2q5O2p7J32j35
4799e5L1O0o4K8l8P4p1M3J3p3R0n5M1p1Q7m5j2O0p9P1n5P7j03P8Jm4K3j0J1k5
4829a2L7k3k0M7k1oj6J9qk3L8n1P0m5K1l9L3J3m2K0nJ3qJ5j6NK0rj4K2j9L7m3
4862a0K3l3N9n3K3j3NK1m9N0l8N3m7K7k3LJ3k8K1j1PQk4L7m4O2n6J2qNK0m8O3
4895B7o3Q2q2M6k8K1Nl3N5n0M3l9K9oP%k5K4nQj0l2M3k7M2n1L7l0L3k1pL3m2L6
$$ y = [-44, 39, -174, 304, -269, 103, 29, -30, -2, -46, 163, -263, 219, -68, -35, 2, 30, 37, -197, 241, -177, 59, 12, 6, -34, -62, 215, -252, 153, -47, 28, -38, 33, 80, -175, 236, -132, 42, -40, 99, -29, -79, 165, -159, 91, -43, 40, -71, 31, 89, -173, 137, -70, 42, -73, 61, -6, -89, 153, -126, 56, -61, 102, -104, -2, 78, -91, 81, -47, 47, -77, 86, -6, -81, 97, -48, 33, -55, 68, -38, -8, 78, -94, 63, -27, 74, -75, 55, 27, -44, 48, -37, 25, -52, 80, -55, -24, 36, -28, 0, -38, 36, -35, 8, 21, -52, 38, -17, 24, -47, 40, -5, -17, 43, -36, 35, -20, 57, -46, 32, 33, -11, 12, 2, 13, -12, 25, 2, -18, 29, 8, 2, -14, 5, -3, -26, 12, -39, 31, -14, 7, -32, 1, 14, -28, -8, -13, 0, -8, 7, -9, -4, 16, 7, -7, 15, -4, 33, -10, 13, -20, 39, -14, 9, -4, 1, 22, -27, 23, -15, 38, -9, 18, -5, -2, 11, -17, 4, -7, 0, 8, -16, 21, -23, 39, -17, -5, -13, -8, 12, -36, 27, -36, 46, -36, 10, -18, 3, 8, -25, 30, -20, 23, -16, 13, 7, 14, 14, -11, 13, 8, 16, 6, -26, 17, -10, 32, -19, 18, -12, 21, 0, -7, 26, -16, 20]
4929B0n5N1m9N3l9J4J8j9MnNj4K2mqJ1QPk5J8Kj8K6l4K7k3N9q8N7k1K3j9pJ3l3
4964b3N5m7K8m2O9m8qL3k2Qk0L6n4K8L1n2M3l7P3r8O8j5j9N2p4P7q7J37j41P3
4994B4Kk0Ll8R5j33J26n7Jk0L0K5j07J25p8K8lqJ8q2J67j95J44p6P1p9J3R7j84
5023a11K10j65J10r9J02l6r5J76j49R6r4J14r8J9J22k11J70j00J16j65J32K4j81
5046a13K13j86J68j88K26j81NJ55j82J37j47K08k44J67J3j45J31p9J17k20K54
5067A09j30n9J71j55J23j79L00l12J44O5j29J01j36K54l58L28j56k0O3l5P8k42
5089a75L76l03J05L2n0L6j12K76l77K71o0m8J5l0J81l59M17k79R0k5N5k9j57L61
5113B11l70K34r8Q4j17M7J47l29L25j60M6p6R8K1k39L78l24J70r6J49j72jK70
$$ y = [20, -35, 16, -33, 20, -19, -5, 13, -6, -2, -7, -2, -16, 6, 2, -6, 5, 13, 20, -5, 13, 15, -3, 23, -11, 16, -7, 52, -36, 21, 0, 23, 4, -3, 10, -23, 32, -15, 13, -29, 40, -8, -16, 17, -5, 3, -17, 19, -35, -7, 24, -28, 15, -22, 51, -47, 21, 6, -13, 39, -35, 42, -45, 92, -49, 24, 26, 6, 9, -29, 66, -67, 59, 2, 3, -17, 13, 38, -69, 56, -22, 6, 3, -5, 13, -69, 98, -97, 47, -29, 42, -37, -24, 73, -111, 99, -66, 44, -55, 47, 11, -84, 92, -57, 39, -55, 59, -39, -20, 102, -109, 61, -39, 77, -88, 44, 68, -113, 100, -86, 82, -106, 120, -61, -56, 99, -83, 54, -93, 115, -129, 38, 51, -94, 37, -42, 75, -145, 109, -21, -80, 91, -64, 59, -120, 180, -132, 12, 77, -52, 49, -87, 167, -191, 137, -19, -39, 24, -11, 67, -175, 201, -102, 3, 35, -15, 21, -91, 185, -192, 79, 19, -29, -14, -44, 137, -222, 195, -84, 6, -19, 36, 7, -150, 211, -159, 75, -23, 61, -56, -9, 138, -191, 134, -26, 20, -56, 42, 63, -176, 202, -122, 48, -48, 101, -71, -72, 198]
5136A98l85L05j81J63k36K11j8k25L03k07J21j64K47j79m2K32k72J90j23J97k58
5157a23J53Q6k72K63j62J74k93L25j79n8K12j91J27j70L01l31J52N9j44J15r2
5178d8J63k75K58q2j13J56r6J05k27L30k81Q8Q8j20Q0j25K83l58K70q5k8K5nQ0
5202H3k49L18k03L3L8%%j07K58k92J63j8m3K0l4J72l11K97j69O1m8N8j2j32K65
5227A48k53J39o7Q3j05K2J28k00J63q2L7m8N6L8j73K12j48Q0o4Q7n7n2J85k31
5251a02J64r3J11j46J01J1j18J47j01P1r5J12p3l2J11j07O9n8O5p2J1P7j38J31
5275D6r8R7j10J11m1m6R0q1O4p3R3r8N8Rl8K6j2K2m6M8J0p6P9m7M9o1O1m3j3O2
5305D2q1P4o3O9p3O0k9nQNlk3L6k4j1L6j7rj0J7qj1M3n2O1m5M3n5M9j9lJ2j7J9
$$ y = [198, -187, 118, -63, 100, -136, 75, 57, -168, 135, -72, 49, -115, 132, -47, -89, 143, -129, 61, -62, 135, -123, 30, 116, -156, 107, -55, 119, -174, 151, -28, -86, 126, -65, 62, -108, 193, -138, 14, 73, -71, 44, -48, 115, -160, 98, 16, -97, 59, -37, 68, -159, 171, -110, -22, 66, -54, 26, -99, 184, -174, 96, 11, -17, 8, 3, 83, -166, 152, -51, -18, 20, 20, 20, -87, 171, -121, 42, 24, -19, 1, -33, 139, -172, 125, -44, 17, -31, 27, 15, -117, 148, -105, 34, -33, 50, -55, -33, 95, -105, 58, -24, 13, -35, 21, 59, -114, 98, -50, 30, -34, 53, -4, -56, 129, -102, 62, -31, 80, -66, 35, 46, -72, 75, -26, 45, -50, 62, -11, -43, 68, -39, 30, -28, 37, -35, -24, 53, -85, 46, -52, 45, -65, 46, 5, -41, 49, -32, 32, -41, 52, -46, 12, 21, -17, 9, -3, 19, -27, 21, 31, -45, 34, -13, 36, -25, 36, -7, -20, 42, -39, 35, -28, 41, -32, 28, -1, -6, 2, 7, 4, -19, 17, -7, -18, 18, 1, -8, -18, -1, -9, -20, 23, -29, 32, -13, 30, -25, 24, 5, 2, 14, -3, 16]
5339A6k4K7l5J8mmj3K8j9LrK8l6L8k6J7k1%K1l1M5m5L8m0M4m0L5j8LJJ0j1RrK0
5374A6k3K5k8J2PnL0m9M7o0O6n6N2m6K1Lj6J2j3J3j9J7j1kK2j1j6QKJ9n1N2n1
5407c3O6o0M6k9J8Jj9L2m3N3m7L4l4M5l2J8j1KN%j9J3%J2l0K2nlJj1J3m0O3m9
5441b1L6m1M5m1L1k0J0J2j9J7j9K9l5L3l0K9k0J4lKj5L7l6K2kJ1m1L2Kj8J9j6
5473DK1m9O2n9L6l0M6n6L2qKmqK6m8M5k3%kJ6pj0K0pj6M9m8L6m8R0r0N7j1pkj2
5509cM5o7Q3p7N2m2L7k1j5L7m1J7KPj9mM2p5O2k3Pk0J6K0p8J21j15R6q6J01r6
5540c7K4O0p8P2n8P0r3Q1j6n1O5l5K3n6O9k7l4P8r4O7o4J05j22N4L7r3Q9q1J07
5569F2j57J72r8J6J3j3J8o4J28j25N1K2l8K9l9R1j39J20k9m3N8m2O8j61K12j63
$$ y = [16, -8, 19, -16, 2, -2, -6, -19, 9, -10, -7, -16, 12, -24, 14, -12, 5, -16, -16, 5, -26, 19, -26, 12, -28, 16, -24, 11, -7, -4, -3, 7, -4, 5, -4, 16, -7, 18, -10, 2, 9, 4, 34, -15, 32, -28, 38, -18, 34, -12, 9, 12, -4, 8, -5, 8, -11, 6, -5, -7, 15, 4, -12, -4, -2, 17, -34, 18, -33, 33, -27, 19, -10, 8, 9, -10, 22, -21, 32, -15, 19, -15, 30, -2, 16, 5, 7, 12, 12, -7, 6, 6, 18, -12, 10, 5, 2, 3, -8, 5, -35, 28, -21, 15, -26, 19, -22, 9, -11, -1, 11, -8, 9, -10, 19, -16, 17, -13, 16, -4, 10, 7, 9, -6, 31, -5, 17, 15, 26, -15, 17, 19, 1, 20, 4, 25, -24, 38, -21, 15, -15, 31, -25, 7, -1, 1, -3, -11, 15, -33, 12, -11, -11, -13, 3, -4, -14, 6, -1, -17, 32, -16, 20, -28, 62, -28, 29, 18, 11, 9, -3, 42, -25, 58, -19, 33, -9, 28, 7, -8, 29, -12, 5, 7, 14, -5, -9, 33, -42, 20, -3, 4, -16, 0, 20, -58, 63, -52, 44, -42, 59, -37, -13, 47, -31, 41, -17, 53, -40, 41, 25, -26, 39, 4, 27, -29, 40, 13, -21, 57, -37, 30, -34, 71, -51, 3, 40, -53, 36, -45, 62, -95, 77, -21, -5, 8, -5, 13, -51, 77, -48, 3, 25, -13, 16, -23, 68, -71, 49, 20, -23, 35, -7, 61, -100, 112, -51]
5595e1O5lJ5j8n7J50j77J31n6L0o0K9M9j39J64r4K4j4K7Qj23K05j84R8l3M4n7
5622b7qJ33k16K05j33R8j09J16l8r0J50j17N6n7J06r7lJ19j43R3n2P3j14O1O7
5647G3j68J88j42J10j43J66j18l1J29j22Q4r8J64j80J05K0q8P0l7P7j41J40m7
$$ y = [-51, 14, 11, 26, 8, -49, 101, -76, 55, -1, 29, -31, -2, 47, -92, 72, -22, 2, -12, 15, 23, -100, 105, -79, 19, -14, 30, -27, -35, 98, -118, 87, -46, 52, -57, 59, 21, -69, 81, -36, 20, -37, 69, -28, -31, 88, -55, 38, -14, 59, -55, 6, 73, -95, 93, -49, 61, -82, 84, -34, -65, 64, -58, 26, -72, 92, -88, 17, 37, -51, 19, -18, 59, -82, 58, 11]
$$ [...]
8191i
##END NTUPLES=NMR FID
##END=
