##TITLE=1H_x2401-1
 aceton-d6
 8 sc, 
 9.2.2023
##JCAMPDX= 6.0         $$ Bruker NMR JCAMP-DX V2.0
##DATA TYPE= NMR FID
##DATA CLASS= NTUPLES
##ORIGIN= UXNMR, Bruker Analytische Messtechnik GmbH
##OWNER= root
$$ XWIN-NMR		Version 3.5
$$ Thu Feb  9 15:41:20 2023 Russian Standard Time (UT+4h)  she@DPX200
##.OBSERVE FREQUENCY= 200.13135
##.OBSERVE NUCLEUS= ^1H
##.DELAY= (6, 6)
##.ACQUISITION MODE= SIMULTANEOUS
##.ACQUISITION SCHEME= undefined
##.AVERAGES= 8
##.DIGITISER RES= 18
##SPECTROMETER/DATA SYSTEM= spect
##.PULSE SEQUENCE= zg30
##.SOLVENT NAME= Acetone
##.SHIFT REFERENCE= (INTERNAL, Acetone, 0, 15.7039)
##AUDIT TRAIL= $$ (NUMBER, WHEN, WHO, WHERE, WHAT)
$$ ##TITLE= Audit trail, XWIN-NMR		Version 3.5
$$ ##JCAMPDX= 5.01
$$ ##ORIGIN= Bruker BioSpin GmbH
$$ ##OWNER= she
$$ F:/spectra/data/she/nmr/H-F/1/audita.txt
$$ ##AUDIT TRAIL=  $$ (NUMBER, WHEN, WHO, WHERE, WHAT)
(   1,<2023-02-09 15:40:20.48 +0400>,<she>,<DPX200>,
      <created by zg, POWCHK disabled, PULCHK disabled
       configuration hash MD5:
       00 E9 B6 7A A2 85 ED C7 34 08 36 98 17 FE 4E 26
       data hash MD5: 16K
       1D 44 39 FA F4 71 6B 5B 65 B2 80 F2 20 2E 93 E0>)
$$ ##END=
$$ 
$$ hash MD5
$$ 5E F4 FA 44 81 86 74 6F 19 EA E1 2E DE 4C 04 6F
##$RELAX= 
##$RELAX= 
##$RELAX= 
##$RELAX= 
##$RELAX= 
##$RELAX= 
$$ Bruker specific parameters
$$ --------------------------
##$DU= <F:/spectra>
##$EXPNO= 1
##$NAME= <H-F>
##$PROCNO= 1
##$TYPE= <nmr>
##$USER= <she>
##$AMP= (0..31)
100 100 100 100 100 100 100 100 100 100 100 100 100 100 100 100 100 100 
100 100 100 100 100 100 100 100 100 100 100 100 100 100 
##$AQSEQ= 0
##$AQ_mod= 1
##$AUNM= <au_zg>
##$AUTOPOS= <>
##$BF1= 200.13
##$BF2= 200.13
##$BF3= 200.13
##$BF4= 200.13
##$BF5= 200.13
##$BF6= 200.13
##$BF7= 200.13
##$BF8= 200.13
##$BYTORDA= 1
##$CFDGTYP= 0
##$CFRGTYP= 5
##$CHEMSTR= <none>
##$CNST= (0..31)
1 1 145 1 1 1 1 1 1 1 1 1 1 1 1 1 1 1 1 1 1 1 1 1 1 1 1 1 1 1 1 1 
##$CPDPRG= <>
##$CPDPRG1= <>
##$CPDPRG2= <>
##$CPDPRG3= <>
##$CPDPRG4= <mlev>
##$CPDPRG5= <mlev>
##$CPDPRG6= <mlev>
##$CPDPRG7= <mlev>
##$CPDPRG8= <mlev>
##$CPDPRGB= <>
##$CPDPRGT= <>
##$D= (0..31)
0 1.2 0 0 0 0 0 0 0 0.06 0 0.03 0 0 0 0 0.0002 0 0 0 0 0 0 0 0 0 0 0 0 
0 0 0 
##$DATE= 1675942820
##$DBL= (0..7)
120 120 120 120 120 120 120 120 
##$DBP= (0..7)
150 150 150 150 150 150 150 150 
##$DBP07= 0
##$DBPNAM0= <>
##$DBPNAM1= <>
##$DBPNAM2= <>
##$DBPNAM3= <>
##$DBPNAM4= <>
##$DBPNAM5= <>
##$DBPNAM6= <>
##$DBPNAM7= <>
##$DBPOAL= (0..7)
0.5 0.5 0.5 0.5 0.5 0.5 0.5 0.5 
##$DBPOFFS= (0..7)
0 0 0 0 0 0 0 0 
##$DE= 6
##$DECBNUC= <off>
##$DECIM= 32
##$DECNUC= <off>
##$DECSTAT= 4
##$DIGMOD= 1
##$DIGTYP= 9
##$DL= (0..7)
0 120 120 120 120 120 120 120 
##$DP= (0..7)
150 150 150 150 150 150 150 150 
##$DP07= 0
##$DPNAME0= <>
##$DPNAME1= <>
##$DPNAME2= <>
##$DPNAME3= <>
##$DPNAME4= <>
##$DPNAME5= <>
##$DPNAME6= <>
##$DPNAME7= <>
##$DPOAL= (0..7)
0.5 0.5 0.5 0.5 0.5 0.5 0.5 0.5 
##$DPOFFS= (0..7)
0 0 0 0 0 0 0 0 
##$DQDMODE= 0
##$DR= 18
##$DS= 0
##$DSLIST= <SSSSSSSSSSSSSSS>
$$ [...]
##$SUBNAM2= <"">
##$SUBNAM3= <"">
##$SUBNAM4= <"">
##$SUBNAM5= <"">
##$SUBNAM6= <"">
##$SUBNAM7= <"">
##$SUBNAM8= <"">
##$SUBNAM9= <"">
##$SW= 18.05172834244
##$SWIBOX= (0..15)
0 0 2 0 0 0 0 0 0 0 0 0 0 0 0 0 
##$SW_h= 3612.71676300578
##$TD= 16384
##$TD0= 1
##$TE= 0
##$TE2= 300
##$TE3= 300
##$TEG= 300
##$TL= (0..7)
0 120 120 120 120 120 120 120 
##$TP= (0..7)
150 150 150 150 150 150 150 150 
##$TP07= 0
##$TPNAME0= <>
##$TPNAME1= <>
##$TPNAME2= <>
##$TPNAME3= <>
##$TPNAME4= <>
##$TPNAME5= <>
##$TPNAME6= <>
##$TPNAME7= <>
##$TPOAL= (0..7)
0.5 0.5 0.5 0.5 0.5 0.5 0.5 0.5 
##$TPOFFS= (0..7)
0 0 0 0 0 0 0 0 
##$TUNHIN= 0
##$TUNHOUT= 0
##$TUNXOUT= 0
##$USERA1= <user>
##$USERA2= <user>
##$USERA3= <user>
##$USERA4= <user>
##$USERA5= <user>
##$V9= 5
##$VALIST= <valist>
##$VCLIST= <CCCCCCCCCCCCCCC>
##$VD= 0
##$VDLIST= <DDDDDDDDDDDDDDD>
##$VPLIST= <PPPPPPPPPPPPPPP>
##$VTLIST= <TTTTTTTTTTTTTTT>
##$WBST= 1024
##$WBSW= 4
##$XGAIN= (0..3)
0 0 0 0 
##$XL= 0
##$YL= 0
##$YMAX_a= 210901
##$YMIN_a= -179517
##$ZGOPTNS= <>
##$ZL1= 120
##$ZL2= 120
##$ZL3= 120
##$ZL4= 120
##$ABSF1= 10
##$ABSF2= 0
##$ABSG= 5
##$ABSL= 3
##$ALPHA= 0
##$AQORDER= 0
##$ASSFAC= 0
##$ASSFACI= 0
##$ASSFACX= 0
##$ASSWID= 0
##$AUNMP= <proc_1d>
##$AZFE= 0.1
##$AZFW= 0.1
##$BCFW= 1
##$BC_mod= 2
##$BYTORDP= 1
##$COROFFS= 0
##$CY= 11.3945322036743
##$DATMOD= 1
##$DC= 2
##$DFILT= <>
##$DTYPP= 0
##$F1P= 2.36226072786647
##$F2P= -0.459571619588291
##$FCOR= 0.5
##$FTSIZE= 0
##$FT_mod= 4
##$GAMMA= 1
##$GB= 0.15
##$INTBC= 1
##$INTSCL= 1
##$ISEN= 128
##$LB= 0.24
##$LEV0= 0
##$LPBIN= 0
##$MAXI= 10000
##$MC2= 0
##$MEAN= 0
##$ME_mod= 0
##$MI= 1.114404
##$NCOEF= 0
##$NC_proc= 0
##$NLEV= 6
##$NOISF1= 3.799351
##$NOISF2= 2.8
##$NSP= 1
##$NTH_PI= 0
##$NZP= 0
##$OFFSET= 15.70392
##$PC= 1
##$PHC0= -19188.43
##$PHC1= 7.00078
##$PH_mod= 1
##$PKNL= yes
##$PPARMOD= 0
##$PSCAL= 0
##$PSIGN= 0
##$REVERSE= no
##$SF= 200.130013532006
##$SI= 16384
##$SIGF1= 3
##$SIGF2= 2
##$SINO= 400
##$SIOLD= 16384
##$SREGLST= <1H.CDCl3>
##$SSB= 0
##$STSI= 0
##$STSR= 0
##$SW_p= 3612.71676300578
##$SYMM= 0
##$S_DEV= 0
##$TDeff= 0
##$TDoff= 0
##$TI= <>
##$TILT= no
##$TM1= 0
##$TM2= 0
##$TOPLEV= 0
##$USERP1= <user>
##$USERP2= <user>
##$USERP3= <user>
##$USERP4= <user>
##$USERP5= <user>
##$WDW= 1
##$XDIM= 8192
##$YMAX_p= 0
##$YMIN_p= 0
$$ End of Bruker specific parameters
$$ ---------------------------------
##NTUPLES= NMR FID
##VAR_NAME=  TIME,          FID/REAL,        FID/IMAG
##SYMBOL=    X,             R,               I
##VAR_TYPE=  INDEPENDENT,   DEPENDENT,       DEPENDENT
##VAR_FORM=  AFFN,          ASDF,            ASDF
##VAR_DIM=   8192,          8192,            8192
##UNITS=     SECONDS,       ARBITRARY UNITS, ARBITRARY UNITS
##FACTOR=    0.0002768,     1,               1
##FIRST=     0,             0,               0
##LAST=      2.2672688,     0,               0
##MIN=       0,             -179517,         0
##MAX=       2.2672688,     210901,          0
$$ Real data points
##PAGE= N=1
##DATA TABLE= (X++(R..R)), XYDATA
$$ [...]
940C129n171J729K910l838J772n332J2423j1305L102O64L53J160m821P874j1367
955f718J1809n025j493P0J619M719j2136J2812r653N679j029l31j300l335J4139
970I827j7116Q849k477L702m477J29P135j4694J6932r848K443m692Q228n54j2140
985h753J6736j3630R554o656O305p082Q72J2763j9746J3703o948Q386j0945P047
999A606K515j3727J9497j4185O199q658J5262r003p812J7709j5687J0852r767
1012e199J2717j4867P364R247j9252J4526q367J2133j7769J4433l236r603J7527
1025I654j5364R185j1853K0378j7382K59J4110j5739J1481j0678J5940k1789J6534
1038D736K010j6656J4134o988J2055k2805K2789j0314m506J2938j2016Q497j3588
$$ plain form
940 3129 -2042 -313 2597 -1241 531 -4801 7622 -3683 -581 83 436 1596 -3225 4649 -6718
955 -6718 5091 66 -1427 -1357 262 4981 -7155 5657 -3996 1683 654 323 -977 -4312 9827
970 9827 -7289 1560 -917 2785 -1692 -1563 5572 -9122 7810 -2038 405 -4287 3941 3387 -8753
985 -8753 7983 -5647 3907 -2749 3556 -3526 -2654 10109 -9637 4066 -2882 5504 -5441 1606
999 1606 4121 -9606 9891 -4294 1905 -6753 8509 -494 -8306 9403 -6284 4568 -5199
1012 -5199 7518 -7349 15 9262 -9990 4536 -3831 8302 -9467 4966 1730 -7873 9654
1025 9654 -5710 3475 -8378 12000 -5382 -5123 8987 -6752 4729 -5949 9991 -11798 4736
1038 4736 6746 -9910 4224 -2764 9291 -13514 9275 -1039 -5545 7393 -4623 3874 -9714
1051i714K4133k3223P204P616j0646Q535r997J6447k3607K1786o222r921J0982
1064C373m314Q219k1314K6376j6735J405Q144p389L588r631K3666k6899J2371
1077H60K903n229K114n099J4270k2892K3109j1383k593N108q9L605j6837K4847
1091A2694j9776P819J518k641q55l331J8041k6601J6990k201q52l694K111Q279
1105G501j9488K2207j3313J950p54O107k543j1265K0328j7324R355l926L144m961
1119b982J866J0160k0275J6363n396K318o675P066P67j1744J7770j3321L825k314
1133b572R102q984l504J4591j3958P807m883O369q870O527L592j3301J2342n379
1147a121M459r108R774l899m270J0456j0602N380l683R311j1760L303P162r220
$$ plain form
1051 -9714 14419 -8804 -1600 6016 -4630 3905 -6092 10355 -13252 8534 2312 -7609 3373
1064 3373 -941 7278 -14036 12340 -4395 -2990 5154 -2235 1353 -8278 15388 -11511 860
1077 860 3763 -1466 648 -4451 9819 -13073 10036 -1347 -3940 1168 1079 4684 -12153 12694
1091 12694 -7082 737 2255 -386 -1241 -4572 13469 -13132 3858 1657 805 -2889 -778 7501
1105 7501 -11987 10220 -3093 -1143 -1897 4210 1667 -9598 10730 -6594 2761 -1165 1979 -2982
1119 -2982 -1116 9044 -11231 5132 -264 2054 -4621 2445 3212 -8532 9238 -4083 -258 -2572
1133 -2572 6530 -2454 -5958 8633 -5325 2482 -2401 3968 -4902 1625 5217 -8084 4258 -1121
1147 -1121 3338 -5770 4004 105 -4165 6291 -4311 1069 -2614 6697 -5063 -1760 5402 -3818
1161c818N824m437O573r882R735k305o939Q033l076L252r057J0915o248K68M068
1176B906n655L950l447P820j0879O018J491l851K833l178N013p453R041n700j541
1191b632M420j319R65o206R359o776K681K32j955J738j813N542r001O246r03l15
1207B63m82j283L871n191O350n769J785J098J06k62l599O333n072L208k006K57
1223c93N25k72K473n889N059j336O32j832L85K117k789L267l818K099n2P69j176
1240b31j597L587k335J472k092J229K70J9K97k574K893o50K87j662P98J135j021
1257a75P34j737J389J12L74j277m00J879n25l00j057J118L93k27n43n73J164L40
1275F89n98r24N30J113m47q61oN89O65p41n15mJ049K53j462J92M17R71j039l44
$$ plain form
1161 -3818 2006 -2431 4142 -5740 3995 1690 -5249 2784 -292 2960 -6097 4818 -1430 -1162 2906
1176 2906 -2749 1201 -2246 5574 -5305 713 2204 -1647 1186 -1992 3021 -4432 4609 -1091 -2632
1191 -2632 1788 469 1434 -4772 4587 -2189 492 724 -1231 507 -1306 4236 -4765 1481 578 263
1207 263 -219 -1502 2369 -2822 3528 -2241 -456 642 748 486 -3113 3220 -1852 1356 -650 -393
1223 -393 132 -140 2333 -3556 1503 167 799 -1033 -648 1469 -1320 1947 -1871 228 176 945 -231
1240 -231 -1828 1759 -576 896 -1196 33 303 322 619 -1955 938 288 575 -1087 -289 846 -175
1257 -175 559 -1178 211 323 697 -580 -980 899 374 74 -983 135 528 301 -242 -815 349 689
1275 689 91 -833 -303 810 363 -498 -504 85 750 9 -506 -510 539 792 -670 -478 -61 910 -129 -473
1295d73K22K93R18j464R1j0J450q29j034P94k1J061j528L20k78J138N7j702Q85
1314a10nJ277j741K44J54M27O62j811P90k38J552j477m35P88k0Q71j795Q68m43
1333d42J353o91j140R87r2J080j905P79j87P92Lj441Q94j55J335j820K36M22L22
1352C30L13j512Q59k41J339j364m44Q14K13L76j552Q58j60R21o69q70P50K72N42
1371G75j561N58K69M28k69q52N02K63O57j198j26O37M41k99q35L89M26L65p02
1390a32m78N26P02l47p82Q0Q26P3n85l58K43Q75m77l61m89R90L46q53j88j3J264
1411H62r85P1m48M87O89q52J42r13J946q87l49j79K88J047j514J026j521J791
1429G01k44p76Ok33K089k575J483j149R68K48q07N23j772L546k588L78l00R28
$$ plain form
1295 -473 -251 42 960 -504 -413 -423 1027 198 -836 -42 -63 998 -530 -210 -488 650 707 -995 -110
1314 -110 -115 1162 -579 -335 -181 246 908 -903 -113 -351 1201 -276 -711 77 57 928 -867 1 -442
1333 -442 911 220 -920 67 -25 1055 -850 -71 -258 534 537 -904 -10 -165 1170 -650 -414 8 330
1352 330 643 -869 -10 -251 1088 -276 -720 94 307 683 -869 -11 -171 750 81 -789 -39 233 775
1371 775 -786 -228 41 469 200 -652 -150 113 770 -428 -554 83 524 225 -610 -221 205 570 -132
1390 -132 -610 -84 618 271 -511 -431 395 468 -117 -475 -232 643 166 -195 -684 306 652 -201 -389 -402 862
1411 862 -123 -52 -500 -13 676 -176 -34 -947 999 112 -237 -416 -128 919 -595 431 -1090 701
1429 701 457 -319 -313 -546 1543 -1032 451 -698 270 518 -289 234 -1538 2008 -580 -202 -502 426
1447D26L26k010K578k975K822j140l7o21K05K474m005K992j962J658p78J1L20
1464B84k133M599m129J443p03J674r27j440L279m260L938j849N33j685J740J848
1480B212n043M377k474K045k069J656p21j827M966n072K414j444K790k635l5K882
1496B022m661M736k762J326k769L699j85m576N293l064K045k844L673k927m96
1511a490M732n296K334j455M020m927J815K063m059M165k818J980l677N211k302
1526B96k942M793l024J854k900M671m962J838L266n091K214o03L795o770M625
1541A060K26l227L223j754J625m469O970m470j013L269j707J038l031N520o347
1556c087M098N86l338J608K5L068p304O872k438j300J921n21M25m011Q060o720
$$ plain form
1447 426 752 -1258 1320 -1655 1167 27 -10 -631 -426 2048 -1957 1035 -927 731 -47 -36 284
1464 284 -1849 2750 -1379 64 -639 1035 108 -1332 1947 -2313 1625 -224 309 -1376 364 2212
1480 2212 -2831 1546 -928 1117 -952 704 -17 -1844 3122 -1950 464 -980 1810 -825 -860 2022
1496 2022 -2639 2097 -665 661 -2108 1591 1406 -3170 2123 -941 1104 -1740 1933 -994 -1490
1511 -1490 3242 -2054 280 -1175 2845 -2082 -267 1796 -2263 1902 -916 1064 -2613 2598 296
1526 296 -2646 2147 -877 977 -1923 2748 -2214 -376 2890 -2201 13 -590 3205 -3565 1060
1541 1060 1286 -1941 1282 -472 1153 -3316 3654 -816 -1829 1440 -267 771 -2260 3260 -3087
1556 -3087 1011 1597 -1741 -133 -108 2960 -4344 2528 90 -1210 711 190 615 -3396 4664 -2056
1572b056R84J975j48r41j958N893p333N305j217j229K5J016K243o897P449m072
1588i61Q39J57M85n64k529P298p997L314M58O89k443R0M682p552O472k678K51
1605A1j582K861O48o206P579m630K107j914K401j710j436N914p509M511j422K037
1621A660l435J516K862o243O521l916J414k164L925j456m339P067m885K306k355
1636a522L440l059K1M426o434M291j816K631m139K428J470m388N140l933K191
1651G47k346L852k629j987N239m425K467k338L354l558J578K315m939L744j545
1666d71K357m415L445J03k767L413k894K156k499L736l068l53L061k846J911k253
1682a384L001l094K137L26k866K876j252J499l393L410j006j217K043j936J451
$$ plain form
1572 -2056 -1072 903 755 -186 -2144 3749 -3584 1721 504 -725 -700 316 2559 -4338 3111 -961
1588 -961 -122 35 520 -44 -2573 4725 -3272 42 500 1189 -1254 -1164 3518 -4034 2438 -240 11
1605 11 -1571 1290 1938 -4268 3311 -1319 788 -1126 1275 -435 -1871 4043 -3466 1045 -377 1660
1621 1660 -1775 -259 2603 -3640 2881 -1035 379 -1785 2140 684 -3655 3412 -1473 833 -1522
1636 -1522 1918 -1141 -1120 3306 -3128 1163 -653 1978 -2161 267 1737 -2651 2489 -1444 747
1651 747 -1599 2253 -376 -2363 2876 -1549 918 -1420 1934 -1624 -46 2269 -2670 1074 -471
1666 -471 1886 -2529 916 1019 -1748 1665 -1229 927 -1572 2164 -904 -1257 1804 -1042 869 -1384
1682 -1384 1617 -1477 660 986 -1880 996 -256 1243 -2150 1260 254 -963 1080 -856 595
1697E95j683K937l007N80J716j572Q21j487K426k416J813n66j140J636p77Q70
1713G46k299K614j203o5N99r84R79r26J790k442J168O25o82L2n98J568j681J426
1731F67r34j19O82j75K32j416J831q88K60k85j09N60m65P64j491J117M5k01k63
1750a88j50Q73q41P27q39L11L27m1j77o54J157m98R2l93K03L29k44J95p33P41
1770A97Rj28l02nN70l47J21m81M01K25j88k02j94O59k25j15k28J59L72k58r5k48
1792c03M77O4k87j34mN25k71j77j28K58L13m32k5j03M80j11l00MN2N12n12k3p1
1815a96L52J13m98J68j08N70m39j14L1J58L61o46K12j52N28k67k88J68l5N19o58
1836b21J63j28M19on37L13j36N51n91N8mJ97K42o43L04j51N59m53j42J73M3L28
$$ plain form
1697 595 -1088 1849 -1158 -578 1138 -434 387 -1100 1326 -1090 723 157 -983 653 -124 746
1713 746 -1553 1061 -142 -207 392 -592 387 -539 1251 -1191 -23 602 -80 -48 -646 922 -759 667
1731 667 -267 -386 296 121 353 -1063 768 -120 140 -145 -254 306 -159 605 -886 231 276 75 -188
1750 -188 -338 535 -306 421 -418 -107 220 179 2 -652 505 7 99 -294 -91 238 -6 189 -544 197
1770 197 206 78 -224 -229 341 -6 115 -366 35 260 72 -130 -324 335 110 -5 -233 -74 298 40 -55 -303
1792 -303 174 238 -49 -183 -187 338 67 -110 -238 20 333 -99 -124 -227 253 142 -158 -154 -102 410 -102 -125 -196
1815 -196 156 269 -229 -61 -169 401 -38 -152 -121 37 398 -248 -36 -188 340 73 -215 -47 -82 437 -221
1836 -221 -58 -186 233 227 -310 3 -133 418 -173 -115 -119 78 320 -323 -19 -170 389 -64 -206 -33 10 338
1858C38o27K79j66M98k50l60K72J2L62o18K12n5L00l2m16K08j8M61n75K9R4K06
1880A54J5l82J69o2M60m26j20J03K41K6m13J74k0L41k64j43jK85J13m58R6N9L13
1903B60k78j00m1K68J29l87M3J0L89k89o4j06K36J92l72Lp0N31m02k4p4J57K43
1926B54l60Q4k77O68l69r9m3J15L09m57K78n03P09j79k68m3J37M73q03N72m87
1947b89M50o0j07q2k62J018r84L65k90M81j75k24M13q53J207p51J75l98O09O9
1967C12q78J064j016Q75m71L82o58J31J158j579Q66n15Q92r42M21K50j067J584
1985H09j148N55q90J318n59p03J274j312J226r60R46j274Q11P62j793J363q04
2002c79J158j630J384m42r11J800j413P42j293K214j606j86J275j309J170j257
$$ plain form
1858 338 -289 -10 -176 322 72 -288 -16 -4 358 -260 -48 -103 197 165 -251 -43 -61 400 -175 -146 -52 154
1880 154 169 -213 -44 -106 354 -72 -192 -89 152 178 -235 -61 -81 260 -4 -147 -148 137 250 -208 -112 -53 260
1903 260 -18 -118 -159 109 238 -149 -106 -96 293 4 -60 -166 70 262 -110 -107 -177 354 -48 -72 -146 11 254
1926 254 -106 -22 -299 369 0 -99 -142 -27 282 -175 103 -400 309 130 -138 -181 -44 429 -374 198 -289
1947 -289 161 101 -6 -88 -350 668 -316 49 -241 240 65 -159 254 -599 608 -143 32 -366 243 312
1967 312 -566 498 -518 357 -114 268 -390 -259 899 -680 186 -329 563 -379 42 292 -775 809
1985 809 -339 216 -674 644 85 -618 656 -656 570 -390 556 -718 93 855 -938 425 -379
2002 -379 779 -851 533 91 -820 980 -433 309 -984 1230 -376 -562 713 -596 574 -683
2018f83J655k121J594J95j553J360q79J386k166K146j198l35J578j499P75j260
2034a005K637k569O60J037j322R52r94J792k717K348l58j306J141n47J236k450
2050a465K676j722K23J004j149O44j131K611k996J439L60r13O49o36J456k755
2066a705K952j165q01Q27O4M93k242L076k203O05M62m03m6o62K415l050J729j61
2084A85k36j0j18R87k280K832j651j29M20M29k40j408K700k393J011J43r2o33
2102d83K01J721k895J857k68O2o77O16M39j774K360j567K67j12R15p85o88J958
2120A147j989J133k94L05r89R02P17k222J792m09J61r79J306m39j017J861j328
2137c42K34k75J320j406j3J288j338P89m69O16j126J178m3j307J338m40K39r29
$$ plain form
2018 -683 972 -1149 445 640 -913 447 -432 954 -1212 934 -264 -599 979 -520 255 -1005
2034 -1005 1632 -937 -277 760 -562 390 -604 1188 -1529 819 461 -845 296 -251 985 -1465
2050 -1465 1211 -511 -288 716 -433 211 -920 1691 -1305 134 494 -419 230 -406 1050 -1705
2066 -1705 1247 82 -719 108 172 665 -1577 1499 -704 -99 363 -40 -86 -748 1667 -1383 346 185
2084 185 -51 -61 -179 808 -1472 1360 -291 -420 0 429 189 -1219 1481 -912 99 242 150 -483
2102 -483 -282 1439 -1456 401 133 195 -482 134 573 -1201 1159 -408 -141 -253 662 -123 -811 1147
2120 1147 -842 291 -3 302 -687 215 932 -1290 502 93 254 -725 581 142 -875 986 -342
2137 -342 -108 -383 937 -469 -482 806 -532 257 -212 404 -722 456 413 -894 444 4 243 -686
2155f86J364r11j93J160j103K70j40J144j621N70P26r34M63k64N97j181J311m19
2173A53p06P90j87K06r14J273r25K57M22o60K69j31Q53j444Q82J34m75K46j43
2192a00L95r09J221o90k76M86K2j6o87J100q12L16J00l04J46r4N99j056P16l8
2212A19j52O8j55L21n49Q16o54k1L47j4p5m32P70n95K71j4j63J09l1L68p57N16
2234I3Mr3l8r6K98l43M31m20O8K09n8k5k76M65k92J41o2j21J79m9J49m27L28O2
2258A27j42Kj04K61k21J87k10PK37j47M1k54L44j01k7j6j18K77j83J15k43J84
2280A6J06j82Q6j88L32k00N1r5KK39k40J40k50L02p8q0K9j01L10k93J62j83J45
2303C0Q2j87J10k10L78k37M1p3K7K01k80J96k54L14j19o2Rp6L20l55K08k02K16
$$ plain form
2155 -686 678 -233 -426 734 -369 -99 -239 905 -716 -146 580 -354 109 -155 442 -739 572 153
2173 153 -553 237 50 256 -658 615 -310 -53 369 -291 -22 -153 700 -744 138 272 -203 43 -100
2192 -100 295 -614 607 -83 -359 127 149 133 -554 546 -266 50 150 -154 -8 -102 497 -559 157 119
2212 119 -33 35 -120 201 -348 468 -186 -207 140 126 51 -381 389 -206 65 51 -112 -3 -34 334 -423 93
2234 93 97 4 -34 -130 168 -175 256 -164 -96 113 55 30 -246 219 -73 68 6 -115 64 15 164 -263 65 127
2258 127 -15 -13 -117 144 -77 110 -100 -93 144 -3 38 -216 128 27 0 -16 -134 143 -40 75 -168 16
2280 16 122 -60 26 -162 170 -30 21 -74 -72 167 -73 67 -183 119 41 -39 -10 -111 199 -94 68 -115 30
2303 30 112 -75 35 -175 203 -34 7 -66 -39 162 -118 78 -176 138 19 -43 -34 -110 210 -145 63 -139 77
2326G7j5j47J20j92L67k99J15j17J21R7k61K12k37L39k12M5n8MK31l26K02k09
2348a43K88j42o1P3j18K99l16J70j70K14k6j68J38j68L17k89J34j37J14J05k37
2369a23J78j97L16k30M6j3%J66k64J84j90K74j62l3L1k4J98k72J72j58J97n5j00
2392e9N7p0K42k66J19r2J27rj15P5j22K64k10N4n9R5L7j59J24j34K27j65L6o9
2416g2R2Q2k02J39j18J91j41M0n6K6J55k17J20j27K18j52K7j8o0K09k06J17j72
2439a25K48j29n8J06j24K08k17J80k47K27Oj71J18j15K63l20K29j56O6J11j76
2460g6J28k03L60l29J32No3J51j92K11l38M02j82p4Q5l5J71l57L89l36J88K2p9
2483b0L0j54M12m76K79j04M1L1j06J83l73N04l39N5J0N1O4l00M62m85L36q1k0
$$ plain form
2326 77 62 -85 35 -157 210 -89 26 -91 30 127 -134 78 -159 180 -32 13 -45 -41 190 -136 66 -143
2348 -143 145 3 -58 15 -103 196 -120 50 -120 94 68 -100 38 -130 187 -102 32 -105 9 114 -123
2369 -123 55 -142 174 -56 -10 -23 -23 143 -121 63 -127 147 -15 -48 -17 -41 157 -115 57 -101 96 41 -59
2392 -59 -2 -72 170 -96 23 -69 58 49 -66 9 -113 151 -59 -5 -64 31 68 -91 33 -101 126 -39 -3 -72
2416 -72 20 102 -100 39 -79 112 -29 11 -45 -19 136 -81 39 -88 130 -22 5 -13 -73 136 -70 47 -125
2439 -125 123 -6 -64 42 -82 126 -91 89 -158 69 75 -96 22 -93 170 -150 79 -77 -11 100 -76
2460 -76 52 -151 209 -120 12 17 -46 105 -87 124 -214 188 6 -68 17 -18 153 -204 185 -151 37 59 -20
2483 -20 10 -144 268 -208 71 -33 8 39 -67 116 -257 247 -92 -37 -27 24 88 -212 250 -235 101 20 0
2506@q1J7L50n78M30j80R8j09O9R4l60N39m23J44r4K09j24j54L86m75L83j69P8
2529E0j99J99J46m99M90k53J36k11K82j70k02N44m63J59j17L44l60K5L03m13L51
2550A42k12J95l35L42j8l61M14k68K05k80L82l25J0L65m34K04j24L72n20K60J44
2571A58l38K79j55K12m70N40j98k25K91j42J57l39M90m35J68J60k75J47j16L58
2591B67n53M22q3j68K04j20J50m13O19m16k0J96o3M6l05N44n41K96Rj33O5r6L65
2614B72n83M83k09LN8o8J47l72N84m88J45O1j5nj91M73n65L80p9n5k5K4K55n33
2638c03M92k38P9o4L3J03l18M92m37J92m7P3n5j44L52m36L73j86M5n9N0J57m08
2661b54M44k68J07q4Q4J3k19M01l87K13j06J41j05r3K94l48L06k11J18r4O0J06
$$ plain form
2506 0 -81 -64 286 -292 138 -42 56 -53 16 110 -250 289 -134 10 -84 125 1 -153 233 -242 141 -28 50
2529 50 -149 50 196 -303 187 -66 70 -141 141 -29 -231 313 -150 9 -108 236 -124 -99 204 -209 142
2550 142 -70 125 -210 132 114 -247 167 -101 104 -176 206 -119 -109 256 -178 26 -98 274 -246 14 158
2571 158 -180 99 -56 156 -314 226 28 -197 94 -48 109 -230 260 -175 -7 153 -122 25 -91 267
2591 267 -286 136 53 -115 89 -31 119 -294 325 -91 -111 85 22 68 -237 307 -234 62 71 -62 3 -93 272
2614 272 -311 172 -37 -34 24 -44 103 -269 315 -173 -28 33 18 13 -178 295 -270 110 31 -24 -49 -25 230 -303
2638 -303 189 -49 30 -34 -1 102 -216 276 -161 31 -16 57 2 -142 210 -226 147 -39 6 -53 -3 154 -254
2661 -254 190 -78 29 -55 29 42 -177 224 -163 50 -56 85 -20 -113 181 -167 139 -72 46 -48 12 118
2683A18k98L37k35J51j34R8j1j36K95l17K00j18J29j15m5K12k50K11j63J33j25
2704f3P1O5k02K26j61J36j51J01pj01J90k15J77j22J28r1l7J46j69J58j52J38
2726F5j17P5L2j40J74j38J28j54J18k3o9J21j48J32j24J42j04j1R7j12J15j34
2748g5J48j27O9J2r2J20j05J16j52J25m0m8R5r7J01j11J37j22L1N9q4P7j05J45
2772G7j34Q4pn7P8p9R5j35J27n8j5M6o3Q0j04J31j17M5K3m8N4q1J17j30J07k9
2798Gl1L7m8Q5j21J13o0J7J5l8O2r7J22j04N7oj4K4o3J07j21J09o7J5J8k9N1r9
2826e9R4p0N7l5oM3o5R7j16P0k3K2rm3P2r2R7p2M5j4mM2q5R1p5O6m7K3J0m8Q3
2857D9q9P5n8M3k5l1O1n6Q0j00P4m1J8Pm8O1o0P4o8M1pj2M3p8Q0q2Q4o1J4K0l1
$$ plain form
2683 118 -180 157 -78 73 -61 37 26 -110 185 -132 68 -50 79 -36 -81 131 -119 92 -71 62 -63
2704 -63 8 73 -129 97 -64 72 -79 22 15 -86 104 -111 66 -56 72 -19 -56 90 -79 79 -73 65
2726 65 -52 23 55 -85 89 -49 79 -75 43 20 -49 72 -76 56 -68 74 -30 -41 56 -56 59 -75
2748 -75 73 -54 15 27 -65 55 -50 66 -86 39 -1 -49 46 -51 50 -61 76 -46 -15 44 -40 37 -68 77
2772 77 -57 27 20 -37 41 -38 57 -78 49 -9 -24 22 -41 39 -65 66 -51 -6 17 -31 23 -58 59 -71 36 7
2798 7 -24 13 -35 50 -71 42 -18 -1 14 -24 38 -59 63 -41 16 10 -4 20 -43 64 -57 52 -15 0 18 -11 40 -59
2826 -59 35 -35 22 -13 -19 24 -41 56 -60 10 -13 9 0 -43 29 -63 34 -38 7 -7 -11 31 -54 37 -38 28 -19 4 14 -34 49
2857 49 -40 35 -23 20 -5 -36 25 -31 49 -51 23 -18 0 7 -41 20 -40 34 -34 7 0 -12 31 -47 33 -49 35 -26 -12 8 -23
2888b3O4r3R2o3M8k1j9M4o3J00j15O8l4K3Jn1Q3j00J12q8L6j7J6L5q9J03r0P2
2916C1n6K5jl7J02j35R9o0N6m0j1O8j05J27j11P7o5O8%r8J38j30J17r0O7m6j0
2943b0R8j64J29p9J08j19N5M0j20J55j44J06j08J30o8p6J65j60J31j46J50j34
2965g1P3P0j92J83j24J54j98J44j7j06J87j83J42j68K31j69j1J52j81J82j99K24
2987A23k27J47K7j82K01j59K03k96K72j18o6J77j90J63k29L32k96R2J04j57J52
3008G3k19L28l74K80o7j26J78j46K33l92L90k24K8J16j59J67k64M19m30K16L0
3029E7j02R4j72L46m73M19j78n3Q9o2J96m45N28l55J14Ql7Q3k47M67n28L37q9
3052cJ1j8q1L10n13N26l27P1LN5P1l99N90m69K24r0J01o7j39M57o10M21j59J17
$$ plain form
2888 -23 41 -52 40 -23 25 4 -15 29 -34 66 -49 19 -15 8 9 -42 41 -59 53 -35 1 -16 0 35 -54 49 -41 31
2916 31 -25 0 -1 -38 64 -71 28 -32 24 -16 -27 41 -64 63 -48 29 -36 32 32 -66 72 -58 59 -31 36 -10 -20
2943 -20 78 -86 43 -36 72 -47 8 48 -72 83 -61 45 -63 67 -1 -77 88 -72 59 -87 63 -71
2965 -71 2 72 -120 63 -61 93 -105 39 22 -84 103 -80 62 -106 125 -44 -55 97 -84 98 -101 123
2987 123 -104 43 70 -112 89 -70 133 -163 109 -9 -75 102 -88 75 -154 178 -118 -26 78 -79 73
3008 73 -146 182 -192 88 21 -105 73 -73 160 -232 158 -66 -38 78 -81 86 -178 241 -189 27 57
3029 57 -45 49 -123 223 -250 169 -9 -62 27 -35 161 -284 244 -111 3 11 -26 57 -190 277 -251 86 -3
3052 -3 8 -10 -91 219 -294 232 -95 -24 -21 34 105 -294 296 -173 51 -39 62 -5 -144 313 -297 124 -35 82
3076H2j89Q0K31m79N18l72J82j43J99q6k64N42n01K90j80K10k53P1L18n73M77
3097A60k30J95l38K98L4l95N10l88K46k54L81k92r2M36m67L10k55L40l89K40J13
3118A63m28M43k60K42m22M60j79k28M30l54K15k84M95m98J18L01l78K47k53M12
3138B42n17M06n0k83L30k13K54m78N74l46k3K39k48J89k58M97n97L28P9k37J52
3159D0j53L78n80N31k30j00J89r7J51m26O00m48J37N7j17J36k29M41n90M25p8
3180C7r7O4q2K84n08N60l53L9Q9j5M3l16N69m89K07l9J9Oj33L87n61M35j58K6
3204A4o5K4J77l80M43l55J67k7L5k8j81M32m40K56j18Q5q2kK05l96L89j97P2j17
3228h9J19N3k58L37k93J80p8P8p4o9K74l09K03j41J13r0N1P2k29K88j76O5j00
$$ plain form
3076 82 -107 -27 204 -275 243 -129 53 -90 109 23 -241 301 -200 90 -90 120 -133 -62 256 -317 160
3097 160 -70 125 -213 85 119 -276 234 -154 92 -162 219 -73 -165 271 -196 114 -141 199 -190 50 163
3118 163 -265 178 -82 160 -262 198 19 -209 221 -133 82 -202 293 -205 -87 214 -164 83 -170 242
3138 242 -275 131 81 -202 128 -85 169 -309 265 -81 -104 135 -113 76 -182 315 -282 46 125 -112 40
3159 40 -113 265 -315 216 -14 -114 75 -22 129 -297 303 -145 -8 49 -68 68 -161 280 -310 115 37
3180 37 -60 4 -78 206 -302 258 -95 -56 33 18 61 -255 314 -175 32 -7 12 18 -115 272 -289 146 -12 14
3204 14 -51 -27 150 -230 213 -142 25 -2 33 5 -176 256 -184 72 -46 39 -43 -45 160 -236 153 -44 28 -89
3228 -89 30 83 -175 162 -131 49 -29 49 -25 -94 180 -129 74 -67 46 -44 7 79 -150 138 -38 27 -73
3251g3J32j8j38K12k01J28p1Q0j14K8J58k15J36r8R0p9N0K1j16J76j34N7p6J22
3275E7o0m4J02j23J13n1M6r9P2M8j11O6m6P2p6N5k9k7R0p6K4l4P0m1k5M0n4O7
3303B6l3Mk9M3ol9L4k2M9m5K2k7J5L9n4J9j5M6k4j4kmM0k6%rK4jk9J1kK0j0rK
3338fJ2J3n2K0RJ3mk6PPK4m0OKJ6Pl8K2NJ6j3j6J1J0J6m2K0JJ0rk4J6PNj9R%J3
3376Hkk4J8oL1l1pK5kqk1J4KJ8k1j5RJ2%l1K5PK5m0PjJ2J8l9OQK3l9LJ6QJ1k7
3414hKj4N4m3j5J7PK6n8O1o3N7j2l5K0kN5r2O0m7L4Rl0M2p9J16j03K8J0RQn8R6
3447E2j02Q8n0QrJ2O4j39J24o8O3n9J5K4q2J59j58P2l6O2n4l9J28j51J30r4O3
3474B3p4O3N1j79J70r4R1j18J03l7n5J49j72J07p6J34j40J5J10j59J63j22J20
$$ plain form
3251 -73 59 41 -97 115 -86 42 -29 51 -63 -35 123 -92 44 -54 36 -43 7 28 -88 88 -46 11 -65 57
3275 57 -3 -47 55 -68 45 -6 40 -59 13 61 -50 16 -30 42 -34 21 -8 -35 55 -21 3 -31 39 -2 -27 13 -41 26
3303 26 -7 -3 -32 11 5 -34 0 -22 27 -18 4 -23 -8 31 -23 -4 -19 27 3 -11 -13 -17 23 -3 -3 -12 12 11 -18 -7 -9 11 1 -8 -6
3338 -6 6 19 -33 -13 -4 9 5 -21 -14 -7 17 -23 -17 -15 1 8 -30 -8 -3 13 0 -16 -5 5 21 -21 -1 0 10 1 -23 -7 0 5 -14 -5 -5 8
3376 8 6 -18 0 -6 25 -6 -13 12 10 2 -19 -5 -3 15 -6 -21 -12 0 0 -31 -6 1 26 -14 -7 -8 4 22 -17 -11 -3 20 -19 -16 0 8 19 -8
3414 -8 -6 -20 34 -9 -24 -7 0 26 -32 29 -34 23 11 -24 -4 -6 49 -43 17 -30 4 13 -17 25 -54 62 -41 -13 -3 6 14 -44 52
3447 52 -50 38 -12 -4 -13 -1 63 -76 48 -20 43 -16 -1 23 -59 100 -58 14 -22 40 -14 -53 75 -76 54 -40 23
3474 23 -51 12 63 -116 54 -40 51 -67 36 -1 -56 93 -79 28 -48 86 -54 -39 71 -88 75 -47 73
3497G3j56J53l2j37J76j12R6j60J99j42OJ34j78J19j15K08k48J26M6j22J25j28
3519f9J55k38K66j32o4J43j12J32k27L01k50J03N2j20Q8j08K57l70K74n7n6N3
3541B1o2J56k90L39k12J8M6j4N7k21L55l44K17n7k3Mm3K26m16L71j50Lj2K4J03
3566I6l20M49l38J18k7R5o3j68L96m25K86j47R1r3K8J91m11M17k55J41j29J17
3588D9Kk37M32m04K15j02J40j60m3L43m37L17j73J57k13J38J25l97M24k71J82
3609H7k18K25p9j59L53l93K72j71K14k37P7K10l77L29k08J82k55K57l3k83L84
3630A77k51J55k31L10j96p6K86l13K28j80K61l16J48J19k73K63k03K08k76K95
3650A35j42j38K93k31J41k07L22k69M7J72k44J75j22K28l36K36J4j75J55j16J79
$$ plain form
3497 73 -83 70 38 -99 77 -35 61 -99 100 -42 -36 98 -80 39 -76 132 -116 10 56 -66 59 -69
3519 -69 86 -152 114 -18 -82 61 -51 81 -146 155 -95 8 60 -60 28 -80 177 -193 81 24 -32 21
3541 21 -41 115 -175 164 -48 -30 16 2 59 -162 193 -151 66 9 -14 -10 -53 173 -243 128 -22 -19 -31 -7 96
3566 96 -224 225 -113 5 -22 73 10 -158 238 -187 99 -48 43 -50 -22 169 -242 175 -80 61 -68 49
3588 49 51 -186 246 -158 57 -45 95 -65 -108 235 -202 115 -58 99 -114 24 149 -248 176 -95 87
3609 87 -131 94 15 -144 209 -184 88 -83 131 -106 -29 181 -196 133 -75 107 -148 109 76 -207 177
3630 177 -74 81 -150 160 -36 -112 174 -139 89 -91 170 -146 2 121 -152 111 -92 116 -160 135
3650 135 -7 -145 148 -83 58 -149 173 -96 -49 123 -121 54 -68 160 -176 60 74 -101 54 -62 117
3671A17k65K93j88j2J47j34R6j66K77k84J50K4j29J00n5J40k87K85j02o4O2l7
3693c2R0j92K72k14N4N2l5J5j07K40k64J76m7j8Qk1J14k35K50j41M1j7J7K5j13
3718h2K13k31J23l7L5n1j8J50k08J70j02N8n7N4K8j53J91j37Q3p9P8l7l9J23j65
3743i0J47r2O3p4N0N0j30J39r9P4o8N7j4o9J23j00P4p9Q0n1j6P1j02J06q0P2q9
3770d7O5nm6Q0q2O4o0O9o0nN6o2M7n2O8n8K1Mk0N4l9L3n7P1l6k0L4l0L6l5L9m0
3802a3K3Pk0K0k1K1j2K1l3JJ4k0J6k8L3onNj1J4jJk2K3mnk%J6j1Kj0J7lmoJPL
3841HloJOlj0J1jNppQkKj6J3PKj6lK1j4J8l0JPNKj2MJ0Mj0MoJ4mj2J4Pj5LJJ6
3885A7j5jj1OJ1jJk2K0j1J4k0JLORj6Q%Qnj9J6pJ1j5PPkLmJ1lmjJlJ5k3lQMJ1
$$ plain form
3671 117 -148 145 -43 -55 92 -42 54 -112 165 -119 31 55 -74 26 -29 111 -176 109 7 -57 5 -32
3693 -32 58 -134 138 -76 -22 30 -5 10 -97 143 -121 55 8 -10 -2 -23 91 -144 106 -35 6 -11 6 31 -82
3718 -82 131 -100 23 -14 21 -30 -48 102 -106 64 -38 20 -37 17 45 -108 83 -54 29 -50 28 -9 -48 75 -90
3743 -90 57 -35 28 -46 4 54 -76 63 -36 38 -30 27 13 -56 67 -33 41 -38 42 -9 -25 46 -56 50 -30 42 -47
3770 -47 18 13 -33 47 -35 29 -31 38 -22 -27 29 -33 14 -38 30 -28 -7 -3 -23 31 -8 25 -32 39 3 -17 17 -13 23 -12 27 -13
3802 -13 10 17 -3 17 -4 17 5 26 -7 -6 8 -12 4 -24 9 3 -2 3 -8 6 5 6 -16 7 3 -2 -4 -4 12 1 3 -7 10 7 3 -3 -2 5 8
3841 8 5 -1 0 6 3 -7 4 3 8 1 -6 2 0 2 -14 -1 6 8 -8 -11 10 -4 14 -16 -15 -8 -3 -1 -13 -9 1 5 -5 -1 -7 7 3 -9 5 12 -3 0 1 17
3885 17 2 1 -10 -4 7 6 7 -15 5 -6 8 -12 -11 -8 -2 7 -9 -1 -1 7 2 -17 -1 -8 3 -12 -5 2 0 3 -1 10 7 3 2 3 0 15 -8 -11 -3 1 12
3928A2ljlPj5NjJ2Nj6lQOj9Q%Lj1Qmj0K3k9J6oQJj3QqK1j4OkJ7j5k2L3j8J3j5
3969hJ6pOJ7m0K5k1K3k2J2J4k2J9l2K7j7K4pk7L4l6M4l7L8m2J6K2m6K4k6M2l8
4001b5L0qk0M7m3K7l7O9n4pM0m0L8m4N4n0K5K2l5K1l2M6n8L9qk4N5n1L0l9P3o0
4033a9rM3l2K7l0M8o7N2kl0K7k2M0p5P5j9k0K4k3K2m7Q6q0K0K0mnj4N3q0O8k3
4065Dj3JPL0p7Q8m7jOJ1mm2P8p6L4lNj2JM0o9O0l0KjK4j2m3Q0n3MMK6k4%M8p3
4102b7L4LJ9m8K1J9o4O5l4J5j6L2rm2O1n4K3kK1m2K8K8p2M7jNm3M2Jm1N1k8J6
4135Hm1O9m2j6L9k9K0k3L8m8L0J8l6K6j5J4m6O0k0k7M0l4J3j3M6m8LL1l2J3j1
4166a3M8n8L3Nl8L0qK3n4O3l7oL3k9K4l4M0m3J9J5k3K3k6L4m5M3qk9L1j3J0m3
$$ plain form
3928 12 9 8 5 12 -3 2 1 13 18 2 -1 7 13 -6 2 2 5 -6 2 -2 -12 11 -18 -2 -8 0 1 -12 -4 -12 9 -5 1 -1 16 1 -21 12 -6 7 -8
3969 -8 8 1 7 24 -16 9 -12 11 -11 1 15 -7 12 -20 7 -10 14 7 -20 14 -22 22 -15 23 -19 -3 19 -27 -3 -29 13 -25
4001 -25 5 -3 -23 24 -19 8 -29 40 -14 -21 19 -21 17 -27 27 -23 2 24 -11 10 -22 24 -34 5 -3 -27 28 -23 7 -32 41 -19
4033 -19 -28 15 -17 10 -20 28 -39 13 11 -19 8 -14 26 -49 26 7 -13 11 -12 10 -37 49 -31 -11 9 5 0 -14 39 -41 27 4
4065 4 -9 -8 -1 29 -48 40 -7 -8 -2 9 5 -37 41 -35 -1 -4 1 -11 -10 30 -39 21 -9 -7 -8 16 4 -39 41 -12 -8 -4 22 -2 -2 46 -27
4102 -27 7 10 29 -19 2 21 -43 22 -12 3 -13 19 10 -32 29 -25 -2 -4 17 -25 3 31 -41 6 5 10 -33 9 10 -31 20 -8 8
4135 8 -33 36 -6 -22 17 -12 8 -15 23 -25 5 23 -13 13 -2 12 -34 26 6 -21 19 -15 -2 -15 31 -17 -14 17 -15 -2 -13
4166 -13 35 -23 10 15 -23 7 -1 22 -32 31 -6 -12 21 -8 16 -18 22 -21 -2 13 -10 13 -13 21 -24 19 11 -18 13 0 10 -33
4198c3M9k3RonJ1k8M1k7J4NrPj7J6k9L5j9j1L1j0Rm5O7m1MJ4qJ4j5J7k9J4Ono
4234coK2k3K6j5j4K2j3J3j9K2k4%RnJ2oJ5l0J5Mp%jJ4k5RJ2j2Rj2J5qJ6j9LJ6
4271A2j1M%Nj4J0pjQj0J6j6J3j3lJ0lLj4J7mjnnJ9j0Oj4NjmJ5j6K0k6J7lolPP
4312Dj9J8j6%J5j0J5j9K0oQj4MNj3NkJ0qMnKo%O%%MoKmRj0PjKJ1k4J6j0PjNqK
4357ajoJ7qOpLMjjpNkJ9k4LJkJ0j6NPj2J4nRj2MJ0plqK2l0J6kNqJ4Pk8L1l3K7
4401A5j4OmLOj2J3k6J4k%MqJ7j7LqPLj0J3pJ0j6QnQ%j0J9j7J3j2J3Nj6Lj5L3k5
4441hJ8oMkk0L2k7K3k2J4lj8J2jJ2j2Nk1J6J3k0J5j0Rj3K0j0j3K0k2K1j7K6j1
4475Dj4QnKJJ7k4K3qmJ5j8J3k1J6NoK0k8J8j8K6l6K0j3pJ8j9L0m0M9j7Jjj2J1
$$ plain form
4198 -33 16 -7 2 -4 -9 2 -26 15 -12 2 7 -2 5 -12 4 -25 10 -9 -20 11 1 10 -35 32 -9 -5 9 1 15 0 17 -12 2 8 3 -3
4234 -3 -9 13 -10 16 1 -13 9 -4 9 -10 12 -12 -12 -3 -8 4 -2 13 -17 -2 2 -5 -5 -6 8 -17 -8 4 -8 1 -11 4 -4 12 -7 -4 12
4271 12 1 5 5 10 -4 6 -1 -2 6 -4 12 -4 9 -4 -7 3 0 3 -11 6 2 1 -4 -9 10 0 6 -8 -3 -4 -8 7 -9 11 -15 2 -1 -7 -10 -3 4
4312 4 -15 3 -13 -13 2 -8 7 -12 8 2 10 -4 0 5 -8 -3 -5 5 -3 1 -4 -2 -8 -8 -2 -2 -2 2 -4 -2 -6 3 -7 0 -1 1 12 -12 4 -6 1 0 5 -3 -1
4357 -1 -2 -8 9 1 7 0 3 7 6 5 -2 3 1 20 -4 -1 0 -2 8 -8 -3 4 -8 6 1 10 -2 2 12 5 2 -6 16 -14 2 0 5 -3 11 18 -10 21 -12 15
4401 15 1 7 3 6 12 0 13 -13 1 -1 -1 3 -5 12 -5 -2 -10 -3 0 -10 3 -4 6 -10 -2 -7 1 1 -9 10 -7 6 -6 7 12 -4 -1 -16 17 -8
4441 -8 10 4 8 6 -14 18 -9 14 -8 6 3 -15 -3 -4 8 -4 1 -20 -4 9 -11 4 -6 3 -10 10 0 -13 7 -15 6 -11 15 4
4475 4 -10 -2 -7 -5 -4 13 -11 12 4 0 15 -3 10 -11 5 10 4 24 -4 14 -4 22 -14 6 -7 -14 4 -15 15 -25 24 7 8 7 -5 6
4511Fk3L4l1K7moOj8L1m1K6j5NJ4j4J8l4M4l2J1pJ5Pl9N3o1M3j7J9j9lL7p0O1
4545B3l2K2k2J0J0m9O8m5L4l2M1k7k2N8p0O3l9L1m1K8K6p3O8m8M9o1O1l5l2Q4
4575D8p3M1n0P3n1PL6o8P1o3O8r2P2nn7O9m9N7q4R5o6qO8o8M5n9J01j01N0J4n2
4606c1N5m9P9j12J08m8j8N1n4O1r1J10j10M6L2n8N5o7J06j40R6k2k5L6k7O1j31
4633h7J45q9K2J5j3L7q8J28j23O3Ok8J9k3Q3j45J24n8J7oj2L9j01J55j22M7j2
4660gJ9j0m9J27j51J05l6J1l2J9N7j34J33q4N4m9M8j5n7J17j24Q7m2L9m6MO9j18
4688f5J14p9N2n6N5Qq8J17p8M4o0Q7p4%P7r5P3o0P2q3N0K5q9J05p0N7r0R2n1l2
4718d2P5o5N0o0J01j05M3L4p7O4l5P2j05P9k6l3M2m7P2r0J10q0J7L5m6L0n8J01
$$ plain form
4511 6 -17 17 -14 13 9 3 9 -9 22 -19 7 -8 -3 11 -3 15 -19 25 -7 4 -3 12 19 -20 33 -28 15 -2 17 -2 -5 32 -38 23
4545 23 -9 13 -9 1 11 -38 30 -15 19 -13 28 1 -21 37 -33 30 -9 22 -19 9 35 -38 30 -18 31 -30 31 -4 -36 48
4575 48 -25 16 -34 39 -12 -5 31 -37 34 -29 39 -53 19 14 -43 26 -23 34 -50 45 -21 -29 39 -29 16 -43 58 -43 7 21 -31
4606 -31 24 -25 54 -58 50 2 -16 35 -19 42 -49 61 -49 -3 29 -29 26 -41 65 -75 21 -1 -26 10 -17 44 -87
4633 -87 58 -31 -9 6 -7 30 -58 70 -53 10 16 -12 7 -16 67 -78 46 -12 5 -1 -13 26 -75 80 -42 5 -7
4660 -7 12 2 -47 80 -71 34 -2 9 -23 -4 53 -81 52 -32 22 -27 21 6 -51 66 -58 29 -13 26 -20 -16 53 -65
4688 -65 49 -30 22 -34 21 29 -59 58 -20 24 -36 51 -23 -23 54 -41 32 -28 44 -39 11 36 -53 52 -18 39 -51 41 -10 -42
4718 -42 33 -32 18 -42 59 -46 -3 31 -46 18 -17 55 -50 29 3 -30 12 -35 37 -53 57 -23 -6 29 -17 13 -45 56
4746E6j14Q7j8l6M9m8N9j06J25p8J4K1k2M0p8J01r2M3Jj2J8l7P0r0R2n1jJ8j8
4775gL2p9J04p7L9rrK0m3Q5r7N6j1jJj9M7o9P5n1J4OrK0m8O4n7L8k0%Lj4N1p4
4809c9N2k5K6j3j1L1n1N8l9K0nNml3M9m6M3k3J9j3lK4l8K6k1R%Lkj7L4l1K0jk
4844B%qJ5j4NnNnJ2Kk1J7rNmnJ0pJ0j4J6nPrpJ8qnMO%rPj6J1oPrPOqQj6J2kmM
4891@lMj1J3MpNrJmJ4j4j%J0j4LRoJ1mkl%Lk%KNpJ0j3J3kpNpPj4J5pjJ5k3Nj0
4937a7J9j9J0m%L6l7J4k0L2k0pK6k6K2j9L2l8K1jj1J8l1K9l7M0l5J7K8l6K3l0
4969b1M8n1L0j1mJ3j8M3o5N7k6Jlj3M0o0P8p6L7oKJ9m4P0q0O0l1J0nKL5q7R6n0
5003a0J4qlK8p6J16j16O7k5K0ml5Q8j17R5n2L2l3K1L1r8J15r1O0m6N0qp3J28j21
$$ plain form
4746 56 -58 29 11 -25 24 -24 35 -71 54 -24 -10 11 -11 29 -49 52 -40 3 4 -8 10 -27 43 -47 45 -6 -7 11 -7
4775 -7 25 -54 50 -27 12 3 -6 14 -29 56 -41 15 4 3 4 -15 32 -37 38 -13 1 7 -2 18 -30 34 -23 15 -5 -5 -2 -16 35 -39
4809 -39 13 -12 14 1 -10 21 -30 28 -11 9 4 9 5 -28 21 -25 18 -5 14 1 -2 22 -16 10 -11 -2 -2 1 -1 -18 16 -15 5 4 2
4844 2 2 -6 9 -5 0 -5 0 -5 7 9 -12 5 -4 1 -3 -8 2 -5 5 -9 7 2 9 0 -7 11 3 -2 2 8 8 -1 6 -10 1 -5 2 -7 0 6 -2 6 -10 2 0 -4 0
4891 0 -3 1 -10 3 7 0 5 -4 -3 -7 7 -7 -8 -8 2 -12 -9 0 -6 5 1 -1 -4 -4 -1 -3 -3 -1 4 -3 7 -6 7 5 -2 3 -4 3 -11 4 -3 -4 11 -12 -7 -17
4937 -17 2 -17 -7 -11 -11 25 -12 2 -18 14 -6 -13 13 -13 9 -10 22 -16 5 4 -7 11 -20 9 -28 12 -23 -6 22 -14 9 -21
4969 -21 27 -24 6 -5 -9 4 -14 29 -36 21 -5 -4 -7 -20 20 -40 38 -38 -1 -7 -5 14 -30 40 -40 20 -11 -1 -6 -4 31 -56 40 -10
5003 -10 4 -4 -7 21 -55 61 -55 12 -13 7 3 -32 56 -61 34 -18 14 -19 2 33 -65 50 -41 19 -27 23 15 -58 70 -51
5033e1Q0o4P6o9K2P0j25J11q6Q6r3P3Jq2J16j15R6r3J00p3j2R4j26J15r7R8j22
5060g0R1K3j22J10o9Q4j25J33n6o2J22r4O4r9J43j34M0O7q4O5p3J14j71J61n1
5085Gm6P4o0Q3j51J95j54K9P1o0K2q5J80k04J19lm0K6l5J17k20K08r3jK0kM4j45
5113a04K28k04R2nmj6l8J68k51K01p5Ql0L7O0k00K66j77O1n1P6k6j13K35k42J55
5139E1q8Q5q6nJ58k50K23j35Q3r1Q0Lj58K66k27J21r4J32r8m2K04k60J84j01J22
5164G7j59Q3R4k39K40j65J30j52J48n3j00K27k30J69j48J66j51L4J25k17J89j29
5186f1J36j82J57Kj76K22j56J22j81K16j20m9J58j76J41j53K22k05Q9N5j55J74
5208H0j54J62j97J79o9q5J58j35J17j58J98j57K8J08j37R0r8J68k15J35J1q5J03
$$ plain form
5033 -51 29 -35 41 -28 -6 64 -61 50 -36 50 -43 30 31 -51 65 -50 46 -47 53 -20 -32 62 -64 51 -46 52 -70
5060 -70 21 44 -78 32 -37 47 -78 55 -1 -63 59 -35 29 -70 73 -61 -21 46 -38 27 -46 68 -103 58 7
5085 7 -39 35 -25 58 -93 102 -52 -23 48 -12 10 -75 105 -99 20 17 -23 3 -32 85 -135 73 -20 -21 -1 -3 41 -104
5113 -104 124 -80 12 7 3 -13 -51 117 -134 67 -8 0 -30 7 67 -133 133 -44 17 -34 42 16 -97 138 -104 51
5139 51 -37 48 -38 -43 115 -135 88 -47 36 -55 25 28 -130 136 -91 30 -64 68 -30 -72 132 -128 56 -45 77
5164 77 -82 1 95 -144 96 -69 61 -91 57 4 -96 131 -99 70 -78 88 -63 -29 96 -121 68 -61
5186 -61 75 -107 50 52 -124 98 -58 64 -117 99 -21 -70 88 -88 53 -100 122 -83 6 61 -94 80
5208 80 -74 88 -109 70 1 -84 74 -61 56 -102 96 -61 -33 75 -62 28 -70 98 -117 18 29 -56 47
5231D7j06J32j81J88r1k4Q5q7Q3j43J90j67P4L2q0P3o6J28j90J50l8n2O9n0O7
5256D3j45J88j25J9M8l9L8r7J51j45J01l6k9L5k7P5j43J35p6J6K7k4K7q3J39j14
5282d1L8J0qPm2J01j25J01n4OjQL5r3J10q0M2k3J4lm1Q2r0O6k1J2j5j8N8r4Q9
5313C0o0L1j2J9Oo5R8q7M7j9J6jk5N7q7O5l7L6l2J0K9n6P4o9M1k4J5Ll2O7o7N1
5345B2m8K4nlM1p1O7m7L3l0K2J5m7N1n3M7l0J1j4j1M5l7L3m3K9j9rL1l5N6m6L5
5377A4l5J5J1j5K9m6M3k3J4k1JJ9l5M7m7M0k0J4j0pL6m8L6m1L4j5nL2l7L6l7L5
5409A4k6QMj0K3n5O2m9L7j3kL2m1M0n3M3k5J1j3j0M1m4M0l6K3j1KK3m1N7n3L0
5441Hm0M0mk2M1n3N0n5N2l8RL7n2M6n3N8n5L6kj6L1n0M8m7O7n1RJ4k3K6m4O3o9
$$ plain form
5231 47 -59 73 -108 80 -11 -35 50 -37 46 -97 93 -74 0 32 -48 25 -41 87 -103 47 9 -43 26 -24 43
5256 43 -102 86 -39 -20 28 -11 27 -70 81 -64 37 1 -28 7 -20 55 -88 47 -29 -13 14 -10 17 -66 73 -41
5282 -41 -3 7 -1 6 -36 65 -60 41 -13 -7 -8 0 35 -58 52 -28 14 -9 5 2 -39 43 -47 19 -2 10 -5 -23 35 -59 30
5313 30 -30 1 -11 8 14 -51 47 -40 7 -12 4 3 -22 35 -52 13 -24 12 -20 -10 19 -37 37 -32 9 -15 0 3 -29 38 -29 22
5345 22 -26 -2 -7 -10 31 -40 27 -20 13 -17 5 20 -27 24 -29 18 -12 -1 -15 -26 19 -18 15 -28 1 -18 -27 4 -31 25 -21 14
5377 14 -21 -6 5 -10 19 -27 16 -7 7 -14 -13 6 -29 18 -29 11 -9 5 -5 -12 24 -24 12 -29 5 -10 -15 17 -20 16 -21 14
5409 14 -12 -4 0 -10 13 -42 20 -29 8 -5 -7 25 -16 24 -29 14 -11 0 -13 -23 18 -26 14 -22 1 -10 -8 15 -26 31 -22 8
5441 8 -32 8 4 -18 23 -30 20 -35 17 -21 -12 25 -27 19 -34 24 -31 5 3 -13 18 -32 16 -31 36 -15 -6 8 -15 11 -33 30 -39
5474c9M2%j7K2l0N4p2O9n5K0Qj8L4p5J02q6N2k0KRm0Q4j11R0m0J1k1J6M6j04J19
5505E2q6M1k3K5j1m0J02j16Q7o7N9m8PM8q2J10j01P4q2O6Lp7J24j21Q3p4J00r0
5533c7J5Q6j32J04j00J24j27Q3L1j11J28j21J16j38J37p2l5J15j20J25j31J39
5555G9j47O9N3j23J25j17J62k08J65m3p8J16r4J14j91K27j46PO4p8R8j42K01k17
5579a04J36lp4R2j21J76k37K23j21LP1p5J07j84K55k20P0L3m2N2j26K17k73K08
5603F3o8j5K7n5J53k50K55j74O2Kj2M2j44K64k63J59m0KMo6J74k78K52j17J9k7
5629c1K6P5k18K77j99R3n6O2j3j16K42k56J73r8P5p2J5J07k26K42j60Q2q7J04
5653D1k4j29K33k12J21q5J21j20jJ62k18J65j13J35j63J01M1j55J82j35J06j42
$$ plain form
5474 -39 3 3 -14 8 -22 32 -40 29 -26 -6 2 -16 18 -57 45 -41 11 -9 -7 2 -38 46 -65 25 -15 -4 -25 -9 37 -67 52
5505 52 -34 7 -16 9 -2 -42 60 -56 31 -36 23 -25 -18 30 -52 58 -43 31 -51 15 18 -59 65 -56 27 -47 53 -37
5533 -37 -22 64 -68 36 -64 60 -67 16 47 -64 64 -57 59 -79 58 -14 -49 66 -54 71 -60 79
5555 79 -68 1 54 -69 56 -61 101 -107 58 15 -63 53 -41 73 -118 109 -37 -30 34 -44 54 -88 113 -104
5579 -104 32 29 -45 47 -74 102 -135 88 -33 -30 41 -34 73 -111 144 -76 -6 27 -15 37 -89 128 -145 63
5603 63 -5 -20 7 -48 105 -145 110 -64 -2 0 -12 30 -114 150 -113 46 6 8 12 -54 120 -158 94 -23 -4 -31
5629 -31 -5 70 -148 129 -70 23 -33 29 16 -100 142 -114 59 -39 36 -36 -21 86 -140 102 -58 24 -63 41
5653 41 17 -112 121 -91 30 -55 66 -54 -55 107 -111 54 -59 76 -87 14 55 -100 82 -53 53 -89
5675h9J54q7m2J49j53J20j17J53j78Q3Q0j68J44j00J23j93J88p2p8J40r0Q3j52
5698a02K07j56K7P8j05Q1j07J76k17J54j8p4J00r4J15j84K17j36QP2p1O6j33K26
5722A30k21J03Ml5M0p9J57k14J72p2nK3k5Q4j65J98j51O2kj5K6q2J65j95J25l2
5748djlk7J08j84J88j26M6nMM0j32J78j42P4k0J3mn4J26j62J34p0L3k5LO9j32
5776g5J41j19O6k5K0J8p4J10j08O7m5M2k9j6P8j09R0m9L6m6K5K7o7Q7q0N3m2K4
5804@kl3P5p8O4m7L2j9LL5o6O2m4K6k9K1Mm0P3o7N1l8L8k6mL5n5N4l5K0j9LK0
5837A4l7L8k1J5j1LJ1k6M0m4K0j3J1j2kJ4j7K4k2J0LjJ5k3J6j5J1jLNj9K6l2K5
5871HqNjk4J9j7K1j2JJ3j3NoK5j9MrKJ2qJ0k6K3rOr%J3k0J6j6J3j9NJ7j4K0k4
$$ plain form
5675 -89 65 -22 -64 85 -68 52 -65 88 -90 -7 73 -95 49 -51 72 -121 67 -5 -83 57 -33 50 -102
5698 -102 105 -51 -24 54 -51 30 -77 99 -118 36 18 -56 44 -50 65 -119 98 -38 -30 42 -29 37 -96 130
5722 130 -91 12 16 -19 21 -58 99 -115 57 -15 -20 3 -22 62 -103 95 -56 6 4 -11 15 -67 98 -97 28 -4
5748 -4 -5 -8 -35 73 -111 77 -49 -3 -8 -4 36 -96 82 -60 14 -6 7 3 -51 75 -87 47 -23 10 -15 -12 57 -75
5776 -75 66 -53 13 -12 8 26 -48 62 -46 21 -24 18 -11 -27 51 -58 32 -17 19 -27 -2 25 -42 45 -35 18 -24 0
5804 0 -2 -35 40 -38 26 -21 11 -8 -5 30 -36 26 -18 8 -21 0 4 -36 37 -30 21 -17 21 -5 -9 26 -29 25 -10 10 -9 -6 14
5837 14 -23 15 -6 9 -2 1 12 -14 26 -18 2 -11 0 -12 -14 0 -17 7 -15 -5 -2 -3 12 -11 5 -10 1 0 3 8 -11 15 -17 8
5871 8 0 5 4 -20 -1 -18 3 -9 -8 5 -8 -3 -9 16 -3 1 -8 -6 6 -2 8 -18 5 -4 2 -7 -7 6 -14 2 -14 -1 -20 -15 2 -12 8 -16
5909a6K4qoJ7j7J1j9K0k0J7j1NkrK1k5K4pjJ0j2J7k1J4k2K2j8KJ0j3K0k3K8k4
5943a2RjjMk4L6k5K6j0QqoJ3k6L9l1K2k7J2K0k9K8k4J6k5L4rj7K4l3K9l6M0l9
5977b3L1nk4L6k4K8l4K3j7JK5l2L5l1L0m0J8Nj5K0k8N6o4L6j1MLk6N7p2O8m3J2
6010akmJ9m5O4o1M0j1kJ1l6N7p6P3l9J9j2mK7o0Q0n5K5j8J8rk7P2q1N5l7L3k8
6043a5MM5o9N9m0M4n0M6mn3P0p2N5l5N1m1lM5p5N4l2M4q3O5On9P2n1N8q2R1o7
6075b2jN5n1L9o6R2r0N3J2m7M1l4N7r6J00l2l1L9k6L0q2J30j08K9K7k6J9n8J10
6104F3j18P8k4kjj7P4j14J19q2L0j0qL2p9J33j31P8k4Lj2k4J08j53J17m5K7m7
6132b9K2M4j25J48r4N2m7L8j0o5J37j39J00p1N6m5lR7j58J37q5O2o0M8J3j03J50
$$ plain form
5909 -16 8 0 -6 11 -6 5 -14 6 -14 3 -8 -3 -5 -14 7 -18 6 -1 -2 8 -4 13 -8 6 -16 6 -12 -10 0 -13 7 -16 12 -12
5943 -12 -3 -4 -5 -1 -25 11 -14 12 2 10 2 -4 9 -17 22 -9 13 -14 -2 18 -11 17 -7 9 -16 18 9 -8 16 -17 12 -24 16 -23
5977 -23 8 3 -21 15 -9 19 -15 8 -9 -8 17 -15 20 -11 19 -21 -3 2 -13 7 -21 35 -29 7 -4 0 3 -23 34 -38 30 -13 -1
6010 -1 -3 -7 12 -33 31 -30 10 -1 -3 8 -28 29 -47 26 -13 6 -6 -10 17 -43 37 -18 7 -11 7 -2 -29 43 -38 17 -20 13 -15
6043 -15 -11 34 -35 24 -16 28 -22 24 20 -33 37 -35 20 -15 36 -5 -8 37 -38 16 -16 28 -55 10 16 -43 29 -22 36 -46 45 -22
6075 -22 -23 32 -19 20 -46 46 -44 9 21 -26 15 -19 38 -58 42 10 -21 18 -8 22 -60 70 -38 -9 18 -8 11 -47 63
6104 63 -55 23 -1 -3 -4 -21 53 -61 58 -24 6 -4 -12 20 -59 74 -57 21 -3 0 -12 -36 72 -81 36 -9 18 -29
6132 -29 -7 37 -88 60 -34 18 -29 9 -1 -66 71 -68 32 -39 17 -28 -31 66 -92 45 -40 22 -38 10 23 -80 70
6159G0j20P9p0P3m1l9J16j36J05p3P8o9J9O1j12J08r0Q9q4N2j6o3J36j27R0p4
6185c8R8q7LR7j36J07r3R5r3O4J7j02J18r2Q5r3Q9l5m4Q8r2Q1p7R2j02M4M3p8
6213d1P4p0R0j13Q7j0n7P2o9O5q6J01p3MO2o1N0p3J09j02M7Om9N9o4P0q5Q6l8
6242ij4M7m7M4o9J03r7L5K3m0L6m0Q4j03O1rk8K0j6N2p6P8n5J2J0qK4n6O8o2N8
6273B6j6k1J2j8M4q1P6k6KknK5n0O4n0L2k2Rlk2N9o1M1l2K4j4J1J2m4N1l3K7l6
6306b1K6qk8N7n9L4j7K2k0%L1m6N1k8K0k0kL1n9M9l5L5l1J9jk3M3m5L5k2K3j9
6338hJJ1k5K9k5K4k0K2oj8L0l1K9j8J2oj4K9l9L6j6K2l8RJ9k0J1k0K8j2POk5L3
6372A7l2K7k3J3j7RJ7k9L0k2J5j9J4Lj8J6j7J9j1J0ljLj8K1k9K3lNlJ0LpjmNl
$$ plain form
6159 70 -50 29 -41 32 -9 -48 68 -68 37 -36 42 -27 -8 53 -59 49 -41 48 -36 16 0 -63 73 -54 36 -38
6185 -38 60 -27 -24 73 -63 44 -49 46 -47 17 34 -68 50 -42 43 -50 39 4 -40 48 -44 37 -40 52 -50 -6 37 -41
6213 -41 33 -37 53 -60 27 17 -40 32 -37 28 -58 43 -30 -26 36 -25 25 -48 61 -41 6 12 -37 22 -42 28 -57 29 -9
6242 -9 -23 24 -23 21 -48 55 -42 -7 16 -24 12 -28 56 -47 14 5 -23 -3 -19 33 -43 35 -20 -8 2 -6 18 -38 30 -32 26
6273 26 10 -11 1 -17 27 -54 22 -4 -2 -4 -9 16 -34 30 -20 12 -10 -1 -4 -26 33 -28 13 -19 5 -9 2 14 -30 21 -12 15 -21
6306 -21 5 -3 -31 26 -33 1 -16 6 -14 -14 17 -29 22 -6 14 -6 -8 23 -36 13 -22 13 -18 1 0 -23 20 -25 10 -12 11 -8
6338 -8 -7 4 -21 8 -17 7 -13 9 3 -15 15 -16 13 -5 7 1 -13 16 -23 13 -3 19 -19 -10 9 -11 0 -20 8 -4 3 9 -16 17
6372 17 -15 12 -11 2 -15 -6 11 -18 12 -10 5 -14 0 3 -15 1 -16 3 -8 2 -1 -2 1 -17 4 -25 -2 -5 0 -3 7 10 3 2 -2 3 0
6409@j5K5j4J1j7KjQjj4K7j9J1j2J5krRk2J5qJ2KjKj5J8j9J0mJ4j0kJ7k4J3j2
6446a0RnRj2jJ8k4J3j4K3qMomOjJ5k0MmlJ0j5OqJ0KqK1k0J7j4K0k2J9j1j1J4j6
6485a7J5k0K3j2QjqK3k5K5j9Pjj3J7j5Qj8K1mJ1pqJ9l3L2j9PKPkk6M4l2J9k0J5
6522Ckk0L2l9L1k1K3j3QQk7L2k8J4j6RJ4k8M0m1L1k8L1k6rL4l8M8m1K9k8J3J5
6555A0l2M3l8K9m7M4rj8L9n1M1k6L2m3J8K3m5M7m3N8o4M5k1rL3m1N6o4N9m3J9
6586BK0m6M9m4N3o6M6j0l2M2l2M0o0N6k8kJ6mJ7n3O3m9L0Jj8K2k8M0n3N0k5lK0
6619A4k0L1o9P0m2QJ0rJ1l6O6p5M0mKPk7N3o7N5l4J9j5MJ9o1Q8o8M0j7J4j4j6
6652b3O4p3N5l3J1j8NK8n3O3l8J1j0J3km2O6n6L3k9L5k2PL8o7O3m4L1k8K2jm5
$$ plain form
6409 0 -15 10 -4 7 -10 -8 -9 -1 -2 -16 11 -8 3 -9 6 4 -5 4 -18 -3 -11 1 3 2 4 -11 7 -12 -2 -6 8 -2 -4 13 -11 2 -10
6446 -10 -1 -6 3 -9 -10 8 -16 -3 -17 6 -2 2 -4 -8 -2 -3 12 -8 -4 -8 -11 -1 -16 -10 -18 -8 -6 -14 7 -13 4 -10 10 -12 7 -4 -15 -1 -17
6485 -17 -2 -22 1 -11 -3 -4 -12 11 -14 11 -8 -1 -2 -15 2 -13 -5 -23 -2 -6 5 -2 -10 9 -24 8 -11 -4 -2 5 3 -23 21 -11 8 -12 3
6522 3 1 -19 13 -26 5 -16 7 -6 2 10 -17 15 -13 1 -15 -6 8 -20 20 -21 10 -18 13 -13 -22 12 -26 22 -19 10 -18 -5 10
6555 10 -22 21 -17 12 -35 9 0 -18 21 -30 11 -15 17 -26 -8 15 -30 17 -26 32 -32 13 -8 -17 16 -25 31 -33 26 -17 2
6586 2 22 -24 25 -19 34 -32 14 4 -28 14 -18 22 -38 18 -10 -12 4 0 17 -36 27 -22 8 9 -9 13 -15 25 -28 22 -3 -6 14
6619 14 -6 25 -44 26 -16 -8 2 -7 4 -32 34 -41 -1 -5 -3 4 -23 30 -37 18 -16 3 -12 -8 11 -50 38 -30 10 -7 7 -7 -23
6652 -23 41 -32 23 -10 1 -17 -12 16 -37 26 -12 -1 -11 2 0 -42 24 -32 1 -28 7 -15 -8 30 -37 26 -18 13 -15 7 6 -39
6684c9N3l8L1l2L7j0k5N0n9M1l5M2l9K6J6m5L9l3M6n8N1k6j5L9l3K5l9N3m7K2
6714bJ5m4M6m2N6o3N2ql0M4l5L3o6P3m9QL0l1K5m2N5m9L8kj0J6l7M4n9N0k0j4
6746a8L3k7L4m1O5n6MJ1j8K3l7N0n0L3mj0Oj0L0m5M3k9JJ2%J6l6M1l7J3lqJ4k3
6780b3M5m1K7j7jJ1oK0m3L8j7KNrQj1K8l5K4j1N%j2L9m8L3j5kJMOj7K9k7RknM
6818dnK3k4J4qJ0rmJ3j4J0qNjnJ5j3J7k8J4J%J0j5Qj5J4lMqONnJ3k1K1j0rJ5j1
6858bJ8j7J0j5MjRJ0j1jj3kJ0MNj2J6k6K0j0RnmOj8K2j7QJRrj3J5j%oJJ6rPm%
6900DllKqJ7k1PKjJKMk2K7j9RoJ0qj3K5j2J7kkj2l%j3K1k3K3rlRjJ4j2Qj4MN%
6943Ar%K0k9J6mNnjJ9k6K5k0J6j4JLqJ6j7J8j3Qo%Nk0K4j7JJ1nOlKj6J5nLnPO
$$ plain form
6684 -39 14 -24 7 -25 12 2 -23 27 -32 9 -26 16 -23 3 19 -26 13 -20 26 -32 19 -7 -22 17 -16 9 -30 23 -24 -2
6714 -2 13 -31 15 -27 29 -34 18 10 -20 24 -11 22 -44 29 -20 -12 18 -13 12 -30 25 -24 14 12 2 18 -19 25 -34 16 -4 -18
6746 -18 15 -12 22 -19 46 -10 -6 5 -13 10 -27 23 -27 6 2 -8 -2 -12 18 -27 16 -13 -12 0 0 16 -20 21 -16 -3 -6 -14 0 -23
6780 -23 22 -19 8 -9 -10 1 -5 15 -28 10 -7 -5 0 -9 -1 -12 16 -19 5 -6 -1 -1 -13 26 -22 11 -4 -6 -5 -1 5 -12 17 -10 -1 -3 -8 -4
6818 -4 -9 14 -10 4 -4 6 -3 -7 6 -8 2 -6 -1 -2 -7 8 -5 12 -16 -2 -1 -1 9 -6 2 -13 1 -2 2 -6 0 5 0 13 -8 13 3 -6 9 -2
6858 -2 16 -1 9 -6 -2 -3 6 16 5 4 -9 -11 -1 3 8 -4 12 -14 6 -4 5 0 -4 2 -16 6 -11 -3 -2 7 -2 -15 0 -1 -1 -7 -6 10 1 8 4 4
6900 4 1 -2 0 -8 9 -12 -5 -3 -4 -3 -1 3 -19 8 -11 -2 -8 2 -6 -19 6 -6 11 9 7 -5 -8 -8 -21 0 -23 0 -9 -12 -3 -4 10 -2 6 -8 -4 1 1
6943 1 -8 -8 12 -17 -1 -5 0 -5 -6 13 -13 12 -8 8 -6 -5 -2 -10 6 -11 7 -6 2 -4 -4 1 -19 5 -12 -11 0 -5 1 -2 0 -16 -1 -6 -3 -8 -1 5
6985Ek4L0k3K4j4Lkj5K2j1J5k0K1qnJ0j3K0l5K7j1mJ2j3J7jRk8J2jrQrJ5k1K6
7021Ik0ROj4J6k8K6j3QOj0Mk1L7l2K5k4K0omK6l9K6j5PjLMoJ7m0K1oJ1lnJ5k7
7059a8L1k1J0mkOl4M7l1K2j8J3pLK2l2K7j7Rk5J8Pj2J0j2J4j8J4jqJ8j9J8j7J5
7094Hj7J5Mj6J7j7L1l6K0j1j1QqK0l2M7l9J6Lj2J6j3L7n8M9l1kJ9j1J7m3M5k5
7127a0K4qqJ5m2N9n0L2k1ROj8L7n0M9l2NOj0K1m0P0o4K5nmNk1N5o2M3k4J4j3q
7162a5L8n6N2k8K2k8K8kl4N7o0M2l7K6ok1N3o9O4l9J6k1K0Qm1O0m0RrJ3pl2N9
7195B2n1M5m1M6k6oL0m7M1l4L0k6K8j1j6L4l6L7k8L3k4lL0n2L7k7L1m5J7J4k4
7226b2L5k9M1m5J9KoK0k5J5k3L6k7J0J0l7M0l2L7l9J9Kk1K4j4J8k4K9j5jkLJ3
$$ plain form
6985 5 -19 11 -12 12 -2 1 -1 -16 6 -5 10 -10 11 3 -2 8 -5 15 -20 7 -4 -8 4 -9 8 7 16 -12 0 -1 -10 -2 -11 4 -17 9
7021 9 -11 -2 4 -10 6 -22 4 -9 -1 5 -5 -1 -22 15 -17 8 -16 4 -2 -6 20 -19 7 -8 -1 -2 1 5 -1 16 -24 -3 -9 2 -1 -6 9 -18
7059 -18 13 -8 2 -2 -4 2 -32 15 -16 6 -12 1 -6 -3 19 -13 14 -3 6 -19 -1 6 -6 4 -8 6 -12 2 1 -7 11 -8 10 -7 8
7094 8 -9 6 10 -6 11 -6 25 -11 9 -2 -13 -5 -13 7 -25 22 -17 -1 2 -10 6 -7 30 -28 21 -10 -12 7 -4 13 -30 15 -10
7127 -10 14 6 -2 13 -29 30 -20 12 -9 0 6 -12 25 -25 24 -8 -3 3 -7 14 -26 44 -20 5 0 -4 1 -20 35 -27 16 -8 6 -7 -15
7162 -15 23 -33 19 -9 13 -15 13 11 -23 34 -26 16 -21 5 -1 -22 31 -38 26 -13 3 -18 2 10 -31 29 -11 -2 -11 2 -5 -37 22
7195 22 -29 16 -25 21 -5 -11 19 -28 13 -21 9 -17 11 0 -16 18 -18 19 -9 24 0 -3 27 -25 12 -15 16 -29 -12 2 -22
7226 -22 13 -16 25 -20 -1 1 -5 15 -10 5 -18 18 -9 1 11 -26 14 -18 19 -20 -1 1 -20 4 -10 8 -16 13 -2 -3 -5 -2 11
7259A1k3M0m3J4OqJ1j5J7l6M5l4K1npJ8j9L4k8Rqnj1lL7l9K7j4QJlJ4k7L0k0O
7295ARj4QrL3m7K5j7J3kj5K7l7K4qLoJ5Lk5L0k4K5j3Klj7L4l1K3j9J8k3LK5k7
7331a6K5j8K0k2J2mOJ1k4J6j3LKpJ6j0Rnjj5J4Kk2K3j2J0kQj9NJ1k4L0k5ROlJ
7369cj2K7k4J8k%njJ1j6J0lJ0poQkOj9J9qpRj7L%QmK%j0J6j3Rj5OOoJkJ8j5J8
7412Hk2MLLJ1j9J8j8J4nJ2j2kJrJ9nkJ2j7Qj1MjJqLQk3K0jJ3ppoKJ4j4OjL%pR
7456aqQjOj8J4j1J0%qJ1pO%Rj9OLlMlNKmrj1K3j6Oj2QJ7rlLjpJ2lnlKJ6qMpO%
7504Dj4QRPj6NJnjlJ2k2K1j3Rmj0J8k2J8qMJJopK8k3QqJ4ppQk0J7j%ML%j7K6j5
7548cRj9J8pqK2k0J3rJ3j9POj4J5j0J3j5MQj8J5k2K4k2K8nj2Jj4K7k2L3l1J5r
$$ plain form
7259 11 -12 28 -15 -1 5 -3 8 -7 10 -26 19 -15 6 1 -6 12 -7 27 -1 8 0 -5 -16 -19 18 -21 6 -8 0 1 -2 12 -15 15 -5 1
7295 1 10 -4 4 -5 28 -19 6 -11 2 0 -15 12 -25 -1 -9 -6 -12 3 6 -19 11 -13 12 -1 1 -2 -19 15 -16 7 -12 6 -17 -14 11 -16
7331 -16 9 -9 11 -11 1 -3 3 14 -10 6 -7 -4 -2 -9 7 -3 6 1 0 -15 -1 1 -21 2 -10 0 -2 6 -13 -8 3 -21 9 -16 -7 -1 -4 -3
7369 -3 -15 12 -12 6 4 4 -1 -2 9 -7 3 0 10 3 -3 5 3 9 -10 9 1 -6 3 -14 -11 -11 -3 -7 -5 -5 -15 1 -12 -3 -18 -12 -6 -12 -11 -13 5 -10 8
7412 8 -14 -10 -7 -4 7 -12 6 -12 2 -3 9 -3 -5 -4 -13 6 1 -1 11 -6 2 -9 -5 -6 -5 -13 -10 -2 -25 -5 -6 7 0 -7 -13 -11 3 -11 -5 -6 -3 -3 -10 -1
7456 -1 -9 -1 -2 4 -14 0 -11 -1 -1 -9 2 -5 1 1 10 -9 -3 0 -3 1 -2 3 5 1 -8 -19 4 -12 -6 -18 -10 7 -2 -5 -2 -3 -10 2 -1 -6 -9 -7 9 1 5 -2 4 4
7504 4 -10 -2 7 14 -2 3 4 -1 -2 -5 7 -15 6 -7 2 -2 -12 6 -16 2 -6 -2 -1 0 -6 -13 15 -8 0 -8 6 -1 -8 0 -20 -3 -4 -4 0 3 3 -14 12 -3
7548 -3 6 -13 5 -2 -10 12 -8 5 -4 9 -10 -3 3 -11 4 -6 7 -8 -4 4 -14 1 -21 3 -19 9 4 -8 -7 -21 6 -16 17 -14 1 -8
7584hJKjJ4j8K2k2kJ1j5K4k6K5j3LQnJ0k8K6j8J6j8J5oj2J7k1K6k5OJ7j1kqL2
7620A6k9K4mj7LmJ6k6L3j1j6OjJ1j5K0k3J6j0PQk8K7k2L3j5lMkMk5L7k6Qj4J2
7656f%j2L1l6L2oMj5j0K5k9L9k7J5j0LJ3j5L1l8K1j7J0Mk1K8l2K7k2J9j5QJ5l0
7690a6L6k2Pk8K7qj3J3j6L0k8K9j8%K4l8M2l5L1k9K2j0pK5l4K7k5K8k1pL3k8K1
7723A2k0J7j7J2Mk3K3k1K6l4K6pj4K3j3J8m0L6k0J6Lk8L2k6L5m7L1lqJ2k1K7l6
7756b5L9k3J3%mjk4L2k3K0lqK0k4K9l8K3jqJ5j6L0m6M0k7J1Oj3Nj3J6j4K5kj2
7791akkJ2j9K1pkMMj1kQk1K3Oj2MkJ4j6K0j8Poj1K5l1K9k7J3Rk5K3j8J7j4QnP
7830BjoPj1J7j4PJ1j4Oj5K1j8J4mLKplpJ5mJ%%MqNj1Qj3MRjMk0K0j1LLjjqOnK2
$$ plain form
7584 -8 -7 -5 -6 8 -10 12 -10 -12 -1 -16 8 -18 7 -6 -3 5 0 10 -18 8 -10 6 -12 3 -3 -15 2 -19 7 -18 -12 5 -6 -8 -16 16
7620 16 -13 11 7 -10 -7 -11 5 -21 12 1 -15 -9 -10 1 -14 6 -17 -1 -11 -4 4 -24 3 -19 14 -1 -4 0 -2 2 -23 14 -12 -4 -18 -6
7656 -6 -6 -18 13 -23 9 3 7 -8 -18 7 -22 17 -10 5 -5 -2 11 -4 27 -11 10 -7 3 7 -14 14 -18 9 -13 6 -9 -1 14 -16
7690 -16 20 -2 5 -23 4 -4 -17 -4 -20 10 -18 11 -7 -7 17 -21 21 -14 17 -12 10 0 -7 18 -16 11 -14 14 -7 -14 19 -9 12
7723 12 -8 9 -8 4 8 -15 8 -13 13 -21 5 -2 -16 7 -6 12 -28 8 -12 4 7 -21 11 -15 20 -27 4 1 -7 5 -16 11 -25
7756 -25 14 -9 4 4 0 -1 -25 7 -16 4 1 -7 13 -11 18 -20 3 2 -6 9 -7 23 -23 17 -10 1 7 -6 -1 -14 2 -12 13 11 -1
7791 -1 -3 -5 7 -12 9 2 0 4 8 -3 -5 3 -18 5 11 -1 3 1 15 -1 19 1 8 2 -9 16 -15 14 -13 0 9 -16 7 -11 6 -8 0 -5 2
7830 2 1 -5 2 -9 8 -6 1 12 -2 4 -11 10 -8 6 2 5 7 0 -3 -10 5 1 2 2 2 6 -2 3 -8 0 -13 -9 0 -1 3 -17 3 -8 -5 -2 -3 -4 -12 -6 -11 11
7876A1j3knjJ9k2K0j4PJoRj3KnJ8j8LJ6j5J4j3J0j2J3mkNrRj6K0q%Mj7PkNqMJ6
7918Hj4Mk0K4j0J9k3J1Mj7K2pPjj2JKRnqOkJrJ3j3J3nJ1j4LJ1j3K0k4J3onjMj
7959dj2K7j4MQk0K2j0KqKkPllPj1J6k1K7%j5Oj0K3k1O%j4J3kKmPj1J0%jKj5Oj0
8001a4J9j6J2Kj3J1j5K2j8J4pMNr%j1K2j8RKj1K0j3JnNKrJ0JJ1j9J4j4kLLmj0
8040a6K0j6J7qjmPJ0k8K6j7K0pnMJJ5l4K7j4J0j1jK2l7L2k3K6j9J5j0k2L0k7K9
8075A1k0J5qj0K8l3K6k9K9k3J3Kj8L6k5J1k0K4k9J7Rj6J3k1K9j7NJ4k2J4j2K2
8107A5l7K4jj9K3k3K1k8M2l5J1K1j9K3l9L7l1K0Kj2Qj3L1m8M4k4%JmK6m6M8l9
8140b1K2Nj5K4l6N0n5M6j7j0J5j7M4o1N6m1%LkK1m7O1m5L2qMjl3N9o0M3l0J1M
$$ plain form
7876 11 -2 -4 -9 -10 9 -13 7 -7 0 1 -5 4 -9 -7 -12 6 -12 -9 7 -8 6 -7 3 -9 4 0 -2 3 -6 3 -13 7 -1 -1 3 -14 -7 -9 -4 -12 -8 8
7918 8 -6 -2 -22 2 -8 11 -12 -1 3 -14 8 1 8 7 -5 -4 -2 7 2 -6 0 -2 -1 -10 3 -10 3 -2 9 -5 -2 9 -4 16 -8 5 -1 -6 -7 -3 -4
7959 -4 -16 11 -3 1 9 -11 11 1 3 -5 -3 -5 2 -1 -4 3 -8 8 -13 14 14 -1 5 -5 18 -3 3 3 -11 2 0 2 -2 5 -6 4 4 3 5 -10 -4 -14
8001 -14 5 -11 1 3 -10 1 -14 8 -10 4 -3 1 6 -3 -3 -14 8 -10 -1 1 -10 10 -3 -2 -7 -2 0 -9 1 2 13 -6 8 -6 -8 -5 -2 -6 -16
8040 -16 4 -12 5 -3 -4 -8 -1 9 -19 7 -10 10 3 -2 2 3 18 -16 11 -3 7 -4 -5 17 -20 12 -11 15 -4 11 1 -21 9 -18 11
8075 11 -9 6 -2 -12 16 -17 9 -20 9 -14 -1 1 -17 19 -6 5 -15 9 -20 -3 6 -10 3 -18 11 -6 -1 13 -9 5 -7 15
8107 15 -22 2 1 -18 5 -18 3 -25 17 -18 -7 14 -5 18 -21 16 -15 5 7 -5 3 -10 21 -27 17 -7 -7 -6 -10 16 -30 18 -21
8140 -21 1 6 -9 15 -21 29 -26 20 3 -7 8 -9 35 -26 30 -11 -11 -8 -10 11 -36 25 -20 12 4 8 7 -26 33 -27 16 -14 -3 1
8174Aj0L1n7N6l7L3k1Qkj4L6m6L1rQj8j
$$ plain form
8174 1 -9 22 -35 21 -16 17 -4 4 2 -12 24 -22 9 0 8 -10 -11
8191a1
$$ Imaginary data points
##PAGE= N=2
##DATA TABLE= (X++(I..I)), XYDATA
0@%%%%%%%%%%%qJ6j6K4l2M0n6O5p3Q9j13J37j61J92k25K65l12L61m18M82n52O31
33C36p19Q14r19J039j169J311j467J637j825K030k253K497k762L051l367L711
49A945m088M502m955N452o003O614p294Q057q917R897j1024J2335j3883J5747
63H385j8048K0965k4810L0183l8401N3474j23799K23451j35819k7754J5651M3278
75B6756K3282k09745L70608l56584J76073l0265N5732j08672q434K28181l34301
86a67369K62614j23249M1862o0109Q5962K7166k46394L43621k23996P3635o3924
97e0181J21503q6654p2610K47685k91588J71492m9303P8714j56240P6292J31160
108A20270k54513K16329j22935Q2170j10421J36066n2040j30515K40188j80897
$$ plain form
0 0 0 0 0 0 0 0 0 0 0 0 0 -8 8 -8 16 -16 24 -32 33 -40 49 -64 73 -88 104 -121 144 -168 193 -225 257 -295 336
33 336 -383 431 -488 551 -618 693 -774 863 -962 1068 -1185 1312 -1450 1601 -1766 1945
49 1945 -2143 2359 -2596 2856 -3147 3467 -3827 4230 -4687 5210 -5814 6521 -7362 8385
63 8385 -9663 11302 -13508 16675 -21726 31748 -92051 131400 -4419 -32173 -16522 26756
75 26756 50038 -159707 210901 -145683 30390 125 55857 -52815 -61249 166932 -167369
86 -167369 95245 -28004 13858 -46251 39711 66877 -179517 164104 -59892 13743 -50181
97 -50181 71322 -15332 -87942 159743 -131845 39647 -9656 69058 -87182 -10890 120270
108 120270 -134243 82086 -40849 41321 -69100 66966 14926 -115589 124599 -56298
118e6298Q2315q7041J43881j27322J2024J31724k03551J51921o4839Q0403j61727
129i8510J35333K4261j53034J52481r2748P1616j10191J51626j04642l7971J42754
140H0975j15105N1193p4247J39662j37119N7375L9979j01237R3125n0111O3807
151D8297j33236J38561l8396n9421P5131n1032M8099p9787J23425j18777L0343
162a6793O3123o3122J6618l5157J04619j26346P8251j1023l4660L9084j9512L6644
174C1726r9160J20999o0321o190J7533j0049K3720n1549Q3931r8886N9774O006
186A7534k1966m501p040O1568q9642P0948l7904P535P521O00N518n3558Q8624
199D5237n9617J4351q812J6327q24k3614M5178o3342N4341j7616J695j6970J0960
$$ plain form
118 -56298 26017 -61024 82857 -44465 -32441 99283 -104268 47653 -17186 63217 -98510
129 -98510 36823 61084 -91950 60531 -32217 39399 -70792 80834 -23808 -61779 80975
140 80975 -34130 17063 -57184 82478 -54641 2734 42713 -58524 34601 -15510 48297
151 48297 -84939 53622 15226 -44195 30936 -20096 28003 -51784 71641 -47136 -16793
162 -16793 46330 -16792 -174 -35331 69288 -57058 21193 10170 -24490 14594 -4918 31726
174 31726 -67434 53565 -6756 -12946 4587 -5462 18258 -33291 50640 -48246 11528 17534
186 17534 -4432 -8933 -15973 45595 -44047 26901 -11003 -3468 4053 4653 10171 -43387 45237
199 45237 -14380 -29 -8841 7486 6662 -16952 28226 -35116 19225 1609 3304 -13666 -2706
212b706K7572n0483M4503l5535K4435q200P166j0586j6239N1048m4783J7237j4697
225a1268K2191j0546n423J5354l1935L9645k0384N716j7547J9148P773k5426K0637
238G935k0571K3782j2769N447j2032L360K1820k5923J0690j0589J8196r373o05
251f32n72p519K1879j5079R05q102J6401j907j0406M846n735J4455p925j655o621
266g667J0209N990j2647J327j068J0583m889l631l441M966Q582r234m108J814
280c214R066l050n537j303L308O641m107p025J196Q823j71p388k133N449L824
295D379j777o773k71P490K514o725n749P725L676k118o065m38O423K300l382q194
311f985O134N867j772p103o85P382N23j719p122L140O356K60p097l096Q606J412
$$ plain form
212 -2706 24866 -25617 18886 -16649 7786 -414 6752 -3834 -20073 30975 -13808 3429 -11268
225 -11268 10923 377 -5046 10308 -21627 18018 -2366 3350 -14197 4951 12724 -12702 7935
238 7935 -12636 11146 -1623 3824 -8208 -4848 16972 -8951 1739 -8850 9346 -27 -632
251 -632 -1204 -8723 13156 -1923 -1018 -9120 7281 5374 -5032 -186 -5921 8534 609 -1046 -7667
266 -7667 2542 8532 -4115 -2788 -3856 6727 1838 -1793 -5234 -268 8314 -920 -5028 -3214
280 -3214 5852 2802 -2735 -4038 -730 5911 1804 -5221 -4025 4798 4627 -2761 -4894 555 4379
295 4379 2602 -4171 -4442 3048 5562 -1163 -6912 813 4489 2371 -3694 -4132 2291 4591 1209 -6985
311 -6985 -851 5016 3244 -3859 -4544 2838 3361 1642 -5480 -2340 4016 4276 -2821 -5917 2689 4101
327D101l036n644K173N670P55n171m905O663M786l952o382K163O088M26m708l738
343d711L546O396k558p152Q21O479K142o821j803J966N895r96o799j51M341O231
359F826q931j644K173N164Q6p350J490L05R421q381l512K420M924K079j0418N122
375b26l077R828n445n641K267L505P265j5989P782k449O954k985o003L849l281
390c646J5179j7960M362L62O590k046j0163J1752j1433J7625j3786L02J95O020
404C353M787k1138J9953j2523J2746r211N68J48l000K0505l0152J6353n109J1480
418H760j1961k691J4274k0150K6975k3393R083p099J4638l231k1837K9918k2658
431i372J9731j7603J1216r205L402J9888l8673K8564j2187J6401k3627J1965Q093
$$ plain form
327 4101 1065 -4579 -2406 3264 4019 -1152 -6057 606 5392 1440 -4942 -2779 3309 3735 -973 -4711
343 -4711 -1165 5231 2673 -4479 -3658 2821 4963 -1858 -3661 -1695 4200 3204 -3595 -3746 595 6826
359 6826 -2105 -3749 -1576 3588 3674 -3676 -2186 -1881 7540 -841 -4353 -1933 2991 5070 -5348 -226
375 -226 -3303 6525 1080 -4561 -2294 1211 8476 -7513 269 -2180 4774 1789 -4214 -365 -3646
390 -3646 11533 -6427 -2065 -1703 4887 2841 -7322 4430 -7003 10622 -3164 -2862 -2667 3353
404 3353 8140 -12998 6955 -5568 7178 -2033 -1465 -1317 -4317 16188 -13964 2389 -2720 8760
418 8760 -3201 -5892 8382 -11768 15207 -8186 897 -6202 8436 5205 -16632 13286 -9372
431 -9372 10359 -7244 3972 -5233 -1831 18057 -20616 7948 -4239 12162 -11465 500 8593
444H593k4322L4987l1172J6111j5286K7806j8210j6091L6186l0443K3769k4823
456a2895K4863k3706J4418J4075m0973L6736j9135K2513l5844K9272m926k0258
468a5860L7958l7611K2110k0807L9771l8381n67L5516l6224K4406k4729L4113
480A9695m1187L1500L480l7884L7072j7870K3075m5976M6520j9314j1220L0821
492A8712l3532K2561k3189M5599n2802J7920K4041l2658K0894j9839L4205n0552
504b8640M8479j3729k8467L3757j1232J3909m7634O2715l7152n87K2131k2292
516h742J2978j9909N0130o5206L4340R908k1617J0099j0745L0649n3762N9620
528B7743l2226j1040K4411l700Q52l7703O8260n4236J5336J1049j1071j516n287
$$ plain form
444 8593 -15729 19258 -11914 4197 -11089 16717 -1493 -17584 18602 -11841 11928 -12895
456 -12895 11968 -11738 2680 16755 -24218 12518 -6617 15896 -19948 9324 4398 -15860
468 -15860 22098 -15513 6597 -14210 25561 -12820 -13387 22129 -14095 10311 -14418 19695
480 19695 -21492 10008 13488 -24396 12676 -5194 17881 -28095 18425 -889 -12109 18712
492 18712 -14820 7741 -15448 30151 -22651 -4731 19310 -13348 7546 -12293 21912 -28640
504 -28640 19839 6110 -22357 11400 168 14077 -33557 29158 -7994 -8581 13550 -8742
516 -8742 4236 -15673 34457 -30749 3591 13499 -8118 1981 -8764 21885 -31877 27743
528 27743 -4483 -15523 8888 5188 6040 -31663 36597 -17639 -2303 8746 -2325 -3841 -9128
541i128M3565p1967M8448j908j0824o298P384J9971n0903O0953m0251M728P919
554A689R219j2318k3444O0256n7896K8001l929J480j3285J1044K5816o6131N8768
567A9270j5627k738j6564K6716l69m0198O0878m6595J4219l285K3703l0786o438
580a7814N0856n5958L2061j5215J6813k6295K3448Q335m9924N6735k6734Q685
592D993k3805L7145j8424k0148M8774m7362K2400r654K8928m3775J4107L4027
604B7206m8559K9981j6487K3162l5921L4553o475l2732M5206k5086J2768k8873
616b1257M2973k8133l738K9766l7294K5282j4492K7767m6079K9817J2897l5873
628a8364K6992j5722K1585l6568M1852k1586j5664L4292k0900J0018k6993M5518
$$ plain form
541 -9128 34437 -37530 10918 9010 -1814 -8112 -728 19243 -31660 29293 -10958 -6230 1689
554 1689 10908 -1410 -24854 35402 -22494 5507 1578 3058 -10227 817 26633 -39498 19270
567 19270 3643 905 -15659 11057 10688 -29510 31368 -15227 -1008 -4293 19410 -11376 -17814
580 -17814 33042 -22916 9145 -6070 10743 -15552 7896 16231 -33693 23042 -3692 4993
592 4993 -18812 18333 -91 -20239 28535 -18827 3573 -6081 22847 -20928 -6821 27206
604 27206 -21353 8628 -7859 15303 -20618 13935 7460 -25272 19934 -5152 7616 -21257
616 -21257 21716 -6417 -10155 19611 -17683 7599 -6893 20874 -25205 4612 17509 -18364
628 -18364 8628 -7094 14491 -22077 19775 -1811 -17475 16817 -4083 5935 -21058 24460
640B4460l5518P565J4537k3021J9679j5590K6473m2584L4090k192j8687J6773
652E985j3012J9638l0222L6527k8147J576K0247j6056N673j7472L7411l5581J4905
665A472L519j1692J1251r232J8452l4607L2713r169p964O415m803J3402k2950
678a3193K7710k5204J0366O950q510J996r568K5824k8265J6762n550j964N629
691B983m530Q667k2819K8128j3302j272J25K183N998j5037J8572j8906J2566j204
705B152j986k107k940J5659j8734J2093p784M837K56j872K357j0456J7925j1890
719b490K185k449M568R37o758Q595j1144J0707l374l64l868K508P380j0865O002
734A570m956O444k648o36n89k386R064p862J937k790N284r07l159K047l554P148
$$ plain form
640 24460 -11058 -3493 11044 -11977 7702 -7888 18585 -23999 10091 7899 -10788 5985
652 5985 -7027 12611 -17611 18916 -9231 -7655 12592 -3464 2209 -15263 22148 -13433 1472
665 1472 4991 -6701 4550 -4682 13770 -20837 11876 2707 -5257 1158 -3645 9757 -13193
678 -13193 14517 -10687 -321 6629 -1881 115 -9453 16371 -11894 4868 -682 -2646 2983
691 2983 -1547 7120 -15699 12429 -873 -2145 -2020 163 6161 -8876 9696 -9210 3356 2152
705 2152 166 -1941 -4881 10778 -7956 4137 -3647 1190 1446 -426 1931 -8525 9400 -2490
719 -2490 -305 -2754 1814 2751 -4007 4588 -6556 4151 777 413 -3455 -947 6433 -4432 1570
734 1570 -3386 3058 410 -226 -815 -3201 5863 -1999 -62 -2852 2432 1525 -1634 413 -3141 4007
750D007m317l3k407L858J931n075J895j988N120k687q92j196J549L528m350J77
766h80j063M205q90k563m73J315L442l509j065K08K797J97k699n95J018L071j919
783E97k596Q83K345N05k545o96J115J912m3l253K43K561R62k449j545K114Q44
800I54N53k656o49K301J512j505l341K885J233O7k408o38K242P24J43m134K082
817f35K110Q0k498j148L119l09O35l295Q76K136N64j796k533L706n0J06k576L58
835a150K010L36n15l471L010J152k08k625J6K557j91j06l019J719J837J86k749
852a211p32L080P4q11k150J144J602N20k151j395K484J314j404k110J214J385
868H53N36j898q80R67K149p46k874J092J482J226k970R8N56J535K60k979Q20M85
$$ plain form
750 4007 -310 -343 -2750 1108 3039 -2036 -141 -2129 2991 304 -588 -1784 -235 3293 -1057 -880
766 -880 -1943 2262 1372 -1191 -1664 -349 3093 -416 -1481 -1273 1524 1721 -978 -1573 -555 2516 597
783 597 -1999 -1116 1229 1734 -811 -1507 -392 1520 1477 -1776 -1533 1028 1990 -459 -2004 110 954
800 954 1507 -1149 -1798 503 2015 510 -2831 54 1287 1354 -1054 -1692 550 1274 1417 -2717 -635
817 -635 1475 1555 -943 -2091 1028 719 1354 -1941 -1065 1071 1635 -161 -2694 1012 962 1068 -1508 -1150
835 -1150 860 1196 681 -2790 220 1372 1164 -1461 -1445 1112 921 815 -2204 -485 1352 1538 -1211
852 -1211 -1943 1137 1211 400 -1750 -606 996 1516 -635 -2030 454 1768 364 -1746 -532 853
868 853 1389 -509 -1389 -422 1727 981 -1893 -801 681 1907 -1063 -965 -409 1126 1386 -1593 -773 -288
886b88L102l793n28J366J125N85l614K187j315L786k657j826J584Q93K050n703
902c046L699j460K468j205k012J570j152N377p203K505J87K152j447l096M750
917B087m670O280n178Q26m69K574J255p573P461m321M513m358J491l62q05O539
933E290j0328O133k119M614n761O49M523o900Q665p552L683m067P227k848p021
948e812J0040o295N405p428P232n475J915N611j0967P876m100P774j1384O617
962A009J267o142Q854q780O154p653J2887r922k545R991p289N144q788J2853j3304
977f264Q370K101r919P529l716R825j8109J5186m525l111O108o783O928j1185
991g565J8560j7403M519N851n253L310q351J5965j9659J5979m513n981N380j012
$$ plain form
886 -288 2814 -979 -1507 -141 984 1569 -2045 142 -1173 2613 -44 -1870 -286 607 2657 -3046
902 -3046 653 -807 1661 456 -1556 14 -1138 4239 -2964 -459 -272 1880 433 -2663 2087
917 2087 -2583 3697 -1481 -655 -1124 1450 2705 -4868 2593 -1728 2785 -1573 -82 -444 -1249 5290
933 5290 -5038 1095 -1024 3590 -2171 -1522 3001 -3899 4766 -2786 897 -3170 4057 1209 -5812
948 -5812 4228 -2067 3338 -4090 3142 -2333 -418 5193 -5774 2102 -1998 5776 -5608 1009
962 1009 2276 -3866 4988 -3792 2362 -5291 7596 -2326 -4871 5120 -2169 2975 -5813 7040 -6264
977 -6264 2106 4207 -5712 1817 -1899 7926 -10183 5003 478 -2633 3475 -3308 3620 -7565
991 -7565 10995 -6408 -1889 3962 -1291 2019 -6332 9633 -10026 5953 1440 -4541 839 -173
1005a73Q009k1456K3149j1579Q99K177j693L331j1434K2544k3509J0470J046l58
1019A423k024n130J6714k3091K0913j0945M37Q04K824L924k0143K7389j8813O902
1033A184k314L375k645o848K2475k8568J7000l445L974r203K262J3876k4576K3619
1047A0166j4617O087n847R025j448j6431K6492k0732J1021p847Q974p816j026
1060c999J6841k6818K0065p340O531j3435R912O308k0751K3106j5350P495q837
1073f272J4773r179r946K3188j9082J0063r440J3704j3465M717J0126k0925J8125
1086F387q791Q527j5974J5111j603j2853J8315j4540Q430r385J6889j5985n04
1099e976J6418j6042P811p584J4750j7965J0988L144j4005J2750n769P623j7077
$$ plain form
1005 -173 7836 -13620 9529 -2050 -1151 1026 -667 2664 -8770 13774 -9735 735 1781 1423
1019 1423 -601 -5731 10983 -12108 8805 -2140 -1703 -899 1925 5849 -14294 13095 -5718 1184
1033 1184 -1130 2245 -400 -7248 15227 -13341 3659 214 4188 -5015 -2753 11123 -13453 10166
1047 10166 -4451 1636 -4211 4814 3366 -13065 13427 -7305 3716 -4131 4843 -2973 -3999
1060 -3999 12842 -13976 6089 -1251 5280 -8155 1757 8065 -12686 10420 -4930 2565 -6272
1073 -6272 8501 -678 -10624 12564 -6518 3545 -5895 7809 -5656 -939 9187 -11738 6387
1086 6387 -2404 6123 -9851 5260 3657 -9196 9119 -5421 3009 -6376 10513 -5472 -5976
1099 -5976 10442 -5600 2211 -5373 9377 -8588 2400 5544 -8461 4289 -1480 6143 -10934
1112a0934J8253o693n648J0172q851O678q624J5453j7441O448P600j0075M427
1125G65m159J1214j6834J4358l846p002Q110j834K640j3397J8845j0680n38M362
1139B004k808J970n531J2962j6600R547J148l454l11q06P846j3370J3409q070
1153b064L42K673Q40j002p888J5463j2076L895m80J461j943j157Q293j3850J0507
1168C014k300M07m249L319L876r465J0138p800L872j559L211l340l162J0003r462
1183c497M996l270L699l425J661K970q753R138l801J576m912N447N7n273O606
1198C219n971M359l037M228m775M0N826o081L454l729N074m105K277J0l860N891
1214B820l678K179m455N232j597j893K893l565L724k740L167m413J981K632l430
$$ plain form
1112 -10934 7319 626 -5022 5150 -3701 2977 -5647 9806 -7635 -1187 6413 -3662 765
1125 765 -3394 7820 -9014 5344 1498 -5504 2606 772 3412 -9985 8860 -1820 -2358 2004
1139 2004 -804 1166 -4365 8597 -8003 1544 2692 -762 -1073 -1879 5967 -7403 6006 -2064
1153 -2064 -1722 951 1791 789 -7099 8364 -3712 183 -297 1164 -779 -1936 6357 -7493 3014
1168 3014 714 1121 -3128 191 4067 -5398 4740 -3060 812 -747 2464 -876 -4038 5965 -3497
1183 -3497 1499 -1771 1928 -1497 164 3134 -5619 3519 -282 1294 -3618 1829 1886 -3387 3219
1198 3219 -2752 1607 -1430 2798 -1977 -1937 3889 -2192 1262 -2467 2607 -1498 779 789 -3071 2820
1214 2820 -858 1321 -3134 2098 501 -1392 1501 -2064 1660 -1080 2087 -2326 -345 2287 -1143
1229a143J487k123M030l385J795r84q99K871k065J035k816L799j273p59L85q80
1245i25K301j860J229k334J967P94j587Q2n59K345j806M93p74M24J128r07j75
1262a64j000K183n06q57l30O10R77r88j66m34J027L86q83o02N02J103n14j037
1280f93K81O78L76o62o73N15N92L72j499J39Q66L52n56r64J025j02P51j170l30
1299g02Q39L99L1j794J376K3M47q70m93R83r8P98k094R62N06L31p74q74J534o04
1319g4R47j701M41O68K44k36j623J895n12O43j302J30Q33j57M99k012J586o9M43
1338F43j072k71J252n95Q20j856J058K58L73p40r03J682o18N93j480O56M91J30
1356D21k30j398J674k21K54j232L87P74k17J55j404J210J59K00j085k9J135l80
$$ plain form
1229 -1143 344 -1779 2251 -1134 661 -323 -1222 1649 -416 619 -2197 1602 329 -430 -45 -925
1245 -925 1376 -484 745 -1589 378 1172 -415 -333 -892 1453 -353 140 -634 -210 918 11 -164
1262 -164 -1164 1019 513 -344 -674 -64 913 -75 -241 -675 352 738 -145 -747 -245 858 344 -693
1280 -693 -412 266 642 -20 -693 -178 414 786 -713 -574 292 644 88 -876 149 47 798 -372 -702
1299 -702 137 536 567 -1227 149 172 619 -251 -744 239 141 939 -1155 -193 313 644 -130 -1004 530 -74
1319 -74 873 -828 -387 281 525 289 -1334 561 49 692 -610 -480 353 196 695 -1317 269 200 643
1338 643 -429 -700 552 -43 777 -1079 -21 237 610 -130 -1033 649 31 624 -856 -200 291 421
1356 421 191 -1207 467 246 500 -732 -345 429 212 367 -1037 173 332 532 -553 -582 553 173
1374A73J07j014O97L33J92p28n21J135N8k52q38M90N52Ln30m93P00N27l86q13
1394f08K69P72N6q11j05L12P12m21o11O7M96O83j229K2J76R05m97p82N94k28J070
1415H42j178J64k91R34K57j645J010m10J344j499L34l9N5J323k205J096o50J823
1433A265j636l01J181j110J813k124J312j430K068m19k165K177j027J762k870
1448a504K233j074O3J639k643J772j525L117l326Q32J204j527J974k523K389k800
1464a699L436j551j879K726j419J779l598L968k746Q47J588k848J762j434L974
1479B906n398K625Q37j634J411j987K902m113M939l024q43K313j055J280l780
1494b621N291m490K332N10k210J272p54L791o787M961o22j205N80m73J991m677
$$ plain form
1374 173 280 -734 -37 296 488 -240 -761 374 432 180 -658 -168 384 387 -143 -636 64 591 205 -608
1394 -608 -339 433 489 -322 -427 -115 597 176 -435 -368 128 811 -418 -396 -220 685 188 -594 0 -228 842
1415 842 -336 -172 -463 471 728 -917 93 -317 1027 -472 -138 -177 -122 1201 -1004 92 -558 1265
1433 1265 -371 -672 509 -601 1212 -912 400 -1030 1038 619 -1546 631 -396 1366 -1504
1448 -1504 729 -345 -282 1357 -1286 486 -1039 2078 -1248 -416 788 -739 1235 -1288 1101 -1699
1464 -1699 1737 186 -1693 1033 -386 1393 -2205 1763 -983 -136 1452 -1396 366 -1068 2906
1479 2906 -2492 133 970 -664 747 -1240 1662 -2451 2488 -536 -1379 934 -121 1159 -2621
1494 -2621 2670 -1820 512 1022 -1188 84 -670 3121 -3666 1295 673 -532 48 -425 1566 -3111
1510c111O532m626J63J508M00m76l214O199n649L217p07o61k1L25K877o834O255
1527B177k175j28m57J050K92l643O885o170J605Q71J404k815r26N817o748M216
1543A255j451P08k099K467J331o334O708l060J151k359L163j527k057N827o548
1558b825L251o79K577m734J795L830o424M941k371J735l722M924j219m981O724
1573B822l317J308l485N500l788n19M578n669L388j689L764o085L673J703m826
1588b642M468k950K527m220O068l769k357N810l665J310l262O398n985J851K888
1603B470m718K892j501M184p459N618r5l210K906k168K971n053O719n101P9L563
1619B097k775J289l145O306o706L722N28l132K421j049L245p227O944j951j929
$$ plain form
1510 -3111 3421 -1205 -1042 466 866 390 -2824 3375 -2274 943 236 -425 -446 -121 2756 -4078 2177
1527 2177 2 -126 -583 467 759 -2884 4001 -2169 -564 307 1711 -1104 -2030 3787 -2961 1255
1543 1255 -196 512 -1587 880 2211 -4123 2585 -475 676 -1683 1480 -47 -2104 3723 -2825
1558 -2825 426 -253 2324 -2410 -615 3215 -3209 1732 -639 1096 -2626 2298 1079 -3902 2822
1573 2822 -495 813 -2672 2828 -960 -1479 3099 -2570 818 -871 2893 -3192 481 2184 -2642
1588 -2642 1826 -1124 1403 -2817 3251 -518 -2875 2935 -730 580 -2682 3716 -2269 -418 2470
1603 2470 -2248 644 -857 3327 -4132 1486 1391 -1819 1087 -1081 1890 -3163 3556 -1545 -1466 2097
1619 2097 -678 611 -2534 3772 -2934 788 1316 -1816 605 -444 2801 -4426 2518 567 -1362
1634a362J915r91J956m556O709n714J395K018j531L82k402N621o238M085j054
1649B33j257J515p06K125n651O595l242k88Q76k65R04l088N509n700K553P22n75
1666B60p63r14M392n517L858j679K25J05J35J107m022N265l203Q19m27N81K38
1683D60j757L532m476K988l78r7j075L20K461l987L253j816P11l59O88l6k363
1700a931L864k556P73q30J247l99r08J977k772K391q67L45j142Q10J101k273K009
1717H39j538J097o16P26p01p74K332j845N83p23J339q34j19P63j437J592p90M36
1735C30j114J045L17j119Q28q15J060p37N00p00J14J078j121L43m59R99o44O7
1753b8N7m62R57n72J32o56R08Qo34K84k32O70n18J77m06L11M69o36P4j84O87l53
$$ plain form
1634 -1362 553 -438 1518 -3038 3671 -2043 -648 1370 -161 221 -2181 3440 -2798 1287 233
1649 233 -1024 491 -215 1910 -3741 2854 -388 -676 200 -65 839 -2249 3260 -2440 113 835 260
1666 260 -503 -1417 2975 -2542 1316 -363 -138 -33 102 1209 -2813 2452 -751 68 -359 222 460
1683 460 -1297 2235 -2241 747 369 272 -803 -483 1978 -2009 1244 -572 139 -220 468 432 -1931
1700 -1931 1933 -623 150 -680 567 168 -740 1237 -1535 856 -11 334 -808 2 1103 -1170 839
1717 839 -699 398 -218 508 -193 -967 1365 -480 103 -620 719 -115 -234 529 -908 684 -106 330
1735 330 -784 261 578 -541 287 -528 532 -205 295 -405 -291 787 -334 9 -450 549 -95 -28
1753 -28 29 -433 524 -48 84 -572 336 344 -290 -6 -238 432 -86 91 -315 -4 465 -171 -97 -281 406 53
1775E3j61n7O4N00m74l7j66N49m7m30R8NM32l20j74j4K72K29n13K7N1L82j25m19
1799b75J76R4L46m53r8J59K06R6n53K41J1L60l10l01L21K8K89o21J73J07K18q1
1821A33n06M36q5L81n74J2K70M8J22o52M66q6L36l95j99L85o9L17p28L70M0J87
1843B09j83l79M92j65L82o68J97J85R1k4n71N82j54L00n05M2K59j1J66o71M78
1864E2k0K04l83r6L85j20K10n70L02Q0J85k85k71M66q8J52m76K18O8J81j55l85
1886c46M07L8J13m70J80J34Q8p7l32K50R9J81m96Q4K07J31j51k76K02Q8K14m58
1908a90M3J42K06j51k79K05QL01m54K3O5L13j42l88L36j08L63m45O2k6K99J9n43
1931c41L94j60M41m97J22p0J60L29p56L91j27N56p02J47K30k63N21o53L71m53
$$ plain form
1775 53 -108 -165 -101 399 -75 -112 -278 271 224 -206 -108 -103 329 9 -165 -179 93 322 -191 -164 -113 269 144 -275
1799 -275 -99 -5 341 -112 -210 -51 155 251 -302 -61 -50 310 0 -301 20 48 337 -284 -111 -4 214 133
1821 133 -373 63 -22 359 -215 -203 67 115 237 -415 51 -35 301 -94 -293 92 23 340 -388 -18 22 209
1843 209 26 -353 139 -26 356 -312 -115 70 161 137 -434 148 -6 294 -211 -169 90 79 245 -426 52
1864 52 32 236 -147 -243 142 22 232 -338 -36 44 229 -56 -327 139 51 203 -273 -55 13 194 39 -346
1886 -346 61 99 212 -258 -78 56 144 67 -265 -15 84 265 -231 -147 60 191 40 -236 -34 54 268 -190
1908 -190 -147 -5 201 50 -229 -24 -16 285 -169 -146 -81 232 90 -298 38 -70 293 -152 -90 -116 183 202 -341
1931 -341 53 -107 334 -163 -41 -111 49 378 -378 13 -114 442 -260 -113 117 -146 375 -278 93 -360
1951c60Q62n15l48N20k52M72q34P73p11O35M1p11N07k48Q07j327R68l39o0M64
1971C44o32M56p74J568j414J82M88j92K11q61J377j526J281l94m52L52r6Q68j868
1990a082J767r86L67J12l82L71q62J990k256J017R9l4j51m76J483k209K124j009
2008a17q6n0M83M94k185K588j644P79m69L61j42p52K233k787J690n01N17p58L8
2027c08J295k383K638j706M42l75J007k46j885L015k252J068o61Q79q85k15K143
2044A571l055K000p12Q72j412O99R24k248K624j941Q93p94J426q73j186K719k429
2061i22J376r21J216j498O51J432k913K201p46Q86j960J693J47j885K336j656
2077e63Q83j144K021j581n11K105j937J145j011J474j820J238N15k118J933p19
$$ plain form
1951 -360 502 -13 -361 159 -93 379 -455 318 -393 242 283 -428 79 -169 638 -689 279 -60 -120 344
1971 344 -288 168 -606 962 -452 -270 218 26 237 -624 753 -773 508 114 -338 14 -82 786 -1082
1990 -1082 685 -301 66 178 -204 167 -695 1295 -961 56 155 121 -30 -506 977 -1232 892 -117
2008 -117 -203 -253 230 724 -1461 1127 -517 262 -207 154 12 -740 1493 -1294 396 -105 412 -346 -308
2027 -308 987 -1396 1242 -464 -22 -397 610 364 -1521 1494 -758 310 -351 528 -357 -572 1571
2044 1571 -1484 516 -196 676 -736 -37 887 -1361 1263 -678 215 -579 847 -26 -1212 1507 -922
2061 -922 454 -467 749 -749 -98 1334 -1579 622 -124 762 -1198 495 642 -1243 1093 -563
2077 -563 320 -824 1197 -384 -895 1210 -727 418 -593 881 -939 299 814 -1304 629 -90
2093i0O73j849K158p41j088J894j381N44q10K057k183K70J566j468N49n84J469
2110I86k034J552q5j271J224l57M75j675K190j203k27R93q30K58m52J698k343
2127a101J061P13r20N3L3R89j977J893o43o18N70K85q4j349K114j340J98K47j09
2146A5j11j58J183j962J313J0l33k39L40M49j396J707j023p7K80M78n60p07J763
2165I72j372L85k6K79n11J80P97j571J178k16P3o00N79J69r01J197r86L75p8N19
2185D42p10j73J168j146N36k53M06n96M47K83j104J035k92J31o51P33o0n80P90
2204D06p06M10k44M83o13J7P17p59M22l48M09l79L26J5o36P88l01O5m31N76j11
2225A06l54M99m81L13j53L16m56M2N04m84J97k29L61k50J19nl14N01k54N5k45
$$ plain form
2093 -90 583 -1266 892 151 -937 957 -424 120 -690 1367 -816 -546 1020 -448 101 -483 986
2110 986 -1048 504 419 -852 372 15 490 -1185 1005 -198 -425 568 -262 -4 -456 1242 -1101
2127 -1101 -40 673 -247 -194 -161 828 -1149 744 101 -517 53 338 254 -1095 1019 -321 -123 124 15
2146 15 -96 -254 929 -1033 280 290 -43 -282 58 507 -889 818 -205 -282 -2 476 -84 -791 972
2165 972 -400 -15 -41 238 -273 -93 704 -867 311 95 168 -432 147 316 -585 612 -374 1 -77 442
2185 442 -268 -441 727 -419 117 -136 270 -326 121 404 -700 335 43 174 -477 256 196 -384 406
2204 406 -300 110 -134 349 -264 -247 470 -289 133 -215 194 -185 141 156 -480 308 7 72 -359 217 106
2225 106 -248 251 -230 83 -70 246 -210 -168 336 -148 49 -180 181 -69 50 45 -269 232 -22 33 -212
2246b12L38k6k19K27k81K78j06P5k16M6L48l72J13j02K24r9o5Q8k19L57k04J8
2268ij01J41J20k78J69j67K55r9o9%m5L00l27J24r6J51J9k07J59j68L07k27J8
2291c0k0L2J80l24K02j38K41j44r7J16j01K70l16J52j24J70J9k68K27j53K85k85
2313a06Q9j4K9J64l37K34j71K91k35j9J16j01K33l41K25j58K17p3j82J97j45K89
2335B02l58J85p6P7P3k71K38j86L13l06O3M5j7J57l21K66j85K54j90n2J21o1J99
2358A70l47K42j24J56p8j25J80j52K64l30J56m3Q0K1k20K42j74K44k60Q0J7J6
2380A5R2k75K37j47K16k09L0P1o1J61k72J84j16J92j37p4J37q8J63k56J67p8J20
2403G2m9j36J56o8J58k51J37n4Q4Rj58J32p8J91k54J11mL3K4j54J45j24K12j99
$$ plain form
2246 -212 126 100 -119 108 -173 105 -1 74 -142 -96 252 -120 -7 -109 115 16 -49 39 -180 177 -27 -9
2268 -9 -110 31 151 -127 42 -125 130 31 -38 -38 -83 217 -110 14 -82 69 88 -119 40 -128 179 -48 -30
2291 -30 -50 -18 162 -162 40 -98 143 -1 -98 18 -83 187 -129 23 -101 69 88 -180 47 -106 179 -106
2313 -106 -17 -31 -2 162 -175 59 -112 179 -56 -75 41 -60 173 -168 57 -101 116 43 -139 58 -87 202
2335 202 -156 29 -47 30 103 -168 70 -116 197 -109 -46 -1 -18 139 -182 84 -101 153 -37 -89 32 -29 170
2358 170 -177 65 -59 97 19 -106 74 -78 186 -144 12 -31 49 70 -150 92 -82 162 -98 -18 -1 15
2380 15 107 -168 69 -78 138 -71 -41 30 -31 130 -142 42 -74 118 -19 -93 44 -44 119 -137 30 -48 72
2403 72 23 -113 43 -25 133 -118 19 -35 49 58 -100 32 -46 145 -109 2 -2 31 55 -99 46 -78 134 -65
2427f5L9K2K5M8j95J91j58K08j60%L0J5J18k81K48j66J58j11J3K4q1K65l46K02
2451D3r1J48j26m4J68k29L00k75J39r8J51l3k28L22k69K70k32J32j25P5J82m11
2473b31L27j66K18k94J68M3k12L43l41J98j92L20k24j03L01k77K58k83K81k83
2493a49K15P1l58L58k17K40l68L51j57j09L39l72K20k15M24m47R3K37k73K02k34
2514a49L24m13L77q6k51K94j40J95m09M70l13M8K05k83J56j42M15n74L16Q3k18
2535i5J18q3K38m78N55k66j37J83J6N3l81N47m07J57L1r0K3q7L82n83M31j07m5
2558b5kKJ53m22O01m40P0P3R7j28k04N59n61K91n8M8j65Q9K83n93N02j95Q4j76
2582a17J83L2l37N31m72K20j02K25k51m3M14n40L89j88J56k76K53R7n07N28k46
$$ plain form
2427 -65 -26 -4 21 69 -126 65 -93 115 -45 -45 -15 0 118 -163 85 -81 77 -34 -21 3 -78 187 -159 43
2451 43 -48 100 -26 -70 98 -131 169 -106 33 -65 86 53 -175 147 -122 148 -84 48 -77 -2 180 -231
2473 -231 96 -70 148 -146 22 65 -147 196 -145 53 -139 181 -43 -146 155 -122 136 -147 134 -149
2493 -149 66 137 -221 137 -80 160 -208 143 -14 -123 216 -156 64 -151 273 -174 -81 156 -117 85 -149
2514 -149 175 -238 139 53 -198 96 -44 151 -258 212 -101 -53 152 -131 25 -117 298 -276 40 123 -95
2535 -95 23 -60 178 -300 255 -11 -148 35 51 104 -277 270 -137 20 51 -39 -16 -103 279 -304 127 20 -25
2558 -25 -27 -25 128 -294 307 -133 -63 10 107 -21 -225 334 -227 64 6 54 -111 -22 261 -332 170 -25 59 -117
2582 -117 66 98 -239 292 -180 40 -62 163 -88 -131 283 -257 132 -56 100 -176 77 174 -333 195 -51
2603e1J40k96L55j34k22M69m51K65j94L39l53M5L02m23L57k66K65l28L13m0l48
2624b56M79l13K04l12L97k50p4L58m12K62j93L60m49J79J99l35K53k26L05l70
2644a94L17j09j82L20k41K01l13L81k57K8J90k96K44j97K92l81K42O9k46K20j89
2665a01K60l49L41j57j14K40j80J81l18L80k61O5R2j72J87k00K76l36K21j6j10
2686g1J32j55K15k75K74j60k3J34j14J19k36L01k13P0M1r6J20j67K39k62J70k1
2708B2m2M6j05J80k12K03j26J6N2o9J04j83K30j87Q7nk7N7j16J90k43J61m1Ml
2733gn9J50j98J84j14M8lk4O9j56J97j41P3l5K3K2r7J62j82J26n5L2k7j6J18j85
2759i5J65j07M4j9NM7j35J80j33P2n0M6pp4J36j56J14o8N5m5JQ7j34J27j03P3
$$ plain form
2603 -51 89 -207 148 14 -208 261 -190 75 -119 220 -133 -88 214 -209 148 -118 147 -181 132 92 -256
2624 -256 223 -90 114 -198 199 -51 -125 233 -179 83 -110 250 -199 -20 179 -156 97 -129 176 -194
2644 -194 123 14 -168 152 -89 112 -201 180 -77 -49 141 -155 89 -108 184 -197 45 114 -132 88 -101
2665 -101 159 -190 151 -6 -120 120 -60 121 -197 183 -78 -13 79 -93 94 -106 170 -166 55 39 -71
2686 -71 61 -94 121 -154 120 -40 -63 71 -43 76 -160 141 -72 -2 39 -57 63 -104 135 -127 43 22
2708 22 -20 26 -79 101 -111 92 -34 -18 34 -35 69 -114 116 -71 16 11 -16 41 -75 115 -128 33 -8 -4 -7
2733 -7 -66 84 -114 70 -44 4 1 -23 46 -110 87 -54 19 -16 7 29 -68 94 -88 38 -17 15 -12 -28 90 -95
2759 -95 70 -37 7 -12 -7 40 -95 85 -48 24 -26 20 13 -61 75 -81 33 -35 20 -25 -24 63 -71 56 -47 26
2785B6m6L1J0r8J37j18R5p0N9k9k9R4j30J13q3P0o5J0P0j03J07j03Q6p0N9qp0
2812e5J05j06R1q8P6l6kM9r4J00q4Q1p7L3K1n8Q8j00R7p1N6l1j9O4p1P7r5Q9n1
2841a1J2J3m5O9p6Q3q0M5rj0M2p1O9p1O4m8J6J5l5P1j03Q8o0N2k9j5N0o6P9p9
2871d0O4l7J8Ln0Q3p4O4o6N3k3nL8p1Q3p5P0o9K5K8n6P9q9P5o4O3l3k4O2o4O3
2902C1q4Q8p1L3J6n7Q3q9R8j08O8jl8N9q0R9j03J12q8KO4n7P5j16J25j06P7k8
2930Dm2O6o3J11j68J39n9nM2o7R7j24J68j71O1L4m3N4j21J75j86J50p0j1M8n8
2956c9J20k15K26j35M2J6m8P5j38K24k36J36j6oMq0K01k59K21j33M2j0oJ08k63
2981a69L18k26J09n7K6L4j46K71l30K28q6P3q4k5K01l24L19k24J19p3P0N1k74
$$ plain form
2785 26 -20 11 21 -77 60 -58 37 -33 26 -3 -32 62 -68 45 -38 32 -33 -23 47 -56 51 -52 34 -36 23 15 -55
2812 -55 50 -56 35 -53 23 -13 -15 34 -60 40 -44 37 -40 -7 14 -44 44 -56 41 -30 26 -5 -24 40 -31 46 -49 40 -11
2841 -11 1 14 -31 38 -38 45 -35 10 1 -9 33 -38 31 -40 24 -24 -8 7 -28 43 -60 28 -32 20 -9 -24 26 -40 39 -40
2871 -40 24 -13 5 8 -42 41 -33 31 -35 18 -5 -10 28 -43 40 -35 35 -34 -9 19 -37 42 -47 28 -36 27 -6 -30 32 -32 31
2902 31 -53 35 -36 -3 13 -44 39 -50 48 -60 8 7 -31 28 -52 47 -56 56 -32 -30 34 -23 52 -64 61 -45 32 4
2930 4 -38 28 -35 76 -92 47 -12 -17 25 -42 55 -69 99 -72 -11 23 -20 34 -87 88 -98 52 -18 -29 19 -39
2956 -39 81 -134 92 -43 -1 15 -33 42 -96 128 -108 28 12 6 10 -70 131 -128 93 -40 2 -8 -14 94 -169
2981 -169 149 -77 32 -25 1 35 -111 160 -170 58 -28 45 -39 -64 137 -187 132 -92 27 -46 24 75 -199
3004a99L98l12J77j50J54o8j14L02l81L07j86J74j94N8J92l65L70k95K12j79J89
3025I0o4k10M07l82K49k21K61k02mK70m27L68k21K33l42K39P9l31L73l14K83l10
3047a76L37k07j10L71l60K69k88L76l60J54J58l86L63k41K76m42M14q1k51L32
3067A48k55K54l79M77l77M0K75l17K13k71M60n02K97J4k30K60k00K80m99N49k64
3088b7j04K35j70J67l35N57n60K29J39k03R5j68M57o19M58j40q3J03n9J95n00
3109c33O33m04O7O1l7P8k66N21o16L97o6n1m3j2L43o31N83k84M6j9R2M2m24O70
3133C47n19J96q3J63j09j55M69o01M45j83J11k05J28K09n21N65l83J81j38K03
3153A20j21k38N71n45K88j80K63k68L6L12n25M58k52J91l15K93L9l98N02l80K76
$$ plain form
3004 -199 199 -113 64 -86 68 0 -114 188 -193 114 -72 102 -92 -34 158 -207 163 -132 80 -99 90
3025 90 26 -184 223 -159 90 -131 130 -72 -76 194 -233 135 -86 147 -195 44 123 -208 165 -149 134 -176
3047 -176 161 -46 -156 215 -145 124 -164 212 -148 6 164 -222 141 -100 176 -266 148 67 -184 148
3067 148 -107 147 -232 245 -132 -92 183 -134 79 -192 268 -234 63 77 -153 107 -93 187 -312 237 -27
3088 -27 -131 104 -66 101 -234 323 -237 -8 131 -72 23 -145 312 -307 151 11 -72 31 -28 167 -333
3109 -333 300 -104 -37 24 -13 65 -201 320 -296 101 35 -16 -59 -71 272 -359 224 -60 -14 -33 59 101 -323 347
3133 347 -172 24 -59 104 -5 -160 309 -292 153 -30 81 -124 4 213 -308 257 -126 55 -83 120
3153 120 -1 -239 332 -213 75 -105 158 -110 -74 238 -287 171 -81 110 -205 88 127 -271 231 -149 127
3174A27k76L05k33n8M00m71L21k49L23l53J73J58m09M24k68K06l38L79j11k51
3194b01L76l06K42k89L54l04N6K53l43K44k16L33l98K59j0k19L20k44J98l07L91
3215A89k13q9K38k29J95k38L22l42J71J21k40J65j33K61l59K69p8q9J65j59J53
3236H0k44L25k19PJ12j20J15j58K26k57J95j7j35J13p2J51k48K31j07j1Q7q1N8
3259C1j47K50k03N9L9m3M7r1J28j67J68o3n3N5j3P0j57J44r8M4K9l9J0m9J42j52
3285e9O3jnJ0l8O2q9R8m1k7K2J8J5o9O3n2L9Jk7O%N4p7L5pK2%l8K2k0N3m0j7K6
3319BJ2Ln7M6j4K5j9k8L5LJ5l5rK5KLm3L8j6K3k5j0M2j9J2l7K4NJ1k8j2L8j1J6
3353A7l1J4QLRm2K5RJ1l6JK6rJk4J9J0Lj7j0K1Qol6J4L0Lk2k9K4J5j9j5L0kOj
$$ plain form
3174 127 -149 156 -77 -135 265 -206 115 -134 189 -164 9 167 -242 182 -86 120 -218 161 50 -201
3194 -201 175 -131 111 -178 176 -128 -72 181 -162 82 -134 199 -199 60 50 -169 151 -93 105 -202 189
3215 189 -24 -113 125 -104 91 -147 175 -167 4 125 -115 50 -83 178 -181 88 10 -79 86 -73 80
3236 80 -164 161 -58 -51 61 -59 56 -102 124 -133 62 45 -90 23 -49 102 -146 85 -22 -33 54 -27 31
3259 31 -116 134 -69 -10 29 -14 33 -58 70 -97 71 8 -45 10 -3 67 -90 54 -44 0 29 -10 0 -49 93 -59
3285 -59 4 3 -2 8 -30 32 -57 41 0 -27 -5 13 28 -41 22 -30 9 10 -17 -11 -11 43 -34 1 -6 16 16 -22 0 -20 33 -7 -24 2
3319 2 14 17 -40 6 -8 17 -2 -30 5 8 23 -12 -21 4 6 9 -34 4 -12 11 -14 -24 18 -1 11 -26 -2 3 14 -14 -26 12 1 17
3353 17 -14 0 8 11 20 -22 3 12 23 -13 -12 14 5 6 -18 1 11 14 -3 -13 8 16 10 -26 -12 18 21 -1 -30 -6 9 -10 -25 5 3 9 8
3390Hl2L1%%k9K0J5Nk5lK3oK5m6kK8J4l5j5M1j9J5l7J4J5OLn5O1k4K6n0K1J9j9
3425gM2r0O3j5L8o0MN8n6N8p3N3l6N1j0p4R2m7M9r3Q4l4jM5r5P8m5R1j25M7L4
3456B6m4N1q8J01j12J26p8l4R6p5O6j25J62j15M0L2p8P8q3J59k01J29rm1K5n9
3482e1J36j78J86j32K5M4l4M5j50K24j93J06k8k0K5n5J66k69K25q4J7l3J3R6k21
3507a40K55j98Q2j2N3l9j28K75k53J60q9P3o8J3J18k71K82j52Q3j12J01J4j85
3530a38K89k53J34q5J70j74m0K66l01K11j60J79j97J22Q3k67K80j79J46k25K30
3551I1q6j20K62k79K05j71K54k86J02J84k91K24j77K34l21K81m1k14K62j72J70
3572A11l17L89k14n8K22k33J83k14L32l69J89P0k14K13j90K63l73L65j71j04K34
$$ plain form
3390 8 -24 7 7 7 -22 -2 13 18 -7 -10 13 7 32 -14 -16 12 26 -9 -24 17 -2 13 -24 -10 5 11 14 -41 20 -4 22 -28 -7 12 -7
3425 -7 35 -55 8 -7 31 -29 -25 33 -23 35 -38 15 -21 30 20 -54 38 -9 40 -53 31 -3 -4 41 -54 24 -21 70 -55 -8 26
3456 26 -18 33 -55 46 -66 60 -18 -52 44 -31 35 -90 72 -43 -3 29 -49 29 -54 105 -96 33 24 -17 8 -51
3482 -51 85 -93 93 -39 -14 30 -4 41 -109 115 -78 28 0 -20 5 -50 116 -153 72 -12 5 -28 -15 81 -140
3507 -140 115 -83 -1 -13 40 1 -127 148 -105 55 -34 39 -29 -16 102 -169 113 -39 44 -68 33 47 -138
3530 -138 151 -102 32 -53 117 -57 -97 169 -132 79 -81 98 -99 23 106 -161 119 -60 86 -139 91
3551 91 5 -115 147 -132 73 -98 156 -130 -28 156 -135 89 -88 146 -175 106 65 -149 113 -59 111
3572 111 -206 183 -31 -89 133 -100 83 -131 201 -168 21 91 -123 90 -100 163 -210 155 -16 -120 114
3593A14j59J29k97M46l56Q4J32j73J43k00L64m64L01mj34R8j09K62m06M20k61
3614g0RJ30j03J05k67M46m21J83M7j05O5j14L09m79L96j12o9L7j2J60l72M40k97
3637i4Q3K8j2K4k01L99m02K35p4J3nm7K19m13M04j91K7k4N1O4k79M02l21J34k3
3662cO5q5q5L12l68K15r1R5j07N2J03k92L23j86Q5j17J47n5j31K74k68J53p7J13
3686G2j56M9J78k81K05j00R7j53J35Kj78K33j63R7j29J79j03m7J63j84J55j26
3708e5J49j90J17M7j57J41j07J21j66J75j03m9J58j19Q1j31J94j66L4O1q7P7p5
3731e0J23j75J48k7o6P7o8J05j39J49j20L8M3n6M2q0J62j72R3j2l2L9n3Q0j35
3756h6J43o9j5K8j1N0j10J23j02O4j1k1J3m2J05j21Q8m8L2nk6M3q8J26q1K2PK
$$ plain form
3593 114 -45 84 -213 233 -123 -39 93 -80 63 -137 227 -237 64 60 -74 24 -85 177 -229 191 -70
3614 -70 -61 69 -34 71 -196 250 -171 12 59 -46 19 -95 214 -265 131 19 -50 -13 -25 135 -237 203 -94
3637 -94 -11 17 5 29 -172 227 -175 60 -14 -1 -6 -53 166 -247 157 -34 -7 -31 20 84 -195 207 -114 20 -3
3662 -3 62 -23 -108 204 -164 51 -40 55 -52 0 103 -189 134 -52 33 -84 63 8 -123 151 -117 36 -41 72
3686 72 -84 -35 143 -138 67 -33 64 -89 46 48 -130 103 -60 37 -92 87 -16 -63 100 -84 71 -55
3708 -55 94 -96 21 68 -89 52 -55 66 -100 75 -28 -77 81 -38 43 -88 106 -60 -26 35 -52 25 -50
3731 -50 73 -102 46 19 -47 30 -38 67 -72 77 -43 -5 38 -18 24 -56 106 -66 27 15 -17 22 -31 49 -86
3756 -86 57 -12 -27 1 -10 40 -70 53 -49 15 4 -17 -4 -46 59 -62 26 -22 10 5 -21 22 -66 60 -21 1 8 10
3784A0J4n6P5q4O2j9Kj6nN4p4N9k7J4j2Jpk1O2o2K4%K1j2j8K0k6L0j0nmJ7nl2
3818c0L6k2K4kmpJK0k5LjJ3mmJM%nKlJ2nj2oJ2Jkj5J0J4j2J1k7K3NJj5nK0j0J1
3859Hk2J6lMjjJ3j5omJ7jrOoJ4j0J3j9J3Jj6J4k5K2nJ2j7mJ0rQkRnLOj7K0k3J9
3900Hk4K1Mj5JmK2j2J7k3J0J1k1PrJ4%Pj1k1M1j3Nj8J7pj9J2mJ0pJ3k3J5jJ8k6
3937enJ1lj0RKlJ1j0KjJ0j2%O%KmKj2K0kpmkL1l5K5j4j0Rpjj2M3m1J1J0%j1oL1
3979A8l7K0Jj6K3j8K6o6O1j8j%LJ8l6M4m6L4qL%k7O2o8O6l6Oj2%M0p0P3m9J3m
4014ajJ4l7O4p7O1k4Lj2qN0p0P4m9J3mOK0o9Q2n2L4k5L0k6k4O8q0N7k1L3m5J0
4047fL3o4O3m5L7l7L7j2n0Q4n3J2k7N6m1jM7o8M6j8L3o2L8K4o2N7l0K5m7N5l0
$$ plain form
3784 10 24 -32 43 -41 21 2 4 -12 -17 37 -37 22 -5 9 -3 -2 -9 -30 32 -30 -6 -6 15 3 -15 5 -21 9 -1 -6 -10 7 2 -30
3818 -30 6 -16 8 6 2 -5 -4 16 -9 -6 -7 6 2 -2 -1 3 3 -2 0 -3 9 4 -8 -14 -2 -1 -3 -18 -8 6 -6 5 -22 1 6 7 -8 -13 7 -3 8
3859 8 -14 2 -1 3 2 1 14 -1 -7 -11 6 5 -4 2 -4 10 0 13 -6 7 8 -8 6 -19 3 -2 10 -7 -11 -1 -10 -2 -4 5 0 3 9 -8 12 -11 8
3900 8 -16 5 9 -6 -5 -9 13 1 18 -5 5 16 -5 2 -7 7 7 14 3 -18 23 10 15 -3 14 7 -12 0 -4 6 -1 12 -11 4 3 21 -5
3937 -5 -10 1 -2 -12 -3 -1 -4 7 -3 -1 -2 8 -4 -4 2 2 4 0 2 -10 10 8 1 -3 -5 26 -9 16 2 -8 1 -6 -7 -19 24 -17 -6 4 4 -7 -13 18
3979 18 -19 1 2 -14 9 -9 17 -49 12 -6 -7 -7 -4 14 -22 22 -24 10 2 5 5 -22 40 -28 38 2 8 -4 -4 36 -34 39 -10 3 -1
4014 -1 -2 12 -25 39 -38 23 -1 2 -10 -18 32 -38 36 -13 0 -4 2 22 -47 35 -17 17 -8 22 -4 -28 40 -40 17 -4 29 -16 -6
4047 -6 27 -37 26 -19 18 -19 18 6 -44 40 -13 -1 -28 28 -13 -14 33 -35 11 -7 26 -36 2 26 -36 21 -9 16 -31 24 -6
4078fk3N7l6J2l0N1n2J5L2l9K9j0K9o4N5om0M2j4Qm2P0n0mL3k1rj6O0o2L7%k0
4111a4J8j2K7o2O6k2nMMKl1P2o6K5J2k0kj0M6p1N8j0%k3K6Ro4P5l6Pj4J8j0k1
4145b4N3n5K7J0mj9J8Om9N0k2n%M1j4n2P8n6K7k0L2k3j9N2n5L5jJ5k6LJ7n0N2
4178B2k5J0pJ2lk4N3o2L4j7Rj3mN0n3L9k7K0l1K1Nl8M4j7J1k0J6j2lM5m6K1j7
4211gK5j7jJ3l5L3j5J0j8K6J0l7L0j8MkOLk7L0k0J3j4K4j6JQj4K2k3J3k1J5Lj8
4246a4K9l4K8kj6J6j4K3j5J2oPnj5J5j4J0j1LnJ7ok1J9LNj1lJ4j3Rk0J8knQj4
4283a0RlRpKLj0J1j2K0j8J2j0QJ0j4Pj6J5j2J2qMMj0J5j2JMOLj8Rj0J5j5QkkO
4323DnRj0LL%j6JJ6n%j1jJ1lJ1oRj1jJoJ0mPj0RPj1J0qPj8J2kLMj7mmK6k1MLJ
$$ plain form
4078 -6 -29 28 -8 4 -26 25 -27 -12 20 -19 10 0 29 -35 20 14 -26 16 2 10 -32 38 -12 -16 17 -4 -13 -29 31 -31 6 6 -14
4111 -14 4 -8 19 -43 23 1 -4 0 4 6 -25 47 -19 6 18 -2 -4 -14 32 -39 19 9 9 -14 12 21 -43 32 -4 3 -11 7 -3 -24
4145 -24 29 -26 1 11 7 -12 6 12 -37 13 -9 -14 -14 27 13 -39 39 -17 10 -10 22 -1 -20 32 -23 12 11 26 0 3 20 -30 22
4178 22 -3 7 0 12 9 -15 38 -24 10 -7 2 -11 -15 35 -18 21 -6 14 -17 4 9 -29 15 -2 9 -11 5 -7 -10 35 -11 10 -7
4211 -7 18 1 0 13 -22 11 -4 6 -12 14 24 -13 17 -1 3 1 7 10 -17 13 -7 6 -8 16 0 1 9 -5 17 -6 7 -14 1 4 -14
4246 -14 15 -19 9 7 -9 7 -7 16 1 13 7 14 9 -6 9 -5 5 -6 -3 -8 9 3 -18 1 4 9 -2 -5 9 -4 5 -15 3 1 -4 4 -10
4283 -10 -1 -4 5 -2 0 3 -7 4 -8 12 -6 6 -4 4 14 0 7 -9 6 -6 6 -2 2 6 -4 11 -1 0 4 10 13 -5 4 -6 9 -6 2 0 -2 4
4323 4 -1 8 -2 1 4 4 -12 -11 5 0 0 -11 -12 -1 -4 7 1 10 -1 -2 -1 -7 3 -1 6 -4 5 12 1 11 3 10 -8 4 2 5 9 -8 -12 -16 10 -11 -7 -4 -3
4368cJ0j0J3j8J9j5JQmMqJ2j3J9j5J7Nk0J2j8J5j0%RrkoJ0J2lk0OLqQoRKj5Ll
4409iK5k0J2j3QqPmnJ5j0NmJ2oj2K5j9J1j3K1j3MNj9J5j9K8k3J4ojMj8J9oJPk0
4448a0QmJ1j3K7j8qJ5j5J3mRj9QnQKj3J2j7K9ooMj1K0k4K5l9L2rQjj5K1k4K8k6
4486gRpMRk5K3k6K0j1J9qj5K2k6K1Klk2K4J3m3L0j7K9k0RQk1L9m4K7l6M0k1nK8
4522A9l2L0k8L3l9L4j0k8L6k8K7m1M9k9qK5k0J4k4M1n0K2J3j0Ok9N0o7M9j0j3
4553a8L1k4L6n5N2m2J8J0k1L0m6O9p6N5pokj7M6p8Q3m6J1mPJ2o9J02q4M8j5kj
4586cl3R7j18Q4l3J7k1kM7r3J12q3L7j8K3oo0J15j03O6m0L7k9j7Q0j19R6o3O1
4615C1n4L5Rq3J24j11O6n6O7l4l5R3j17J03o6N8p8L7N6j13J16q0O7q1Q4l1n7J06
$$ plain form
4368 -3 7 -3 10 -8 11 -4 -3 5 1 5 -3 9 -4 15 0 17 22 2 14 -4 11 1 1 10 1 -1 -7 3 15 12 -8 -2 1 -7 1 -5 4 6 -9 -6 -9
4409 -9 16 -4 8 -5 3 -5 2 -2 -7 8 -2 3 -1 11 5 -7 18 -1 10 -3 18 5 9 14 -5 10 -9 19 -4 10 4 3 7 -11 8 2 3 10 -10
4448 -10 -2 -6 5 -8 19 1 -7 8 -7 6 2 11 -8 0 -5 3 5 -8 4 -13 16 10 4 8 -3 17 -7 18 -21 11 2 10 9 -6 15 -9 19 -7
4486 -7 2 -5 -1 8 -17 6 -20 0 -11 8 0 -15 7 -19 2 4 1 -21 3 16 -27 3 -14 15 -5 4 12 -9 30 -14 13 -23 17 -4 -9 19
4522 19 -13 17 -11 22 -17 17 7 -21 15 -13 14 -27 22 -7 -15 10 -10 4 -20 21 -29 -7 6 -4 2 -27 23 -44 5 -5 -18
4553 -18 13 -11 25 -30 22 -20 -2 8 -13 17 -29 40 -36 19 12 6 4 -13 33 -45 38 -8 3 -1 6 18 -51 51 -33 15 0 -2 -3
4586 -3 -36 61 -57 27 -6 11 -10 -12 35 -58 54 -29 8 -10 13 7 -53 62 -41 25 -15 22 -7 -24 56 -63 33 -30 31
4615 31 -23 12 21 -62 62 -49 17 -39 28 -6 -41 52 -65 38 -28 30 -48 -11 45 -68 48 -32 35 -46 38 7 -50 56
4643E6j03P8o9Q8p9J6N1j03J09p9P7r6Q4k0o7R5o2N4j01J22q0mP2p7N7p3J08j17
4671f3O9J5n6P1o2P1j15J25o4k4P3o6M4p8J28j15M5K6n5L8l7J01j46R9k1pJ3l0
4699b1O9j13J34r9L1J1rJ3n6J09j38R6l7J7j6MN1j22J26p9L8k1J6J2q3J31j10
4726d6N7j8K1k1k5Q6j14Q7n1L6l6J7L9q9J17r3N8n2M6k1l4R5j17Q0m9N3n7K7M5
4755D1r7Q6o5N4n2M5j4m3R0p8O6p2O2m5J2M5p7O4m7N1o0L9J8n6O1m6M0n2M7l1
4785a4j4P0n5K5n1O5m8J6K4n1M6m0M1m8N4j5k0L1m0M6m8M7m3J5K4l4K7k9M5m6
4815b0L0lk0K9k3K8l8L0j1nQk0K7l1L9l2ORqJ6l3L5l1K4j2pK3j5QpK5k1mNj9K7
4851Ij4Qj9J5JrPpJ3j3J2mMPn%j4K1j5lJ6oJ4k4Rj2OJ2j6J4rJ3j3J1rpJ5k2PO
$$ plain form
4643 56 -47 31 -38 50 -29 -13 38 -65 44 -35 42 -54 30 10 -57 38 -24 30 -71 51 -29 -33 39 -38 19 -54 54 -63
4671 -63 6 21 -35 36 -26 45 -70 55 -9 -33 40 -26 18 -60 68 -47 -2 24 -31 7 -30 71 -75 24 3 -4 9 -21
4699 -21 48 -65 69 -30 1 12 3 16 -40 69 -69 27 -10 7 -9 -5 46 -76 50 -29 9 -12 4 16 -67 64 -46
4726 -46 11 -7 14 -7 -32 54 -60 27 -24 12 -24 -7 32 -57 60 -33 25 -27 19 -2 -36 59 -58 22 -27 26 -31 -4 41
4755 41 -56 30 -35 19 -33 12 -2 -45 45 -33 33 -39 23 -22 -10 35 -42 22 -25 26 -34 5 23 -33 28 -18 22 -30 17 -14
4785 -14 -28 42 -13 12 -39 26 -22 -6 18 -33 13 -27 14 -34 20 5 -15 16 -24 22 -26 21 -22 -7 17 -17 10 -19 26 -20
4815 -20 10 7 -13 16 -7 21 -17 13 2 -3 5 -15 12 -19 20 -12 -6 3 -5 11 -22 13 -18 6 -6 -13 10 -5 3 -4 21 0 -4 1 -18 9
4851 9 -5 3 -16 -1 0 -9 -2 -9 4 -9 3 -1 3 10 5 5 -9 12 -3 -6 10 4 18 -6 3 -9 -3 9 -7 7 -2 11 -2 9 0 -7 8 -14 -7 -1
4891aJ0j1J0jj3J8qLpKkLkOqOmkNJoQpJp%OjJLjnRj7J5j4NPj3kJ3J4j9NlMKKM
4940Ik7K5rmO%J0j9K2k4K0j0KKj3L0k9K8j9J0j3lK1l5M0l9K7k2J3Mk8M7m7N2m0
4975a3L1k9JM7o7N2m5N0m7K0J2l5N3n2L5l5N0l3mL8n5N6n0N5q4N4L1o6O2o7P8
5006D3r1P7l6j8O0o1M9q2J12q4K6M6p5P3p5Q5j03P5j1l9N0n6P8j10J29q3%N1m5
5035a5M1q4J34j24N9Pl1K6n1J09j39J06l4j5K1k6P0j35J57j27N3Nj8J2n8J50j84
5062i1J21k5Jj7JQ2j72J70r0K6l3L7K7j21J76j52R2n7N5m8k0J41k04J54p8O0p2
5089c7N7J5j36J97j41O6q4J31q2n6J63j70J11r1J34j39N7Q0j72J54j12J23j51
5112h3J42l6j10J78j45J02j30J81j54J9J31j66J12q8J45k18J59J5j34J30q8J21
$$ plain form
4891 -1 9 -2 8 7 -6 12 4 7 0 2 0 3 1 7 -1 5 1 -1 4 5 -1 7 0 1 -6 -6 0 -1 0 3 2 -3 6 -11 4 -10 -5 2 -11 -13 0 14 -5 0 -3 1 3 5 9
4940 9 -18 7 -2 -6 0 0 10 -9 13 -11 9 -1 1 3 -10 20 -9 19 0 10 -3 -6 15 -20 20 -19 8 -14 -1 3 -25 22 -25 27 -13
4975 -13 18 -11 -10 37 -30 22 -23 27 -20 0 12 -23 30 -22 13 -22 28 -5 -9 29 -26 30 -20 35 -49 5 36 -30 32 -35 43
5006 43 -48 29 -7 -25 35 -26 23 -59 53 -31 -5 41 -34 39 -36 49 -54 21 10 -29 21 -35 43 -67 62 -21 -21 30 -15
5035 -15 26 -58 76 -48 11 18 -13 13 -38 71 -68 38 4 -11 10 -16 54 -81 76 -51 2 7 -11 1 -57 93 -91
5062 -91 30 5 6 -11 -10 72 -100 70 -20 6 -27 10 37 -84 92 -60 32 -25 30 -18 -38 103 -101 53 -25 35 -37
5089 -37 20 35 -101 96 -45 21 -63 68 -14 -70 93 -77 34 -57 77 -62 -5 75 -97 57 -55 68 -83
5112 -83 59 23 -87 91 -54 48 -82 99 -55 -36 95 -71 41 -47 98 -120 39 54 -80 50 -38 83
5134H3k06K26j19l8J13r8R5j59K37k42J11M6j09J15j18J72k49K26q8n8J11q7J07
5157G1k12K80k15N0Q2q6P2j40K55k82J59j5m7M9p5J67k57K61j61J6N4m1P4j89
5181a30K85k57J16Ol6K6q1K12l06K36o2j8Lj8J30k66K88j79N2kJ7L4j67K68k58
5206a07J59p2L4j8l9J69k62K30j11L4m0M1M3j87K59k02R3m2N8l6q1K09k25J52
5230E9p7N2o5K6R8j99J90j17O7p7O0J0j07J84j75R9n1O7o6j2J29j79J32p1O6q8
5256d5O5L2j33J50j12Q2q8R5m5n5J33j39R9o8O9q3L7N4j05J10q4Q0r9Q8j8p8J15
5283E7q5N8p6R9o5j2O2p5P5o6P6q9N2J4o1P9p3O1p2Q2n1rN4o4N6o8Q5q0L8J2m7
5314c3N7n1N5p7P7k1k4M0n6O7o4O2n6J8K3l4L8n0O1o5N4j5k7L5l3M7o2P0m2MJ8
$$ plain form
5134 83 -123 103 -16 -54 59 -39 56 -103 134 -108 3 49 -60 55 -63 109 -140 86 -2 -60 51 -36 71
5157 71 -141 139 -76 -26 56 -30 42 -98 157 -125 34 19 -28 21 -54 113 -144 117 -44 -28 26 -15 59 -130
5181 -130 155 -102 14 20 -16 10 -71 141 -165 71 9 -9 -6 -24 106 -160 128 -51 1 -1 16 50 -117 151 -107
5206 -107 52 -20 14 -4 -43 126 -136 94 -17 17 -23 18 61 -126 133 -69 24 -18 40 4 -77 132 -93 59
5230 59 -18 34 -31 -5 93 -106 84 -33 34 -43 17 27 -80 104 -71 28 -23 44 -22 -34 95 -84 48 -23 43 -45
5256 -45 20 52 -81 69 -43 39 -49 46 1 -54 79 -60 39 -29 40 -43 -6 48 -57 53 -31 49 -50 38 20 -58 57
5283 57 -28 30 -46 53 -12 -24 38 -37 38 -28 48 -41 11 25 -36 43 -30 31 -41 41 -10 -19 35 -29 27 -41 44 -36 2 14 -33
5314 -33 24 -27 28 -49 28 7 -17 23 -33 34 -30 32 -24 -6 17 -17 21 -29 32 -33 21 6 -21 14 -19 28 -34 36 -6 -2 16
5345A6l9M8n3O3n0K6J0l9L8n1O5o6M5j7PRl3L8n0N4m1K4Nk1M0n3M8m2L5j2rJ8
5377A3l3M8n1L9m0L3nk2M2m8M2l7K9k1LK6m2M2n1N4k9MOj3L8n1L9l3K7qk1K9l4
5410b5M8m8N1l2OJ6k6K5l5N0n6L8j6%K4l4L1l5L4l1J0Pj4L2l8L6m5M8k5qJj2M3
5443B0n3M3l5K8lj4K0m2O5n1K8j9J2Lj8L8o2O7m2K4k3J4K0n1O4n7L7k6L4k4k5
5474b8O4p3O3n5N1n2K1K6n9P2o5N1o5N6ol0N8o5P3p4P3o9K3M7p2O8o9Q7r4O1m
5505A4n2P1o2P5j09J04o0ML3l5M9r3J30j25Q6k7l0M5o5J17j44J32p5NK9l4N5j26
5533h8J82j48N8%nK9r6J60j79J36n6OKl5J17j86J97j38P0l6J3L8j23J96j94J12
5559C2m8M4k5n9J59k15J85j03O7q4M5O4j80K18j72J17j09R4j8j05K10k16J69j19
$$ plain form
5345 16 -23 25 -28 35 -15 11 21 -18 20 -31 34 -32 13 -4 3 12 -21 17 -33 21 -20 4 9 -12 28 -25 23 -19 16 4 -5 13
5377 13 -20 28 -23 16 -24 9 4 -18 24 -24 18 -19 10 -11 -8 18 -24 18 -33 21 -8 -4 2 -11 27 -24 15 -18 9 1 -20 9 -25
5410 -25 23 -25 26 -6 0 16 -10 15 -20 30 -26 12 -4 -4 20 -14 17 -18 16 -15 -5 2 -12 20 -18 18 -27 21 -4 -12 -11 -23 20
5443 20 -33 10 -25 3 0 -14 6 -36 29 -22 6 -13 -1 2 -16 22 -40 27 -15 9 -14 0 20 -31 33 -24 13 -13 21 -3 -28
5474 -28 36 -37 26 -29 22 -30 -9 17 -42 30 -35 16 -49 7 1 -29 29 -36 37 -37 36 -33 -10 37 -35 33 -36 51 -43 18 14
5505 14 -38 33 -29 46 -63 41 -19 -15 18 -17 32 -61 69 -56 30 3 -27 18 -47 70 -74 58 -17 -12 17 -17 38 -88
5533 -88 94 -54 4 4 -1 28 -68 92 -87 49 -7 -1 1 -34 83 -103 94 -44 26 -10 3 41 -82 114 -80 32
5559 32 -16 28 3 -56 103 -112 73 -30 37 -47 -2 62 -118 100 -72 45 -64 30 12 -93 117 -99 70 -49
5583d9J00r0MJ28k10K17j65J19j35J08J4j58K32j85J24j34J67j11n3J90k19J70
5605F4j41J76j72P4P1j76K10j81J57j85J73p0q2J90j85J42j57K02j81N3J12j83
5627h9J43j23J83k29J63Lj46J65j14J31k16K38j24k4J07j25J21j66K29k20J20
5648B7J3j00J01q6J57k51K19q8l4Q7o8Q7j91K71k15N6M6m6L5r7K03k42J73n4j2
5673iRk8J20k17K26j47N1NqK0j08K18k36J37k5J1m2k2J54k43K20j11M9o7O2L7
5699E6j70K29j69R2p7O9l5n3J68k12J57r8R3r5L6Q2j95K15j40Q3j01J26m5j12
5723i6J91j70J26j11J28r9%J21j71J34j10J29j36Q0K8j18J45j35J15j19J36q4
5745a6l6J17j33J10r8J26j40P1O0j33J17r3J14j39J14k2p2J13j09R0j09J26p9
$$ plain form
5583 -49 51 -39 -35 93 -117 100 -65 54 -81 27 41 -117 115 -70 54 -80 87 -24 -77 113 -106 64
5605 64 -77 99 -73 1 72 -104 106 -75 82 -103 70 0 -82 108 -77 65 -92 110 -71 -18 94 -89
5627 -89 54 -69 114 -115 48 51 -95 70 -44 87 -129 109 -15 -39 68 -57 64 -102 127 -93 27
5648 27 40 -60 41 -45 112 -139 80 -8 -42 45 -23 64 -127 144 -71 -15 31 -15 20 -77 126 -116 57 3 -9
5673 -9 0 -28 92 -125 101 -46 5 10 2 22 -86 132 -104 33 8 19 -23 -45 109 -134 86 -25 24 -43 19 56
5699 56 -114 115 -54 38 -39 30 -5 -58 110 -102 55 -43 50 -45 -9 73 -122 93 -47 36 -65 61 16 -96
5723 -96 95 -75 51 -60 68 -31 -31 90 -81 53 -57 72 -64 16 44 -74 71 -64 51 -68 68 -16
5745 -16 -52 65 -68 42 -56 70 -70 1 61 -72 45 -48 66 -73 41 19 -53 60 -49 41 -68 58 -21
5768b1J1M9q3R7j03J24j30Q5j2o7R2q1P7j02J11m6k7O2o9O3q4J08q6K6K4m9N4
5795B3o5Q6q8N7j5k1M1l4N4p9P8o0J7K9m4L0k5O3p7L4J4k5J2k9M7n1M4k1j1K0
5825Dj6L2m9M8l5J1Qj7K3l1L5l6K0jrQrK1j1J3opRj4J3j4J7j8NOj3J7lJj9K5j4
5862fjMqK1l1J2Nj3K2j1Rk8L4j7nJ1j8K2j2J7nomkJ8k1J4plkJ1Mj8K1k5K2j2j
5900iJ2pK0l6L6k9J6JoRk0L0l0J2pJ1l%J5k4K4k3Ooj2K2j1K8k4J7j7J4j3pK1k6
5936a6K1k0K7k0J1jj4K4k2J5j8RMj1J8j4J9l0K0k7K3Lj2K0k1K4l2L3k9J1JpL8
5969B7n5M4l0J4MrJ4l0M1l4K3k2J9%l0L9m2M7m0L0j5kJ0k0M5n2K8k6L0qj5L7m8
6002b6L6k5L1m0K4K2m9M6m2L7m5M7j6j7M0m6M8n6N8l3j1L6m9N3n0N9n2L3rk8L8
$$ plain form
5768 -21 -10 39 -44 53 -50 74 -56 29 17 -50 42 -39 38 -64 47 1 -26 36 -33 30 -54 54 -32 -6 18 -31 23
5795 23 -42 44 -44 13 -2 -23 18 -16 38 -41 37 -23 -6 23 -21 9 -16 47 -30 4 18 -7 5 -24 23 -28 16 -5 -16 4
5825 4 -12 20 -29 19 -16 -5 3 -14 9 -22 13 -23 -3 -4 -13 -5 -14 7 -4 9 3 -4 5 -9 4 -10 7 -11 -6 0 -13 4 1 2 -17 8 -6
5862 -6 -7 -3 -11 10 -21 -9 -4 -17 5 -6 3 -25 9 -8 -13 -2 -20 2 -10 7 2 -4 -8 -10 8 -13 1 -6 -9 -11 0 4 -14 7 -18 4 -8 -9
5900 -9 3 -4 16 -20 16 -13 3 4 -2 7 -13 17 -13 -1 -8 3 0 0 15 -9 15 -8 -2 -8 -20 2 -9 19 -5 12 -5 9 -4 -11 10 -16
5936 -16 5 -15 12 -8 3 2 -12 12 -10 5 -13 -4 0 -11 7 -7 12 -18 2 -25 -2 1 -11 9 -12 12 -20 13 -16 -5 -4 -11 27
5969 27 -28 16 -14 0 4 -5 9 -21 20 -14 9 -13 6 6 -24 15 -27 20 -20 10 -5 -7 3 -17 28 -24 4 -22 8 0 -15 22 -26
6002 -26 10 -15 16 -24 0 22 -27 19 -23 14 -31 16 0 -17 23 -23 25 -31 27 -6 -17 19 -30 23 -27 32 -20 13 4 -24 14
6033A4l3M2n8P1m0j4K6k7M2n9Q6p4K4jj4L0m5N9p0O8l0j4K2j4L8p4R7q0L8KmO
6065A4n0R1r5O5k3J4j5kN2j05J07o9K6k1J6J6n2Q0q3O8n1M3m7KO5j09R7m9L4m9
6095c0N0kp0R3p0O3o4O6m3k7P5q2O2n7Q5r0K9N2q8Q6p4P2q0P9l0m7R9r0O0p4J07
6126F0r6J0P1r5Q3p9J06j29Q8Kp5Q5p2J00j22J16o9oN4p1O4q6J30j26P3K0o6N5
6154B5p0J18j53J39o0l5N7n4P8j34J68j15K0L2m0M3q8J50j61J02k2k2M6o0R2j49
6180i3J43o7MK1k8N7j18J57j29O5qj5J9o2J28j48J06l6J1ll1Q0j35J42q8M0k0
6207hPL8r8J34j32Q0k5Mnk5J00j44J15n6J1pJN1j13J27q6L5k3L1ln5R6q9O9m5
6237a5K9k6nO3j05R6n8L7l5L6Ko1Q1o2L5m0O3n4kO0q4P8o2N0m7K0K8o8P9o4N2
$$ plain form
6033 14 -19 23 -35 36 -4 -18 8 -19 23 -36 50 -24 0 -1 -15 15 -30 29 -41 27 -3 -17 5 -9 29 -45 52 -28 10 12 8 14
6065 14 -36 55 -40 25 2 16 1 -1 51 -54 53 -16 10 -11 5 21 -31 49 -34 34 -17 26 -21 -19 46 -63 34 -15 19 -30
6095 -30 20 18 -52 41 -29 34 -30 36 -7 -34 41 -41 21 -36 49 -41 -12 40 -48 38 -36 36 -44 35 5 -42 57 -33 27 -47 60
6126 60 -36 -26 45 -50 33 -46 60 -69 19 21 -54 31 -41 59 -63 53 -16 -22 32 -39 25 -61 69 -57 16 36 -30 25
6154 25 -45 73 -80 59 -1 -36 21 -33 45 -89 79 -36 -16 16 -24 19 -69 81 -80 22 0 -22 24 -36 56 -93
6180 -93 50 -17 -13 8 -20 37 -81 76 -53 12 4 -11 8 -54 74 -74 32 -4 7 4 -27 53 -82 60 -28 12 -8
6207 -8 -1 37 -61 73 -59 21 -4 0 -5 -30 70 -74 41 -15 -4 -11 -10 41 -72 55 -31 4 -19 12 9 -46 50 -39 30 -15
6237 -15 14 -12 -17 46 -59 37 -21 16 -19 17 19 -42 39 -23 12 -28 35 -19 -21 39 -45 33 -29 21 -26 -6 22 -46 33 -31 21
$$ [...]
8191A7
##END NTUPLES=NMR FID
##END=
