##TITLE=1H_x0606
 aceton-d6
 8 sc, 
 9.06.2022
##JCAMPDX= 6.0         $$ Bruker NMR JCAMP-DX V2.0
##DATA TYPE= NMR FID
##DATA CLASS= NTUPLES
##ORIGIN= UXNMR, Bruker Analytische Messtechnik GmbH
##OWNER= root
$$ XWIN-NMR		Version 3.5
$$ Thu Jun  9 14:10:39 2022 Russian Standard Time (UT+4h)  she@DPX200
##.OBSERVE FREQUENCY= 200.131
##.OBSERVE NUCLEUS= ^1H
##.DELAY= (6, 6)
##.ACQUISITION MODE= SIMULTANEOUS
##.ACQUISITION SCHEME= undefined
##.AVERAGES= 8
##.DIGITISER RES= 18
##SPECTROMETER/DATA SYSTEM= spect
##.PULSE SEQUENCE= zg30
##.SOLVENT NAME= Acetone
##.SHIFT REFERENCE= (INTERNAL, Acetone, 0, 15.7039)
##AUDIT TRAIL= $$ (NUMBER, WHEN, WHO, WHERE, WHAT)
$$ ##TITLE= Audit trail, XWIN-NMR		Version 3.5
$$ ##JCAMPDX= 5.01
$$ ##ORIGIN= Bruker BioSpin GmbH
$$ ##OWNER= she
$$ F:/spectra/data/she/nmr/H-F/1/audita.txt
$$ ##AUDIT TRAIL=  $$ (NUMBER, WHEN, WHO, WHERE, WHAT)
(   1,<2022-06-09 14:09:28.39 +0400>,<she>,<DPX200>,
      <created by zg, POWCHK disabled, PULCHK disabled
       configuration hash MD5:
       00 E9 B6 7A A2 85 ED C7 34 08 36 98 17 FE 4E 26
       data hash MD5: 16K
       D5 6D CC 9E 74 EE 5D 07 BC 0E E6 7F 83 D5 18 5F>)
$$ ##END=
$$ 
$$ hash MD5
$$ 9A 48 34 A7 21 4F 75 68 3A 3B DB 93 31 DD 23 E9
##$RELAX= 
##$RELAX= 
##$RELAX= 
##$RELAX= 
##$RELAX= 
##$RELAX= 
$$ Bruker specific parameters
$$ --------------------------
##$DU= <F:/spectra>
##$EXPNO= 1
##$NAME= <H-F>
##$PROCNO= 1
##$TYPE= <nmr>
##$USER= <she>
##$AMP= (0..31)
100 100 100 100 100 100 100 100 100 100 100 100 100 100 100 100 100 100 
100 100 100 100 100 100 100 100 100 100 100 100 100 100 
##$AQSEQ= 0
##$AQ_mod= 1
##$AUNM= <au_zg>
##$AUTOPOS= <>
##$BF1= 200.13
##$BF2= 200.13
##$BF3= 200.13
##$BF4= 200.13
##$BF5= 200.13
##$BF6= 200.13
##$BF7= 200.13
##$BF8= 200.13
##$BYTORDA= 1
##$CFDGTYP= 0
##$CFRGTYP= 5
##$CHEMSTR= <none>
##$CNST= (0..31)
1 1 145 1 1 1 1 1 1 1 1 1 1 1 1 1 1 1 1 1 1 1 1 1 1 1 1 1 1 1 1 1 
##$CPDPRG= <>
##$CPDPRG1= <>
##$CPDPRG2= <>
##$CPDPRG3= <>
##$CPDPRG4= <mlev>
##$CPDPRG5= <mlev>
##$CPDPRG6= <mlev>
##$CPDPRG7= <mlev>
##$CPDPRG8= <mlev>
##$CPDPRGB= <>
##$CPDPRGT= <>
##$D= (0..31)
0 1.2 0 0 0 0 0 0 0 0.06 0 0.03 0 0 0 0 0.0002 0 0 0 0 0 0 0 0 0 0 0 0 
0 0 0 
##$DATE= 1654769367
##$DBL= (0..7)
120 120 120 120 120 120 120 120 
##$DBP= (0..7)
150 150 150 150 150 150 150 150 
##$DBP07= 0
##$DBPNAM0= <>
##$DBPNAM1= <>
##$DBPNAM2= <>
##$DBPNAM3= <>
##$DBPNAM4= <>
##$DBPNAM5= <>
##$DBPNAM6= <>
##$DBPNAM7= <>
##$DBPOAL= (0..7)
0.5 0.5 0.5 0.5 0.5 0.5 0.5 0.5 
##$DBPOFFS= (0..7)
0 0 0 0 0 0 0 0 
##$DE= 6
##$DECBNUC= <off>
##$DECIM= 32
##$DECNUC= <off>
##$DECSTAT= 4
##$DIGMOD= 1
##$DIGTYP= 9
##$DL= (0..7)
0 120 120 120 120 120 120 120 
##$DP= (0..7)
150 150 150 150 150 150 150 150 
##$DP07= 0
##$DPNAME0= <>
##$DPNAME1= <>
##$DPNAME2= <>
##$DPNAME3= <>
##$DPNAME4= <>
##$DPNAME5= <>
##$DPNAME6= <>
##$DPNAME7= <>
##$DPOAL= (0..7)
0.5 0.5 0.5 0.5 0.5 0.5 0.5 0.5 
##$DPOFFS= (0..7)
0 0 0 0 0 0 0 0 
##$DQDMODE= 0
##$DR= 18
##$DS= 0
##$DSLIST= <SSSSSSSSSSSSSSS>
$$ [...]
##$SUBNAM2= <"">
##$SUBNAM3= <"">
##$SUBNAM4= <"">
##$SUBNAM5= <"">
##$SUBNAM6= <"">
##$SUBNAM7= <"">
##$SUBNAM8= <"">
##$SUBNAM9= <"">
##$SW= 18.0517599122864
##$SWIBOX= (0..15)
0 0 2 0 0 0 0 0 0 0 0 0 0 0 0 0 
##$SW_h= 3612.71676300578
##$TD= 16384
##$TD0= 1
##$TE= 0
##$TE2= 300
##$TE3= 300
##$TEG= 300
##$TL= (0..7)
0 120 120 120 120 120 120 120 
##$TP= (0..7)
150 150 150 150 150 150 150 150 
##$TP07= 0
##$TPNAME0= <>
##$TPNAME1= <>
##$TPNAME2= <>
##$TPNAME3= <>
##$TPNAME4= <>
##$TPNAME5= <>
##$TPNAME6= <>
##$TPNAME7= <>
##$TPOAL= (0..7)
0.5 0.5 0.5 0.5 0.5 0.5 0.5 0.5 
##$TPOFFS= (0..7)
0 0 0 0 0 0 0 0 
##$TUNHIN= 0
##$TUNHOUT= 0
##$TUNXOUT= 0
##$USERA1= <user>
##$USERA2= <user>
##$USERA3= <user>
##$USERA4= <user>
##$USERA5= <user>
##$V9= 5
##$VALIST= <valist>
##$VCLIST= <CCCCCCCCCCCCCCC>
##$VD= 0
##$VDLIST= <DDDDDDDDDDDDDDD>
##$VPLIST= <PPPPPPPPPPPPPPP>
##$VTLIST= <TTTTTTTTTTTTTTT>
##$WBST= 1024
##$WBSW= 4
##$XGAIN= (0..3)
0 0 0 0 
##$XL= 0
##$YL= 0
##$YMAX_a= 192220
##$YMIN_a= -175061
##$ZGOPTNS= <>
##$ZL1= 120
##$ZL2= 120
##$ZL3= 120
##$ZL4= 120
##$ABSF1= 10
##$ABSF2= 0
##$ABSG= 5
##$ABSL= 3
##$ALPHA= 0
##$AQORDER= 0
##$ASSFAC= 0
##$ASSFACI= 0
##$ASSFACX= 0
##$ASSWID= 0
##$AUNMP= <proc_1d>
##$AZFE= 0.1
##$AZFW= 0.1
##$BCFW= 1
##$BC_mod= 2
##$BYTORDP= 1
##$COROFFS= 0
##$CY= 11.3945322036743
##$DATMOD= 1
##$DC= 2
##$DFILT= <>
##$DTYPP= 0
##$F1P= 2.36226072786647
##$F2P= -0.459571619588291
##$FCOR= 0.5
##$FTSIZE= 0
##$FT_mod= 4
##$GAMMA= 1
##$GB= 0.15
##$INTBC= 1
##$INTSCL= 1
##$ISEN= 128
##$LB= 0.24
##$LEV0= 0
##$LPBIN= 0
##$MAXI= 10000
##$MC2= 0
##$MEAN= 0
##$ME_mod= 0
##$MI= 1.114404
##$NCOEF= 0
##$NC_proc= 0
##$NLEV= 6
##$NOISF1= 3.799351
##$NOISF2= 2.8
##$NSP= 1
##$NTH_PI= 0
##$NZP= 0
##$OFFSET= 15.70392
##$PC= 1
##$PHC0= -18114.16
##$PHC1= 11.60074
##$PH_mod= 1
##$PKNL= yes
##$PPARMOD= 0
##$PSCAL= 0
##$PSIGN= 0
##$REVERSE= no
##$SF= 200.130013532006
##$SI= 16384
##$SIGF1= 3
##$SIGF2= 2
##$SINO= 400
##$SIOLD= 16384
##$SREGLST= <1H.CDCl3>
##$SSB= 0
##$STSI= 0
##$STSR= 0
##$SW_p= 3612.71676300578
##$SYMM= 0
##$S_DEV= 0
##$TDeff= 0
##$TDoff= 0
##$TI= <>
##$TILT= no
##$TM1= 0
##$TM2= 0
##$TOPLEV= 0
##$USERP1= <user>
##$USERP2= <user>
##$USERP3= <user>
##$USERP4= <user>
##$USERP5= <user>
##$WDW= 1
##$XDIM= 8192
##$YMAX_p= 0
##$YMIN_p= 0
$$ End of Bruker specific parameters
$$ ---------------------------------
##NTUPLES= NMR FID
##VAR_NAME=  TIME,          FID/REAL,        FID/IMAG
##SYMBOL=    X,             R,               I
##VAR_TYPE=  INDEPENDENT,   DEPENDENT,       DEPENDENT
##VAR_FORM=  AFFN,          ASDF,            ASDF
##VAR_DIM=   8192,          8192,            8192
##UNITS=     SECONDS,       ARBITRARY UNITS, ARBITRARY UNITS
##FACTOR=    0.0002768,     1,               1
##FIRST=     0,             0,               0
##LAST=      2.2672688,     0,               0
##MIN=       0,             -175061,         0
##MAX=       2.2672688,     192220,          0
$$ Real data points
##PAGE= N=1
##DATA TABLE= (X++(R..R)), XYDATA
0@%%%%%%%%%%%%%%%%%%Qj6J6j6J6j6K4l2L2l6M4m8N6o4P2q3R1j00J12j28J44j60
40h4J76j92K14k38K62k88L16l49L83m23M69n16N68o28O95p71Q60r62J082j227
60f53J403j624J911k301K851l681N076p802J4877o3598j21520K63977N1136k67462
74a27410L5245K49358j13987k14037J71147J73931k14176j20413K39163N8103
84A36924k53211J4433K48465q6013k22591J47180J71269j85610j08112K01481
94F4215M6151j99282M462J86286m5629j62944Q0794J31827j12946r4207J40696
105C9423N3122j57480q912J55144l3800j32641O9278R9610r4495o9440J10999
116C0808M6494j21737k6969J27181L466j28133K6486J23776o0957j12013R2626
$$ plain form
0 0 0 0 0 0 0 0 0 0 0 0 0 0 0 0 0 0 0 0 8 -8 8 -8 8 -8 16 -16 16 -20 24 -24 32 -32 40 -43 48 -52 60 -68 76 -84
40 -84 92 -100 114 -124 138 -150 166 -183 200 -223 246 -270 298 -330 365 -406 454 -508 574 -653
60 -653 750 -874 1037 -1264 1587 -2094 2982 -4820 10057 -53541 -175061 88916 140052 -127410
74 -127410 -92165 157193 43206 -170831 316 174247 -39929 -160342 78821 136924
84 136924 -116287 -101854 146611 60598 -161993 -14813 156456 -29154 -137266 64215
94 64215 110366 -88916 -84454 101832 56203 -106741 -25947 105880 -7066 -101273 39423
105 39423 92545 -64935 -73847 81297 47497 -85144 -15866 83744 -10751 -80191 30808
116 30808 77302 -44435 -71404 55777 59243 -68890 -42404 81372 20415 -91598 1028
127A028R1025j13400o3518J21766L6197j23487j2125J25643j0512j26852L6340
138c7895J21342o5785j04670R5770P7714j20618m4067J33694P926j31820K6284
149d2125J17216n7552r7104Q6666P4787j13884m8210J34677J3743j43192K8239
160d6739J36926p2691j16753J13125Q5833j42377m7186J56818N869j57115L4242
171e0048J47586p1650j30423J06067J03750j35148o6553J53790K1359j58628K4771
182e5127J48175o5773j23950R6974Q9088j16575m9420J25597J0630j26424K5246
193d1559J19780n7899j02669Q6678P4208j07992l7599J19172l09j19361L4548
204c3002J09356o2603r1004Q3265O7144r7213m1630J05537J5380j08999J1641
$$ plain form
127 1028 92053 -21347 -84865 36901 73098 -50389 -62514 63129 52617 -74235 -37895
138 -37895 83447 17662 -87008 8762 86476 -34142 -78209 55485 63411 -68409 -42125
149 -42125 75091 17539 -79565 7101 81888 -31996 -80206 54471 68214 -74978 -46739
160 -46739 90187 17496 -99257 13868 99701 -42676 -89862 66956 72825 -84290 -50048
171 -50048 97538 25888 -104535 1532 105282 -29866 -96419 57371 78730 -79898 -55127
182 -55127 93048 27275 -96675 299 89387 -27188 -76608 48989 59619 -66805 -41559
193 -41559 78221 20322 -82347 4331 78539 -29453 -67052 52120 51811 -67550 -33002
204 -33002 76354 13751 -77253 6012 73156 -24057 -65687 39850 55230 -53769 -42128
215d2128J05623l8340r4182O0857P5955p6046n3958Q4091L0609q5937o993Q3090
227D2641j4638p6426L2937O7299m7752n4904N9965L7692o8615j6252P1752o141
239B7558o9839K5869O4053m2523n5220N6129M2386o6572k6355P3658Q280p7966
251d0542J1347P9127l1885p4674N1219O3892o6110m8227P6292L0056q2623r549
263d1677Q5135j2599q2453L3993P4123n2510o1006O7215M2806p7737j9676Q1897
275C7511o274p9101L0836P0449n1838n7047O8862L8537q0640j4777Q5540j1219
287C0839q3212L6647P5244n9539o1561P8561M2029r0882j8184R4858o868r1774
299e3842L1020Q3081n3632o9193P2197M9901q3949k7714Q7773M638q5124J8358
$$ plain form
215 -42128 63495 25155 -69027 -8170 67785 -8261 -62219 21872 52481 -33456 -40449 42641
227 42641 28003 -48423 -15486 51813 4061 -50843 9122 46814 -21801 -38053 33699 27558
239 27558 -42281 -16412 47641 5118 -50102 6027 48413 -18159 -44514 29144 37424 -40542
251 -40542 -29195 49932 18047 -56627 -5408 58484 -7626 -55853 20439 50495 -32128 -41677
263 -41677 43458 30859 -51594 -17601 56522 4012 -56994 10221 53027 -24710 -44386 37511
275 37511 31237 -47864 -17028 53421 1583 -55464 13398 51935 -28705 -43482 42058 30839
287 30839 -52373 -15726 59518 -21 -61582 16979 59008 -31874 -50058 44800 37932 -53842
299 -53842 -22822 60259 6627 -62566 9631 59532 -24417 -52131 35642 40280 -44844 -26486
311b6486P6826m0156o2683N7912M4235o9010k3894P3843L253p2810J7963O5729
323D4722l8160n2671N4674L6037o6004j8292P2225l39p3030J9440O7197l7445
335H354n6029N2010M1932o2930k6591P0081R951p2117P094O8197k2323n9528L5155
348f744M8414m5787l5058N3832K0161n7302n378N5877p600n0909J9188M3293l0230
361A757l3006L9352K0585m5308q065M7741l963m7439J5977M3601k7797l5902L7887
374E420K5856m5588j5105N1746L931n5658Q593N5656k1511n0827L3685M2453m4503
387e852l1680N3647J8653n9563m360O0554r856n7188K2963N0391l5681m0211M7208
400I025K6030n5408r190N8410p920n6040K3950M8937l8041l6930M9261K1354n6215
$$ plain form
311 -26486 50340 10184 -52499 5413 49648 -19362 -43256 30587 33840 -38970 -21007 44722
323 44722 6562 -46109 8565 44602 -21402 -39694 32531 32192 -40838 -21398 45799 8354
335 8354 -47675 4335 46267 -16663 -43254 26827 36778 -35339 -28245 39952 17629 -41899 -6744
348 -6744 41670 -4117 -39175 14657 34818 -22484 -27862 28015 20415 -30494 -11306 31987 1757
361 1757 -31249 8103 28688 -16620 -24685 23056 19093 -28346 -12369 31232 3435 -32467 5420
374 5420 31276 -14312 -29417 22329 26260 -29398 -20805 34851 13340 -37487 -3802 38651 -5852
387 -5852 -37532 16115 34768 -24795 -29155 31399 21543 -35645 -12682 37709 2028 -38183 9025
400 9025 35055 -20353 -29543 28867 20947 -35093 -11143 37794 -247 -37177 12084 33438 -22777
413b2777m307N9203j2299n8493K8454N3192m3660m1967N5794K5507o3200o978
425c1531O5513j1238o3244K7425N5955m0529m4248M9688K9747n5460j4011N8632
437B6699k592n7881J9579N1357l4286l9021M4364K3816m9044q064M9170p055m5413
450b8371K0720L8536l2008l0165M0479K0580m6419q840M8715n668m6291K0250
462h482L9629l1467l1245L7934K2905m0506j4253M0671N168l9440L958L8074j2521
475A0425l6041K0857L1502k7958k3240L1885J3138l2273m332L0700k545k8866
487a6748Q694K6488j5450k3252K2546J8790k9454j2252L4796K451l6239R875L2974
500B3219k1338k7119K9850K1717l5568j6406L9917Q884m2994K230M4235j5692
$$ plain form
413 -22777 -27084 32119 19820 -38673 -10219 42973 -687 -42654 13140 38647 -24553 -31531
425 -31531 33982 22744 -40500 -13075 42880 2351 -41897 7791 37538 -17922 -31933 26699
437 26699 24107 -33774 -14195 37162 2876 -36145 8219 32035 -17009 -25073 24097 17042 -28371
450 -28371 -7651 30885 -1123 -31288 9191 29771 -16648 -25488 23227 17559 -28732 -8482
462 -8482 31147 -320 -31565 6369 29274 -11232 -25485 15186 20354 -19086 -15128 22946 10425
475 10425 -25616 -4759 26743 -1215 -24455 7430 20568 -11705 -16037 14663 12118 -16748
487 -16748 -8054 18434 2984 -20268 2278 21068 -8386 -20638 14158 16609 -19630 -9755 23219
500 23219 1881 -25238 4612 26329 -9239 -25645 14272 23156 -19838 -17608 26627 10935
512A0935m3112K9257L8118m0703k7992M7328J3703m8449N99M5807j2351m1952
524b8812K2065L6674l1367k8083L9876J5949m5545j748M6884j2828m2289K6686
536b538L1715l7550j7590M3604M303m4995O074M3387j5461l9354K6117L2043l7548
549g793k1914M6632J0012n0955K851M9043j5979m1124K7091K9923l3758j9446
561b5417L6418J1509l7123l793L6939n741l4577J6249K9097k4809k0622K9721
573G851R928l0810J370K8362j0536k4164J5283K0226j7272j7023J9871J2415k4483
586h982n232K8996l030l0741J0202K8813j5516k3584J9708J6805k2753j0839K5009
599H856P369k7344m534K9826q97l0680R431K8083j8356k2528K4628J5145k7739
$$ plain form
512 10935 -32177 -2920 35198 -5505 -33497 13831 27534 -20915 -20316 25491 13140 -28812
524 -28812 -6747 29927 -1440 -29523 10353 26302 -19243 -20991 25893 13065 -29224 -2538
536 -2538 29177 -8373 -25963 17641 21944 -23051 -16977 26410 10949 -28405 -2288 29755 -7793
549 -7793 -29707 16925 26937 -24018 -21167 27876 11897 -29227 -2136 27787 -5971 -25417
561 -25417 11001 22510 -14613 -18406 18533 12792 -21785 -5536 23561 -1248 -21870 7851
573 7851 17779 -13031 -11661 16701 6165 -17999 -2716 17510 238 -16785 3086 15501 -8982
586 -8982 -14214 14782 11752 -18989 -8787 20026 4510 -19074 634 17439 -5314 -16153 8856
599 8856 16225 -11119 -15653 14173 13276 -17404 -7973 20110 1754 -20774 3854 18999 -8740
612h740o909K8211j557k7036Q850K5219j4693k2905K0519J8531k7127r794L2878
625A5447k284l4873J4214L2347k3067k5948K8862J7184l2775p448L5259j727l6600
638b1409R805L6270j8021l2982K6825K5024l4484j3464L8071J432l6924Q648L2491
651B1282j6593k6228K2969J9040k7351j1357K9694L301l0166O101K8604j6676
663B620k3945K5941J6179l0977p030L1262j978k8965J0300K5760j7819k2109K3531
676B770J7740k7267j2372K9659N274l0676L655K9210j2242k4753J8130J8942k0761
689b691j3298K1830Q222k2377l002K2048k308k0634P594J8163j3092j4443J8020
702D032Q922k0805k709K0469k784j8398P382J6275j2199j4181J7402J1207k1600
$$ plain form
612 -8740 -15649 12562 11005 -16031 -7181 18038 3345 -19560 959 19490 -7637 -17431 15447
625 15447 13163 -21710 -7496 24851 1784 -24164 4698 21882 -10893 -18341 16918 15191 -21409
638 -21409 -11604 24666 6645 -26337 488 25512 -8972 -22436 15635 17067 -19857 -11209 21282
651 21282 4689 -21539 1430 20470 -6881 -18238 11456 14757 -15409 -9308 19296 2620
663 2620 -21325 4616 20795 -10182 -17212 14050 12072 -16893 -6593 19167 1348 -20761 2770
676 2770 20510 -6757 -19129 10530 15804 -14872 -11217 17993 5751 -19002 -872 18070 -2691
689 -2691 -15989 5841 14063 -8314 -11316 10732 8424 -12210 -4616 13547 455 -13988 4032
702 4032 12954 -7851 -10560 9909 7125 -11273 -3891 12384 185 -13996 3406 14613 -6987
715f987p004K4156J754k5022M855K4261j2228k1321J8654J6731k2642j1861K4694
728H040O978k6071j176K6247n783k4381J2460K0463j8076j5326K2427Q992k4972
741a0178j594K4551n562k1345J1477J7084j6347j2506K1013P040k4389l05K5083
754A4022o563k3105J2916J9481j8901j4456K3901P965k6712j241K6835m645k5412
767a5915R974K2836j5636j8469K0802J2265k4004n529K5040o46k4385O712K1857
780A4902j2437j7007J6872J0879j9378m902K0761q65k1189O894J9509j2631j5450
793a4042J6794J0021j9517m483K1454j434k2197P429K0734j2380j7424J5842J3486
806A4283j8575q890K1073L295k2156K650K1258p405j9040J1058J6075j4298j1856
$$ plain form
715 -6987 -13991 10165 11919 -13103 -8248 16013 3785 -17536 1118 17849 -4793 -16654 8040
728 8040 15018 -11053 -12229 14018 8235 -16146 -3686 16777 -1299 -16625 5802 14794 -10178
741 -10178 -11772 12779 7217 -14128 -2651 14433 -1914 -14420 6593 13633 -10756 -11061 14022
754 14022 7459 -15646 -2730 16751 -2150 -16606 7295 15260 -11452 -12693 14142 9497 -15915
767 -15915 -5941 16895 1259 -17210 3592 15857 -8147 -13676 11364 10718 -13667 -6955 14902
780 14902 2465 -14542 2330 13209 -6169 -11071 9690 8825 -12364 -5470 14039 1408 -14042
793 -14042 2752 12773 -6744 -11227 10227 8793 -13404 -5975 14759 2379 -15045 797 14283
806 14283 -4292 -13182 7891 11186 -10970 -8320 12938 5533 -13507 -2449 13626 -672 -12528
819a2528J6825O312j7857p95J7462l880j6491Q003J4473j1957j0683J4820N495
832I199j6034l34J6341m388j6100R156J4622j3419j1306J6264P150j7702k781
845i332J8687j972j9068P167J7927j1691j5283J4578J1961j6511q212J8018L407
858I676j8660J830J7790o364j5963R865J3655j2952j0195J5468N189j6335L61
871f635J5742n244j4402R596J2499j3587r149J6561M318j7822R32J7855o234j7178
885a2748J1633J5107j6686j1167J9915O101k1053r56K0875m248j9824R812J7379
898A4140j4802j3426J8154Q859j9682l868J9946j863j8547P886J5203j2602j0785
911a1387J5244O380j6473k077J6742k874j5667P865J2957j2031r441J5116N535
$$ plain form
819 -12528 4297 10609 -7248 -8043 9419 5539 -10952 -2949 11524 -433 -11116 3704 9199
832 9199 -6835 -7169 9172 4784 -11316 -2160 12462 -957 -12263 4001 11151 -6551 -9332
845 -9332 9355 7383 -11685 -4518 13409 1718 -13565 1013 12974 -3537 -11749 6269 9676
858 9676 -8984 -7154 10636 4272 -11691 -1826 11829 -1123 -11318 4150 9339 -6996 -6635
871 -6635 9107 3863 -10539 -943 11556 -2031 -11180 5381 9699 -8123 -7191 10664 4430 -12748
885 -12748 -1115 13992 -2694 -13861 6054 12155 -8898 -9854 11021 6773 -13051 -3239 14140
898 14140 -662 -14088 4066 12925 -6757 -10625 9321 7458 -11089 -3203 12000 -602 -11387
911 -11387 3857 10237 -6236 -8313 8429 5555 -10112 -2247 10710 -1321 -10762 4354 9889
924I889j7356r57J8083m013j6509Q173J3515j0928j0394J3212P512j5453m101
937i327J6867L21j6589L234J4898o483j2405R704Q923j2227n005J2947J729j2325
951e738M65J1457k720j0627N874Q889r061o100J1238L036j2304J84J2656l686
965C563j1820O969R814r051p565J0503N683j2570l379J5039j46j6348M121J5487
979A0300p666j3064J0786R640j3720n584J5567J629j5697J394J4879m111j3691
992i338P935J1464j2455p310J5702K062j6370L059J5029p687j2382J1682Q622
1005A0013j4360m355J5328L26j5616L598J5833q358j4997J3302J1728j6624o453
1018a0635J7506Q66j6882M180J5643q193j3517J0654J0586j1463p377J2040L960
$$ plain form
924 9889 -7467 -8424 9659 5646 -10863 -2690 10825 -103 -10497 2715 10227 -5226 -9327
937 -9327 7540 7861 -8728 -5494 9404 2921 -9484 220 9143 -3084 -8089 4858 6587 -5738
951 -5738 -5273 6184 3464 -7163 -1289 7600 -1461 -7561 3677 6713 -5591 -5407 7249 3563
965 3563 -8257 -1288 8526 -525 -8090 2413 8096 -4474 -7853 7186 7040 -9308 -5187 10300
979 10300 2634 -10430 356 9996 -3724 -9308 6259 7888 -7809 -6415 8464 4353 -9338
992 -9338 -1403 10061 -2394 -9704 5998 8060 -8310 -5251 9778 2091 -10291 1391 10013
1005 10013 -4347 -8702 6626 6952 -8664 -5066 10767 2409 -12588 714 12442 -4182 -10635
1018 -10635 6871 7737 -9145 -4965 10678 2485 -11032 -378 10208 -1255 -8632 3408 7368
1031G368j3293L69J3995n140j2402Q583Q706j0086m607J0452R35j0459K097R728
1045F246m384q365O003P191q011o051J0782L805j2751j14J2419l611j0271O328
1059g84Q290q126p159R399O161r903m797R975K834j0632J64J1558m198j1214P567
1074h65Q816q866n661Q680K990q690o94R281j711r466M165Q839o662p310R626
1089B472M614j2306m99J3040l917j1278P223Q587r487o553J1576M788j3495k345
1103g580J4254j083j3731N178J2498r767j0312J3701O629j5179k075J3910j829
1116D614j1605M842R921p574q406J0090N993j1674k510J2166j523j1827N688J0180
1130H375r367o860J1338K630j1391O70J0777k696j0570M513J0039o759q230R083
$$ plain form
1031 7368 -5925 -5556 8439 3299 -9103 -520 8186 -1900 -6507 3945 4880 -5579 -3482 6246
1045 6246 1862 -6503 -500 6691 -1320 -7371 3411 7216 -5535 -5649 6770 3159 -7112 -784
1059 -784 7506 -620 -7779 1620 7781 -2122 -6919 3056 5890 -4742 -4578 6980 2782 -8432 -865
1074 -865 7951 -915 -6576 2104 5094 -3596 -4290 4991 3280 -6186 -2021 6818 156 -7154 2472
1089 2472 7086 -5220 -5719 7321 3404 -7874 -651 7936 -1551 -8104 3472 8260 -5235 -7580
1103 -7580 6674 5591 -8140 -2962 9536 -231 -10543 3158 9787 -5392 -7467 6443 4614
1116 4614 -6991 -2149 7772 198 -8208 1882 7875 -3799 -6309 5857 4334 -7493 -1805 8375
1130 8375 -992 -7852 3486 6116 -5275 -4605 6172 3476 -7094 -2581 7458 699 -7531 1552
1144A552N436j0919k434J2153m36j2126L222J0321n228p409O153N160o923l933
1158e411Q227K551r370l30R215k357p923M809O112o935l907Q322J165q419J339
1173b912P660k910p160M239P061o156o089Q439L632r970n46J0609k153j0627M490
1188b393R693o498p587P761N056q525l130R545J337j0772J188J0801m198q987
1202f709O586O250q089l474R097O40r335K307Q495m660o940O281N378p807l474
1217e454R496M15j0357L276R676o330q096Q247O228r636l836J0460P60j0360K113
1232c398R662m218r001O099Q076q054n839R294K682r197K63Q474k456p733M423
1247i23O563o094m603O877K414o985n55P122j626p180M291O219o598m326P669
$$ plain form
1144 1552 6988 -3931 -6365 5788 5352 -6774 -3552 6769 1541 -5868 285 5445 -1478 -5411
1158 -5411 2816 5367 -4003 -4333 4882 2525 -5398 -589 5523 -1412 -5319 3003 4168 -4251 -2912
1173 -2912 4748 1838 -5322 -1083 5978 -178 -6267 2172 5804 -4166 -4712 5897 3744 -6883 -2393
1188 -2393 7300 802 -6785 976 6032 -2493 -5623 3922 5259 -5513 -4325 6476 2278 -6709
1202 -6709 -123 6127 -1962 -5436 3661 4301 -5034 -2727 5768 1108 -5832 449 5827 -1980 -5454
1217 -5454 4042 4457 -5900 -2624 7052 722 -7374 873 7101 -2535 -6371 4089 4849 -5511 -3398
1232 -3398 6264 2046 -6955 -856 7220 -834 -6673 2621 5303 -3894 -3631 4843 2387 -5346 -923
1247 -923 5640 -454 -5057 1820 4234 -2751 -3306 3816 2190 -4990 -699 5520 -1078 -5404 2265
1262B265K425q015o81Q300j567q107M170P148o150n864P421M690q510k982R366
1277C909L40r159K434P928m444o624N904N385p318l544Q064J088p701J174O743
1292D179l029n913N014M729o912k679P782L65p428J565O765l327o072N419M813
1307E271p234k914Q049J139q156L01Q143k176p683M453O199o221m344P073K846
1322D746p599j430P935n52p400K679O007m200m496N349L178o443j501P142o71
1337B744o676K607N438l987m239N331K943o821j131P629r21p422K499O757l919
1352H32n985N655M607p332k521Q111N51q067R22P923k441p385M362N947n962l832
1368d615O821J893p280j55P504j897o856L902N128n289l062O018J244o769O86
$$ plain form
1262 2265 4690 -3325 -4006 4294 2727 -5380 -1210 5938 -212 -6076 1345 6035 -2475 -5457 3909
1277 3909 4249 -4910 -2476 5452 1008 -5616 288 5673 -1645 -5189 2875 3963 -3738 -2564 4179
1292 4179 1150 -4763 251 4980 -1932 -4611 3171 3536 -3892 -2327 4438 1111 -4961 458 5271
1307 5271 -1963 -4877 3172 4311 -3845 -3544 4599 2423 -5260 -807 5392 -829 -5173 1900 4746
1322 4746 -2853 -4283 3652 3100 -4300 -1621 4386 186 -4310 1039 4217 -2226 -3727 3415 2744
1337 2744 -3932 -1325 4113 126 -4113 1218 4161 -2660 -3791 3838 2917 -4505 -2006 4751 832
1352 832 -5153 502 5109 -2223 -4744 3367 3918 -4149 -3227 4696 2255 -5130 -768 5179 -783 -4615
1368 -4615 2206 4099 -3181 -3336 4168 2271 -4585 -683 4445 -844 -3906 2112 3356 -3413 -2727
1383b727P172k965o566N006M953o252l053P064J174p805J131P927l429p008M950
1398d28N661n755m382O576K781p385n49P425j670o652L123N636m068m599M915
1413F29L004n356j015N063n50m654J630M603k820m228M189K887m911r98M917n86
1429A804m801J870M813l232m384M362L382m932k435N388J474o169N9O643k204
1444A638o118L935M946m790l911N331K888n844j317O005m81n681K062N322l424
1459E61m912M984L600o111j239O086j138n363K844M667m177m060N405K835o239
1474b257j105O482o79o576K562O490m820n394O775L201p452r47P137n55o661J856
1490a943O149l456n058N005L523o014k109O648N00o720J657N641l893l510N075
$$ plain form
1383 -2727 4445 1480 -5086 -80 4873 -1379 -4432 2632 3806 -3999 -2868 5059 1630 -5378 -428
1398 -428 5233 -522 -4904 1672 4453 -2932 -3481 3944 2274 -4378 -1255 4381 313 -4286 629
1413 629 3633 -1723 -2738 2325 1775 -2879 -1249 3354 534 -3694 495 3382 -1529 -2527 2390 1804
1429 1804 -2997 -1127 3686 454 -3930 432 3814 -1118 -3553 1835 3309 -2860 -2801 3842 1638
1444 1638 -4480 -545 4401 -389 -4300 1031 3919 -1925 -3242 2763 2282 -3399 -1337 3985 561
1459 561 -4351 633 4233 -1878 -3117 2969 1831 -3532 -688 3979 -198 -4258 1147 3982 -2257
1474 -2257 -3362 3120 2441 -4135 -1573 4917 97 -5297 1478 4679 -2773 -3720 3417 2862 -3799 -1943
1490 -1943 4206 750 -4308 697 4220 -1794 -3903 2745 3245 -3475 -1818 3823 -70 -3580 1495
1505A495J550n237n54N197k25n101J546M564l102l599M366K688n372j558O071
1520B729j71n855J945M742k814l665K863L276l171k984M032K024m818q21N155
1535B467k33n149J303M546k580l032L452J374l609n87L683N45m115O2M359j629
1551H57l704L455K486m835j248N678k10n772J961M887l411l654M044K965m594
1566a095k609N607J478o612O37O758k733o033M193M783n114k970N664Q02n586
1581b830R41N164j709m901K269M587l497l323M982J027n771J244N528k794m698
1596c781L877L298m755j450N056q4m930Q98M961j657n116L189M567m934l017N821
1612A943J247n655K31N013j530m240K661L386l221k749L188K458l346j814L886
$$ plain form
1505 1495 3045 -2192 -2746 2451 2226 -2875 -1329 3235 133 -3466 900 3588 -1784 -3342 2729
1520 2729 2558 -3297 -1352 3390 576 -3089 -226 3050 -121 -3105 927 2951 -1867 -2688 2467
1535 2467 2234 -2915 -1612 2934 354 -2678 774 2148 -1461 -2048 1635 2180 -1935 -1873 2486 857
1551 857 -2847 608 3094 -1741 -2989 2689 2479 -3293 -1332 3555 144 -3510 534 3499 -1095
1566 -1095 -3704 1903 3381 -3231 -2594 4164 1431 -4602 -409 4374 -740 -3710 1954 2756 -2830
1581 -2830 -1889 3275 1566 -3335 -1066 3521 24 -3299 1683 2710 -3061 -1817 3711 917 -3781
1596 -3781 96 3394 -1361 -2811 2245 2161 -2769 -1871 3090 1433 -3683 -494 4073 -861 -3878 1943
1612 1943 3190 -2465 -2234 2779 1249 -2991 -330 3056 -165 -2914 274 2732 -614 -2428 1458
1627A458J67m137J825L559k959k615L100J766l004q30L088k25l143J058L254j574
1643G88l510K488L380l907k250M935N41m967P69M430j600m009K480L605l560k964
1659c351M283K215m623j348M951j48n048K330M278m036k844M553J586m325n77
1674b104M169p11l990K266L493l508k788M282J965n012o27N467j381n023L113
1689c89L799l948k663M255J905m754r75N181k50m991J386M389k334l676L464K704
1705C103m553j189M748j59m059R03L266j474k756K435K077l480j043L905M3l825
1721b058P73L648j898l149L222K020l933q03L983P9l998M54M239j380m083K513
1737c71L293l278k371L788J572m408n65M750p11m335J653L431k108k770K688K129
$$ plain form
1627 1458 1625 -2512 -687 2872 -87 -2702 398 2164 -840 -1670 1418 1193 -1950 -892 2362 788
1643 788 -2722 -234 3146 -761 -3011 1924 2465 -2502 -1733 2697 1097 -2912 -432 3173 -387 -3351
1659 -3351 932 3147 -1476 -2824 2127 1979 -3069 -739 3539 -497 -3341 1212 2798 -1527 -2104
1674 -2104 2065 1354 -2636 -370 3123 -385 -3173 1109 3074 -1938 -2565 2902 1521 -3502 -389
1689 -389 3410 -538 -3201 1054 2959 -1795 -2770 2411 2161 -2830 -1444 2945 611 -3065 399 3103
1705 3103 -1450 -2639 2109 1950 -2109 -1206 2060 586 -2170 265 2342 -1138 -2181 1724 1767 -2058
1721 -2058 -1285 2363 465 -2684 538 2558 -1375 -2178 1805 1884 -2114 -1660 2579 1199 -2884 -371
1737 -371 2922 -356 -2727 1061 2633 -1775 -2340 2410 1699 -2636 -983 2448 340 -2430 258 2387
1753B387l604j028M208l32l993J337L437k097k820L129J771m025k63M275j034
1768A348l972J819L720k664l279L754K163m564o67M669n75m554J508M433k569
1783E70l863L545K614l923j263L831L35l880N96L956j732l418K599K367k797j427
1799a890K906O12l217N03L268j722k739K391K044k627j571K978Q61l464L20L540
1815B193j494l181K171K885k686k587L401J772l908m72L827n84l547J305L477
1830B572k144l195L070K289l552j098L461J37l411Q50L400k104k909L117J884
1845B367l438r17L445P1l542J060L529k452k892L451J977l814j219M064L86m290
1861b214R18M009k248l210L021K458l487j905L965J003m206L15L754j475k961
$$ plain form
1753 2387 -1217 -2245 1963 1631 -2362 -1025 2412 315 -2505 624 2395 -1630 -1893 2382 1348
1768 1348 -2624 -805 2915 251 -3028 726 2889 -1675 -2342 2327 1752 -2802 -1294 3139 570
1783 570 -3293 252 2866 -1057 -2320 1511 1846 -2034 -1438 2518 786 -2632 -33 2334 -463 -1890
1799 -1890 1016 1628 -1589 -1086 2182 460 -2279 112 2156 -471 -2042 936 1797 -1667 -1347 2193
1815 2193 699 -2482 -311 2574 -112 -2699 702 2474 -1434 -1906 1921 1337 -2210 -905 2572
1830 2572 428 -2767 303 2592 -960 -2058 1403 1540 -1871 -1021 2379 275 -2634 483 2367
1845 2367 -1071 -1988 1457 1528 -2014 -954 2575 123 -2769 682 2659 -1155 -2374 1690 2076 -2214
1861 -2214 -1296 2713 465 -2745 276 2734 -753 -2658 1307 2310 -1896 -1581 2173 698 -2263
1876b263K161K321k765j703L387P11l504M45K980j205k362J806J954k622j281
1891a940L361K32l415O52K982j147k643J697K323k520j692L134Q66l256l56L228
1907A506j3l352P84L147j743k382K284J669k469j317K818R09l204m5L099q57k570
1924a736J496K066k138j575K960O50l436N33L111j323k560J789K203k567j636
1939b163L548N68m068N81L988j435l630K263L092l285k025M032O63m045K75L766
1955B125q15l669J593L346k657k375L333J096l430q0L383q77l242J927K561k610
1971c91j458K627N90k499j1K803p92l069J913K680k676j786K875R32l006m6L172
1988A858r86k959J713K380j859j983J860J826k401j279L024J69l022Q26K487j282
$$ plain form
1876 -2263 -102 2219 -546 -2249 1138 1849 -1655 -1210 1770 565 -1797 9 1963 -659 -1940
1891 -1940 1421 1653 -1762 -1110 1872 725 -1918 -221 2102 -418 -2110 1024 1890 -1366 -1722 1506
1907 1506 1493 -1859 -1075 2072 329 -2053 231 1900 -569 -1886 932 1841 -1363 -1408 1691 834 -1736
1924 -1736 -240 1826 -312 -1887 1073 1723 -1713 -1180 1931 608 -1952 -163 2040 -527 -2163
1939 -2163 1385 1953 -2115 -1534 2454 1019 -2611 -348 2744 -541 -2566 1466 2129 -1916 -1641 2125
1955 2125 1310 -2359 -766 2580 -77 -2452 881 1977 -1453 -1533 1850 973 -2269 -342 2219 -391
1971 -391 -1849 778 1368 -1131 -1142 1661 869 -2200 -287 2393 -283 -2069 806 1738 -1268 -1314 1858
1988 1858 872 -2087 -374 2006 147 -1836 24 1850 -551 -1830 1194 1363 -1659 -833 1654 372
2004C72k061J679J686k100j027K148L97j875p8J945l69k359J389K360k414j637
2020a944K743O84k590P2K534q17k668J653K477k154k093K335J795k796j202L570
2036A599n2l854J501L245k335k309K618J582k885q73L132j0k977Q25K554j488
2052B73k271K375J836l421p59L778p01l069J712K071k243j475K748J086l182n05
2068a747L212j61k913Q30K764j757k562K882J779l426o03L027k10k404N21K172
2084A404q72k093J383J689j762j147J986O77k379m7K650r01k125J627J032j700
2100e78l01J657K14j986q0K358l82k245R85J839j627j519K440J036l120j60L013
2117A544o20k350Q80J927j030k025J623J929k373j291K754M65k808K84K811j105
$$ plain form
2004 372 -1689 -10 1676 -424 -1451 697 1094 -781 -859 1086 717 -1642 -253 2107 -307 -1944
2020 -1944 799 1483 -1107 -1035 1499 682 -1986 -333 2144 -10 -2103 232 2027 -769 -1971 1599
2036 1599 1547 -2307 -806 2439 104 -2205 413 1995 -890 -1763 1369 1359 -1618 -793 1761 273
2052 273 -1998 377 2213 -1208 -1967 1811 1110 -1959 -247 1824 -419 -1894 854 1940 -1242 -1747
2068 -1747 1465 1304 -1609 -779 1985 228 -2334 548 2327 -1099 -1702 1325 1115 -1289 -768 1404
2084 1404 532 -1561 -178 1511 -251 -1398 588 1265 -1114 -1161 1489 588 -1537 90 1122 -578
2100 -578 -879 778 992 -994 -1074 1284 902 -1343 -358 1481 -146 -1665 775 1811 -1309 -1469 1544
2117 1544 924 -1426 -546 1381 351 -1674 -51 1878 -495 -1786 968 1433 -1375 -1091 1720 615
2133F15k475J907J560k174n69K036O0k116J94K531q29k556J717J825k373q27K745
2150A271l3l066Q76L026j716k318K162J391k169q98K386O04k903J07L119j124
2166G15k626J836J882k152j284K406N26k462L99K052j004j564J116J463j282j490
2182a469J832Q98k198J34K057r30j773J320J679j664j379J964P20j916j39J789
2198I25q9k039M41K443j248k228J950J448k107q09K060M06k249K20K236r75j840
2215a455J383J441j520j306J911Q85k347J22K270j148j736J680J319j906j073
2230a480K241N21k433L80K181j053j902J455J872k053j624K696Q01k834J42K448
2246A358o96k137J115K016j744j616K274Q78k259l30K095m9k058O85J902j549
$$ plain form
2133 615 -1860 47 1607 -567 -1136 900 960 -1156 -962 1569 740 -1816 -99 1726 -647 -1474 1271
2150 1271 1238 -1828 -952 2074 358 -1960 202 1593 -576 -1474 912 1516 -1387 -1280 1839 715
2166 715 -1911 -75 1807 -345 -1629 777 1303 -1159 -760 1292 288 -1276 -160 1303 21 -1469
2182 -1469 363 1261 -937 -803 1254 324 -1449 -129 1550 -114 -1493 471 1191 -725 -864 925
2198 925 836 -1203 -762 1681 433 -1795 155 1603 -504 -1313 747 1153 -1096 -876 1360 385 -1455
2215 -1455 -72 1369 -151 -1457 454 1339 -1008 -886 1384 236 -1500 180 1499 -407 -1480
2230 -1480 761 1282 -1151 -771 1410 357 -1545 -90 1782 -271 -1895 801 1602 -1232 -1090 1358
2246 1358 662 -1475 -360 1656 -88 -1704 570 1448 -811 -1141 954 905 -1153 -468 1434 -115
2262a15j253K009M83j933j11J834j98j876Q42J616j565r93J863N26j953l07K196
2279A065j27k282Q50J893j384j300J545J049j779q92K212L76k308K56J958n59
2295E73j685Q05J568j327j278J884O02j984p1J803j96j729N74J649j286j150J852
2312F04M39j952J0J959l09k073R50J893j711j197K081N46k197j38K391l34k538
2329a576J089K154j696j432J883Q61k010m68K326j75k412R26J947j338j323J447
2345B03R32j688m41J997l34j898R62J486j173j163J287R51j660m08J935l87j794
2362a193Q53J540j024j457J297J272j722o67J848J8j665L00J641n33j728J008
2378b12J523j439r12J426M58j328k28J508k40j628Q65J338j210q97J198O35j312
$$ plain form
2262 -115 -1368 641 1124 -809 -920 914 716 -1160 -318 1298 -267 -1260 603 1129 -824 -1131 1065
2279 1065 938 -1344 -494 1399 15 -1285 260 1309 -470 -1362 850 1226 -1082 -826 1132 573
2295 573 -1112 -307 1261 -66 -1344 540 1142 -842 -913 890 694 -1035 -461 1188 -98 -1248 604
2312 604 1043 -909 -899 1060 751 -1322 -372 1521 -190 -1387 694 1240 -957 -1095 1296 962 -1576
2329 -1576 -487 1667 -29 -1461 422 1283 -727 -1195 1131 956 -1456 -530 1417 79 -1244 203
2345 203 1135 -553 -994 1003 669 -1229 -267 1219 46 -1117 170 1121 -539 -947 988 601 -1193
2362 -1193 -340 1200 176 -1281 16 1288 -434 -1101 747 765 -900 -600 1041 508 -1220 -212
2378 -212 1311 -128 -1040 386 844 -484 -712 796 556 -1072 -207 1131 -79 -976 222 857 -455
2395d55l51J627l09j659R60J338j234j086J365J008j707o25K061j50j961P90J700
2412A312j101j606J440J481j912r30K107J61j891L19J729o97j769J306J495j883
2428d39p81J926P5j665L68J528q26j441J483R78j840l43J783n0j681L64J741r97
2446A83j528J715Q89j965l08J828Q2j791J60J798o99j460J125R71j241p88J395
2463C66P02j688k83J729l43j281O79Q37p31p51R40O69j243l08J289r0j130K68
2481c69J131n98j131J173P31j604q1J527k54j338K71J409n15j399J048J049j455
2498d05o09J657L94j880r2K057n64j701J134J025j259o56J298N80j582l16J803
2515H84k93j625Q17J248j157r55J537N33j897K29J792q85j331J059J047j066r68
$$ plain form
2395 -455 -806 821 512 -1147 -187 1151 -83 -1169 196 1204 -503 -1128 933 783 -1178 -388 1312
2412 1312 211 -1395 45 1526 -386 -1316 791 952 -939 -620 1109 412 -1357 -51 1444 -439
2428 -439 -1220 706 781 -884 -516 1012 186 -1255 228 1206 -634 -977 806 756 -925 -561 1180 183
2446 183 -1345 370 1259 -706 -1014 814 896 -895 -735 1063 364 -1096 29 1000 -241 -1029 366
2463 366 1068 -620 -903 826 483 -798 -119 718 -13 -764 176 845 -398 -706 583 493 -637 -369
2481 -369 762 164 -967 206 937 -667 -748 779 525 -813 -542 867 352 -1047 1 1050 -405
2498 -405 -1014 643 1037 -843 -935 1122 558 -1143 -9 1016 -243 -899 399 979 -603 -919 884
2515 884 591 -1034 -217 1031 -126 -1081 456 989 -908 -679 1113 228 -1103 -44 1003 -63 -1031
2532a031J395O43j822O7J929o78j773R76J604j300j186J659L86j690K97J402m58
2549D20j280M27J368p33j194J194O27j411m8J359k83j313O57J116j055o48J157
2566C60K44r56j93Q99K28j202J84J404q54j199J190Q90j215o84J277L14j332K22
2584d23J210n21j098M80J274n98j374J092R56j514j80J514l63j338O22J183q73
2601D9r19J163M30j196r2J113j9j290L62J451j109j162J721N26j793j0J561k86
2619E00j428P32J246j187r51J397P59j400o85J545L59j758M35J585j151j068J330
2636B60O40j210m42J198J19j217L47J014o08q33P26P96j064n77J494l0j522O59
2654b50J063q16o69Q23N36j038l78J303J05j326Q2J213j68j226N55J126j173o66
$$ plain form
2532 -1031 364 1007 -815 -748 1181 503 -1270 -294 1310 10 -1176 483 869 -821 -524 878 420
2549 420 -860 -433 935 202 -992 202 829 -582 -630 729 446 -867 -210 906 -149 -797 360
2566 360 604 -352 -545 354 582 -620 -436 968 114 -1085 105 995 -220 -904 373 687 -645 -423
2584 -423 787 266 -832 -352 922 324 -1050 42 998 -516 -696 818 455 -883 -261 922 49
2601 49 -870 293 723 -473 -565 548 529 -761 -399 1052 -57 -1219 502 1028 -765 -775 786 500
2619 500 -928 -196 1050 -137 -1088 309 1068 -332 -1017 528 887 -871 -436 1149 -2 -1070 260
2636 260 900 -310 -752 446 565 -652 -305 709 101 -732 -6 790 -274 -851 643 613 -909 -250
2654 -250 813 -3 -672 151 687 -351 -729 574 679 -647 -565 648 480 -746 -191 935 -238 -904
2672i04J413J90j196p8R89J03j046J67J053n92q27Q23O48r52n49J242J51j400
2690g65M60J117q06o72Q00M99r04m27J269R6j498L29J388o48j148Q95R49j316
2708c82n41J693q7j608M94J271n29j095O62J013j087o40J410J21j396K33J253
2725G85m60j174Q31Q86j193l08J176j45r75K49R84l79j116P60R31j084m76J088
2743C80J60j069N1J222m19j228Q05R28q74o26P53N52q73l75J176p3j229M76R77
2762G14n69q03O25P14q94l75J039j03q99L34P81l92q39O11Q19r97m10J119n4r96
2782e75K97R77m93j072Q64R23j176n25J156K43j120n4J265l13j356Q38J101j111
2800a31p26J091N09j113k75J290k48j211P30R16r24o36R51M94j114j65J240m26
$$ plain form
2672 -904 509 699 -497 -575 414 517 -529 -362 691 99 -728 95 743 -209 -758 484 635 -765
2690 -765 -305 812 6 -666 134 633 -271 -698 571 667 -831 -502 886 238 -910 -15 934 -382
2708 -382 -923 770 683 -925 -431 840 311 -784 -122 891 -196 -836 574 695 -701 -468 785
2725 785 325 -849 -18 868 -325 -633 543 398 -577 -328 656 277 -839 -79 852 -232 -708 380
2743 380 540 -529 -478 744 325 -903 -98 830 -44 -670 83 635 -238 -613 563 490 -739 -263 714
2762 714 145 -658 -33 681 -213 -588 451 348 -551 -217 564 172 -667 -56 763 -234 -644 475 421 -575
2782 -575 -278 699 206 -866 -2 921 -255 -780 376 619 -501 -555 710 397 -959 -121 980 -131
2800 -131 -857 234 743 -370 -645 645 397 -814 -84 832 -92 -728 223 717 -397 -562 678 252
2818B52j004Q08O66r34n20J060L90j293J1J278m94r66P20P22q28o72J095M87j311
2837e33q3J209k37r11L23Q34m86q08Q34N65j024k18R10Q1q06k8Q62k84p88O56
2857F8M98q13k52P64K29q71j10J042l18q81O59N65p69m11Q85M03j183j15J291
2876F81l37j041N76P76o62p13R38N61j275j49J296k25j071L84R09n45q25R13N15
2895G06j199k7J131k38r75L36R56o10q11R90L91j161N2J072k13j083L74J118p49
2914F0q75J054L95j080o9J012m1j128K98J153o75q70Q58M87q00k82Q56R9j019
2933e67L02R41o16o23O16M06n37l40O94J18q91K87Q13n45n95N19N56o27m81Q47
2953B77J53q99J97P40k70p12K68Q90n47q25Q54N02r19j76Q27M6r03J76J002n46
$$ plain form
2818 252 -752 56 722 -212 -732 328 718 -575 -564 714 220 -746 -26 696 -132 -804 291 778 -533
2837 -533 -616 593 356 -555 -232 602 116 -692 142 707 -317 -535 375 456 -350 -378 484 200 -588 68
2857 68 566 -247 -499 265 494 -377 -487 555 237 -644 15 580 -189 -600 285 688 -495 -610 681
2876 681 344 -697 -121 655 -7 -720 218 779 -496 -645 651 426 -645 -261 648 103 -722 191 706
2895 706 -493 -520 611 373 -602 -266 690 80 -731 259 650 -511 -459 613 400 -683 -309 809 60
2914 60 -815 239 634 -446 -515 497 456 -672 -374 779 104 -766 92 579 -221 -503 353 452 -567
2933 -567 -265 676 60 -563 53 459 -78 -418 276 394 -497 -210 603 58 -537 -18 538 -89 -570 277
2953 277 430 -469 -272 468 198 -514 -246 644 97 -728 126 628 -291 -467 360 406 -497 -321 681 135
2973A35q26P33N27o63m00P04K64r54J47J045o42p90Q27M84p99k97Q97J3j006M27
2993a74Q77p29o20P62N47q62m99J150J15j245L95R97o87o87P47N78r10m35J077
3012C97J00r53J46P18k25o77M12P39q18n16J062P8q67J95N91k59n45M45N07p14
3032a84k95P66R7o50j02P28n1q91M81P25q09l33P86J04o71r8P43Op99K08O59l31
3054H9m89L98M95o39m37R76Q4r49K65N87l13l63L00M17n39l80P85J74q05QP29
3075C93j40p90M56P56r13l67J025l8q49J76P52j88q35L92Q15p01n33Q53K23r03
3095d16n0J057k47j063O36O89p80k10O40L3o00l7Q00j52q65M51O22n89l44O57
3115B32J97q43N8R56m43p19O13L77m80l20M31M19o76k65Q46r8p43K81O64l78o76
$$ plain form
2973 135 -691 42 569 -94 -494 210 474 -480 -333 712 70 -720 107 591 -208 -505 392 405 -601 -174
2993 -174 703 -26 -646 116 663 -199 -698 452 567 -678 -283 714 27 -660 87 665 -245 -680 397
3012 397 497 -456 -310 408 183 -494 -82 657 -161 -677 385 463 -404 -209 382 123 -422 23 530 -184
3032 -184 -479 287 384 -266 -368 360 309 -582 -101 624 -185 -518 268 372 -299 -397 346 352 -447 -239 420 89
3054 89 -400 -2 493 -146 -583 393 477 -472 -207 380 67 -296 4 421 -118 -498 287 461 -344 -336 393
3075 393 253 -537 -81 675 -238 -605 420 382 -467 -291 461 273 -562 -170 645 -56 -589 264 487 -416
3095 -416 -466 591 344 -719 -83 606 -174 -384 256 289 -311 -348 452 300 -565 -114 508 -81 -425 232
3115 232 429 -414 -356 600 157 -562 51 428 -52 -372 59 478 -198 -463 383 285 -458 -177 487 109 -567
3136e67N34N55o81j85N68o8l93M0N02l6p22K91O59n37l13N40Q0n30M4O58k85o43
3158d89N25L74n32j71M12K13n42j95Q27j60q49N35O04o46m46O78L81q10j44Q48
3178D13k11o45L49N19l25o53N28O62q24l06Q68j43o56L36N54m36n64O45L84p76
3198b81l1O26j32n00J47O27l71o64P49L71q93MP23j24o04J64O26l94n06O19K41
3219C97n93j54N16K18o31r0P16k82m94M88K03m17j75M04K35n31p4N27j48l41J90
3240c6K94k20l96M57L53p24k8O38j77m33J58M20k34m84M98L31o70r2O00L9n92
3261b98j0P02k55o27N79L15o43p8N55P6n95j5O93k79n31N07K39m98j44N41J22
3282C56p28J14P48m34m77N21K28m74j95N75J31p72J51P27l72n07L74L99l85l93
$$ plain form
3136 -567 -33 522 -159 -344 224 156 -237 -197 305 269 -453 -162 497 -40 -353 187 267 -263 -219 439 154 -489
3158 -489 36 410 -122 -293 119 332 -210 -405 422 262 -587 -52 552 -94 -540 138 519 -291 -435 413
3178 413 202 -443 -94 425 100 -553 -25 637 -187 -493 375 232 -424 -88 466 30 -534 111 495 -281
3198 -281 -312 314 182 -318 -171 456 85 -579 170 541 -352 -348 375 251 -353 -189 437 43 -463 156 397
3219 397 -196 -350 166 384 -247 -337 379 97 -397 91 294 -123 -298 106 341 -190 -264 263 115 -226 -36
3240 -36 258 38 -358 99 452 -272 -300 338 161 -272 -114 306 72 -412 86 417 -253 -345 255 294 -298
3261 -298 -308 394 139 -488 91 406 -237 -315 240 316 -279 -294 399 120 -411 96 335 -163 -307 234 356
3282 356 -372 -258 490 56 -421 100 328 -146 -341 234 365 -407 -256 471 99 -408 -34 365 -20 -413
3302d13O07J76p40J53N83k45m33J85M46k81l91M76J38n14J15L82j34l67J32M46
3322C21l01l31M55L4l71R3K95o5l87J44M83l61l33M33J36l33j22L60J07n47J06
3343a84N65l34l93L03L31k67l73M22K49o03O0N44k24m21K15M48k78m63N24K00
3363C21n64R5M44j88m12K34M95m45m09O40R2n78J26M49j83m91L15N32n73l39O69
3384B30O8n28J2M50m5n44K57N41n43k81N44J10m17j04M18L7m96K36L73l97j58
3405b37L34J41l11j95M48K9m71K34K67l10j22K48J97l42j99M94Lm36J47K68j35
3426E2k54J65L47l81k54N24J1l86L4K69jl35J23L63l52j92M01N4l25q3L65O6m76
3449b65J86L96m22j32M07M7l60r9M67K3n55K34L96l51k43L62K34m83j83O63o8
$$ plain form
3302 -413 194 370 -370 -217 366 121 -312 -127 319 38 -353 123 261 -253 -138 244 110 -257 -125 321
3322 321 20 -311 144 178 -193 -100 195 130 -257 -113 370 9 -324 109 245 -88 -210 150 257 -290 -184
3343 -184 381 47 -346 -43 288 21 -352 70 319 -284 -224 320 96 -325 -110 338 60 -403 121 321
3363 321 -243 -148 296 108 -304 -70 425 -20 -429 211 303 -275 -149 300 117 -374 -59 473 -100 -439 230
3384 230 298 -230 -218 232 187 -357 -100 441 -102 -383 161 271 -146 -250 168 205 -291 -55 318 -79 -237
3405 -237 97 238 -73 -268 180 209 -262 -28 239 -71 -193 55 252 -90 -289 205 208 -228 -81 187 52
3426 52 -202 -37 310 -71 -325 199 210 -176 -142 127 126 -209 -86 277 -75 -267 134 188 -137 -220 145 211 -265
3449 -265 -79 317 -105 -237 170 217 -143 -242 225 248 -307 -73 323 -28 -271 91 325 -158 -341 322 254
3470B54o26L00L72l09k59K86K81m27j81N77q0m83K06L36j96l08K92K50m86RN00
3491C08k62l01K53K07j62k71K69K03m16L1L99j75l14J45L58j98l70L64J73m10
3511a69O6K53o8j86n2L41l9m03K21K67k53j49J90J53k66p4L68j54k76K56J16j27
3533A5j63R2K55k64j27M11j53l39K54K73k25l02L24K19m35J6L88j73k52J13L12
3554B39j19m51L25L54m97q9M37n0l59O9L94k17l42L89J57l79m0K44R8k81o8M29
3576B43k01l62M39J69m43l6L52Pl40J06L36l31j78L58O3k34j53K77J67m34N9M06
3598B70k93k03L04Q3k29j03K76L8l12J06J92j19q2K2J66r7k30L35O4l98J18K44
3620A52j06j35M1J77j56j55K94L5k63l2K16J29l37l1M27k26k97L81Q6k97n7K44
$$ plain form
3470 254 -372 -72 300 -9 -268 18 299 -128 -309 268 188 -295 -89 247 51 -257 35 285 -201 -192 308
3491 308 46 -255 -2 205 43 -228 41 244 -172 -141 258 83 -231 -86 272 74 -296 68 241 -169
3511 -169 -103 150 82 -104 -156 185 146 -257 -36 231 -22 -171 19 172 -94 -168 200 46 -230 26 142 15
3533 15 -148 -56 199 -65 -192 219 66 -273 -19 254 29 -273 51 270 -165 -149 239 66 -186 -73 239
3554 239 120 -331 -6 348 -149 -238 199 149 -210 -141 253 36 -306 83 240 -139 -179 65 163 -118 -186 243
3576 243 42 -320 119 288 -155 -191 161 168 -172 -66 270 -61 -239 119 182 -52 -205 72 239 -195 -136 270
3598 270 -23 -226 78 161 -68 -171 105 143 -169 -63 129 10 -72 -50 116 19 -211 124 188 -210 -92 152
3620 152 46 -89 -48 129 -27 -182 112 147 -116 -148 68 197 -140 -171 256 30 -267 114 200 -97 -154 90
3642I0J17l51jL70j68k37J69J80j89k05L34J13m98J54L83k77j73K25R1j98j04
3663a75L28Jm15J72L37j93k51J82K70l20j89N01q2m39K42K51j75k09J16K75k61
3684c4j68L38j3k72N3K42m4l22J69K99l49o7K89q4j29N2J37l8k52J74K34k62j02
3707a49K06N3j87k6K73r5l23K83J79k73p0J52J27j69j55L08Ol25J27K41j44k30
3729a91J61K54k65j71L45j2k64J01J57n0k28J20K89k86j96L48J5k61M2K54r9l19
3751b56K76K50l94o8L30j7k35mK94q2l60L00K34l83o3L23K5k91j3L54j63k90L14
3774H1J01k95k6K25N8k70l0L32j38k39K49P4k12m7K19Q3l15J9L24j53j91J71R2
3797A12j06j65K18J52l48KL13j09j89O6J86o8k38K17J35k91OK21k9j66l5K53o5
$$ plain form
3642 90 207 -144 -145 225 57 -180 -11 169 -20 -225 109 222 -276 -122 261 -16 -189 36 127 -71 -175
3663 -175 153 154 -261 -89 248 55 -196 -14 256 -64 -253 248 166 -273 -31 220 45 -164 -48 227 -34
3684 -34 -202 136 123 -149 -96 146 102 -220 -51 248 -101 -168 121 37 -92 -40 97 59 -193 -19 215 -47 -149
3707 -149 57 110 -77 -103 170 75 -248 35 214 -59 -129 23 150 -19 -174 134 140 -185 -58 183 39 -191
3729 -191 -30 224 -41 -212 133 121 -143 -42 115 65 -163 -43 246 -40 -236 112 127 -134 -92 162 63 -256
3751 -256 20 270 -124 -192 138 121 -114 -118 176 94 -266 34 268 -115 -178 145 170 -121 -134 220 57 -233 81
3774 81 182 -113 -139 86 144 -126 -156 176 38 -201 48 122 -90 -137 82 165 -150 -131 193 40 -151 20 112
3797 112 6 -159 59 211 -137 -135 178 69 -120 -54 132 64 -174 43 178 -113 -107 114 85 -81 -116 137 72
3820G2k56K30J08k63K3J90Lk32LL19j53k48K54Q9k22n0K17Q0l22OM08j99k75K39
3844B1J43j76j59K54J23l75L1L82j70k59J69J87j50k18K71J21l71R1K85j68k06
3865a74J48K13j97j98L13L1l33J51K08j43j99J46K49k58j87L75j6k88J07J86o9
3886F5k24J22K72k52j68K89L0j89l7J72L3k59R8K68k48j29J99P6j44j09J94P2
3908A31k84J03K17j89j20J45J46j64j89L08N1l44J35K18j61j48J15K35k36k16
3928b47L79L8l33P7K29p5k51J42K85l02j73L80J1k92L8K07rk86J35K82l09j38
3950b12L40J6k75rL04n6l28K17K17l20p1K92K2k53o1L46l2l78K10K53k79j15K50
3973G8J06k98o3L74q7l23K09J51j57j08J53J43k71q2L82j05k92J72J61j40j66
$$ plain form
3820 72 -184 46 154 -109 -86 104 107 -125 -122 197 44 -204 50 139 -83 -133 84 164 -158 -152 256 57 -218 21
3844 21 164 -12 -171 83 206 -169 -138 244 74 -185 -16 171 21 -197 74 195 -176 -85 200 32 -174
3865 -174 -26 187 -10 -208 105 136 -197 -46 162 19 -180 -34 215 -43 -230 145 129 -159 -52 134 65
3886 65 -159 -37 235 -17 -185 104 134 -55 -92 80 113 -146 -48 220 -28 -157 42 118 -26 -135 59 131
3908 131 -153 -50 167 -22 -142 3 149 -15 -204 104 155 -189 -54 164 3 -145 -30 205 -31 -247
3928 -247 132 170 -163 -86 143 68 -183 -41 244 -58 -231 149 160 -132 -94 113 104 -182 -47 235 -74 -212
3950 -212 128 144 -131 -140 164 108 -220 -3 214 -106 -177 115 137 -116 -177 169 137 -241 -31 222 -57 -172 78
3973 78 184 -114 -177 197 110 -213 -4 147 -10 -118 35 178 -93 -175 207 102 -190 -18 143 3 -163
3994a63J88J46k94j9L07j20j97Q0K02n8k91J99K34l19o4L14l6k58L2K85n4l31
4016b17K10K07k41q4K01P5k48q1L81p1l85K53K08k66q2K08R8k95j8L59j48k86
4038b22K32J74j98j84K62J59m03J2M29k27k82K54J93k18k02K73J63l61J2L18j32
4059E2k32J30K72j97k91L41J59l91M7K77j21j85R6K34j65k50K87J14k92oK34J3
4081A26k87O8L37k65k13L35M9k73rK18N3l00L1L28j94k19K59J44k38j59K96J24
4103B11l81N8L26k25j44J74J52j76k00K79J35l43K6K96j19k33J31K37k39k07L70
4124A28N3l76Q4K60o5k41O6L14k22k48L46J11l68j5L39j6l56J15L41k94j67L31
4146A20L0k64l4K73M7l70J14L24k62j78L03O8k79n6L39m3l64J99K51k54j18J84
$$ plain form
3994 -163 25 171 -123 -142 165 45 -152 -72 130 72 -219 -20 214 -105 -169 145 109 -149 -117 168 114 -217
4016 -217 -7 200 -41 -125 76 151 -97 -178 203 132 -253 0 208 -58 -140 68 166 -129 -147 212 64 -222
4038 -222 10 184 -14 -198 64 223 -180 -168 261 34 -248 6 199 -19 -221 52 215 -146 -134 184 52
4059 52 -180 -50 222 25 -266 75 234 -157 -110 167 46 -139 -43 191 26 -224 63 177 -115 -121 113 126
4081 126 -161 -93 244 -21 -234 101 150 -123 -132 86 139 -161 -130 198 4 -215 44 188 -50 -209 87 211
4103 211 -170 -112 214 -11 -155 19 171 -5 -205 74 209 -134 -108 188 69 -164 -33 204 -35 -242 128
4124 128 181 -195 -111 149 84 -157 -91 223 1 -247 99 210 -158 -173 166 150 -206 -91 250 -44 -211 120
4146 120 150 -114 -148 125 172 -198 -84 240 -22 -200 103 171 -108 -164 175 132 -232 -33 218 -36 -154 30
4168C0J30k15j51L59kl87J77K77j99k11J64K18k56j25L30j6k94R1K27n2k51R2
4190f4K90k45j79L32jk81O8K38n5k83J53K48k81r7K52L1k26m1K83k4l66K06K90
4213B48l12j48K87Q4k65o9L40n7l52K10K55k24j94K03J99k77j45L93m2l62J99
4234b9K23j87j99K02K07k88j11L60o7k91J21K46j46k59K40K32l80o5L74q7k55
4255a59R8K41j24k94K59K22l60o0K94J4k57mL02r7l22K84J73l02p2K45O1k43n1
4278a52L18q5k82K18J73k54q2K04J43l10o4L75j12k75J84J63j62j87K22J82l38
4299a21o8L80r7k73J15K34j22k70K42K09l80l5L42o5k37N2K55r3l00K75J77l57
4321a37j5K96pk77L4L26j56k95L02J35l15l2K62L9l22J7L76j86k89K76J53k45
$$ plain form
4168 30 160 -55 -206 153 151 -236 -59 218 19 -192 -28 190 -66 -191 139 123 -171 -80 147 95 -156 -64
4190 -64 226 -19 -198 134 133 -148 -80 158 103 -180 -27 221 -60 -157 95 126 -100 -141 142 118 -248 -42 248
4213 248 -64 -212 75 159 -106 -175 165 108 -244 -34 221 -3 -197 6 205 -72 -217 176 134 -228 -29
4234 -29 194 7 -192 10 217 -71 -182 178 111 -180 -59 187 41 -218 22 254 -126 -191 183 96 -159
4255 -159 -61 180 56 -238 21 243 -117 -177 117 131 -126 -130 172 75 -247 37 210 -92 -164 81 142 -101 -152
4278 -152 166 81 -201 17 190 -64 -146 58 201 -109 -173 202 90 -185 -1 162 0 -187 35 217 -121
4299 -121 -189 191 94 -179 -64 170 48 -222 20 229 -151 -186 156 91 -146 -94 161 68 -232 43 220 -137
4321 -137 -152 144 137 -140 -106 220 64 -231 71 206 -109 -141 121 160 -162 -145 231 45 -244 32 185 -60
4343f0j15K65R6l55J4L85j78k58K07J57j76j69K51J33l55L7L25j59k18J40K01
4364A68j49k28K81J19l48O1K72j08k17R8K61j84k44L09R5l21J7K58l5k61O2L20
4386B26k06k57K90J17k60m1K25O2l26M2L51j95k38K23J62k14j26K34J09l41M2
4407a21L47j98k15J96J81j95j94K96R9l63P0L20j85k27J65K46k30k24L50O6l67
4428a83O8K83j12k39J30K92k69k22L63O7l40M3K55k6l00J27K91k50j88L14O1k67
4450a02l5K74%l21J23L02k75j62K80Q4k41r9L05L3l60J25K83k20j79K15J62k53
4472f1j52L57K2l56J19K60j55k05J55K16k46j67L36L9l38Q1K57r0k53J53K55k87
4494f0j49L59Ql18M8K75m7l25J61L16l11j72L33P0l12m6L54m4l82J85K99k87j48
$$ plain form
4343 -60 -175 90 186 -169 -155 230 52 -206 1 158 -18 -187 64 197 -158 -121 204 45 -173 -33 168
4364 168 19 -209 72 191 -157 -96 176 68 -149 -51 210 26 -218 91 186 -135 -118 140 105 -156 -94 226
4386 226 20 -237 53 170 -90 -131 94 156 -170 -128 223 28 -210 13 175 -39 -165 69 178 -163 -121
4407 -121 226 28 -187 9 190 -5 -199 97 196 -167 -97 223 38 -189 -24 222 -8 -232 118 184 -183
4428 -183 -115 168 56 -183 -53 239 -30 -252 111 178 -162 -119 136 110 -190 -63 228 -22 -210 104 165 -102
4450 -102 -137 137 137 -184 -61 241 -34 -196 84 168 -73 -172 133 166 -194 -69 214 -6 -185 30 192 -61
4472 -61 -213 144 166 -190 -71 189 34 -171 -16 200 -46 -213 123 162 -176 -95 162 72 -181 -28 227 -60
4494 -60 -209 150 158 -160 -112 163 116 -209 -48 268 -43 -215 118 188 -124 -170 184 140 -242 -57 242 -45 -193
4517a93K64J10k88q6L49rl99J87K83k38j78K36J51k90q1L80q1l36J82K48k02j76
4539a67J94J84l10r6L98p8l39J53K74j66k51K21K22l48p8L44l3k87N4K78p6l31
4561b38K11K78l17j36L14K3k67j1L13p7l35K22K38k68j34K54R8k68o3L61r2l59
4583b53K39K57k81j54K57J36l20n8L73q8l34J99K43j94k52K48K38l78q1M07j06
4604I8l08J58K60j85k57K70J92l47o4L31l8k77P7K90j52l11L15K00l74o0L26%
4626A44k91L7L29j52l21L03J82l05j11K95Q3l43JL89j77l17K87J69k78j12K68
4647H0R6l24k3L62j16k83J83K09k02j99K85J45l92K0L56j34k52J60K14j70k40
4668b25K98J43l66pL31n8k96R0L18j97k81L23J53l59k9L07j4k97L5L56j79k97
$$ plain form
4517 -193 71 181 -107 -193 156 147 -252 -65 218 -20 -198 38 189 -101 -182 198 117 -219 -37 211 9 -167
4539 -167 27 211 -99 -195 203 125 -214 -61 213 47 -204 17 239 -109 -187 157 124 -163 -109 169 93 -238
4561 -238 -27 251 -66 -202 112 135 -132 -143 170 93 -242 -20 218 -50 -184 70 168 -100 -163 198 106 -253
4583 -253 -14 243 -38 -192 65 201 -119 -177 196 108 -226 -27 216 22 -230 18 256 -122 -203 204 98
4604 98 -210 -52 208 23 -234 36 228 -119 -183 148 110 -167 -90 200 48 -263 52 252 -122 -182 144 144
4626 144 -147 -110 219 67 -254 49 231 -74 -185 110 193 -150 -149 240 63 -254 33 202 -76 -188 80
4647 80 176 -148 -171 191 75 -208 -25 184 -18 -217 68 213 -179 -159 197 63 -189 -29 185 15 -225
4668 -225 73 216 -150 -157 174 116 -180 -90 228 31 -250 73 226 -133 -162 145 131 -166 -131 225 46 -251
4690b51K87J72l18q4L21L9l64O0L80k26k57K82J46k70j03L07N5l79O9L77k04k73
4712b34K51K01k82j59L56O7m02Q3L42j66k50J70K35k31k14L27J10l80M7L13j01
4733H3k84J35K92k42k27L26Q5l19K4K74m1l04J12L18k35k36L23R9k99l5L17l1
4755A35l32J23L24k46k14K68J40k63j15L19L7l80J15L32k28k25K23J88k60j52
4775b11L47M4l78J09K92j60k53J89K34k59k00L68O4l73P6L02j31k77J85K72k95
4796e5j92L79M4l38L5L12q6l37J98L07l09j88L49O4l09j5L07m9l38J74K87k87
4818d7j64K79J23l06p1L34j9l60J88K47k42j56K39J43k89j01L63k5l54J57K63
4839B02j86k18K20K12l19j26L80j0l41J04K75j31k65J96K48l16j35L61Ol14M9
$$ plain form
4690 -251 36 208 -110 -194 127 166 -198 -138 242 16 -241 41 187 -83 -186 121 176 -203 -134 243 39 -234
4712 -234 17 218 -64 -223 133 200 -202 -119 223 57 -193 -23 212 -19 -233 94 204 -176 -129 184 83
4733 83 -201 -66 226 -16 -243 83 168 -151 -127 147 106 -198 -86 232 -3 -239 84 183 -116 -151 166 135
4755 135 -197 -74 250 4 -210 58 198 -65 -180 139 176 -204 -89 243 15 -210 13 201 -59 -211
4775 -211 136 180 -198 -89 203 43 -210 -21 213 -46 -246 122 186 -187 -111 191 60 -217 -32 240 -55
4796 -55 -247 132 176 -162 -127 185 99 -238 -40 267 -42 -230 119 183 -126 -141 166 117 -221 -47 240 -47
4818 -47 -211 68 191 -115 -186 148 129 -231 -43 204 -38 -194 45 188 -101 -202 161 136 -218 -61 202
4839 202 16 -202 18 230 -89 -215 165 155 -186 -82 193 62 -203 -7 241 -75 -210 151 157 -157 -108
4860a08K80q2l26K14K52l00j38L19L7l03J6L09o7l50K23K42k73j39K87Q7l18l8
4882a76L73p6l63K09K62k60j68K63J48l40o0L96q7l63J94K75k04k31K37K03l40
4903a08q4L84p8l20J44K55j59k56K49J86l34o7L39l6l00R3K96j56k91K68J94l24
4925a05p0L19j4k92M6L18j37l09K62K01k85j04K72N6l02ML49j36l02K31K16k52
4947c4j66K66J23l33k2L67j24l00J88K33k21k16K90J50l42l2L53r8k81J41K70
4968B12j99k66L04K00l71n4L48n4k99J07K99j81k98L05J71l25o1L11ok99N6L20
4990B20j86k85L11J49l06p9K96K9l27O2L29j77k76K66J70k66j24K98Q0l70M9L60
5012B23j74k75K31K07k44j74L00J15l59QL47j20k75J57K39k05k27L15J20l53J8
$$ plain form
4860 -108 172 90 -236 -22 230 -70 -208 111 148 -155 -139 170 103 -247 -24 218 -55 -194 93 180 -138 -176
4882 -176 197 121 -242 -33 229 -31 -199 64 212 -128 -188 208 121 -242 -48 227 23 -208 29 232 -108
4903 -108 -192 192 114 -206 -62 193 34 -222 27 213 -121 -188 151 115 -185 -92 204 48 -243 25 219 -105
4925 -105 -175 144 130 -162 -116 202 65 -244 18 219 -66 -170 102 158 -144 -140 209 73 -229 2 218 -34
4947 -34 -200 66 189 -144 -166 201 77 -223 -35 198 -23 -239 51 201 -141 -173 180 82 -199 -58 212
4968 212 13 -253 51 251 -120 -174 174 120 -179 -72 227 46 -252 53 224 -101 -162 149 143 -156 -100 220
4990 220 34 -251 60 209 -97 -176 120 149 -178 -116 213 36 -240 26 196 -70 -194 104 184 -186 -137 223
5012 223 49 -226 5 212 -32 -206 94 209 -150 -142 205 85 -190 -33 206 1 -226 89 209 -144 -126
5033a26K98q5k62J19K72k09k27L04J11l32k3L13l0l19J13L26k39k32L00J17l04
5054a15n7L18J8l66Q2L56k02k67K73J77k81j29L37M8l78P7L33j82k54K28J86k53
5076e1j68L24Q2l84P6L38j69k64K03K30k74j71L40N3l51Q1K90j11k84J58K81k59
5098c0k09L53O7l35K0L03p0l10J60K92k62j83K84R4k93m0L03j4l38J39L11k65
5120b3j92K88J26l06p0L28j9l37J35K93k22k15K30J91k90j36L66K6l86J20L11
5141B18j87k45K18K27l00j50L55K6l36O6K97j09k92J93K62l08j58L58K7l17L9
5162a16L00r8l04K00K46k92j53L20Q4l34k1L43p8l51K20K73l03j59L14J00l18
5183a27n2L44n0l32J73K66k31j97K69J53l18q4L67n6l33J64K43j98j93K35J63
$$ plain form
5033 -126 172 87 -175 -56 216 7 -220 84 195 -137 -160 153 123 -196 -83 243 4 -228 72 189 -115
5054 -115 -172 146 164 -202 -120 236 34 -233 40 217 -64 -193 144 192 -186 -109 224 42 -212 16 202 -51
5076 -51 -219 105 187 -197 -121 217 48 -216 -13 217 -57 -228 112 165 -186 -105 185 74 -210 -52 229 -30
5098 -30 -239 114 181 -154 -134 169 99 -211 -51 241 -21 -204 80 174 -119 -159 144 130 -208 -69 242 -23
5120 -23 -215 73 199 -107 -177 151 132 -205 -70 223 1 -214 16 207 -83 -219 147 173 -213 -93 218
5141 218 31 -214 4 231 -69 -219 136 162 -174 -108 189 80 -212 -19 243 -65 -223 135 162 -155 -116
5162 -116 184 86 -218 -18 228 -64 -217 103 187 -147 -168 175 97 -254 -34 239 -64 -223 91 191 -127
5183 -127 -179 165 115 -217 -44 222 -9 -206 63 216 -102 -186 181 125 -208 -44 199 1 -192 43 206
5204B06l10q5L44l5l02R8K77j49k53K24K03l30p8L41k1l13O1K92j03k83K14K25
5226B23l01j10L06L7l10K0L45j11l28K31K22k78j28K77Q1l01k4L36p9l31K00K38
5248B15k45j67K74J21l42l0L73j01l13J84K31k05k14K60J64l38m7L67p8l13J42
5269f2K74j89k45K65J76l46l8L28n2k85Q2K98j51k79K68J72l16o5L16k3k93O6
5291i9L19j80k72K64J66k90p9K82M0l15M2L19j51k88K41K05k61j41K70R5l14R
5313a38L42j37k70J78K20j99k08K72J52l54J6L00p7k74J48K40k12k08K80J33l34
5334a30oK92o1k62R3K88k04k47K99J50l36m2L09j7l24R8L27k16k39K86J50k98
5356i0q1K99K7l36O8L24j85k45K61J44k62j03L01N1l42Q0K93j62k34K08J80k60
$$ plain form
5204 206 -104 -189 155 120 -182 -84 193 44 -209 15 218 -112 -190 151 130 -183 -122 170 67 -216 -2 223
5226 223 -78 -188 118 155 -155 -135 210 99 -229 2 224 -54 -182 95 176 -125 -149 187 108 -223 -23 215
5248 215 -30 -197 77 198 -144 -174 199 98 -215 -31 200 -5 -219 41 205 -133 -180 187 109 -204 -62
5269 -62 212 23 -222 43 219 -127 -165 163 111 -174 -92 206 55 -224 44 216 -100 -165 151 128 -165 -99
5291 -99 220 40 -232 32 198 -92 -171 111 151 -164 -122 197 46 -242 -1 204 -57 -198 72 167 -147 -138
5313 -138 204 67 -203 -25 195 -4 -212 60 212 -142 -126 174 97 -177 -29 211 -1 -209 71 204 -130
5334 -130 -136 156 95 -167 -74 214 10 -237 62 212 -124 -166 143 126 -198 -100 227 11 -228 58 208 -90
5356 -90 -171 128 155 -181 -113 211 26 -219 42 186 -76 -179 122 173 -169 -89 204 42 -192 16 196 -64
5378f4j35L17N3l48O5L10j44k36J71K04k40j71L23O8l31J9K98p8k71J31K61k24
5400b2j99L05Q3k81j9K83l4k99J13K87k17j86K62R0k63m3K79pl11R3K95k02k05
5423a98K43J18k46r1L03K3l47J07K83j75k17K09J70k47j45L33K0l21P3K85j33
5444D7k46J88K22k53j53L20K9l16O6K71j18k59J84K41k71j45L12K0k83L4K72q7
5466G5k79J74K46k64j51K91N4k69j4K85m9l00J66K43k23j68K29J08k39p2K95l3
5488A05l04J54K44k01j69K09J30k35q6K94j7k92J27K25j53k11J96J90k80j09L12
5509A29J3l12R0K57j38k43K11K14k83j27K92L8k83K9K83q4k94J88K33k71j21K81
5531A02N2k76pK90p6k80J87K11k44j34K54R3k80l1L20j09k81K00K10k37j46K61
$$ plain form
5378 -64 -199 118 171 -177 -112 198 54 -182 -11 193 -47 -218 105 173 -158 -139 159 81 -190 -59 202 -22
5400 -22 -221 84 167 -114 -133 150 116 -183 -70 217 0 -186 76 166 -97 -140 139 132 -179 -86 209 7 -198
5423 -198 45 163 -83 -174 129 152 -195 -88 195 20 -197 12 182 -65 -210 123 143 -178 -105 180 47
5444 47 -199 -11 211 -42 -195 125 154 -162 -96 175 57 -202 -18 223 -48 -193 119 139 -144 -110 162 75
5466 75 -204 -30 216 -48 -199 92 146 -123 -137 148 99 -201 -35 208 -15 -183 46 154 -85 -157 138 105
5488 105 -199 -45 199 -2 -171 38 168 -67 -153 141 124 -168 -41 184 31 -180 16 206 -74 -183 129
5509 129 142 -170 -80 177 39 -204 7 221 -62 -189 103 141 -142 -113 170 86 -208 -20 213 -58 -179 102
5531 102 154 -122 -129 161 85 -195 -8 203 -41 -175 79 172 -108 -139 181 72 -209 -9 201 -36 -182 79
5553G9J07l00l7L08n5k91J48K23j82j94K42J42l10n7L34m8k86J17K23j43k09K22
5575C3J55k83o2K95j8k62N1K65j30k37K38J40k69o2K69Nk58K0K78r5k61J88J92
5598A92k42j19K65N0k79j1L25j15k68J85J85k07j40K33J06k79l6L28q0k88J53
5619d2K28k00j77K68R8l16OL18j08k52J35K30j81k04K60J36l21j8K98o5k75J17
5641f5K73j93k22K59J19k72l9K61j0k71P1K77j62k42K51J36k61o8K78Nk93R3K72
5664A97j66k29K34J45k24j14K52O4l03O3K86j64k27J96J77k25j52K81O4k98M2
5685a01K65j09k27J45K13j95k11K94R9l08J1K66o4k48J28K32k00j88K63J01k68
5706a02l8K66k0k72J02K79k19j95K84R9k65o3K92j3l02J04K73k01k11K55J40k82
$$ plain form
5553 79 186 -114 -151 157 102 -189 -41 182 0 -194 48 190 -120 -177 157 109 -177 -60 163 20 -189 33
5575 33 188 -95 -157 138 120 -142 -91 174 44 -193 45 185 -84 -146 123 128 -130 -110 168 73 -188 0 192
5598 192 -50 -169 96 146 -133 -144 181 66 -202 -17 168 -39 -179 54 160 -119 -155 173 93 -195 -42
5619 -42 186 -14 -191 77 175 -141 -135 183 75 -177 -42 188 7 -197 63 199 -122 -140 158 93 -182 -65
5641 -65 208 15 -207 52 171 -101 -140 121 111 -160 -89 188 26 -216 35 171 -90 -158 120 125 -168 -75 197
5664 197 31 -198 36 181 -43 -157 95 159 -144 -81 205 41 -186 10 187 -38 -190 91 155 -143 -101
5685 -101 164 55 -172 -27 186 -9 -220 74 173 -135 -124 142 78 -170 -42 190 -10 -198 65 166 -102
5706 -102 -140 126 106 -166 -64 215 -4 -199 85 184 -81 -144 148 135 -167 -63 210 9 -202 53 193 -89
5728h9r8L06L1l35J00K88j97k07K20J55k52j11L09J7l09Q0K72j48k02J89J68k55
5750f8j28L16K9l05N2K77j30k13J67J96k28j41K86M0k80J4K77n5k87J47K38k41
5772c7j41K65O5k69k7K95m3k88J22K49k16j63K38J17k78m6L07k9l13J32K54j77
5794A7j90K15J30k57q2L18rl12J18K40j42k38K08J84k71j03L26j6l11R2K74j45
5816D6k44J97K04k55j23K95K2k92M1K80j02k82K02K12k60j15K77K5k57J8K90j02
5838G7k93K07K16k45j46K88N4k88RL05r7k82J82K26k42j64K58J15k87m1L13p1
5860I4k75J43K27j87j95K41J23k75n0K94o0k43J00K34j48k24K34J67k93o8K90
5881A29j4k64P8K51j44k46K42J73k81q6K83K5k94M8K90j27k70K20J99k69j35L05
$$ plain form
5728 -89 -187 119 150 -185 -85 203 6 -201 19 174 -78 -189 120 137 -172 -92 180 32 -170 19 187 -68
5750 -68 -196 120 149 -156 -104 173 43 -170 -3 193 -35 -176 110 150 -130 -116 161 106 -181 -34 204 -37
5772 -37 -178 87 152 -117 -144 151 108 -180 -58 191 -25 -188 50 167 -111 -157 150 121 -192 -60 194 17
5794 17 -173 42 172 -85 -167 151 142 -170 -52 188 46 -192 16 200 -71 -174 152 136 -175 -83 191 46
5816 46 -198 -1 203 -52 -175 120 142 -150 -109 171 69 -213 -11 201 -59 -174 103 128 -129 -111 179 77
5838 77 -216 -9 207 -38 -184 104 158 -130 -121 184 87 -195 -13 213 -29 -193 65 180 -107 -148 165 94
5860 94 -181 -38 189 2 -193 48 171 -104 -154 140 80 -163 -63 171 23 -201 33 200 -93 -161 129
5881 129 115 -149 -71 180 36 -210 32 205 -76 -162 121 146 -148 -100 190 63 -207 13 212 -57 -192 113
5903A13M9k94kL15j15k59J90J96k47j43K83Q3l11qL28j13k61J79K01k12j64K73
5925H1R9l28J6K90o8k68J35K48k16j84K71J20l20k5L08n4k70J04K51j80j99K50
5947F1J16k96l3K98k5l03P6L04j80k23K48J31k68o2K84Ok89O5K88j48k34K08J53
5970A77k40j06K77O1l32N3K97j26k55J93J87k03j61K77P1l08PL05q1k84J42K51
5992B02k13j81K67Q3l04J3K95p3k78J23K68j99k12K82J00l04j0L08o1l16J46K93
6014B29k32k09K80J12k77m5K84j4l01R9K91k00k26K52J47k70q6L00rk95J03K52
6036A85j62k12J93J69k20j40K78M8k92N5K80j36k43K02J87k44j30K87M8k90K6
6057a11K72r2k55J63K41k50j75L01Q6k95kK71o6k77J54K25k04j79K52J21k72o2
$$ plain form
5903 113 162 -132 -134 181 66 -193 -3 193 -54 -197 86 169 -142 -150 178 65 -196 -17 184 -28 -192 81
5925 81 180 -148 -132 158 90 -178 -43 205 -11 -195 76 196 -124 -149 159 105 -165 -61 190 10 -189 61
5947 61 177 -119 -152 146 121 -182 -106 198 18 -205 43 174 -94 -156 128 134 -155 -90 198 50 -184 24 177
5970 177 -63 -169 108 169 -163 -110 187 61 -194 -1 186 -17 -178 99 170 -138 -131 174 93 -191 -49 202
5992 202 -11 -192 75 158 -146 -133 162 89 -189 -66 202 3 -209 73 173 -131 -141 167 106 -210 -64 229
6014 229 -3 -212 68 180 -97 -142 142 128 -173 -74 217 17 -209 43 190 -80 -166 134 125 -170 -67 185
6036 185 23 -189 4 173 -47 -187 91 139 -153 -98 182 46 -197 5 192 -52 -182 105 153 -137 -111
6057 -111 161 69 -186 -23 218 -32 -207 94 180 -115 -117 154 88 -189 -35 190 -14 -193 59 180 -92 -154
6079a54K75Ol05J08K60k08j84K45J30k74o7K95qk85R1K54j66k11K17J73k64j32
6101b04L49Nl22Q7K68j51k25K12J87k75j09K92M5l09M1K83j01k67J83K12k62j34
6123a95L16K9l08M1K72q6k68J73K10k40j34K66Q4k95l1L24n1l05J61K31k22j56
6145a84K45R8k66n0L09k9k95J02K59j61k24K24J53k77p7L11k5k96J07K49j51k10
6167a88J92J69k63q4L04Rl13N8L01j31k79K24J99k79r8L07nk82M7K81r3k88J96
6190a6K22k52j57K92P1l08%L36j05k89J82K27k21j65K49R9k85k3L03p5k94J60
6212d9K51k21j92K72J10l10k5L25q9k71J48K36j84k15K41J58k97n7L18m4k89J18
6234f6K69j85k29K45J65k82q2K69Lk51M5K83j43k49K08J91k57j23K78N1k83L1
$$ plain form
6079 -154 121 127 -178 -70 190 -18 -202 43 173 -101 -168 127 119 -166 -75 179 13 -198 19 192 -72 -204
6101 -204 145 150 -172 -85 183 32 -193 19 206 -69 -178 114 159 -150 -109 174 73 -194 -11 201 -61 -195
6123 -195 121 150 -158 -117 155 69 -199 -26 184 -56 -190 76 160 -135 -166 158 107 -198 -37 194 -28 -184
6145 -184 61 159 -107 -157 152 123 -172 -70 189 28 -196 28 181 -96 -173 138 113 -183 -76 173 22 -188
6167 -188 4 173 -90 -174 130 139 -174 -116 185 54 -225 -1 198 -81 -179 128 123 -159 -112 169 76 -212 -16
6190 -16 206 -46 -203 89 160 -148 -148 188 83 -206 -24 203 -18 -183 66 165 -120 -143 160 85 -209 -49
6212 -49 202 -19 -211 61 171 -139 -164 161 72 -199 -51 185 1 -214 27 185 -112 -169 149 105 -184 -66
6234 -66 203 18 -211 34 199 -83 -165 104 107 -144 -99 184 41 -208 0 191 -66 -189 89 140 -143 -112
6256a12K80j28k36J86J81k22j40K54R2k78j1L04r3k75J86K13k32j66K74J03l16
6277a36kK96p0k64J41K35k12k06K76J46l21m7L08m9k77J22K49j92k02K62J25k89
6299a07n9K84%k91O1K98j81k16K51J42k96o4L06J3l06O5K81j36k35K09J66k57
6321g2j06K82N6l04K3K95j17k48J80J75k19j34K85N2l00J7K89r0k38J45K06k04
6343b7j65K79O8k96nL01o7k74J33K36k08j76K67J05k85l5K92k8k91R2K74j66k10
6366a86K33J40k74p4K89kk97Q0K77j44k47K19J65k60q9K92J6l19P0K98j58k34
6388b05K00J97k60j15K98K1l11P1K98j33k75J91K26k48j40K74O4k98M2K68r2k67
6410a94J60K33k28j63K64Q5k71oK60n2k78J54K43k16j79K52Q7k53k9K68m0k71
$$ plain form
6256 -112 168 40 -196 -10 171 -51 -191 63 155 -123 -134 170 77 -198 -12 201 -31 -197 77 180 -136
6277 -136 -138 158 88 -176 -35 200 -12 -218 58 204 -117 -164 144 95 -182 -60 189 -3 -205 57 182 -107
6299 -107 -166 118 118 -173 -112 186 5 -211 40 182 -114 -178 128 141 -165 -100 181 45 -190 19 185 -72
6321 -72 -178 104 160 -144 -121 174 57 -191 -11 164 -55 -189 96 148 -152 -135 154 64 -174 -29 177 -27
6343 -27 -192 87 155 -141 -146 155 88 -186 -53 183 -25 -201 66 171 -114 -149 143 115 -176 -84 190 24 -186
6366 -186 47 187 -87 -161 128 126 -171 -91 186 42 -205 14 179 -81 -170 122 138 -181 -111 187 29 -205
6388 -205 -5 192 -68 -183 115 136 -175 -104 194 61 -214 -23 203 -45 -185 89 153 -145 -103 165 73 -194
6410 -194 -34 199 -29 -192 72 157 -114 -120 140 88 -190 -36 207 -9 -188 64 151 -102 -131 137 97 -174
6432a74J03K54j87k03K32J55k68p8K95j3k90R2K63j65k19K09J80k55j08K90K4
6453A37k78N6K57j31k35J93J86k48j16K77M5k81K5K65r7k46J64K24k41j60K77
6474G3P1k81oK91q4k55J69K15k33j53K71Q5k75k6K84m5k76J35K28k13j70K73R7
6497A75k85l8L00n6k73J21K20j63j81K31J31k83o6K98k4k70R7K29j55j86K06J40
6519A68k59p6K80Jk64M4K59j01k35J79J76k45r9K71L2k60J5K62p9k30J49J89k16
6542c9j31K40Q3k91PK87p9k60J56J98k13j27K31P7k61j8K85o3k72J31K30j80j82
6565a91K35J28k94k5L14p3k75J22K31j58j98K02J42k43p6K90ok78O9K64j43k24
6587a87K05J64k63o0K45Pk61P5K32j10k29J69J81k26j10K60L1k85O0K76j25k44
$$ plain form
6432 -174 -71 183 -4 -207 25 180 -88 -166 129 116 -174 -82 181 16 -203 6 186 -69 -177 113 137
6453 137 -141 -85 172 41 -194 -1 185 -63 -179 98 143 -138 -113 152 55 -191 -27 197 -44 -204 73
6474 73 144 -137 -143 148 64 -191 -22 193 -40 -193 78 163 -112 -138 146 101 -175 -40 188 -25 -195 78 175
6497 175 -110 -148 152 96 -177 -56 164 1 -180 51 182 -101 -167 131 107 -163 -66 163 8 -178 28 168
6519 168 -91 -167 113 114 -150 -106 153 52 -183 -4 172 -73 -172 99 131 -129 -114 148 69 -161 -12 177 -39
6542 -39 -170 70 153 -138 -131 156 77 -183 -27 171 -42 -169 62 139 -122 -140 145 82 -190 -59 171 -9 -191
6565 -191 44 172 -122 -147 167 94 -181 -59 172 14 -184 18 160 -83 -159 131 125 -153 -84 180 37 -187
6587 -187 18 182 -81 -141 104 111 -150 -75 157 47 -182 -13 168 -58 -168 92 123 -162 -102 174 49 -195
6609a95J96J64k19r7K18O3k50RK65r1k49J51K13k02j64K44Q2k45MK32n5k22J18
6632c0J90j56j63J87J40k56m5K55k0k65J01K35j79j77K13J33k43n8K32J3k45M3
6654i5K59j38k21K08J76k56r6K61K6k69N9K53j39k01J79J74k27j16K39P0k72J3
6676a13K76j18k25J85J61k24j18K54O6k67LK51p6k15J22J95j83j63K46R5k73k7
6698a48K76m5k43J13K01j69j46K11Q6k19n7K41Qk55N7K47j48j86K27R2k46k8K52
6721A21k1k52P2K09j06j91J91J22k14q1K53K5k72M2K55j11k11J73J48k12r9K34
6743G5M1k44PK56q1k26J33J96j89j42K60N1k69K2K46n8k35J19J96j69j44K11Q2
6766A38k53mK62n3k62J22K24j93j43K08R2k50j3K42l6k59J10K37j64j65J91J24
$$ plain form
6609 -195 1 165 -54 -151 67 130 -120 -111 154 63 -186 -35 178 -24 -188 56 138 -107 -103 129 74 -148 -30
6632 -30 160 4 -159 28 168 -88 -133 122 102 -163 -62 173 -6 -183 30 163 -80 -138 94 107 -138 -95
6654 -95 164 26 -195 13 189 -67 -163 98 124 -145 -86 167 28 -173 6 180 -47 -163 76 146 -126 -113
6676 -113 163 45 -180 5 166 -58 -176 78 144 -123 -120 131 55 -160 -38 157 -26 -189 57 152 -121 -148
6698 -148 128 83 -160 -47 154 -15 -161 50 136 -83 -140 101 109 -146 -89 158 10 -176 51 143 -103 -131 121
6721 121 100 -152 -80 129 23 -168 23 145 -69 -150 103 128 -144 -102 153 42 -169 4 152 -60 -159 75
6743 75 116 -128 -121 135 54 -172 -39 157 -32 -174 86 137 -132 -110 136 78 -157 -38 158 -11 -155 56 138
6766 138 -115 -119 143 90 -172 -50 174 -19 -162 46 138 -112 -125 117 81 -178 -68 169 5 -160 31 155
6788A55k38n3K53l2k50J06K27j55j68J68J34j96p6K09K2k40O8K11j12k08J74J50
6810A49j95j00K24K3k24M3K04q1k07J43J86j96j25K23O2k35MK25o8k18J42J83
6832A62j89j36K17P4k26j9K34m7k30J27J90j77j47K18J07k35m9K41l3k16J00J89
6854A55j57j53J78J42k42o7K51j0k35O4K16j26j90J76J56k27q5K42K4k50N1K23
6876A36r8k06J68J54k10j05K52L0k42K7K20p7j99J48J53j98j05K38M3k37J6K09
6898A17o2k05J25J74j83j20K10P4k34j6K32m1k18J02J73j46j23J79R9k21m8K40
6920A08j5k27Q7J79j22j61J76J16k20l7K09Qk26O0J97r9j74J56J34k23n9K34n
6943I6k31N2K37j13k01J65J37k09p6K21L4k30K5K30r4k09J50J52j76r5K00N4k35
$$ plain form
6788 155 -83 -136 117 85 -165 -59 168 13 -155 13 147 -49 -125 84 106 -134 -66 145 33 -175 -1 149
6810 149 -46 -146 78 101 -123 -80 124 43 -164 -21 165 -31 -156 67 129 -106 -102 123 55 -163 -21 162
6832 162 -27 -163 54 128 -98 -117 117 70 -160 -33 157 -20 -167 51 158 -77 -126 115 82 -134 -34 155
6854 155 -2 -155 23 165 -77 -144 107 97 -138 -74 142 16 -174 2 158 -69 -154 88 112 -138 -87 136
6876 136 38 -168 0 154 -56 -161 91 121 -121 -94 126 49 -150 -2 151 -47 -152 86 129 -108 -92 117
6898 117 55 -150 -25 149 -34 -154 56 130 -104 -120 112 71 -147 -45 128 -18 -141 38 137 -84 -132 108
6920 108 93 -134 -47 132 10 -151 25 141 -79 -116 93 101 -125 -65 132 33 -141 15 149 -74 -133 101 96
6943 96 -135 -83 154 41 -160 5 142 -67 -143 78 112 -118 -93 137 43 -166 -16 136 -40 -135 65 119 -116
6966a16J4K39q4j99J15J77j45j30J86P3k29MK19o4k09J21J74j56j35J69R8k08
6988h6l6K35m2k17R0K00j33j77J89J06k03l4K07k6k00P6J84j14j74J70J22j84
7010d7q5K04K4k13M3K13j14j76J61J30j81r7J87N8j95LK21q2k02J35J62j71j39
7033a61K23N4k16kK04n7k00J32J61j50j39J94Q8k30j8K29n2k07J18J74j69j33
7055a57K14P6k26j6K17k4k08Q0K09j73j48K13Q4k17m3K20j8k06O7J97j41j45J59
7078A4J05j72q1K14K5k34N4K03j12j58J52J21j94o6K04K8k23L0J92o5j65J14J47
7101A33j52j13K01N5k26KK19o8j82J17J42j61r6J96N2k01j6K07k3k20Q1J85j47
7124a5j30J87P0k06j2K10l0k03O6J83j15j36J50J05j85p0K34Kk49P0K15j32j58
$$ plain form
6966 -116 -102 137 53 -146 -31 146 1 -129 57 130 -99 -95 124 60 -149 -28 146 -10 -145 24 122 -86
6988 -86 -122 113 71 -146 -56 144 11 -166 23 129 -74 -108 99 73 -127 -51 133 19 -155 15 137 -47
7010 -47 -132 72 96 -117 -74 139 25 -151 10 140 -41 -138 49 107 -88 -85 136 54 -148 -13 149 -22 -161
7033 -161 62 116 -100 -102 102 45 -155 -23 138 -12 -151 43 131 -99 -117 112 60 -147 -29 145 -24 -157
7055 -157 57 133 -93 -109 108 84 -124 -44 165 -8 -156 57 141 -76 -119 101 83 -123 -56 141 0 -145 14
7078 14 119 -53 -134 80 105 -129 -75 128 16 -142 10 131 -63 -129 75 103 -120 -90 102 37 -128 -14 133
7101 133 -19 -132 69 124 -102 -100 119 51 -131 -14 128 -33 -129 67 119 -82 -98 109 86 -134 -53 132 -15
7124 -15 -145 42 112 -94 -106 104 74 -129 -63 120 5 -131 19 124 -61 -131 103 105 -144 -74 141 9 -149
7147a49J63J05j84n1J94Qk09M0J96o8j91J51J39j97p6K11jk00L9K08j13j44J12
7170a7J28j47r0J77L7j85J1K00p1j84J09J54j45r6J78K8j56pJ76m9j73R1J65j25
7194Ij45J65R5k02k6J90j9j89P7J76j29j24J18J25j67p1J83J8k00N1J91j22j60
7217a56J56J35k02n7K07Nk07N6J85r5j62J20J53j76r4J93L3k00L1J95q6j82J52
7240DJ26j74q3J76O0j90j6J96m1k03J19J52j58j24J89Q0k09k0J99m0j72R9J43
7263A13j28j22J62Q3j92l1K02l3j82Q0J60j16j25J73Q6k19pJ84Jj87N0J67j03
7286A6j48J34J29j82o8J96J9j98K4J83q1j74J25J26j50p8J65O6j95j8K08m9j80
7309a30J01J53j43j09J87N3k05j1K09m4j80R0J59j42j15J75P6k16j6K23n5j89
$$ plain form
7147 -149 14 119 -65 -116 78 86 -123 -83 113 45 -146 5 144 -53 -129 82 81 -119 -80 128 15 -129 -17
7170 -17 111 -36 -126 51 88 -97 -86 114 43 -141 -32 122 -23 -119 59 87 -69 -76 100 51 -122 -31 134 9
7194 9 -136 29 124 -78 -104 86 67 -122 -45 131 2 -122 -4 121 -46 -117 66 84 -116 -65 126 4 -156
7217 -156 0 135 -67 -124 83 88 -119 -63 122 27 -135 -15 138 -38 -132 61 94 -106 -75 120 34 -148 4
7240 4 130 -44 -127 49 109 -81 -97 99 58 -145 -26 126 -32 -156 33 113 -96 -116 83 43 -129 -30 113
7263 113 -15 -137 25 108 -84 -115 87 54 -128 -48 112 -4 -129 44 130 -89 -96 88 89 -98 -48 119 16
7286 16 -132 2 131 -51 -119 77 96 -102 -78 105 24 -150 -25 101 -49 -127 38 104 -91 -109 99 50 -130
7309 -130 -29 124 -19 -128 59 112 -93 -104 105 61 -119 -29 130 -12 -127 48 124 -92 -108 115 60 -129
7331a29R0J65j30j24J69O3j89k0K06l1j89N4J88j15j55J58R9k00l2K10j8j80M5
7354f5J75r8j43J41J02j62o0J74K1k01N6J86r0j70J33J28j70o6J64L7j98K9J93
7377A16p5j74R9J44j24j07J65M6j83J1J85n8j62Q4J53j44j17J69P5j79j0J73l2
7400E5j83Q7J61j26j29J69R1j82l8J80j4j82N9J78j12j72J67J18j74o0J76K1k04
7423a14M2J96j09j64J42J28j67p0J82K7j99M2J76r5j55J36J20j63p9J88K7j92
7445a01K4J74p1j52J27J16j42j03J86M1j83MJ91o7j59R4J36j26j24J76O9j83k6
7468i9J68Kj90O8J63j24j14J44Q6j67n2J88Nj93N8J66j07j22J39R9j78n9J97J5
7492I3j99M6J76r2j44J31J13j72o6J91J1j95K4J94o9j56R2J39j56q9J94K6k02
$$ plain form
7331 -129 -39 126 -4 -128 41 104 -85 -105 101 70 -119 -65 123 8 -147 11 110 -90 -122 88 70 -110 -65
7354 -65 110 12 -131 10 112 -50 -110 64 85 -116 -60 126 36 -134 -1 127 -43 -109 55 92 -106 -77 116
7377 116 41 -133 -34 110 -14 -121 44 90 -93 -82 103 45 -117 -33 120 -24 -141 28 103 -76 -86 87 55
7400 55 -128 -41 120 -6 -135 34 125 -57 -95 85 71 -111 -52 126 14 -158 9 127 -47 -107 69 90 -114
7423 -114 -72 124 15 -149 -7 121 -46 -116 66 93 -106 -64 112 17 -138 -2 118 -45 -124 64 91 -101
7445 -101 -77 97 26 -126 1 117 -25 -128 58 99 -84 -80 111 44 -115 -21 115 -11 -135 41 110 -73 -99
7468 -99 69 71 -119 -51 112 -12 -126 18 104 -63 -115 73 78 -115 -57 109 2 -120 19 118 -60 -119 78 93
7492 93 -106 -60 116 24 -120 11 124 -48 -114 77 88 -107 -83 111 42 -114 -22 117 -39 -128 66 92 -110
7515a10K0J87n9j61R2J38j44r0J64M8j83mJ98l4j80P5J64j39r8J64N0j73qJ82
7539I9l9j88R9J41j30r8J42P9j67m1J93l0j91Q9J53j11j21J17J01j63l6J76kj78
7563a06M3J68q3j54J33J09j70m3J65Mj57K9J60p3j51J11J24j31r6J69M2j71OJ77
7587A05o9j69J10J46j48q7J45M6j50MJ63n2j66Q7J54j37j18J63O5j69k2J89n0
7610D0j58R5J28j18j10J37Q8j64k9J78k6j64P0J58j12j36J54Q6j69m3J72k0j45
7633h8L6J57q3j40J27R5j36q0J65L4j74K0J65q0j35J24J01j51n8J39L3j44mJ59
7657H2n5j26J06J03j46q1J67M1j66RJ55m9j35Q4J13j16j04J47Q6j79l5J94m0j54
7681i9O8J37j08j04J42O0j64k9J75j9j55M1J50q9j20J37R3j74m7J86j5j66L9J67
$$ plain form
7515 -110 -90 97 38 -123 -31 107 -37 -127 37 85 -98 -102 96 62 -118 -43 121 -18 -116 48 98 -75 -83 99
7539 99 60 -128 -29 112 -18 -116 26 105 -62 -103 90 60 -131 -42 111 0 -121 -4 97 -66 -102 74 72 -106
7563 -106 -63 105 22 -132 1 110 -60 -103 62 66 -91 -62 98 25 -126 -15 109 -22 -118 51 93 -78 -72 105
7587 105 36 -133 -23 123 -25 -112 33 79 -71 -67 96 44 -122 -35 119 -18 -136 27 92 -77 -99 90 40
7610 40 -118 -23 105 -13 -123 14 102 -62 -91 87 61 -103 -33 125 13 -123 31 117 -52 -95 77 57 -88
7633 -88 -52 105 22 -118 9 104 -32 -112 53 87 -87 -67 98 18 -117 7 108 -43 -101 38 71 -73 -77 82
7657 82 27 -99 7 110 -36 -117 50 91 -75 -66 89 40 -95 -11 102 -14 -118 29 115 -64 -99 95 55 -99
7681 -99 -31 106 -2 -106 36 96 -68 -97 78 59 -96 -55 95 6 -114 23 116 -58 -105 81 66 -100 -61 106
7705A06q6j36J26Q0j41k9J41K8j81K1J84p9j39J18Q2j41l7J51Kj59K8J52o3j30
7729a02P8J16j13q9J50N1j87J5J84p0j39R4J12j05r7J37M8j74J6J43pj57N5J43
7753A02r2j17J27P2j53k4J61rj65N2J46r7j04J19P3j37l4J43Kj68M9J56j02j19
7777a19J20Q4j36l3J33K3j61L5J49q6j06Q6J08j23q1J50L1j60K6J54o0j32J01
7800CJ08j24r5J47M7j48jJ50m1j54Q7J38j15j09J30N4j37j3J37l0j37O3J25j05
7824b0r3J35O4j48k4J51j5j55P2J28j00j07J34N9j27m2J42J4j50N3J25q8j01J08
7848A5P5j19o5J53Oj46L7J28o7j21J03Q7j26n0J37K4j42j5J54l3j31Q1J13j16
7872a8r8J59K6j32nJ35k4j40Q8R3j14p9J57M3j51k1J50j4j51O0J25j01p9J24M3
$$ plain form
7705 106 20 -116 10 90 -51 -80 61 89 -92 -71 113 34 -105 13 95 -46 -83 68 70 -89 -61 91 28 -102
7729 -102 -24 92 -21 -110 40 91 -96 -81 103 33 -106 -12 100 -5 -102 35 83 -91 -75 68 61 -96 -41 102
7753 102 10 -107 20 92 -61 -85 76 67 -98 -46 100 3 -101 18 91 -46 -80 63 65 -103 -54 102 0 -119
7777 -119 1 85 -51 -84 49 72 -89 -54 95 9 -97 -11 97 -26 -107 43 74 -86 -60 94 34 -98 3
7800 3 111 -13 -108 39 86 -62 -63 87 46 -108 -21 117 2 -107 23 77 -60 -73 64 34 -103 -40 85 -20
7824 -20 -113 22 86 -62 -86 65 50 -105 -33 95 -5 -112 22 81 -46 -88 54 68 -82 -29 96 8 -93 15
7848 15 90 -29 -94 59 65 -81 -44 84 17 -104 -1 86 -40 -90 47 71 -71 -86 68 35 -96 -15 98 -18
7872 -18 -116 43 69 -63 -68 67 43 -97 -9 84 -30 -109 48 91 -60 -81 69 55 -96 -36 89 -12 -91 33 76
7897G6j33k0J43j7j37M6J25q2r9J11O6j49k4J58j4j48L2J60q8j12J02R4j38n1
7921i9J65j5j38L6J41o8j19J05P8j20m9J37Kj31K4J36n1j34Q8J01j17m7J21J1
7945E7j33J6J29l7j39P5J12j00p9J28L7j29j4J50l0j57Q1J09q0r7J20N2j33j1
7969g3J55k6j44M2J40r9r6J09Q2j38l2J43j1j31M1J31q7j17J14Q0j37l2J27Mj31
7994h6L2J47q8j21J23Q6j35l6J24Qj23J8J29p1j03R5J02j28p0J35M2j51QJ43n2
8019B8j16R0P5r0p4J12N1j38qJ45l1j39P6J06j03r7J27O4j49KJ32l0j05M2J00
8044G0p0j08J37M6j22m6J49kj28N0J11q8j01J30N6j35k3J21Rj29K0J38p0j07R3
8069AR9j42m1J38Rj40K6J24o2j05Q8Q9j09o6J31L3j53PJ48m1j35Q6Q4r1o3J22
$$ plain form
7897 76 -57 -77 66 49 -88 -42 83 1 -98 13 79 -70 -94 64 50 -98 -66 94 6 -106 -4 90 -48 -99
7921 -99 66 51 -87 -51 90 22 -97 8 86 -34 -83 54 56 -75 -51 85 34 -100 -12 89 -28 -75 46 57
7945 57 -76 -60 69 32 -107 -32 80 -20 -99 29 66 -63 -77 73 43 -114 -33 76 -4 -101 19 71 -62 -73
7969 -73 82 56 -88 -46 94 -5 -101 8 90 -48 -80 63 52 -79 -38 93 6 -111 3 83 -54 -86 41 45 -86
7994 -86 -54 93 5 -116 7 93 -42 -78 46 54 -69 -51 78 7 -96 -1 101 -27 -97 38 80 -71 -63 80 28
8019 28 -88 2 77 -13 -87 25 76 -62 -70 75 44 -95 -19 87 -16 -113 14 78 -71 -69 63 33 -72 -30 70
8044 70 0 -108 29 75 -47 -93 56 54 -74 -24 87 -1 -102 28 84 -51 -74 47 56 -73 -53 85 15 -92 1
8069 1 100 -42 -83 55 64 -76 -50 74 12 -93 -5 84 -25 -91 40 73 -80 -73 75 34 -101 -15 69 -22 -85 37
8095C7L5j43J3J36m1j19N4J06p6q2J19M0j49OJ38l3j36P6R9q6q0J08N3j28j5J33
8121F5k4j29N6J12p5j14J20N6j21j9J35nj49M9J26p3j05R1Q5j11n0J27K8j51L6
8146d0J36p8r3Q3Q4j19n1J28Pj18J7J28n5j17P1J11j03q3J27J9j33K6J19m5j16
8171i5Q1R9j03o9J14M5j26mJ21k0j43P3J29j17p8J21M1j18j4J25
$$ plain form
8095 37 72 -71 -58 78 37 -82 -28 78 2 -80 39 79 -70 -64 74 41 -95 -19 80 -6 -86 22 75 -53 -68 65
8121 65 41 -88 -32 80 5 -109 11 67 -54 -73 62 57 -92 -43 83 10 -95 -4 81 -30 -80 47 75 -76 -40
8146 -40 96 18 -75 8 92 -27 -78 50 57 -61 -44 84 29 -88 -17 94 -9 -92 35 54 -79 -53 66 21 -95
8171 -95 -14 85 -18 -87 27 72 -54 -58 63 43 -100 -27 102 -15 -93 28 69 -49 -63 62
8191F2
$$ Imaginary data points
##PAGE= N=2
##DATA TABLE= (X++(I..I)), XYDATA
0@%%%%%%%%%%%%Qj6J6j6J6k4L2l5M3n6O4p2Q8j04J20j36J60j85K09k40K73l12
34a67L52l94M44n00N62o26O97p77Q63r56J057j168J289j423J569j728J905k098
52a099K310k548K813l110L449l833M276m798N417o165P093q280R861j2079J5440
67H747k1179L3506j03708J17643J57211l04855j6100K59167m1097k51332J26623
78c5374J98434j63551j61954K07100R4694k18719l2701K30487m7016k10808J11075
89b8333J75786j66348j13398J90491N1982j99890O753J90213n0235j74524Q9154
100b8349J46229j21250j13331J52527P3654j74752l1944J83282j2000j69326N0913
111d4347J40115q0872j06493J00631P9996j13570n9187J20910L8103j23704j1147
$$ plain form
0 0 0 0 0 0 0 0 0 0 0 0 0 0 8 -8 8 -8 8 -16 16 -19 24 -32 32 -40 48 -56 64 -72 88 -97 112 -128 145 -167
34 -167 185 -209 235 -265 297 -329 368 -409 454 -502 555 -613 676 -747 822 -906 999 -1099
52 -1099 1211 -1337 1476 -1634 1815 -2018 2258 -2540 2877 -3288 3805 -4475 5386 -6693 8747
67 8747 -12432 21074 -82634 35009 192220 -112635 -128735 130432 89335 -161997 -35374
78 -35374 163060 -491 -162445 44655 139349 -79370 -112071 118416 71400 -139408 -28333
89 -28333 147453 -18895 -132293 58198 110180 -89710 -82957 107256 57021 -117503 -28349
100 -28349 117880 -3370 -116701 35826 109480 -65272 -97216 86066 74066 -95260 -44347
111 -44347 95768 14896 -91597 9034 89030 -24540 -83727 37183 75286 -48418 -59565
122e9565J21444k2163j13434N6536R6356q4022p1072R8482M2311j02922j6137
133e4186J04787p057j07431L1459J06577n9555r5931R0420P4376j18901m3823
144g9265J39081Q897j45092K6300J36485n8564j18710Q8061R7670j16177p4187
155i5501J40350M4087j55292n896J55876l7907j41960Q0924J15597j16278p9779
166i5779J38160L8794j44781K894J39595m2006j25903P8614J04271j11262p2022
177h9425J36236L0041j48756J6620J46340o1094j29322R7605R9514j23297o2069
188h7607J37290K2648j42130J4196J39399m8025j27976P8601J05129j03579p1812
199h3866J19726L3849j24801K798J19427l4048j04381N8554Q2433p5702n6959
$$ plain form
122 -59565 61879 39716 -73718 -17182 79174 -4848 -75920 22562 64873 -38049 -54186
133 -54186 50601 43544 -63887 -32428 74149 14594 -81337 9083 83459 -35442 -79265
144 -79265 59816 68713 -76379 -50079 86406 27842 -90868 -2807 94863 -21314 -95501
155 -95501 44849 88936 -66356 -72252 83624 45717 -96243 -15319 100278 -16000 -95779
166 -95779 42381 81175 -63606 -60712 78883 36877 -89026 -10412 93859 -17403 -89425
177 -89425 46811 76852 -71904 -55284 91056 29962 -99360 -1755 97759 -25538 -87607
188 -87607 49683 72331 -69799 -55603 83796 35771 -92205 -13604 91525 -12054 -83866
199 -83866 35860 69709 -55092 -52294 67133 33085 -71296 -12742 69691 -6011 -62970
210f2970Q6695L0620r2779l656R3064k4085q5885M9547P0654o9101n0376Q0929
222B2657K7547q6145m011Q5917j8756q1330L8789P3848n4971o3572O8442M9405
234E7820p8870l0041Q4832Q041q5050J2955Q0873l0763p3483M5498O2400n7366
246c154m7694O5620L0205p1041j1222P3552r302p1967K9838O3960m7446n0080
258d8731O0158L2782o8452j3117P3379q568p3612L1049O8393n1360n7810O8287
270A2398M2534q1299k2066Q9063k733q9992K8080Q4165n0790p3414O9451N7648
282F3045q3866l6583R2023J1409r2889J4475Q7319l8562p6192N9738N9333p5522
294a6272l6866Q3664J1847q3647J3276P7596l7094o6241N8404M9383p4201k8287
$$ plain form
210 -62970 23725 54345 -38434 -42090 50974 26889 -58996 -9449 61205 -7896 -58272 22657
222 22657 50204 -35941 -39952 45965 27209 -54121 -15332 58516 3545 -60027 8415 57820
234 57820 -21050 -51091 33741 41782 -43268 -30313 50560 19797 -53686 -8188 54212 -3154
246 -3154 -50848 14772 44977 -26064 -37286 36266 26964 -45003 -15165 48795 1349 -48731
258 -48731 11427 44209 -24243 -37360 36019 27451 -46161 -15112 53281 1921 -55889 12398
270 12398 54932 -26367 -48433 40630 37897 -52095 -24015 60150 9360 -64054 5397 63045
282 63045 -20821 -57404 34619 46028 -46861 -32386 54933 16371 -59821 -83 59250 -16272
294 -16272 -53138 30526 42373 -41274 -27998 49598 12504 -53737 4667 54050 -20151 -48438
306d8438Q2145N332q2966J7736P7705m0543o6863O0698N0528p5350l1167Q3224
318C2041J0959q5067R715Q1182l0362p0866M8829N5707o2401l8250P0922K0124
330D2533p4220j074P1443j7841o2384L4278M9079m7115l4094N6213J7711o1170
342b6641m56O0216j6254n3767L0511M3793m2481l1621N2301J7543n8464k454N9748
355C1974j1300n6522K3398N0537l4534m1788M4761L0495n2253j8047N6179O018
367B8918n7168N658N4965j7580m9066K8416L9659l7117k9011M3744J7941m8774
379a9415n914N0781p145m8071K0072M1153l1663l1262M2034J9247m9980n180N3770
392B8427r387n2629K3175M7671l6234l9532M8638K7476n9033j2017O4808n098
$$ plain form
306 -48438 33707 39039 -43927 -26191 51514 10971 -55892 4806 55334 -20016 -51183 32041
318 32041 43000 -42067 -32352 48830 18468 -52398 -3569 52138 -10263 -48513 22409 42533
330 42533 -31687 -32761 38682 20841 -41543 -7265 41814 -5301 -39395 16818 34529 -26641
342 -26641 -27097 33119 16865 -36902 -6391 37402 -5079 -36700 15601 33144 -25320 -27774 31974
355 31974 20674 -35848 -12450 38087 3553 -38235 6526 37021 -15232 -33279 22900 28918
367 28918 -28250 -22592 32373 14793 -34273 -5857 33802 -3315 -32326 11418 29359 -19415
379 -19415 -25329 25452 18307 -29764 -9692 31461 -202 -31464 10570 29817 -20163 -25343 28427
392 28427 19040 -33589 -10414 37257 1023 -38509 10129 37605 -21428 -33445 31363 26265
404B6265o5249K1479O0553l6442n1090M9042L7172n7958k0569O2649L803o3506
416c3851J2561O0541k8255n2045M2214L7737n2001j9565N6757P09n6769J6848
428a5119N1940l1933m2328M3274K8860n0903j3699N5564k542n7314J9514N4070
440C9384l5738m4651M8380L0799n5660j5241N7982K0n6008J4363N0535k6642m2681
453c5158L6316L3754m3345k3214M7375R857m7221N164M2154j8545l4155K7365
465C47K5434l1832j6877L3082P758l2493J641L1226j0634k9757J9344K6918k7416
478c259k0524L3403J1126l5573j456L4924o135l3294J2297L1466j8622k8889K5437
491I01K5183l2461k0075L8633J2071m2216r00M1019j1316l5897K1285K9881k8048
$$ plain form
404 26265 -38984 -17505 43048 6606 -44484 4558 41730 -16228 -36797 25852 29655 -33851
416 -33851 -21290 39251 10996 -41049 1165 38902 -13099 -32664 24093 24802 -31967 -15119
428 -15119 36821 4888 -37440 5834 34694 -16209 -29908 25656 23114 -34200 -14686 39384
440 39384 3646 -41005 7375 38174 -17486 -32727 25255 25275 -30733 -16370 34165 7523 -35158
453 -35158 1158 34912 -8433 -31647 15728 25585 -21636 -16472 25682 7137 -27018 347
465 347 25781 -6051 -22928 10154 17912 -14581 -12940 18286 7652 -22105 -2761 24157 -3259
478 -3259 -23783 9620 20746 -14827 -16283 18641 12506 -20788 -8491 22975 4353 -24536 901
491 901 26084 -6377 -26452 12181 24252 -17964 -18864 22155 10839 -25058 -3773 26108 -1940
504a940k4594L2891J8384l6480q819L8663l832l8632J7844L5738l0785k8144M0265
517A0559J5454m4253n85M3290j2704m0091K3215L5837l2770k9353M1899J9000
529B9498m9346n803N3094q567n1629K2784M4039l5274l1153M3734J7051m7023
541a8595n208M6596m209m3604J4075L7842k5403k8801L6006J7438m2982m884M4246
554B2517q534l9232K1160K9101l0455j7843L5002Q732l6614j318L7141p171l6194
567b3708J7531L2564k7288k5627L4152J6127l7041m960L6228n451l2569J2316
579g726K8218j5131k4766J6843K1027k0427j5103K5144O948k8406J001K8145p322
592H445k4308J2078J7878j5782j1028J8488O180k0689l258K3384o51k5388P982
$$ plain form
504 -1940 -26534 6357 24741 -11739 -20558 18105 14273 -24359 -6515 29223 -1562 -29706 10559
517 10559 26013 -18240 -18825 24465 11761 -28330 -5115 30722 -2048 -31401 10498 29498
529 29498 -19848 -25651 27443 18876 -32753 -9969 34070 -1204 -32357 11377 28428 -18595
541 -18595 -23803 22793 18584 -25020 -10945 26897 1494 -27307 8699 26137 -16845 -21729 22517
554 22517 13983 -25249 -4089 25012 -5443 -23286 11716 20448 -16166 -17484 19657 12486 -23708
567 -23708 -6177 26387 -901 -26528 7624 23751 -13290 -18250 17978 12527 -20042 -7726
579 -7726 20492 5361 -19405 -2562 18465 -1962 -17065 8079 15027 -13379 -12378 15767 8445
592 8445 -15863 -3785 14093 -1689 -12717 5771 11951 -8738 -11996 11388 10737 -14651 -6669
605f669K4790j7262k0641K5225J4163l0021o420L1778j997l1486R877K9920j6281
618D976k8110K1718K5153k7914j8823L4286Q182l8306M265L7903j4719l3088K1875
631b602K5261k6475j5613K9618N900l1392K810L1990j0922l0367J9619K4747k8418
644e844j4669L4410K357l5730Q834L2818j7869k7518K5051K0835l0519j3510L3899
657A2545N867l5258K641L4903j2608l1887K2870K5580l0065j6830L2448P640l0975
670a3129J020K7961r057k4425J5742K0259k0492j5358K3441R007k5286p97K5207
683A4093q474k2214J6079J6856k0325j1039K2121N841k3010p22K3377m487k2576
696a4480R765K0803j5077j7893K0417J3387k4440p454K5544J556k4056L238K1699
$$ plain form
605 -6669 18121 859 -19782 5443 19606 -10415 -16835 14943 12946 -18540 -8663 21257 4976
618 4976 -23134 -1416 23737 -4177 -23000 11286 19468 -18838 -14573 23330 8611 -24477 -2602
631 -2602 22659 -3816 -19429 10189 16089 -15303 -12493 19497 8575 -21792 -2173 22574 -5844
644 -5844 -20513 13897 16254 -19476 -10642 22176 4307 -23211 1840 22675 -7844 -21354 12545
657 12545 18412 -16846 -14205 20698 8090 -23797 -927 24653 -5412 -22242 10206 17846 -13129
670 -13129 -12109 15852 6795 -17630 -1888 18371 -2121 -17479 5962 14969 -10317 -11114 14093
683 14093 5619 -16595 -516 16340 -3985 -15024 7097 12938 -10072 -10794 12583 8096 -14480
696 -14480 -4715 16088 1011 -16882 3535 16922 -7518 -14972 10572 12128 -11928 -8690 13009
709A3009p733j9680J2692J7133j7504j3449K0769Q646k2337k643K2356m559k0395
722a3695J1838J6446j7156j1435K0145O576k1847j230K2860n312k2196J2370J9307
735A6671j8670j4856K3701R206k7421k408K8616n004k6745J1449K2850j6635j8497
748a7743K1304J3654k5396p519K7469O58k6551N993K3571j2078j9110J7682J3197
761A5131k1678o289K3052k02k2253N787K0217j1420j6863J7094J1413k1542m776
774a2329K3691j716k4014P788K2623j3769j8997J9016J3476k2443p361K4312J722
787A1999k5254M084K4803j0003k1820J4931J6863j8169j1322K0315N592k1726
799i707M56K1284o153j8691J0315J4812j3352j0536J6058N314j8027P28J8153
$$ plain form
709 13009 5276 -14404 -1712 15421 -2083 -15532 5237 13883 -8454 -11097 11259 6700 -13695
722 -13695 -1857 14589 -2567 -14002 6143 12719 -9128 -10358 12502 7190 -15006 -2636 16671
735 16671 -1999 -16855 6846 16052 -11369 -13777 14839 9835 -16910 -5461 17389 754 -17743
748 -17743 3561 17215 -8181 -15700 11769 12427 -14124 -8131 15440 3362 -15748 1934 15131
761 15131 -6547 -12836 10216 10014 -12239 -6452 13765 2345 -14518 2576 13989 -7553 -12329
774 -12329 11362 9646 -14368 -6580 16043 2274 -16723 2293 15769 -6674 -14035 10277 11999
787 11999 -13255 -9171 15632 5629 -16191 -1260 15603 -2566 -13888 6427 12019 -9707
799 -9707 -9251 12033 5880 -12811 -2496 12316 -1036 -11572 4486 9800 -8227 -7499 10654
812A0654o254j6484J0523J3983j3968j0495J7078N627j9004Q3J9342n145j8690
825a2750R366J7395j3411j4652J6871J0061j8869m854J9416k1j9430M615J8618
838A2355r205j6101J2763J2153j4715p752J5795L240j6502J947J6178p024j4096
851a0964J0839J1005j3225p448J5017L137j6309K050J6249p143j4921J1121J2936
864A2344j4439j0285J7348O097j9202p24J9304m509j8233Q960J6756j3041j4204
877a3828J6592J0088j8589m908J9055l14j8626N653J7264j1023j4180J5292R405
890A1881j7445m166J7758j087j7194O572J5487j2128j2246J6471P893j8929l141
903a0274J9915k157j9504Q203J7244j3721j3246J7408Q861j9180m648J9931J50
$$ plain form
812 10654 4400 -12084 -1561 12422 -1546 -12041 5037 10664 -8340 -8257 11085 5940 -12750
825 -12750 -3384 14011 600 -14052 2819 12880 -5989 -10843 8573 8552 -10878 -6263 12355
838 12355 3150 -12951 -188 11965 -2750 -10502 5293 8533 -7969 -6022 10156 3132 -10964
851 -10964 -125 10880 -2345 -9793 5224 8361 -7948 -5898 10351 3208 -11713 -592 12344
864 12344 -2095 -12380 4968 11065 -8137 -8861 10443 5934 -12299 -3339 13417 376 -13828
877 -13828 2764 12852 -5737 -10645 8410 8096 -10530 -4877 12387 1364 -12816 2476 11881
890 11881 -5564 -9730 8028 6941 -10253 -3681 11806 -322 -12568 3903 11796 -7133 -10274
903 -10274 9641 7484 -12020 -3817 13427 -294 -13540 3868 12729 -6451 -11099 8832 8982
916H982j9579M867J7595r451j4378J2925J0618j5569o395J7066J439j6608L299
929e189J4044o786j0769R179P770j1504m592J3538Q92j4166K944J3180o342j1096
943h897R684Q199j2755m439J4531P20j4505J877J3670l883j2989O482J1834r791
957b62r581J2475O609j4006l562J4655K42j4383L259J2849n945j0468P535Q380
971G797r078o338J1478L396j3541N92J3736m474j1969P797Q961j0987n163J3568
985E775R52j4631K545J4214n288j3313Q455J1825j2827q727J7008L953j8996J314
999g741J8571o068j6528J0382J3347j3754r172J5455M965j5825j128J6029l177
1012E356j5900Q223J3817j2611r314J4646L595j4654J836J3680o511j2068R911
$$ plain form
916 8982 -10597 -5730 11865 2414 -11964 961 11579 -3990 -10385 6681 8120 -8488 -5189
929 -5189 8855 2069 -8700 479 8249 -3255 -7847 5691 6583 -7583 -4639 8541 2199 -8897
943 -8897 787 8986 -3769 -8208 6323 7043 -7462 -5585 8085 4202 -8787 -2305 9529 -262
957 -262 -9843 2632 9241 -4765 -8327 6328 6570 -7813 -4554 8295 2350 -8118 -583 7797
971 7797 -1281 -7619 3859 7255 -6286 -5694 8042 3568 -8401 -604 8357 -2630 -7793 5775
985 5775 6727 -7904 -5359 8855 3567 -9746 -1291 10534 -2293 -11020 5988 9941 -9055 -7741
999 -7741 10830 4762 -11766 -1384 11963 -1791 -10963 4492 9457 -6368 -7496 8533 5356
1012 5356 -10544 -2321 11496 -1115 -10429 4217 7812 -6842 -5006 8674 2163 -9905 6
1025FR488j1487o375J2067L203j3060O35J4390n306j4110R621J1397j2030p363
1039h924J2790L501j2943k01J2575k444j1450M245J0024n884q951Q243P355j0840
1053b904m268J1677L20j0151K995P847n206o256O841N269p769m024P995K399q344
1068c579R6R330l765r880P753Q498j0235n574J0582K608j0385k85J0775j994j1351
1083g406M384J1162o758j0126R451Q112j2378m648J4225K43j3535L721J1014o335
1097A126q512Q444O653j0514m583J1913J565j1975K246J1032o751r423J1269O464
1111H954j4233k182J4291k205j2295N619J0278q410q873J1105P100j3228m118
1124h197J4263L92j4305L708J3402p675j0906J0588O900j1467k972J0919L20j0407
$$ plain form
1025 6 9494 -1993 -8368 3699 6902 -6158 -5523 8867 3561 -10549 -928 10469 -1561 -8924
1039 -8924 3866 7367 -5576 -5777 6798 4354 -7096 -2851 7173 1289 -7662 581 7936 -2904
1053 -2904 -7172 4505 4825 -5326 -2331 5516 310 -5946 895 6164 -1605 -5629 2366 4765 -3579
1068 -3579 -3483 5847 2082 -7798 -45 8453 -1782 -7356 3226 5834 -4551 -4836 5939 3945 -7406
1083 -7406 -3022 8140 1382 -8744 707 8819 -3559 -8207 6018 6261 -7274 -3553 7461 1126
1097 1126 -7386 1058 7711 -2803 -7386 4527 6092 -5883 -3637 7395 644 -8779 2490 8954
1111 8954 -5279 -7461 6830 4625 -7670 -2051 8227 -183 -9056 2049 9149 -4079 -8197
1124 -8197 6066 6458 -7847 -4139 9263 1588 -9318 1270 8170 -3297 -6269 4650 4970 -5437
1138e437J410J0113l466q990N855O484p979l472R556N01j0293K443R428m963o891
1153e701O457M185p194k507Q291J442r720L31J0364k886r597N449Q019p715o128
1168f910R518L622j0282r24R750j092q967K340Q729l866q321O063O542q018l547
1183e363R046N81r303J968Q909m203p302N945M799o907k500P750P19r036J370
1198c527R881m303r051P135O615r084l880J0295J188j1046J723J0778m408r468
1212g152O298P911p708o277R350L873j0709l30J0766l168r435N581P664p191n553
1227f080Q346K673q730M68Q201l017p519M946O833o952n338Q739K493r328O98
1242c567Q853l205q169N249P378p120n808Q398L697q715j729Q772j48q961K565
$$ plain form
1138 -5437 -4027 6086 2620 -6370 -515 5969 -2010 -5482 4074 4575 -5718 -3275 6153 1190 -5701
1153 -5701 756 4941 -2253 -4760 3531 4973 -4747 -4416 5948 3062 -6535 -1086 6933 -782 -6910
1168 -6910 2608 6230 -4052 -4976 4774 3682 -5285 -2945 5784 1918 -6403 -340 6202 -1816 -5363
1183 -5363 3683 4264 -5039 -3071 5838 1635 -5667 278 5077 -1830 -4330 3420 4139 -4897 -3527
1198 -3527 6354 2051 -7000 135 6750 -2334 -6214 4081 5269 -5777 -4054 6724 2316 -7152
1212 -7152 -854 7057 -651 -6928 2422 6295 -4414 -4744 6022 2854 -6581 -1000 6664 -527 -6080
1227 -6080 2266 4939 -3791 -3323 4878 1861 -5658 -712 6121 -831 -6169 2570 5063 -4265 -3567
1242 -3567 5286 2081 -6088 -839 6539 -581 -6389 2009 5706 -3009 -4738 4034 3886 -5075 -2510
1257b510Q570n179p038O833N004p398l235P606J273p722J261P092l690n826N288
1272C29M576o416l189P508R74p926J961P165m435n803O125M629p575l206Q789
1287C506J007r039J421Q263l403p415N215O529p252m965Q704K656q832n51Q191
1302D035j180p494L096O570n128m864O484K922o811j334O850l04o647K491N670
1317D356m682l872O003K115o669p59P165r43p207L097O202m990m684O244L349
1332D725p369j978Q406P3q547K050P612l620o318M878N151o300l623P529J600
1347D269p758K58P176j704o449L243N399n081l581O351J382o674L50O548j811
1362A918o280L602N337n505l450O772J393p404M06P822k218p719M326O549o071
$$ plain form
1257 -2510 6060 881 -6157 676 5680 -1718 -4953 2653 3926 -3796 -2535 4557 867 -4959 329
1272 329 4905 -1511 -4700 2808 3782 -4144 -2183 4982 547 -5256 869 5498 -2077 -5283 3506
1287 3506 4513 -4526 -3105 5158 1755 -5660 -445 6084 -1168 -6133 2571 5227 -3605 -4156 4035
1302 4035 2855 -4639 -1543 5027 -101 -4965 1519 4441 -2370 -3704 3146 2842 -3805 -1314 4356
1317 4356 -326 -4198 1805 3920 -2749 -3508 3657 2714 -4493 -1396 4806 -184 -4868 1376 4725
1332 4725 -2644 -4622 3784 3857 -4690 -2640 4972 1352 -4966 -88 5063 -1237 -4860 2669 4269
1347 4269 -3489 -3231 3945 2241 -4208 -965 4434 -647 -4228 2123 3505 -3169 -2819 3729 1918
1362 1918 -4362 -760 4577 -928 -4378 2394 3787 -3617 -3211 4611 2393 -5326 -1000 5549 -522
1377e22m546P022K643p729q72Q349j207q335L422P120n061n271N978L353o736
1392b392j260P236j144o795L160N541m273m176N069K816n965q21O501j552o079
1407d134L427N143m587m192N489K924o224j109O273p32n868J942N664l005n573
1422d562M283M762n360l069N656J316n480N5N481j350n291K688M495l495l411
1437c282L910K481m525j284N299p19n294K787M339m142l173M775K191n362r42
1452b941N805q73n671K587N283l966n022N463M318o915k415P483m2o960K050O205
1468D389l452n653M724M795n804l237O258J422o351L39O403k464n881M715M107
1483D310o117j697O210k07n767J560N367l048m573M743L195o054j684O873K82
$$ plain form
1377 -522 -5068 1954 4597 -3132 -4004 4345 3138 -5197 -1775 5345 284 -4987 991 4344 -2392
1392 -2392 -3652 3584 2440 -4355 -1195 4346 73 -4103 966 3782 -2183 -3004 3497 1945 -4134
1407 -4134 -707 4436 -151 -4343 1146 4070 -2154 -3263 3010 2278 -3590 -1648 4016 1011 -4562
1422 -4562 -279 4483 -877 -3946 1710 3026 -2454 -2399 3082 1732 -3559 -871 3624 129 -3282
1437 -3282 628 3109 -1416 -2700 2599 1880 -3414 -627 3712 -430 -3603 1172 3363 -1999 -2941
1452 -2941 2864 1991 -3680 -1093 4190 224 -4798 665 4983 -1932 -4347 3136 3094 -3866 -1816 4389
1468 4389 937 -4716 8 4803 -1001 -4238 2020 3442 -2909 -2570 3833 1369 -4512 203 4310
1483 4310 -1807 -3504 2706 2499 -3268 -1708 3659 611 -3962 781 3976 -2078 -3762 3111 3393
1498C393p316J589O887l887n190N635L004o205j576O119Q64o108J05N829j613
1513A530n029L035M037m127l063N028J646n327K97M574j741l261K128K531k203
1528E5k285K862J677l808m73M368o87m584J696M339k913l322M091J581m600l23
1544b326M598P2m875P5N359j174n151K976M146m580k894N655J598o084K2N684
1560C101j717m472K730L428l225k992L964K356n127o41N779j671n447L508M409
1575C983m676k918N463Q61n750J239N463k497n057K997M900l816m210N296K394
1590C672o494j2O728j870o156L090N027m055l375M657J576m694m22M539k54m691
1606b734J395M577l204l459M648J661m961L2M496j388l788K676K996l590k195
$$ plain form
1498 3393 -3923 -2334 4553 666 -4524 1111 4115 -2090 -3666 2453 3317 -2791 -2686 3143 1530
1513 1530 -3499 -464 3573 -554 -3617 1411 3057 -2270 -1973 2601 860 -2401 -273 2258 55
1528 55 -2230 632 2309 -1499 -1972 2396 1709 -2875 -1179 3160 247 -3075 1016 2597 -2003 -2326
1544 -2326 2272 2344 -2531 -2456 2903 1729 -3422 -446 3700 -880 -3774 1881 3479 -2605 -2583 3101
1560 3101 1384 -3088 -358 3070 -155 -3147 817 3173 -1954 -2595 3184 1513 -3934 -426 3983
1575 3983 -693 -3611 1852 2713 -3037 -1798 3665 1168 -3889 -892 4008 192 -4018 1278 3672
1590 3672 -2822 -2834 3894 2024 -4132 -1042 3985 -70 -3445 1212 2788 -1906 -2328 2211 1957 -2734
1606 -2734 -1339 3238 34 -3425 1223 2884 -2077 -2045 2451 1063 -2725 -49 2947 -643 -2838
1621b838L808J787l814j453M225L38m780J623M590l283l762L810K868l729k050
1636b660L701J011l743m6L788n61l960J187M106k345l498L736J942m256k91L904
1652B015p62l365J569K996k621k471L570J732m101r82M449j83m755K083M492m204
1668e38l325N334J935n387q41N126k00n002J652M705l094m042M027L339m743k290
1684c344N366N80n411J410M478k759l174L220K225l595j422M117K87m293R72L838
1700B495j988l178L036K395m254j118N007m02m705J469L863j982l257K730K763
1715B874l813j913M574Q62m684pM513r13m229K149L399l247k122L568J092l499
1731a396n26L635j66l750J312L247k305k275K911J423l465n49M063o57m062J856
$$ plain form
1621 -2838 970 2757 -1057 -2510 1715 2053 -2727 -1104 3486 203 -3559 251 3119 -610 -2660
1636 -2660 1041 2052 -1691 -1737 2051 1490 -2470 -1283 2823 478 -3020 716 2658 -1598 -1889 2015
1652 2015 1253 -2112 -543 2453 -168 -2639 931 2663 -1438 -2420 2029 1846 -2909 -826 3666 -538
1668 -538 -3863 1471 3406 -1981 -2822 2304 2104 -2898 -1246 3459 365 -3677 350 3689 -1054 -3344
1684 -3344 2022 2602 -2809 -1399 3079 320 -2854 366 2591 -1004 -2426 1691 1978 -2315 -1343 2495
1700 2495 507 -2671 365 2760 -1494 -2612 2395 1993 -2712 -1243 2620 638 -2619 111 2874
1715 2874 -939 -2852 1722 2584 -2100 -2107 2406 1493 -2736 -587 2812 -435 -2557 1011 2103 -1396
1731 -1396 -1922 1713 1547 -2203 -891 2356 51 -2224 687 2110 -1355 -1904 2159 1502 -2560 -704
1747g04L318k514k529K970J941l788j137M646j63m853J356M397k159l837L005
1762e1L062m034j738M636K77m522P60M169j463l855K459L124l509j696L941K53
1778A813l853P84L770j805l490K914K534l667j139L737nl701Q61L864j936l680
1794b999L016K844l526j829L623J019l818j03M090j111l829K085L151k467k556
1809b410K689K027l153j060L437k24l222J147K822j693k573K320K039l024q99
1824a777L232l37k994J222K839j983k729K956K148l707j028L878m2l768R45L804
1840B659k063l638L278K825l951j797M014R23m035k5M140j299l813K553K946l190
1856d73k078L443J340l690k43L711j166l100K271K268k840j617L290R73l776K05
$$ plain form
1747 -704 2614 100 -2429 541 2482 -1306 -2443 2203 2040 -2813 -1457 2940 781 -3056 -51
1762 -51 3011 -1023 -2761 1875 2152 -2370 -1610 2559 1096 -2759 -300 2824 -685 -2381 1560 1813
1778 1813 -2040 -1256 2514 709 -2781 133 2667 -1000 -2139 1598 1593 -2108 -1247 2617 681 -2999
1794 -2999 17 2861 -665 -2494 1129 2148 -1670 -1773 2317 1206 -2623 -538 2613 146 -2410
1809 -2410 279 2306 -847 -1907 1530 1306 -1916 -769 2053 360 -2213 107 2146 -878 -1777
1824 -1777 1455 1118 -1876 -654 2185 202 -2527 429 2577 -1130 -2158 1720 1678 -2090 -1145 2659
1840 2659 596 -3042 236 3061 -890 -2687 1327 2250 -1785 -1810 2330 1031 -2782 -229 2717 -473
1856 -473 -2551 892 2232 -1458 -1701 2010 844 -2256 15 2283 -557 -2174 1116 2089 -1687 -1482
1872a482L703j549l016K451K260l055j734L708R58m150J77L911j155l273J749
1887d97K784k400k312L241J440l662l90L400k83k925P15K655j446k171K249J339
1903A737k582o50K548K73k642K89K673j271k163K079J331k397q00K639N05l084
1919a515J31L302j079k933J846K401k410j983L190J319l917j91L953q21l436J369
1935g74K955j914k572K829J764l682n43L809m74l538J252L132k214k322L197J025
1951A930l578K11L379q81l200J505L090k494k459L456J264l823r1L797q30l764
1967b488J821L392k777k457L094J397k930p56K996J34l358Q76L334j907k578K336
1983A29J672k425q05K600j58k622J156K155j586j597J563J386j851j091K528K09
$$ plain form
1872 -1482 2221 672 -2344 107 2367 -688 -2422 1286 2244 -1906 -1729 2182 1027 -2246 -497
1887 -497 2287 -113 -2425 816 2256 -1406 -1796 1604 1321 -1604 -889 1766 320 -1851 398 1737
1903 1737 -845 -1495 1053 1326 -1316 -1027 1646 375 -1788 291 1622 -775 -1575 1064 1569 -1515
1919 -1515 -1384 1918 839 -2094 -248 2153 -257 -2240 950 2269 -1648 -1839 2114 1293 -2143 -774
1935 -774 2181 267 -2305 524 2288 -1394 -1937 1872 1398 -2140 -888 2244 30 -2292 905 1930
1951 1930 -1648 -1437 1942 1061 -2139 -634 2456 -38 -2497 959 2223 -1600 -1691 2106 1276 -2488
1967 -2488 -667 2725 -52 -2509 585 1982 -948 -1704 1292 1426 -1932 -1056 2278 371 -2207 129
1983 129 1801 -624 -1429 1171 1013 -1609 -453 1702 116 -1481 82 1468 -383 -1474 1054 1263
1999A263k921R39K581j646k083K018J735k456j248K733N69k571j01K403j85k691
2015a661Q89L023k003k639K730J703k705q43K527J29k596P02K571j427k253J705
$$ plain form
1999 1263 -1658 -719 1862 216 -1867 151 1886 -570 -1818 915 1484 -1087 -1188 1215 1030 -1661
2015 -1661 -772 2251 248 -2391 339 2042 -663 -1506 1021 1150 -1446 -744 1827 400 -1853 -148
$$ [...]
8191D8
##END NTUPLES=NMR FID
##END=
