##TITLE=1H_Akr1
 CDCl3, 8 sc, 
 17.12.2020
##JCAMPDX= 6.0         $$ Bruker NMR JCAMP-DX V2.0
##DATA TYPE= NMR FID
##DATA CLASS= NTUPLES
##ORIGIN= UXNMR, Bruker Analytische Messtechnik GmbH
##OWNER= root
$$ XWIN-NMR		Version 3.5
$$ Thu Dec 17 11:51:07 2020 Russian Standard Time (UT+4h)  she@DPX200
##.OBSERVE FREQUENCY= 200.1315066352
##.OBSERVE NUCLEUS= ^1H
##.DELAY= (6, 6)
##.ACQUISITION MODE= SIMULTANEOUS
##.ACQUISITION SCHEME= undefined
##.AVERAGES= 8
##.DIGITISER RES= 18
##SPECTROMETER/DATA SYSTEM= spect
##.PULSE SEQUENCE= zg30
##.SOLVENT NAME= CDCl3
##.SHIFT REFERENCE= (INTERNAL, CDCl3, 0, 15.7039)
##AUDIT TRAIL= $$ (NUMBER, WHEN, WHO, WHERE, WHAT)
$$ ##TITLE= Audit trail, XWIN-NMR		Version 3.5
$$ ##JCAMPDX= 5.01
$$ ##ORIGIN= Bruker BioSpin GmbH
$$ ##OWNER= she
$$ F:/spectra/data/she/nmr/H-F/1/audita.txt
$$ ##AUDIT TRAIL=  $$ (NUMBER, WHEN, WHO, WHERE, WHAT)
(   1,<2020-12-17 11:49:55.45 +0400>,<she>,<DPX200>,
      <created by zg, POWCHK disabled, PULCHK disabled
       configuration hash MD5:
       00 E9 B6 7A A2 85 ED C7 34 08 36 98 17 FE 4E 26
       data hash MD5: 16K
       FB F5 AA 2A 4C EE FA FB 5A F9 A9 3F 4F 1D 6B 06>)
$$ ##END=
$$ 
$$ hash MD5
$$ 56 F6 D8 AD B8 49 3D 3E 2C 05 02 8B 14 3F C5 D9
##$RELAX= 
##$RELAX= 
##$RELAX= 
##$RELAX= 
##$RELAX= 
##$RELAX= 
$$ Bruker specific parameters
$$ --------------------------
##$DU= <F:/spectra>
##$EXPNO= 1
##$NAME= <H-F>
##$PROCNO= 1
##$TYPE= <nmr>
##$USER= <she>
##$AMP= (0..31)
100 100 100 100 100 100 100 100 100 100 100 100 100 100 100 100 100 100 
100 100 100 100 100 100 100 100 100 100 100 100 100 100 
##$AQSEQ= 0
##$AQ_mod= 1
##$AUNM= <au_zg>
##$AUTOPOS= <>
##$BF1= 200.13
##$BF2= 200.13
##$BF3= 200.13
##$BF4= 200.13
##$BF5= 200.13
##$BF6= 200.13
##$BF7= 200.13
##$BF8= 200.13
##$BYTORDA= 1
##$CFDGTYP= 0
##$CFRGTYP= 5
##$CHEMSTR= <none>
##$CNST= (0..31)
1 1 145 1 1 1 1 1 1 1 1 1 1 1 1 1 1 1 1 1 1 1 1 1 1 1 1 1 1 1 1 1 
##$CPDPRG= <>
##$CPDPRG1= <>
##$CPDPRG2= <>
##$CPDPRG3= <>
##$CPDPRG4= <mlev>
##$CPDPRG5= <mlev>
##$CPDPRG6= <mlev>
##$CPDPRG7= <mlev>
##$CPDPRG8= <mlev>
##$CPDPRGB= <>
##$CPDPRGT= <>
##$D= (0..31)
0 1.2 0 0 0 0 0 0 0 0.06 0 0.03 0 0 0 0 0.0002 0 0 0 0 0 0 0 0 0 0 0 0 
0 0 0 
##$DATE= 1608191394
##$DBL= (0..7)
120 120 120 120 120 120 120 120 
##$DBP= (0..7)
150 150 150 150 150 150 150 150 
##$DBP07= 0
##$DBPNAM0= <>
##$DBPNAM1= <>
##$DBPNAM2= <>
##$DBPNAM3= <>
##$DBPNAM4= <>
##$DBPNAM5= <>
##$DBPNAM6= <>
##$DBPNAM7= <>
##$DBPOAL= (0..7)
0.5 0.5 0.5 0.5 0.5 0.5 0.5 0.5 
##$DBPOFFS= (0..7)
0 0 0 0 0 0 0 0 
##$DE= 6
##$DECBNUC= <off>
##$DECIM= 32
##$DECNUC= <off>
##$DECSTAT= 4
##$DIGMOD= 1
##$DIGTYP= 9
##$DL= (0..7)
0 120 120 120 120 120 120 120 
##$DP= (0..7)
150 150 150 150 150 150 150 150 
##$DP07= 0
##$DPNAME0= <>
##$DPNAME1= <>
##$DPNAME2= <>
##$DPNAME3= <>
##$DPNAME4= <>
##$DPNAME5= <>
##$DPNAME6= <>
##$DPNAME7= <>
##$DPOAL= (0..7)
0.5 0.5 0.5 0.5 0.5 0.5 0.5 0.5 
##$DPOFFS= (0..7)
0 0 0 0 0 0 0 0 
##$DQDMODE= 0
##$DR= 18
##$DS= 0
##$DSLIST= <SSSSSSSSSSSSSSS>
$$ [...]
##$SUBNAM2= <"">
##$SUBNAM3= <"">
##$SUBNAM4= <"">
##$SUBNAM5= <"">
##$SUBNAM6= <"">
##$SUBNAM7= <"">
##$SUBNAM8= <"">
##$SUBNAM9= <"">
##$SW= 16.9725356469052
##$SWIBOX= (0..15)
0 0 2 0 0 0 0 0 0 0 0 0 0 0 0 0 
##$SW_h= 3396.73913043478
##$TD= 16384
##$TD0= 1
##$TE= 0
##$TE2= 300
##$TE3= 300
##$TEG= 300
##$TL= (0..7)
0 120 120 120 120 120 120 120 
##$TP= (0..7)
150 150 150 150 150 150 150 150 
##$TP07= 0
##$TPNAME0= <>
##$TPNAME1= <>
##$TPNAME2= <>
##$TPNAME3= <>
##$TPNAME4= <>
##$TPNAME5= <>
##$TPNAME6= <>
##$TPNAME7= <>
##$TPOAL= (0..7)
0.5 0.5 0.5 0.5 0.5 0.5 0.5 0.5 
##$TPOFFS= (0..7)
0 0 0 0 0 0 0 0 
##$TUNHIN= 0
##$TUNHOUT= 0
##$TUNXOUT= 0
##$USERA1= <user>
##$USERA2= <user>
##$USERA3= <user>
##$USERA4= <user>
##$USERA5= <user>
##$V9= 5
##$VALIST= <valist>
##$VCLIST= <CCCCCCCCCCCCCCC>
##$VD= 0
##$VDLIST= <DDDDDDDDDDDDDDD>
##$VPLIST= <PPPPPPPPPPPPPPP>
##$VTLIST= <TTTTTTTTTTTTTTT>
##$WBST= 1024
##$WBSW= 4
##$XGAIN= (0..3)
0 0 0 0 
##$XL= 0
##$YL= 0
##$YMAX_a= 532578
##$YMIN_a= -527537
##$ZGOPTNS= <>
##$ZL1= 120
##$ZL2= 120
##$ZL3= 120
##$ZL4= 120
##$ABSF1= 10
##$ABSF2= 0
##$ABSG= 5
##$ABSL= 3
##$ALPHA= 0
##$AQORDER= 0
##$ASSFAC= 0
##$ASSFACI= 0
##$ASSFACX= 0
##$ASSWID= 0
##$AUNMP= <proc_1d>
##$AZFE= 0.1
##$AZFW= 0.1
##$BCFW= 1
##$BC_mod= 2
##$BYTORDP= 1
##$COROFFS= 0
##$CY= 11.3945322036743
##$DATMOD= 1
##$DC= 2
##$DFILT= <>
##$DTYPP= 0
##$F1P= 15.9154993809931
##$F2P= -4.1035820241983
##$FCOR= 0.5
##$FTSIZE= 0
##$FT_mod= 4
##$GAMMA= 1
##$GB= 0.15
##$INTBC= 1
##$INTSCL= 1
##$ISEN= 128
##$LB= 0.24
##$LEV0= 0
##$LPBIN= 0
##$MAXI= 10000
##$MC2= 0
##$MEAN= 0
##$ME_mod= 0
##$MI= 1.114404
##$NCOEF= 0
##$NC_proc= 0
##$NLEV= 6
##$NOISF1= 3.799351
##$NOISF2= 2.8
##$NSP= 1
##$NTH_PI= 0
##$NZP= 0
##$OFFSET= 15.70392
##$PC= 1
##$PHC0= -10762.02
##$PHC1= 13.20094
##$PH_mod= 1
##$PKNL= yes
##$PPARMOD= 0
##$PSCAL= 0
##$PSIGN= 0
##$REVERSE= no
##$SF= 200.130013532006
##$SI= 16384
##$SIGF1= 3
##$SIGF2= 2
##$SINO= 400
##$SIOLD= 16384
##$SREGLST= <1H.CDCl3>
##$SSB= 0
##$STSI= 0
##$STSR= 0
##$SW_p= 3612.71676300578
##$SYMM= 0
##$S_DEV= 0
##$TDeff= 0
##$TDoff= 0
##$TI= <>
##$TILT= no
##$TM1= 0
##$TM2= 0
##$TOPLEV= 0
##$USERP1= <user>
##$USERP2= <user>
##$USERP3= <user>
##$USERP4= <user>
##$USERP5= <user>
##$WDW= 1
##$XDIM= 8192
##$YMAX_p= 0
##$YMIN_p= 0
$$ End of Bruker specific parameters
$$ ---------------------------------
##NTUPLES= NMR FID
##VAR_NAME=  TIME,          FID/REAL,        FID/IMAG
##SYMBOL=    X,             R,               I
##VAR_TYPE=  INDEPENDENT,   DEPENDENT,       DEPENDENT
##VAR_FORM=  AFFN,          ASDF,            ASDF
##VAR_DIM=   8192,          8192,            8192
##UNITS=     SECONDS,       ARBITRARY UNITS, ARBITRARY UNITS
##FACTOR=    0.0002944,     1,               1
##FIRST=     0,             0,               0
##LAST=      2.4114304,     0,               0
##MIN=       0,             -527537,         0
##MAX=       2.4114304,     532578,          0
$$ Real data points
##PAGE= N=1
##DATA TABLE= (X++(R..R)), XYDATA
0@%%%%%%qJ6j6J6j6K4l2M0n6P2q8J12j36J60j92K32k78L26l81M43n15N94o82P86
30D21q98J018j154J305j472J656j857K079k323K586k872L187l533L910m321M769
46B501n258N793o379P024p735Q521r392J0361j1451J2683j4084J5696j7574J9797
60A0503k2469K5752k9889L5270m2582N3085o9425R8225j62519N22822k8298q56889
72d66414R93831q46954K03553M51819o81795M36668k55452J53535L86501o71037
82b95745M61679k37518j30319O21691m71477J9185K0832j07452K22147k77398
92a74375K30060j98185N1285N23641m97196J61202q7270k63920M82812m23483
102a95429K48055l8223l75208Q50761o21782m3484N59006q69126P13378R9176
$$ y = [0, 0, 0, 0, 0, 0, 0, -8, 8, -8, 8, -8, 16, -16, 24, -32, 40, -48, 64, -72, 88, -104, 128, -150, 176, -205, 238, -277, 317, -365, 421, -477, 541, -613, 692, -780, 876, -981, 1098, -1225, 1361, -1511, 1676, -1857, 2053, -2268, 2501, -2757, 3036, -3343, 3681, -4054, 4467, -4925, 5436, -6015, 6668, -7416, 8280, -9294, 10503, -11966, 13786, -16103, 19167, -23415, 29670, -39755, 58470, -104049, 418773, 390475, -466414, 527417, -319537, -115984, 335835, -345960, 90708, -164744, -11209, 375292, -295745, 165934, -71584, -201903, 419788, -51689, -32504, -11672, -119124, 103023, -174375, 55685, -142500, -91215, 432426, -64770, 96432, 9162, -254758, 228054, -195429, 52626, 14403, -360805, 489956, -131826, -175310, 383696, -485430, 227948, 327124]
112C27124o59413N77059m57963J25422K47162m39832M53029l30456J70731M23650
122D36513o73288L41366r7231k94988M96012k77388J097O0245k8897J96081k62029
133a02507J80515j14894r5590M15567l35288O9203k2224k04581L58543l18360
143a69616K02265Q1192l64447O40172l66802j95400M32097n93658L56207J34298
153A56308l77002L88128k96313J61395J34892l81284M11396k90312P523M12725
163C27456n07295J80173K8455k41468K99452j28433O3821L895k0041J99745k97363
174i1603J10839j9688k00163L16863j58683K9625N5454j39687K47485k42441J04646
185A2647J17174l35971M13549j69545k12842L18417l50339J74099J11899j92500
$$ y = [327124, -332289, 244770, -213193, -87771, 159391, -280441, 172588, -157868, 12863, 436513, -236775, 104591, 7360, -287628, 208384, -69004, -67907, -7662, -36559, 159522, -102507, 78008, -36886, -132476, 283091, -52197, 17006, -5218, -209799, 148744, -169616, 32649, 113841, -250606, 389566, 22764, -172636, 259461, -334197, 22010, 156308, -220694, 167434, -128879, 32516, 167408, -213876, 197520, -92792, -85269, 327456, -179839, 334, 28789, -212679, 86773, -41660, 22161, 26056, 6015, 205760, -91603, 19236, -452, -200615, 116248, -42435, -12810, 42644, -97043, 150442, -91999, 12647, 129821, -206150, 207399, 37854, -174988, 143429, -206910, -32811, 79088, -113412]
195a13412K80091k20171J17679Q7346l44136K93646j78524p6994L26644k70809
205i8640J06421M8404j30492J51473j25429R8309k5272q0415K01521k24572L2984
216d5708O6150j67699J91895m8289L3085N4645j15163J61240j89925J967J32680
227G4878k47163K31067r908j43937K06306j72605O6590M5561j15316J78099j57202
238d3630N6927P7174k37758J77038o9327o5032K02139j15502P5531O804p8263
249a3899O9914j37483P2919J330q1907J67261j01261P851P0119j10232Q8369l4838
261a857J0792M7030r6543R2005q9272m3851J08623j14921R9692M8810o7450R3466
273H6524q2911k148j389p5715R1451o0901K9276P0535j00465P5897k1247m2795
$$ y = [-113412, 166679, -53492, 64187, 151533, -192603, 101043, -77481, -154475, 172169, -98640, 7781, 56185, -74307, 77166, -48263, 50046, 24774, -55641, 145880, -78692, -45708, 20442, -147257, 44638, -3651, 29434, 84079, -31084, 130156, -59769, -57802, 74878, -172285, 58782, 48874, -95063, 111243, -61362, 5228, 50789, -64527, 113572, -43630, 13297, 90471, -147287, 29751, -39576, -104608, 97531, -17971, 57560, 64364, -13899, 56015, -81468, -8549, -7219, -89126, 78135, -23126, -15275, 54844, -55388, 32981, -1857, 8935, 55965, -40578, 51427, -37845, -81696, 26927, -87994, 11698, 60508, -6942, 86524, 3613, 1465, 76, -75639, 15812, -45089, -15813, 54722, -45743, 30154, 8907, -33888]
285c3888P8430m9191L5548n375m4773L1121p5787L1340K3489l0555R3823k2172
297C2010k952K6403p1841J2178k2271j1435L8923k1781L7062m817k3524L3336
309B1291l2804J7128K6177k5329K1084k0056k9767j406j8141J5121J9255K2898
321A5451K6228q712j915j7168l7557L046q39q962L3500M438j3505J8378j4127
334a744n097J7907j834J3936j1382n009q530m7103K6750k173r610P0677j4212
347B2576q59K3097m6561m672j8641N31J1379j1260N0876k9818j0134M3089n1691
360b2088L0619J7592k4504K6234l2261J3420l8355k5211O8205o2330O4339N2550
372F8210q9472Q0813m3836m7568N1616p5562N7705r295j5596Q7228j14344N6721
$$ y = [-33888, 44542, -4649, 30899, 25524, -19249, 11872, -63915, -32575, -9086, -39641, 54182, 32010, 29058, 55461, -16380, -4202, -26473, -37908, 1015, -20766, 16296, 11479, -12045, 21291, -11513, 5615, 31792, 6463, 27547, 7491, -22276, -23682, -41823, -26702, -7447, 15451, 41679, 32967, 31052, 13884, -23673, -20627, -21466, -30428, 3072, 7510, -5995, 12383, -1744, -6841, 11066, 9232, 23168, 11786, 6777, -1753, -48856, -22106, -24279, -33889, 36788, 22576, 21717, 44814, -1747, -6419, -25060, -24529, -13150, -24410, 26466, -3352, -13486, 29603, -22088, 8531, 26123, 1619, 27853, -4408, 9012, -29343, -54554, 13651, -48679, 15660, 68210, -21262, 59551, 15715, -31853, 19763, -55799, 1906, -7389, -22985, 64243, -50101, 6620]
384F620L7739j06191J24737m5218m5607P8761p8496K0980k4991j1364N7884m7556
396c2702R1834j9543o2567P9020p7061O020J0448l4039M5889l9926P9910m2010
408E273o6626J33843j19239N0049Q5698j59907J13419m3756m7249Q5564j36104
419i9035J18191q910n2981J83192j90382L4422J00643j89219J42584m0002p8366
430g9863J29725p4042N9450l5964m9433J06503r3793P8356J2709j18546Q9567
441B4669l7255j739n641j8166O5224o5340J29260l9764j36962J70156j37362K3837
453b9083J05208j84511J43687l9501j5557J21965k18506J58349k502j27871K54465
464A66143k28154q937J69723k09509J49897l8021q6568J61884r6726R6887m5218
$$ y = [6620, 44359, -61832, 62905, 17687, -27920, 50841, -27655, -6675, -31666, -43030, 14854, -32702, 59132, 39589, -22978, 56042, -21019, -14999, -4551, -38590, 7299, -32627, 47283, 5273, -61353, 72490, -46749, 3300, 88998, -70909, 42510, -1246, -48495, 37069, -99035, 19156, 10246, -42735, 140457, -49925, -15503, 85140, -104079, 38505, -1497, -79863, 49862, -24180, 35270, -694, -50127, 56376, -37417, 40939, 53648, -64898, 24669, -12586, -14325, -19966, -38132, 27092, -38248, 91012, 51248, -85714, 84442, -52920, -29083, 76125, -108386, 35301, -4200, -19757, 102208, -116298, 42051, 39549, -88322, 166143, -62011, -70948, 98775, -110734, 39163, 1142, -85426, 76458, -20268, 76619, 31401]
475C1401j25764J56280j06843L3442O2093j28762P8770J5987J7096m2557k8941
486c7798Q3613j02924J31528j1153j87125J78676j00209J3207J06574j82192J59372
497E1569n0984j310J50234k92848J62941K5182j85131K94438k16277l4214K16059
508A19659k04189J57339n9353j10923J90993j40152J07233r431j89355J85071
518D6892o5674p777P9629j03320N8051J3458N2262o7464q3955J24549j16106R1129
530B1674N6106j93300J51863m0998Q137P4168j75216J57186p7043n263J85398
541A62712l23620J51833P6701k17055K95836j75683o2476K23662j96159J43733
551G9484o8945j35108K06819j51492R8024L9704j96212J76341l6120j8604N1723
$$ y = [31401, -94363, 61917, -44926, -11484, 50609, -78153, 617, 16604, 33700, -8857, -37798, 45815, -57109, 74419, 63266, -123859, 54817, -45392, -32185, 74389, -107803, 51569, 585, -725, 149509, -143339, 19602, 44784, -140347, 154091, -62186, -96400, 119659, -84530, 72809, 13456, -97467, 93526, -46626, 60607, 51176, -138179, 46892, -18782, -26559, 53070, -50250, 7801, 21259, 73521, 6057, -77898, 46651, -69455, 21674, 77780, -115520, 36343, -4655, 3482, 77650, -97566, 59620, -17423, -22686, 162712, -160908, -9075, 67626, -149429, 146407, -29276, -91752, 131910, -64249, 79484, 10539, -124569, 82250, -69242, 28782, 68486, -127726, 48615, 12495, -6109, 45614]
562D5614r5365O8709l2410O2545k1089j39455J42892o6497K7151Q5347j43852
573f6410R8313l4966K9509L9816j92735J81268q1924m4402K41530k95950R8940
584b7011J32450k23302K31762j19280p9429J83470j65341J31416o2796j24112
594a22173K03964j43375Q2961O3824j79501J48923l9539j9736L8759j06221Q9764
605A7650m1991L7581M4069j38105J09111k5902o058O0753j08050Q6264o0937K7408
617A793P5248k09248J70331k3557j04215K39259k06114K2366J30990j80779J51394
628F7468q8013n0641J39299j45239J41639m5431j19630J93418j37716M6376P4749
639G6279j55615J14876l7223j3084M0176r6297R6374m0400J4093P0432j20589
$$ y = [45614, -49751, 18958, -13452, 49093, 28004, -111451, 31441, -35056, -7905, 77442, -66410, 31903, -3063, 26446, 66262, -126473, 54795, -27129, -71531, 169999, -125951, -27011, 105439, -117863, 113899, -5381, -84810, 98660, -66681, 64735, 1939, -122173, 81791, -61584, 21377, 85201, -94300, 54623, 15084, -4652, 34107, -72114, 17650, -24341, 13240, 57309, -80796, 28315, 2413, -3645, 57108, -50942, 35322, -25615, 1793, 77041, -132207, 38124, 14567, -89648, 149611, -56503, -34137, 96853, -83926, 67468, -20545, -71186, 68113, -77126, 64513, 19082, -100548, 92870, -44846, 1530, 76279, -79336, 35540, -1683, -14767, 25409, -70888, 25486, -14914, -821, 69611, -50978]
650e0978P6928k0839k3542N2927r6193Q7947m5400n318J11222j73014J06746K4816
662D5302j22541J72581j21532o892R3079j28655J16360p3766k4892J23032j38816
673f6740J22222j2970j19666J52206j07057J2339O2706j04185Q9965m0552J0134
684a598L9606r2123R5051m4440j5218P7694j01138N5725j1619l1009N8022p9605
696e0652P5141j6571l7429J06825j19525M3294L8560j04866J07025o1891o413
707b6502O7116q8710Q9914m8615k8271R7723j11290P2165Q807q9904R8756o8750
719b7561R487M0142o3133P6956m5519J1401M0900q6941P2575l3508k8806O8607
731C4600o9565M5297k682k9154N6085o4724M6950K173n2042P9299o8563R471L8055
$$ y = [-50978, 25950, 5111, -18431, 34496, -61697, 26250, -19150, -24468, 86754, -86260, 20486, 45302, -77239, 95342, -26190, -33082, 59997, -68658, 47702, -26064, -50956, 72076, -66740, 55482, 42512, -77154, 75052, -32005, -19666, 43040, -61145, 28820, -11732, -1598, 38008, -54115, 40936, -3504, -18722, 58972, -42166, 13559, 1940, -29069, 28953, -50652, 24489, 7918, -29511, 77314, -42211, 1083, 39643, -65223, 41802, -20089, -26502, 40614, -48096, 41818, -6797, -35068, 62655, -48635, 23530, 32337, -57567, 41189, -27561, -18074, 22068, -41065, 35891, -9628, 1773, 42673, -44268, 28307, -5201, -34007, 34600, -34965, 10332, 7650, -21504, 34581, -30143, 16807, 18980, -33062, 46237, -22326, -12855, 25200]
744B5200p0018O4252k6873m564M8219o0070N4110k5362l1475O1352o8723L5385
756A433J5372m8914O0122l9957R398K2494m3144N1356l4726Q59L2730n9193M3783
769A1613j5407k1573M8515m1108L0289K333k7111L8716m3641J6811R541l7607
781b8629M6878k8279J501K7338l8676L2843j1772r504K8182l4059K2069p133k0165
794a9406L0601k9797J6867J2863k3046L1188j8877k677J3211k5413J7666q335
806e155l789J7391j9552J6729k057j2174K0629j4624M587O284j3209P035p941
819e846K449O47n032J5713q720M647R080j7145P289j338q509P224m906L759K99
834c89j384R135j0741K430J1805j4868P049O720k1151J0570M049j5507J4693k820
$$ y = [25200, -44818, 19434, -7439, -12003, 36216, -23854, 30256, 4894, -26581, 34771, -33952, 1433, 16805, -32109, 28013, -11944, -2546, 19948, -23196, 28160, -6566, -5707, 27023, -32170, 11613, -3794, -25367, 23148, -17960, 12329, 14662, -12449, 26267, -17374, -563, 8978, -28629, 18249, -10030, -8529, 18809, -19867, 12976, 1204, -8300, 19882, -14177, 7892, 759, -19406, 11195, -18602, -1735, 11128, -11918, 19270, 393, -2284, 10927, -14486, 3180, -5155, -8944, 8447, -11105, 5624, 3567, -8607, 12022, -2602, 1985, 8269, -4940, 2095, -5846, -3397, -2750, -7782, 7931, -789, 3858, 12938, -4207, 3082, 1744, -6765, 459, -4447, -688, -389, -1773, 7362, -3379, -949, 10856, -4012, 3037, 9757, -11394, -824, 3225, -12282, 2411, -409]
848d09k608J3570j0884P322p347j0487K2011k1611L751J9035l1306K3470P284
861A1791k5464K2076q864k456J1947j1672M659j1866M671J1696j6894J1898L5
874A557m952J0769p74n884j4281J9531m774j5768L3109l3731M074L6690m1734
887a6168K5820p085j9505M2751l9140K0359M42m5816O9893l7635j3548N4694o7067
900c2005M0707K0383n3181L9852k9180P364K5810l6098K9191k4330J14M0640l9122
913i855R477L100j0547J6696l477p60l0423K8073J4318l7486M6433l8655o844
926a9950N7997n6019L0999j7402k9374P6021o7002L0848J6545q5572J10360l9580
938G871m3073Q1111r0752M9065L3320p1621N5231m8457J8975M6684o7404M7835
$$ y = [-409, -3017, 10553, -331, 6991, -356, -10843, 11168, -10443, -6692, 12343, -18963, 4507, 11791, -13673, 8403, -461, -2917, 9030, -2642, 2017, -9849, -5178, 6518, -10376, 1522, 1557, -3395, 7374, 6600, 716, -13565, 5966, 1192, -14576, 18533, -15198, -11124, 25566, -16168, 9652, 2567, -16938, 25813, -13327, 7032, 7474, -38342, 31551, -6084, -19632, 35062, -32005, 8702, 29085, -24096, 15756, -13424, -6060, 19750, -16348, 12843, -11487, -11373, 29267, -9855, -378, 2722, -7825, 8871, 5394, 4634, -25789, 2284, 16602, -20884, 25549, -13106, -19950, 38047, -17972, 13027, -4375, -33749, 42272, -24730, 6118, 22663, -62909, 47451, 7871, -35202, 45909, -44843, 4222, 37542, -34079, 21152, -27305, -8330, 38354, -29050, 18785]
950A8785k7385j6605O7122m8679k735N829o327K1458r336J1051m2968K4178L9152
963C3540n4614M4044l6062j5633P1559o3150L8378k3248m3346J09333q4618K3208
975f09M0482j16894J25364k5481o7045R1824r8907N6058L9926q3919P3003o7830
987c4028K0634P2486r7340N4119j7841l4689Q1976m6440r983K052O77K8469k4142
1000d050K3093m6118R697N9512o2358L7374k9854k1262Q0309o9481M3072j9584
1012C50o1181J29027q8297P716N8915j27795J23028j4170p3553R4969j04686O2656
1024F979M2320r8935R2393p5819O396R5887j09179M7054k196m2172P7162l9451
1036D39m185j0145K859M1746m5391L2915l2891j4280P2702n7584K5408j8451k5387
$$ y = [18785, -8600, -25205, 41917, -6762, -9497, -3668, -9995, 11463, 2127, 13178, -29790, -5612, 33540, -21074, 22970, -13092, -28725, 42834, -20316, 18062, -5186, -48532, 60801, -23817, -609, 39873, -77021, 48343, 22862, -44183, 47641, -51266, 4792, 44718, -39201, 33802, -34028, -13394, 59092, -38248, 15871, -1970, -36659, 45317, -1123, -11106, -9054, -8377, 20092, -4050, 19043, -27075, -17378, 42134, -20224, 17150, -12704, -33966, 46343, -23138, 19934, 350, -60831, 68196, -20101, -12385, 46530, -81265, 41763, 27593, -45960, 49009, -55677, 6979, 49299, -49636, 42757, -33062, -26666, 69221, -39958, 7096, 4900, -37272, 39890, 439, -3746, -13891, -11032, 30714, -14677, 18238, -14653, -28933, 43769, -13815, 11593, -6858, -32245]
1049c2245P8736p1104M3558r590p5146J32837q1032o326P2438j27555J11526p068
1061B9029p5138R8992j06571N7351M8713j07153R7281o4699j0255R7063r7082
1072c2469L8334k305l3280O5489m7215J8396j7112j3073O3232n7999K5256n153
1084B101l3771O5224m2852J7636j3802k6222P6254p3339M0190J0104q7935J23661
1096E7249o2494k3348Q0584j15142Q6873J921p0797R4495r4564M4754M8347r9264
1108e1386R0598n4230j3840Q1359q4771M4266j2479k7030O5088o0084L3672q065
1120C098l2940O9746n4335J5462Q285l6860N4529m0687K2108l572l9378P9816
1132D5272o6644J9333L6977q9909R2901l3735l4802P3270q7869O0812M673n8527
$$ y = [-32245, 46491, -24613, 18945, 9355, -65791, 67046, -13986, -20312, 52126, -75429, 36097, 29029, -46109, 52883, -53688, 3663, 52376, -54777, 42504, -22195, -32450, 64613, -32469, 5865, 3560, -29720, 35769, -11446, 6950, -10162, -23235, 39997, -18002, 7254, 2101, -31670, 33554, -9298, 8338, -5464, -31686, 44568, -28771, 11419, 21523, -66412, 57249, -5245, -28593, 51991, -63151, 23722, 25643, -45154, 49341, -45223, -469, 47878, -51386, 39212, -15018, -28858, 52501, -32270, 11996, -483, -27513, 37575, -22509, 11163, 3098, -29842, 39904, -14431, 1031, 9316, -27544, 26985, -13702, 8406, 4834, -34544, 45272, -21372, -2039, 34938, -54971, 37930, 4195, -30607, 42663, -45206, 15606, 20279, -38248]
1144c8248Q3680p9175L2235M2701q7633Q0344m3974j6418O7254p3395M7297j2835
1156A833k6431O1668o2137L5562m18m1416O3930m9622J5457J3132l9551N4659
1168B6666m2440J8144J6002n3251P0026m5580m862M8023p3450O0043j3982l2131
1180b6792O1273o5147M2369N893n0885P1200o0696J5733L8562o9752O1885k8650
1192e007j4629N1191n7687M2653j1296k5422N2606n6828L0740N103m0551N5816
1204B6689m1718J3682J8453m0861M9691l6110N774K7187n2809N1829k5528j4795
1216a8516M5537n3983L8808l569k8500M9619m8882K5117R203m3128N2659l8951
1228a4586N507L0805m8440M4796j8895j1252L5941m4954L3301q905k2748M1804
$$ y = [-38248, 45432, -33743, -1508, 41193, -46440, 33904, -10070, -26488, 40766, -32629, 14668, 1833, -24598, 37070, -25067, 10495, 10077, -31339, 32591, -17031, -1574, 11558, -27993, 26666, -15774, 2370, 18372, -34879, 35147, -10433, -15295, 32728, -40722, 19321, 5339, -26792, 34481, -30666, 11703, 17596, -33289, 37911, -22785, -7052, 31510, -38242, 23643, -5007, -19636, 31555, -26132, 16521, 5225, -20197, 32409, -24419, 6321, 11424, -29127, 26689, -15029, -1347, 17106, -23755, 25936, -10174, -4400, 22787, -30022, 21807, -3721, -18516, 27021, -26962, 11846, 8277, -20223, 29396, -19486, 5631, 14834, -28294, 24365, -14586, -9079, 21726, -26714, 18082, -813, -12065, 23876, -21078, 12223, 3318, -19430, 22374]
1240B2374m2684K2307Q712l2757M3437l0875Q065J8331l6893L7243k4771k827
1252a0338K6857l9576L4413j0226j5062L5787l6716K2290J353k4915L4590l1593
1264a3136J1959J1601l0939L5846k1775J020K2938l2424K8606j1892j1919K5505
1276A5390l1143J9672r08j7248K9650k4785J1999Q791k3056K5825j8196J90J3666
1289I847k3551K0321j0384l524J8066k1074J8696m656j0182K0102k2312J0384
1301A733J643j6050K0864j5948O283R215j8047K2020j1970l689J5462k2540J3919
1314B895q43j3215J7125j3114N427P806j1211J2557p562j235Q239j2083M508n76
1328a282m742O786j057K08m86L237Q97l544M659q121Q89N034p447N517l884p88
$$ y = [22374, -20310, 1997, 10709, -22048, 21389, -9486, -1421, 16910, -19983, 17260, -7511, -10338, 16519, -23057, 11356, 1130, -13932, 21855, -14861, 7429, 8782, -16133, 18457, -13136, -1177, 10424, -20515, 15331, -6444, -5424, 17514, -14910, 13696, 1804, -10115, 15390, -15753, 3919, 3011, -14237, 15413, -9372, 2627, 11418, -11638, 14187, -4009, -3819, 9847, -13704, 6617, -3767, -7291, 10775, -10299, 8397, 3741, -6441, 13661, -8651, 1733, 3376, -12674, 8190, -7758, -1475, 7740, -10307, 11713, -257, -3946, 11516, -11024, 2895, 2052, -11163, 5962, -7152, -1725, 6081, -5130, 7427, -135, -1370, 6869, -5214, -706, -1282, -6024, 762, -295, -87, -573, 2664, 3561, 17, 4676, -3445, -2556, 2478, -4969, 548, -3336, -4124]
1344d124J0362p288N823q9j0234J3430o830p043J0123j2302M675J1487j3092P095
1358A993J890p676J4010q388o973R681j3232J0348M419j9314J7405l740n141K1814
1372A7096k1410O87J3058j7262J4309p214j3267J7905q049O770M557j6429J3128
1385C879J486n238N511j0307m136J0627Q09p479L706j562k564J9908j3097o534
1399d991J1419j7131J9462l676k3961K6647j9396J1494K2940m3332K8341q09k0267
1412a3260M0901m0462n18K6424l0809L2443j3343k1040L4781k0298J4020N659
1424A4498l3482K3554k530m542Q964j7947L511R744Q526p435n895N334q427K2677
1438A6550j3031j8976K1256k3116K6733M935m0117M1410k3412N705L8338o4918
$$ y = [-4124, 6238, -1050, 4773, 4684, -5550, 7880, 1050, -5993, 4130, -8172, -3497, 7990, -5102, 1993, 3883, -3793, 10217, 1829, -5144, 4537, -8695, 1653, 6072, -13242, 4163, 423, -4718, 17096, -4314, -3627, 9431, -7831, 6478, -736, -14003, 3902, -4147, 2623, 7180, -9249, 3879, 5365, 127, 5638, -4669, -8805, 1822, 2631, -4848, -1142, -2704, -5268, 14640, 1543, -4991, 6428, -10703, 8759, 5083, -18878, 7769, -11627, -133, 22807, -20525, 7816, 7007, -13260, 27641, -12821, -13339, 13085, -17724, 14719, 1376, -19664, 15117, -5181, 8839, 14498, -18984, 4570, 2040, -2502, 6462, -11485, -7974, 1770, 10296, 2861, -3034, 2300, -6127, 16550, 3519, -15457, 5799, -17317, 9416, 14351, -25766, 15644, -7768, -2063, 36275, -28643]
1450b8643L1515N089l2286N6991n0007j932L9878m2339M7023j8811l3333M9660
1462B2805l3632J7545Q393m5638L3681l228j309J3590k5287J0728O154Q242n603
1475F441j6940R897j1440K4387p570k5259L0438k5099K6514J3684n3792M6428
1487A7689k3389n103M9242p2538L1469J2922l8506O7752n3077m537M7055n3016
1499b4037N2680k0637m2895N8014l9514K0677J4075n0375M1704o526m49J6528
1511A9245l3816J4544J7O146L86k3057J7280j2384K2446K846l3453L4844k5401
1524a0357J5094K4060o1326M3322j6626j3263N7414o9869K9696J9379m5493P1341
1536D3372n4205j0126N1079o2283N4235j5416m6133O3954m0499K1057J8359n1371
$$ y = [-28643, 2872, 7961, -24325, 32666, -17341, -19273, 20605, -21734, 25289, 6478, -26855, 22805, -10827, 6718, 15111, -30527, 3154, -74, -1383, 12207, -13080, -2352, 3802, 12044, 6441, -10499, -602, -12042, 12345, 4775, -20484, 9954, -15145, 11369, 25053, -28739, 17689, -5700, -10803, 38439, -34099, -2630, 10292, -28214, 39538, -13539, -18076, 28979, -24037, 28643, 8006, -34889, 23125, -16389, 4288, 18363, -32012, 9692, 3166, 2717, 19245, -14571, -27, -10, 6136, 6522, -16535, 745, -11639, 10807, 13653, -19800, 15044, -10357, 4737, 28797, -32529, 10793, -5833, -19096, 38318, -31551, -1855, 17524, -27969, 43372, -10833, -20959, 30120, -32163, 22072, 6656, -39477, 24477, -16022, 5035, 23394, -27977]
1548b7977M2199j3886Q9J6053l8339K2940o939O357J1080k9416K5836j2874J1200
1561F323J4155m1055L2272j9984K201L0946n5910L9225p784j8776N8830o3872
1573b3429K4127K1659n3417O7001m6264j5389N3570n9689M8970n450m2489N9094
1585B8294m0100J8394J4777m8550M2045k2945L549J9784l9656L3221j1695J876
1597a006K0936l5983K7135j2997k266K1680m1022L0460j2605o160L7423m9191
1609b3596L3869q20k9512N5443n4344J2534K6237n3201N6888l0074j5378M8919
1621B6965n0390L9566m027l5395M9525m2567J7593J2539m2882M4393k4872M088
1633e464K5110l8944L4439j4717n435K4315l8645K7741j1622r607K9985l8337
$$ y = [-27977, 14222, 336, 425, 16478, -21861, 1079, -5860, 497, 11577, -17839, 7997, -4877, 6323, 20478, -20577, 11695, -8289, -6088, 24858, -31052, 8173, 389, -18387, 40443, -23429, 698, 22357, -31060, 35941, -10323, -25712, 27858, -31831, 17139, 11689, -30800, 28294, -11806, 6588, 21365, -27185, 14860, -8085, -4536, 15248, -24408, 8813, -2882, -1006, 19930, -16053, 11082, -1915, -4181, 17499, -23523, 6937, -5668, -11828, 25595, -23596, 10273, 9453, -20059, 35384, -18960, -6426, 19811, -33390, 23498, -6576, -21954, 26965, -23425, 16141, 12114, -23281, 26244, -16323, 1270, 13809, -29073, 15320, -9552, -5464, 19646, -19298, 15141, 424, -5011, 19304, -19341, 8400, -3222, -12829, 17156, -21181]
1645b1181L0004m076j6945L9370m3064K1536O454l5906M6374l7625N168K8497
1657A8606m3837M5001j9079j3442L9317m5150L0303m153l0298M3105l8159J5954
1669a832J4851l5179M1279k3221J566K2241l7178L1129j7022q744K7097l6322
1681b1335K8671n654j4892L3915l3941K0378L654k6890L4859l3087J0662J3746
1693A0086l3025L8261k1913o75K7042l6007L1280j2152j5356L1006l6746K1544
1705C345N39k3460L6989k8507J2159J3705k9314L2197k2210n97J8458l2566K8107
1718H845j2579q433K8263l0325K3461j346j7829K8525k8746J1598N040k4279K9648
1731A1843k1860O155J7079k7159K8423j3820n678K1321k9748K0131o351j4134
$$ y = [-21181, 8823, 4747, -12198, 27172, -15892, 5644, 12098, -23808, 22566, -15059, -9891, 18606, -25231, 19770, 691, -12751, 26566, -18584, 11719, 7566, -22732, 20373, -17786, -1832, 13019, -22160, 19119, -4102, -2536, 19705, -17473, 13656, -3366, -12110, 14987, -21335, 7336, 1682, -13210, 20705, -13236, 7142, 10796, -16094, 18765, -14322, -3660, 10086, -22939, 15322, -6591, -7266, 19776, -16231, 15049, 2897, -12459, 18547, -18199, 3345, 3884, -19576, 17413, -11094, 1065, 14770, -14544, 17653, -4557, -5154, 13304, -19262, 8845, -3734, -12167, 16096, -14229, 9232, 7886, -9943, 18582, -10164, 1434, 6474, -17805, 11843, -10017, -3862, 13217, -13942, 14481, 661, -5017, 16304, -13444, 6687, 336, -13798]
1743a3798K5974k6058J6178M642j8535K8713k1499N230J0454k5386K2955j5402
1755f532k529J8221k3240K1521n517q154K1131k2707J3091n90j6117K0711j9541
1768a0252P424P148j6791K2573j3234L246J2110k0910J7843j0737o967J6613k1600
1781a3534J5367l95j0040K1033j7845Q823N534j7514J9298j4570j811J1940j8011
1794a1725J4944l701n629J4995j1863Q894l60r451R667j1648M512J364p925J1065
1808C139o273N589K808p543R448r001L792K850j4223J2618p764j147J2522j4749
1822g934J1354J374p262J4143j5135J736N559j4025J3753n991o828J5604q766
1835b418M601N533j2211P465q30l747L409p391N7N332j700K481R53l624N991L567
$$ y = [-13798, 12176, -13882, 2296, 6938, -11597, 17116, -4383, 847, 11301, -14085, 8870, -6532, -9061, 9160, -14080, 7441, 1924, -6230, 14901, -7806, 5285, 4695, -11422, 9289, -10252, -2828, 4320, -12471, 10102, -3132, 114, 12224, -8686, 9157, -1580, -8547, 8066, -13534, 1833, 1438, -8602, 12431, -5414, 3409, 8943, -8571, 10727, -3843, -5654, 6286, -11725, 3219, -482, -6111, 8884, -2979, 5915, 5555, -3896, 5771, -5877, -1365, -1, -7926, 3139, -3134, 2455, 5263, -2280, 7168, -1833, 1959, 4809, -9414, 3204, -4560, -5707, 6815, -7934, 3420, 4794, -2468, 11675, -3460, -1724, 3835, -10190, 3563, -2428, -9256, 6348, -2418, 2183, 7716, -4495, 2970, 2140, -1607, 1802, -5589, -5532, -200, -1900, 581, 1534, -2090, 3901, 7468]
1851G468q389J826k340o334J0841m312n822R296m970N824N888j1999M976j071
1865H82l161R375j2755j866R822q873J0754J904j4863J5373k93p457J0187j5986
1879f957r81J3453j1626Q668l040r430K0999q734j855Q513k1182J4869O687j9082
1893i698J2177q804k982K0505j1763R0L615o532J2634l981j1037K627l465M079
1907b535R135j0352l687J2629m451L685N931k2339J0409R750j5793J4350j4899
1920h167n647K6097j7191J1504l71k2304L2875j4365r592J8426l3702K1597J4232
1933A3392k5936K1464j3953j359K4578k0498M076l020r027K0971j0582o809M650
1946b053n343J0702P093q676p790J0094L46m831Q618k2432N066J9498j6899J6274
$$ y = [7468, -921, 905, -1435, -7769, 3072, -1240, -7062, 2234, -2736, 3088, 8976, -3023, 1953, 882, -2279, 7096, -5659, -7525, 2297, -6576, 4178, 6082, -8781, 6592, 6299, -1158, 9029, -6957, -7938, 5515, -6111, 2557, -483, -9913, 11086, 2352, 497, 9010, -12172, 2697, 9384, -9698, 2479, -6325, -9307, 11198, -565, -475, 3140, -3392, 9242, 5261, -5776, -3149, -6614, -2535, 6600, -3752, -7439, 5190, 739, 4424, 10355, -11984, -1575, 8175, -7618, 6732, -8167, -13814, 12283, -4908, 6596, 6225, -16079, 16796, 2431, -7161, 11265, -22437, -840, 13392, -12544, 8920, -5033, -6392, 18186, -2312, 1764, -1256, -10283, 10688, 106, -6703, -2053, -7396, 3306, 10399, 1723, -6067, 4027, 4373, -458, 8160, -14272, -9206, 10292, -6607, 9667]
1960I667j1804j0836L2313k3475R504K661l3480M1282j3603j5495K8871l8471
1972b2866K3540J8719l0483K4866k0034p73K5356k8434J1027o374j0238L0280
1984A4586j3969l210M963q115J2151O96n221j1103N521Q889j0693J1804j5447
1997i148j412K5254j8113J4194r115j7448L4220k6962O889J0600l8773M4594q202
2010F578j9098L3542l8985J9646J7297l3197K7276k4367J102K8287l2369J9167
2022D879o032j2901L3155j7184j187K487j0768J3085p080K516q754n12J9345j4596
2036c547J1348p152j1348K5188j9027R867l159k2183L5890k3984L385J9334l9268
2049b4656L9004l271k3009L2642l7133J4530J4938l2020L1191k2762J080L0911
$$ y = [9667, -2137, -12973, 19340, -4135, 5369, 8030, -25450, 15832, 2229, -13266, 15605, -22866, 674, 19393, -11090, 13776, -6258, -7031, 18325, -10109, 918, -5456, -15694, 14586, 617, -2593, 2370, -5745, 6406, 7102, 1881, -9222, -3701, 5188, -5505, 6299, -9148, -10560, 14694, -3419, 10775, 1660, -15788, 18432, -8530, -1641, 8959, -29814, 14780, 6578, -12520, 21022, -17963, 1683, 18980, -14217, 13059, -11308, -10206, 18081, -14288, 4879, -1153, -14054, 19101, 1917, 730, 3217, -7551, 5534, -1546, 970, -7784, -8296, 11049, -3547, 7801, 649, -10699, 14489, -4538, 5329, 2170, -20013, 15877, -8107, -4722, 14612, -24656, 14348, 11077, -11932, 20710, -16423, -1893, 13045, -18975, 12216, -10546, -9466, 21445]
2061B1445l3987K0771m896j6512K8729j9575L786j32j0654J8897j4714R649k220
2074E87j0269K4962j7186N550P52j7920K2426j7233P807N725k3593L5243j8514
2087a663m522K5292l8382K7559M98k4017L1201l0706J1905J4287k8636L2130k0037
2100e091p51K7282l3255J9509o044j6044K5418k0938J1045J240j1925K4022k0458
2113e990R195L878j9564K4889j6462J918P312j9332K3218j5508M085J5088k7275
2126a4548K9508j1672j3547K6016l2271J7154M327k0073K8803k3151J0041J2169
2138A2756k7099K8575j8236l611K2931k9680J9236m635j2573K3644k1528J5069
2150D849J310j4484K4131k3314P171O590k1874K4063j4258K063J3682k1005K2607
$$ y = [21445, -12542, 8229, 3333, -13179, 15550, -4025, -239, -371, -11025, 7872, -6842, 2807, 587, -9682, 15280, -1906, 3644, 4396, -13524, 8902, -8331, -524, 5201, -18392, 16851, -1663, -6185, 19107, -19275, 8284, 8782, -15235, 15966, -14740, -2835, 11452, -17184, 14946, -5091, -5842, 21440, -11815, 7694, 1650, -14394, 11024, -9914, 1131, 2371, -9554, 14468, -5990, 3205, 7083, -12481, 12408, -4054, -2136, 5176, -14156, 9062, -6446, -2361, 12727, -14548, 14960, 3288, -10259, 15757, -16514, 640, 4967, -15106, 13697, -9454, 587, 12756, -14343, 14232, -4004, -7615, 15316, -14364, 4872, 237, -12336, 11308, -10220, 4849, 6159, -8325, 15806, -7508, -337, 6253, -15621, 8442, -5816, -3753, 9929, -11076, 11531]
2163A1531j2597m071J9141k7146K0162l845j5624K4114k3428J1772O477j7640
2175a1154K5898j8973N208J1152k6426K3273j3284n497K0901k2965J8203k846
2187C490j0433J9746k1426J3135Q21j6201K2924k0567N854R249k0521K2655j1305
2200b579J39J5240k1265J7636r788q224J8175k2360J5316J114j2971K1733j8288
2213f122P227O261j7608K0604j4838J097J1972k2007J8732p583n475J8620j8476
2226g596J4226j387j1798J6428j8924Q443L393j4198K0254j3179L385J0053j7552
2239h452J6408q808k832J2333j7173J3367n848p105J5763j6751J2379K259j1272
2252e732J7882j5346L112N074j6245J6834r682L58J2239j6792J5389m825q006
$$ y = [11531, -1066, -5137, 14004, -13142, 7020, 3175, -12449, 11665, -11763, 9, 6486, -11154, 14744, -4229, 979, 12131, -14295, 8978, -4306, -9803, 11098, -11867, 6336, 3490, -6943, 12803, -8623, 4512, 5333, -10868, 12056, -8511, -2657, 6592, -13929, 8726, -2579, -2440, 12800, -8465, 9171, -617, -8841, 9334, -13026, 2290, 3404, -9567, 12166, -6122, 1105, 7366, -10242, 10362, -4476, -3379, 8593, -13414, 5318, -2265, -7740, 10880, -7596, 6630, 5243, -6555, 9873, -9051, -608, 2785, -11413, 8841, -4338, -953, 9100, -8452, 7956, -852, -3684, 8649, -8524, 4843, -1005, -8110, 7653, -9098, 3281, 5540, -5732, 12150, -3196, -84, 4990, -11255, 5579, -4103, -3745, 8494, -8298, 7091, 2266, -5740]
2265e740J5208j5784Q376K377j1635J2728j1389L227O280j0223J3819p288P8P938
2279G972j3050P497n166l052Q477p750Q916m042k766J0465j2948Q550p83r336
2293g016J4360j1144K535L614j2071J4672o971O76J0364j5115J1727j789j1531
2306g689J2505j1697L200R095r883Q184l801j429P036p668M104j491l411O581
2320C636l964j939k70O43K125Q16M536p034K286M689r531N699m592m240J1783
2335D643o147M159j91q559J2856o888j701Q549j5249J0185M360j3498R672n671
2349c480k053J3570p312J013M17n462P536m550m963N046n046N506P779j1059J469
2364a589M941o755P284N7j1061P662R36l342M181q227K027P889l487O400o576
$$ y = [-5740, 9468, -6316, 2060, 4437, -7198, 5530, -5859, -2632, 3648, -6575, 7244, -44, 34, 7972, -5078, 2419, -2747, -5799, 2678, -5072, 3844, -198, -2964, 7501, -5447, 3103, 2320, -7016, 7344, -3800, -1265, 2349, -9722, 4950, -2021, -1345, 9019, -6096, 5631, 3842, -7689, 4816, -6881, -3681, 5414, -4469, 3715, -86, -1515, 5521, -2147, 1957, 466, -2945, 3636, -328, -2267, -2537, -1894, 231, 1047, 5583, -1451, 835, 5524, -4007, 1692, -2900, -7140, 4643, -1504, 2655, 2464, -6095, 6761, -127, -1828, 6721, -8528, 1657, 6017, -7481, 2191, -3480, -5533, 8037, 725, 1738, 2155, -3307, 4229, -321, -5284, -238, -5284, 222, 8001, -3058, -1589, 3352, -3403, 3881, 3938, -7123, 539, 1475, -1867, 2314, -5913, -3886, 4003, 516, 6916, 340]
2379C40o645J2206o860k621P013j2766Q531J0707j2487L966j129o271J3113m825
2393B272n258M500q145J0437Q55j3585J1530n321M23J7401j8098j264R588j2228
2407f893J1126k285j2122J2504k230L607K577j4299Q144K034l269Q774j1133m283
2421g748J2560m365k820M637q280L965J2885r320k693J157p149J1336k541p770
2435f146Q470r635J1655P051k2238J4138m179p115K4191k0752l006J3536j4523
2448h553J4964m405j2224J5500p798Q984K243j9757J1901j474l572J1371j1780
2461d600j522J0281m12k762j191k558j298J0675l005p702L809n938R618O95j0826
2476f736J2125j0871P800J3106k7278J3150l1j3317K6221j7902l509J5312j5549
$$ y = [340, -6305, 5901, -959, -3580, 3433, -9333, -802, 9905, -2582, 1384, 255, -6016, 7097, 2272, -2986, 1514, -6631, 3806, 4661, -8924, 2606, -2715, -2292, 15109, -2989, -4253, 5335, -6893, 4233, 1948, -10174, 2330, 100, 3707, 6284, -8015, 129, 2163, -1106, 7668, -3465, -7748, 4812, 447, -2373, 2264, -6016, -2051, 10834, 1514, -1179, -22, -7171, 4165, 1624, -6146, 2324, -7311, 4344, 11395, -10843, 3295, -884, -7999, 16192, -4560, -7566, 5970, -8553, 6411, 2006, -10218, 5282, -2516, 6468, 8711, -11046, 855, -619, -4191, 7180, -4600, -6122, 4159, 3747, 985, -206, -2764, -4062, 6613, 3608, -4094, -285, -6223, 3395, 4090, -6736, 5389, -5482, 2318, 15424, -11854, 1296, 1265, -12052, 14169, -3733, -7242, 8070, -7479]
2489g479J7476p848j2345J7584j4022J1616M063k2429J5748k666l693J1261j1278
2502d012K000M329K103j008q141L315l679O252L754r481O130m966O396L591j5012
2517h429J3993r875N85J8820k6451J0029N292j6006K4170j4531l062J4595j7284
2530h154J8249r165j2850K0332j8187J1859P642k1278J6822m978k389Q955j2153
2543e295O314k491L044M101j3114R076m181O17Q691j0958Q064m682J046P610j8160
2558a0318J3693m520p096K2215k1100O271Q455j8011K0413j2341k774J3872j9056
2571a0297J8598p184j2887K1833j8491R153Q379j7496J5212p944p9N835j3512
2584h880J2605p389K107R836j5960J1308l233m622J0851j2251R109l594m326J2560
$$ y = [-7479, 9997, 2149, -10196, 7388, -6634, 4982, 9045, -13384, 2364, -302, -3995, 7266, -4012, -2012, 2317, 4420, 3412, -4729, -1414, -5093, 1159, 4913, -4568, 1562, -3404, 2992, 6583, -8429, 5564, -4311, -3726, 15094, -11357, -1328, 3964, -12042, 12128, -2403, -5465, 9130, -8154, 10095, 930, -11920, 8412, -9775, 2084, 9726, -11552, 5270, 292, -2097, 6858, -5295, 1019, -1472, 1572, 5673, -7441, 1635, -2546, -1929, 6762, -4196, 3868, -814, 232, 7842, -10318, 3375, -1145, -8241, 13974, -7126, -855, 7600, -10411, 10002, -2339, -5113, 8759, -10297, 8301, 1117, -11770, 10063, -8428, 725, 9104, -8392, 6820, -1124, -1203, 4632, -8880, 3725, -3664, -1557, 8279, -7681, 3627, 394, -4228, 6623, -5628, 3481, -113, -4439, 8121]
2598H121j7856J1467J072j2192K1266j5472J719J0119j7434J6091r674l739J4996
2611H484j8661J6405k821j2569J9920j7251O392O493j4430J5386j0660K137P123
2624E948j5532J5988q505j592J3503j5960J0620k907p494J2749j4635J0702j401
2637A484p769J6476j6704O908N930j5902J7143r659j139J0917j6259J4383p962
2650b153l457J4535j7079J3012m28j1407J6058j5163M275N735j2181J5915j0761
2663c099J765Q524j5788J4821p252l218J2626j5933J1083k070p580J2987j4329
2676g463R052J869j0572J6386j2538J623P421j5172J4577p941p48J1326j4589
2689f769J1889m684o084J3729j5722J0227J564j1958J5023j2153L154O359j2668
$$ y = [8121, -9735, 1732, 2804, -9388, 11878, -3594, -1875, 8244, -9190, 6901, -2773, -6512, 8484, -10177, 6228, 3407, -9162, 10758, -6493, -101, 6392, -8038, 7348, -3312, -1175, 5948, -9584, 6404, -2101, -3693, 9810, -6150, 4470, 1563, -5931, 6818, -7817, 2885, 1484, -6285, 10191, -6513, 395, 6325, -9577, 7566, -2093, -3232, 7685, -8574, 5809, -2153, -5610, 8925, -8154, 4858, 4430, -6977, 9081, -6082, -1807, 3928, -8253, 7662, -3099, -1334, 7190, -8598, 6223, -1029, -4247, 8379, -7554, 3529, 1459, -6121, 6866, -7463, 1589, 3458, -7114, 9272, -3266, -1643, 5778, -9394, 5183, -2758, -3506, 7820, -6769, 5120, 436, -5648, 8081, -7641, 2586, 4150, -7808, 7215, -4938, -1784, 4575, -8093]
2702h093J4737q148J85Q629j4314J1296n087n128J3371j3064R487j687p508J3054
2716G730j3461O475K751j0309J4555j0433J079P192j3535J2421n830k124J0797
2729G308j3334J0662l099o473J1939j3909P506K789j0852J4077r788J849O740
2742E415j2430J1301n110k001Q328j0779Q850k808o531J0785q884N766J319o771
2756c550P868p203L328J441p618J0821p789K691N348j1574J0512n326j540R077
2770F486j2185R451l163n366J1423j1879N232M276j0685J3876q213k096P896j0480
2784e427Q171k349m399Q573p811M600J687q060P821l723R97K825m659K171k260
2799a843L052r41l603O259n388L914K703q559O990m893J251N610r251P077l387
$$ y = [-8093, 6644, -1504, -1319, 7310, -7004, 4292, -795, -5923, 7448, -5616, 3871, 2184, -5324, 7730, -5731, 744, 3495, -6814, 7741, -2692, -1613, 5579, -7956, 4465, -1365, -3489, 7308, -6026, 4636, 1537, -4936, 7003, -6906, 600, 3389, -7463, 6614, -3174, -1325, 5415, -7015, 4286, -824, -2825, 5503, -5276, 3574, 766, -5765, 5020, -3864, 1902, 3221, -3550, 4318, -2885, 443, 1884, -5734, 5087, -2702, -11, 5337, -6237, 4275, -1051, -2591, 6486, -5699, 3752, 589, -4777, 6646, -5233, -1, 4275, -6410, 7466, -747, -2843, 5053, -5427, 2744, 395, -4004, 4569, -3242, 1358, 3045, -5015, 2806, -917, 80, 2905, -1754, 417, -1843, 1209, 268, -3335, 2924, -2464, 1450, 4153, -4406, 2584, -2309, -1058, 4552, -4699, 2378, -1009]
2814a009k967J2524j3387L213N327r992J1659n081n469Q830p370N402O16p802
2828e506P732l140J301M796r545K588L634k724K650j387l544K363M034l580j575
2843a903K535l432N086L57n255L679m770N231K722r097O495l201j689J2329j2580
2858c493lO728q732Q895j406p300P573l619L327K370r798O435J031m559P357o684
2874a878l529R774m778j59L203p801M509N614o121J199k367r38P754m851J21N27
2890B79o433R465J224r312O062l848r41J0695r643j415N626m098M856j48q508
2905f139P532k752K617M253j1364L494O249n763O984n060r082J3806l811j999
2919a035M414j0190O322N198n697L304o729J768R401q193K137k66o678J1529j745
$$ y = [-1009, -3976, 8548, -4839, -1626, 3701, -6291, 5368, 287, -5182, 3648, -3722, 1680, 2296, -5506, 2226, -914, 387, 5183, -4362, -1774, 1860, -864, 1786, 399, -3145, -782, 3252, -328, -1903, 632, -2800, 2286, 2643, -2612, 1067, -3703, 1528, 4250, -4847, 1648, -1553, -3242, 9087, -3493, -3496, 3232, -5500, 3395, 1989, -5311, 2262, -1357, 1970, 4340, -5458, 977, 2008, -2551, 4806, -1878, -5407, 4367, -411, -570, 2633, -5168, -659, 4955, -1166, 33, -2334, -3272, 4482, -369, -248, 279, -6154, 3311, 4535, -4777, 1285, -2563, -3504, 7191, -2452, -3867, 1759, -2339, 2517, 2369, -6139, 1393, -1359, 1258, 5511, -5853, -2359, 3890, -1873, 5111, 51, -9031, 4775, 964, -1035, 3379, -6811, -489, 4709, -988, 2316, -4413, -2645, 6756, -1437, 700, 434, -6244, 5285, 3540]
2934C540p901M651j495N78O192m712l891L469m87L205r20n218K883R9p15O508
2950E786j0028L20J0012q830N814k59j2625J4082k502l182N120j0669P969L400
2964D408p043Q101j0797K713R791j1104O214j707p391J0798j350m898K376j977
2978a866J688K642j453l156K05L068P86l11n464L206K404m341P772o991m717J2463
2994E935q626M434K848j3371J3453l048l034P529j3267Q804K477r330J1500j0696
3008d392J003J1060j2070O150N35p686R797m786J082o36k475N275k776J308j592
3023b03k328M289j359J957l529j426M836n899O943k860o725J2558p379k68N761
3038D368j1235R911j656m608Q949j1754P531J613r771J2897r049j120J2015j2783
$$ y = [3540, -4361, 290, -1205, -627, 5565, 853, -3038, 431, -56, 3149, 2229, -2989, -106, -7, -722, 5786, -4242, -3922, 6090, -2740, 3074, 2815, -9810, 4272, 1770, -1412, 3708, -6961, 1008, 4408, -2635, 5466, -5331, -2618, 7173, -3931, 2283, 576, -6815, 3983, 2633, -2265, 111, -1866, -178, 2464, 1011, -2145, -1940, 1128, 1914, 1603, -3861, -655, 1749, -2592, 5180, -1811, -6528, 5935, -2691, 1743, 4591, -8780, 4673, 1625, -1409, 6120, -7147, 1657, 4134, -5196, 6304, -4392, -3389, 7671, -4399, 1751, 2286, -5400, 4397, -389, 693, 57, -2418, 2857, 81, 1389, -203, -2531, 1758, 399, 2356, -1173, -2599, 2237, -3662, 3281, 421, -6304, 6254, -1125, -1393, 4368, -6867, 3044, 1388, -3220, 5729, -6025, 1506, 3119, -6652, 6245, -2804, -3924, 8091, -4692]
3052d692O740j224m711Q065p331M366j226m322R429p185K101J456o649R496n774
3067a461L296p79m387P672p066L019L505j0869J2746n624k882P799j1095Q297
3081B171j105n297J0847j2195O664L941j2056J2752q326q14R145j0848Q179l263
3095b05l392P969r264P885j554o322J1154r801L484L060q142R261o780K713K830
3110B896p163R162o810L60O434j1572J0590l215m938R992j0623O367k74o371J0948
3125E783j0061M646M472j0838J0893o745j166P666r845R016l764k512Q472j1131
3139e114P410n23p305J0883q759L471L074p549Q714p143K451M979r701J0661n443
3154A06k704P717j0731Q217j687m716R464q911M950O30p159J0682r262L023M745
$$ y = [-4692, 2048, 824, -3887, 4178, -3153, 1213, -13, -4335, 5094, -2091, 10, 1466, -5183, 4313, -1461, 1835, 1056, -3331, 4341, -2725, 294, 3799, -7070, 5676, 52, -2830, 4969, -6126, 2171, 1066, -4231, 6616, -5579, 1085, 5026, -7030, 5722, -2604, -3418, 5727, -5121, 3058, -205, -3597, 4372, -4892, 2993, 1439, -4883, 6271, -3530, -46, 3014, -5128, 4133, -2647, 66, 2896, -4267, 4895, -1915, -1555, 4879, -6693, 3897, 682, -4256, 5736, -4887, 1480, 1206, -5165, 5783, -4278, 368, 4840, -5998, 4895, -1850, -3016, 4650, -5195, 3821, 57, -2455, 6017, -5114, 2296, 1773, -5532, 5351, -3408, 63, 3137, -4412, 4302, -2841, -390, 4589, -5112, 5549, 106, -2598, 5119, -5612, 2605, 918, -3798, 5666, -3245, 1705, 2335, -4824, 5858, -3404, -381, 4364]
3169D364j0045R869n076k375Q113r644P566j902m397R242j0087N472l7o661R745
3184D147o844K948L612q201Q531o023P47M774r152Q993l665k858P838r672O390
3199A565m80m786R107q516M301J084q478J1234q182J820N649j0561J1296m328
3213G25l284P465r625O297k32m479P595q035L911K102p221R092n956R98M567p592
3229c672O801l990r27M495o313O941l276k023O907q684N753j556m351P923p522
3244c494N014M20p212J0069p314P35O474j0268R457k278n351Q009r047M260K326
3259A800n029P036n997J833L990p081N354l006j551N422m396L022j867o30K183
3274A083l229M248k670j22M422n980L979k274k992P034o768M728O01o713R968
$$ y = [4364, -5681, 4188, -888, -3263, 4850, -4794, 2772, 870, -3527, 5715, -4372, 1100, 1063, -5598, 4147, -2697, 251, 3863, -4338, 4193, -1830, -1083, 3691, -5461, 3532, -133, -2991, 4847, -4825, 1565, 1085, -3701, 5406, -3110, 1191, 2275, -6203, 5031, -3151, -1331, 4318, -6243, 5053, 725, -2559, 4906, -4719, 1578, 1346, -3133, 4462, -3573, 338, 2440, -4781, 4311, -1645, -647, 3920, -3672, 3129, -861, -1788, 2707, -3606, 3335, 59, -1964, 4943, -3741, 2012, 456, -3895, 4028, -3494, 1520, 1940, -5272, 4797, -2517, -1782, 4692, -5576, 3881, 1603, -3748, 4261, -4786, -526, 1800, -3229, 3807, -2190, -357, 3633, -3448, 1906, -1100, -2651, 2771, -1625, 1397, -470, -1100, 1083, -2146, 2102, -568, -690, 3732, -2248, 1731, -543, -3535, 3499, -3269, 1459, 2060, -4653, 5315]
3289E315p029L73N475j0716Q739L36n977P753q029K919M493o873P645n050j253
3304a879O841p396K785l1l551M773M6q91q62K35N85p98J633l524J151K701k511
3321f93L552m667o34N802n974N817j810o568R866n533j039M935r495P389K056
3336C004n419O884p362J582N447p112M880k036m166R483m606k350L223m344L196
3351C04L601l996o62N58q66K597o36l809K577P68L73K875o238Q14M273n445N839
3368B927k608n948R346l235j477L930q229N490L724m810N025o698l2O793o454
3383b256K568N8n290R219j420n332M083m381J881M677n552M02J629j794M785k533
3399G44m682M603j805K943K399p852K393L059m115N263l783l514P396j954p95
$$ y = [5315, -1714, -1341, 4134, -6582, 2157, 2493, -3484, 4269, -3760, -841, 3652, -3221, 4424, -626, -1879, 4962, -2434, 351, 320, -3231, 1542, 1588, 697, -165, 70, 655, -143, 1490, -2034, -883, 1818, -693, 2859, -1808, -2442, 3360, -2614, 3203, 1393, -5175, 4691, -842, -1881, 3054, -6441, 948, 3004, -2415, 4469, -2893, -1311, 4136, -2976, 1904, -132, -4298, 5185, 579, -1771, 1452, -2892, 304, 3905, -91, -753, -195, -1061, 1536, 900, -2909, -332, 436, 809, 3684, -2554, -1740, 2533, -2912, 2927, 319, -5629, 3717, 482, -995, 2935, -5294, 196, 3920, -890, 4135, -2563, -2595, 4198, -2256, 312, 370, -4920, 4299, 2879, -2453, 1630, -2751, -870, 3807, -1745, -1343, 286, -1508, 3277, 744, -3938, 665, -1140, 1803, 4202, -3650, -1257, 1802, -2313, 2950, -833, -4347, 3049, 1095, 300]
3414C00J852o413L230L132l259L156m017j293P791o225N88K875o468O752K755
3429D756p789M533l064j261O792o387J112K532l266P311m578m196N471n005M597
3444A558K590p972L222K066k558L999l908j519M582k17k18j224l491K712J134
3459G56j638J934j414k327O784k475l936M522n811L264M328p077L734j098j938
3474b392O453o924K902J130l953P701m260n391P313o241M078K653o499M061K68
3489H99j066K613m799J143K36M05K363k443q31Q27J293l18o03J499l259L779N14
3506B252n974M984l313N11N561o808L693P8k865O387o577J50M515o598P728l300
3522D24m155P291n954K511K638n119M787k629l3K265m803L488j811K87L679l944
$$ y = [300, 2152, -4261, -1031, 2101, -1158, 1998, -2019, -3312, 4479, -1746, -1158, 1717, -4751, 2001, 4756, -3033, 1500, -1564, -2825, 3967, -2420, -1308, 1224, -2042, 5269, 691, -3505, 1966, -3039, 1558, 4148, -3824, -602, 1464, -1094, 2905, -1003, -2522, 2060, 1843, 1625, 401, -3090, -378, 756, -882, 1052, -362, -2689, 4095, 1620, -2316, 2206, -3605, -341, 3987, -3090, 644, -454, -2392, 4061, -2863, 39, 1169, -2784, 4917, 657, -4734, 2579, -3662, 416, 3069, -3430, 631, 899, -167, 2446, -2353, -1210, -974, -569, 1794, -649, -1480, -653, 640, 322, -281, 1218, -2041, 1738, 2252, -3722, 1262, -2051, -1540, 4021, -2787, 906, 984, -1881, 4506, -2071, -1921, 2594, -4004, 3724, 424, -3731, 3560, -2394, 117, 2755, -2364, 2423, -206, -239, 2026, -2777, 711, -1100, -813, 2866, -1078]
3538a078J641l63J97J243m284M157l107J199L063n899M770k231k590O104m092
3553a270J816J007l902O288o107k61N726q093P167j168m439P261n839K338P00
3568A224m256N725m340J980J472m548O103n463Q64M431m862M069k014j268L146
3583B263n877M486r88j815O089n938K948R84m886N438m353J724K109n829P276
3598C631m797j449N512o168N269J36m560O865o730K257O43m244O969n297K213
3613B50L185p165O709l807j051M815n874M566j150j935M186n913M489p87l216
3628b698P123o309K078J964n756O115m582J442K993n290O127j919l025N293p587
3643d031N327l31k948N596n703K249J014n047P187n008J518M025p359O001l425
$$ y = [-1078, 563, 200, 397, 1640, -2644, 1513, -1594, -395, 2668, -3231, 1539, -692, -3282, 2822, -1270, 546, 1553, -2349, 3939, -2168, -2429, 3297, -4796, 2371, 1203, -3236, 4025, -1814, 524, 1224, -3032, 2693, -1647, 333, 1805, -2743, 3360, -2103, -1239, 3192, -1670, 2399, 385, -883, 2263, -3614, 872, -116, -1931, 4158, -1780, 1168, 2152, -2734, 2704, -1649, 75, 2184, -3645, 3631, -1166, -2615, 2897, -3271, 1998, 2134, -2426, 4439, -2291, -34, 609, -3635, 3334, -1963, 250, 3435, -3730, 2979, -828, -1879, 2936, -2938, 1628, 478, -1457, 2729, -3184, 1305, 518, -2698, 4425, -1884, 194, 2158, -3598, 2517, -2065, -623, 2370, -2920, 3207, 1288, -1737, 3556, -4031, 1296, 965, -1983, 3613, -2090, 159, 1173, -3874, 3313, -1695, -177, 3848, -3511, 2490, -935]
3658i35j520M865n667M948o71k712N523o204L614k41m393O778n513K019K685o061
3674c485N933l670J19M536o338N829k475k314N492p309M118M87m451P625n701
3689a604J569K987o677O844m231m58M609n981M820j707k739N140m932L478O2l115
3705a935N265n286K515M41m968O286m347K031K666n478N765m468L37M250p042
3720c968O068k208k458O840p787L723J761n640Q168n402P4L843o731N871k552
3735c98k692N662m702L829J17l764M180l268J225Q38k832L368k849J936K13l156
3751b293M059l191K322J633m618M579m148O66L844p222O128j982k250P862q120
3766b731L127J266n485P353m638j055M904o432N874j256m332O079l867J812K510
$$ y = [-935, -2455, 2410, -3257, 1691, 1020, -1692, 3831, -2373, 1241, 1000, -3393, 3385, -2128, -109, 2576, -3485, 2448, -1222, -1103, 3433, -2905, 2924, 449, -1865, 3627, -3682, 436, 923, -3528, 4097, -1604, -35, 2952, -3725, 3119, -1112, -1570, 3039, -2942, 1878, 171, -2568, 2572, -2360, 1118, 1180, -1935, 3330, -1956, 559, 1000, -3968, 2318, -2029, 2, 2668, -2810, 2955, -1513, -1176, 3074, -3968, 2100, -108, -2566, 4274, -3513, 210, 1971, -3669, 4499, -903, -829, 3014, -3717, 2154, -398, -3090, 2572, -2130, 1699, 1816, -1948, 2232, -1036, 189, 1027, -1805, 1563, -1286, 650, 863, -2293, 1766, -1425, 897, 2530, -2088, 2491, -1657, -991, 2853, -4369, 1759, -223, -2473, 5389, -2731, 396, 1662, -3823, 3530, -1108, -2163, 2741, -3691, 2183, 927, -3405, 2674, -1193, 619, 3129]
3781C129n383K632j053J12J297k239J323l71J776p3j978J156k535L134J69k990
3797a894L701m306K517L394p324N609j965j761P440p833J927K021n853P837l932
3812d22k426N890n920N147M36o730N428k180K52L907n283Q63J614q87J619j712
3828d04r86J550J577p99l61j597j511M271j188j748L017m318L544K648o811M281
3844A165k043j320O763o546J138J838m724P270l492l034N905m929L518J887p436
3859d040M122m1j667M963m718m53L316j837J567r05l034K644R36j089J366k867
3875a737n54M841k324r96K059l956L914J565n325L021k093j74N752n214N98J784
3891A161l656N931k378m325M985l417K185L034o756K833J344k260M289l150j891
$$ y = [3129, -2254, 378, -675, -563, 734, -1505, -182, -553, 1223, 1150, -828, 328, -2207, 927, 1096, -1894, 1807, -2499, 18, 3412, -3912, 1697, -268, -2029, 5411, -2422, -495, 1526, -4327, 3510, -422, -2848, 3042, -2878, 2269, 2705, -4025, 1403, -777, -525, 3382, -1901, -1038, 576, -311, 1308, -404, -1390, 160, 1737, 938, 577, -1020, -2531, 1740, 552, -1196, 1821, -2497, 1047, 3695, -3116, 1165, -878, -2198, 4565, -1981, -843, 995, -3729, 3541, 49, -2985, 2920, -2009, 1509, 3396, -4040, 82, 41, -1626, 3337, -1381, -1834, 1482, -355, 1212, 307, -2727, -83, 853, -236, 1130, -1737, -2291, 2550, 226, -770, 1289, -2667, 1247, 2812, -2513, 508, -1585, -1759, 3993, -1221, -623, 1161, -2495, 3436, 1058, -3267, 1718, -1699, 486, 3520, -3236, -403, 941, -1319, 2970, -180, -2071]
3906b071L891k361J478j05m529L992Q86j840K966l758j55M510l191K78O91l645
3922b963M255N70l218K053k253P28L884l749K16R83k278L687j213l650L356j254
3938h46N16L324m623P42K281k611L382k310k909M763k319R49J245m988M077O80
3954A353k434L340l354o33M239l651J073K8k176L692p87p24R86k102J458J279
3970A587k146J60L92p66J543J41k435J152N22n18K575k451r38K416k476J758k8
3987D88l212M315j595k3K497n013L139Q54l281M001l419P6L128l379K109q67j239
4004a421L179j840K61M19j995K120r61k92M30o60J279m96R95j192m89J896k235
4021a002J372Lk196L019k045P02J653l698L836j512j038L303m479K243P43l402
$$ y = [-2071, 1820, -541, 937, 832, -3697, 295, 1181, -659, 2307, -1451, -1606, 2904, -287, -9, 682, -2963, 1292, 1862, -1356, 697, -1556, -828, 3056, -693, -477, 506, -1772, 1915, 702, -2948, 408, -846, -330, 2994, -1629, -887, 1394, -1217, 2165, -145, -3054, 1709, -610, 339, 1584, -3404, 673, 1353, -1081, 2259, -1095, -1728, 2511, -1140, -67, -39, -2215, 1477, 690, -34, 952, -1150, 308, 1587, -559, -399, -7, -773, 770, 911, -1524, -372, 150, -368, 2207, -244, -1182, 1234, -1242, 516, 488, -2724, 1591, -4, -27, 2470, -2543, 596, 1450, -1831, 2170, -1249, -1173, 1955, -1424, 685, -182, -1421, 1758, -82, 179, 598, -1397, 723, -238, -530, -100, -760, 519, 23, 1018, -174, -663, 1233, -1002, 370, 373, -1823, 1196, -849, -147, 1506, -2192, 1644, 132, -906, 2397, -2082, 161, 904, -2498]
4037b498M162k603K83K555l386K575r98j495L288l315K029j86j854K943k408J201
4053B93L51j736K560j899R68K97k768L286k363O80J764l179L357j767p48K865
4069A961m099L200n65k197M096m108J632J535l690L876k224O0K472l807L383j897
4085c72j320L342l663K701j19k136L951l668J652N91k940L751k874O09J716l471
4101b250L631k153j96K943m036L563j570j231L366m297K584M28l100M867l451
4116i02N24K277l856L727k162l48K657l972L825k052j465M054m237K903J0k705
4132a722M174l432Q73J220l416M102k887Q87J821l150L385k292m35K795m228L146
4148H41o95j504L243m435L249N11l507M470l088Q20J853l952L223p22j227K521
$$ y = [-2498, 1664, -939, -656, 1899, -1487, 1088, 90, -1405, 1883, -1432, 597, 411, -1443, 1500, -908, 293, 644, -1092, 1468, -431, 537, 834, -1934, 1352, -1011, -331, 1433, -1746, 1611, -156, -904, 1961, -2138, 1062, 497, -1700, 2396, -1712, -80, 1455, -2235, 1641, -583, -523, 1949, -1858, 1525, -372, -1692, 1650, -2013, 688, 569, -1567, 2384, -1284, 368, 959, -1981, 1770, -1104, -495, 1221, -2250, 1381, -772, -968, 1975, -2061, 1502, -68, -1299, 2067, -2230, 354, 782, -2318, 2549, -902, -378, 1899, -1957, 1770, -392, -740, 1917, -2055, 1770, -282, -1747, 2307, -1930, 973, 983, -1722, 2452, -980, -107, 1113, -2303, 1799, -1088, -201, 1620, -1530, 1855, -437, -872, 1923, -2305, 841, 146, -1358, 1885, -2550, 699, 1210, -2297, 2173, -915, -95, 1758, -2194, 1029, 307, -920, 1601]
4164A601l764L412K11l239L793l878J181K079l699M588k626o17J972k613K969
4179A370k779J222K191l383L128k397q76L153l281K637p85j992L969l406K074
4194H45L41l635M580l286P20K639n373M824j148k211L972m052K537N48l594M198
4210A905k756k85J704k434K711j175K24J390k360J783p40j09J297k670K034j630
4226a111j36L092k735K216j497j013L037l933K857l60l837N678m102M10L612n851
4242c673N398j232k933M915m305K633J203l557M205m175J45L891l943J499O36
4257G07k043K611j393R92j203q08R98K66O69j390K29J092j280K513l216q82L908
4274A770l550L094n22m436O020k478K64J995n596M940m75k975M853n554J495L776
$$ y = [1601, -2163, 1249, 1460, -1779, 2014, -1864, -683, 1396, -2303, 2285, -341, -958, 1014, -1599, 1370, -1409, -187, 2004, -1379, 1749, -648, -1524, 1629, -1652, 985, 200, -1792, 2177, -1229, 845, 1186, -2449, 2131, -1155, -435, 2204, -3169, 1655, 507, -1704, 2268, -1784, 753, 1301, -2293, 1905, -851, -1136, 568, -1866, 845, -330, -106, 1284, -1076, 707, -33, -142, 1155, -1515, 519, -1111, -1247, 1845, -890, 1326, -171, -1184, 1853, -2080, 777, 417, -3420, 2258, -1844, -1434, 2178, -3673, 1725, 493, -2440, 2475, -1830, 803, 2006, -1551, 2654, -1521, -1376, 2515, -1428, 71, 707, -1336, 1275, -118, 874, -329, -1137, -139, 127, 796, -594, -365, 727, -553, 1960, -1256, -2138, 1770, -1780, 1314, 792, -3644, 2376, -102, 162, 2157, -3439, 1501, 1026, -1949, 2904, -2650, -1155, 2621]
4290B621m721L811k282j566M692l064P40K18k452L080l77q90O0o51N64J033K51
4307A067k082N01P08q65K360l346k77L653l249L153r85l883N533k961P01K359
4323B387o090M692J60l109M872n546J432M094m589L131j452k566N039k740q5J012
4339F42k913K933P48j868M52o89j54K307n89k158J161k4P5K072l350J51K412k191
4357i83K990j392l293M415k082M91J813n281M027O48k649L751m241L25M408m096
4373a149K076j044k765N076j892j072J565k769K333J396k453P31l58p82K712j015
4389E90k222J871p47P26J780l523P00J479j393K234j701j915L219j467L93J348
4405A372l835K781Q78k077K764l092k35L523k893R43K95k705L706k88j887J408
$$ y = [2621, -2100, 1711, -571, -2137, 2555, -509, 231, 449, -2003, 1077, 700, -190, -130, -781, -217, 816, 1067, -1015, -514, 194, -671, 1689, -1657, -1934, 1719, -1530, 1623, 638, -3245, 2288, -673, 28, 2387, -3703, 989, 1149, -1960, 2912, -2634, -1202, 2892, -1697, 1434, -18, -2584, 2455, -285, -370, 642, -2271, 662, 1410, -458, -6, -695, -849, 1458, 869, -1289, -128, -152, -77, 1995, -1355, -1204, 1208, -983, 2007, 615, -2678, 1737, -345, 146, 1959, -3322, 705, 1353, -1296, 2455, -1786, -1461, 2947, -1149, 927, -117, -2882, 2194, 302, -770, 795, -1974, 359, 1755, -698, 33, -325, -1107, 1605, 590, -1632, 239, -508, 218, 1998, -1525, -825, 654, -739, 1495, -206, -2121, 1098, -369, 24, 1372, -2463, 318, 1196, -881, 1883, -1209, -1444, 2079, -814, 129, 424, -2281, 1425, 1137, -750, 658]
4421F58k002J081K234k788Q91j3j268K685j166j527J642j062J111J110k716Q72
4437b58O39j206K191j614j261K265p95L05O53k519J368J341j730J389j130q69
4453a231K677j556k27Q80j752J744K68j840J826j474R2J981k266R66L46j653K423
4470A204o55j307J504j617J107P45k389J514k88l4J115j191k6O34n22K21K41q76
4488f20M38M63k70j5J84p70Q99J83j159J226j087L07J507k041J277k50j245K388
4506A415j957K34J129j972J920o57j151K137j889J131L11j387J325r49J53J156
4522I49j558Q38l24o0N74q09M41j16p0P60j346J328q84k6J055j808J458n87p06
4541h91J998k021J031M53j723K132j289oJ348k124J488m56q50J957j754J062O04
$$ y = [658, -1344, -263, 1971, -817, 74, 61, -1207, 1478, 312, -1215, 427, -635, 476, 1586, -1130, -258, 381, -825, 1366, -248, -1509, 756, -39, 266, 919, -1600, -232, 1109, -621, 768, -362, -1231, 1446, -110, -337, 543, -1209, 535, 803, -1037, 789, -685, -593, 1388, -878, 88, 434, -1219, 1204, 549, -758, 746, -871, 236, 981, -1408, 106, -182, -216, 899, -292, -318, 316, -206, 15, 256, -620, -182, 281, 11, -4, 180, -590, 309, 492, -667, 559, -528, -221, 1286, -755, 522, 272, -973, 1415, -542, -308, 821, -1151, 769, 112, -1039, 1098, -791, 340, 651, -736, 589, -360, -207, 949, -609, 229, -95, -155, 419, -390, 51, -65, -135, 625, -721, 607, -277, -303, 752, -1056, 402, -185, -891, 1107, -914, 117, 570, -1153, 979, -310, -316, 1032, -1092, 396, -60, -910, 1047, -707, 355, 959]
4558I59j638J761j534O2J250j901J791j183L48R98j927J576o91k35J540k051J341
4575D66n9j210J934k079J105K89j552K533j868K91J281k554K623j500m29K190
4591A461k887J912l0j413K205k113Q14P51j827K233j628J36J426k201K062j081
4607a80l58J650k367J773l86j214K459k307J390L9j654K236j811P88O33j695K356
4624A352j840J67J564l095K959j393o62K779l141J839J50j777K616k312N30J430
4640A166k656K691j884R7J645k124J300k31o84K087k740K067j02j579K175k307
4656a079J607M22j951K074j975J158R2k035L110j935L81J561l023K386l71j741
4672a319L050l593K310j10j827L407l316R50J825l175L046j242j360K740k908
$$ y = [959, -679, 1082, -452, -390, 860, -1041, 750, -433, -85, 913, -1014, 562, -129, -364, 1176, -875, 466, 407, -803, 1131, -948, 157, 446, -1106, 1427, -441, -150, 1131, -1423, 1200, -300, -729, 1461, -1426, 486, 456, -957, 1248, -865, -51, 700, -1127, 1106, -522, -386, 1040, -1161, 901, -180, -538, 1112, -1255, 518, 132, -1082, 1377, -930, 460, 499, -1155, 1081, -730, 58, 691, -1004, 1352, -488, -321, 1243, -1852, 1107, -286, -948, 1831, -1310, 529, 679, -1098, 1518, -794, -264, 1166, -1490, 1201, -683, -586, 1059, -1065, 235, 4, -680, 1407, -1333, 734, 632, -947, 1228, -1079, 528, 950, -1001, 1073, -902, 256, 348, -1687, 1423, -512, -131, 1430, -1593, 793, 422, -1319, 1731, -1862, 448, 338, -1489, 1918, -1398, -448, 1377, -1798, 1248, 6, -1354, 1386, -1522]
4687a522K091Nj852J985j492R34O52j750J540j165R18P1j093J409j613J316L66
4704H00k247K606j921L78K088l428K940j455r30L617m091K144M47l047M714l138
4720e23m94K546l471L310p21k542L114k478J395J045k538J909q57L67R64j744
4736g18J009p57R40J39j294R25j124J682pj572J902k419J299J844l383K475j764
4753h23q17M169m189J624Q44l497N195k687j329L220l850L211L08l419L302k170
4769i08P03J831l083J455K3l13J549j421n65N99M50K40m40k55j005K081k41j429
4787g29J696k300J506J652l437K767j887o01M393m462J489O94l050M866k548j830
4803a781L598l855L247O06l822L128j903L26K766l542R27Q80j272J879j203j142
$$ y = [-1522, 569, 574, -1278, 707, -785, 149, 801, -949, 591, -574, 344, 415, -678, 731, -882, 434, 800, -1447, 1159, -762, -384, 1704, -1724, 1216, -239, -1169, 2448, -1643, 501, 948, -2099, 2615, -523, -1017, 1529, -1942, 1368, 647, -1895, 1219, -1259, 136, 1181, -1357, 552, -305, 62, 1026, -718, 291, -466, 474, 613, -681, 244, -880, 802, 795, -777, 1125, -1294, 5, 1849, -1534, 941, -823, -1640, 2529, -1660, -36, 808, -2689, 2506, -181, -1510, 1710, -2140, 1071, 1379, -2040, 1262, -908, -205, 1626, -1457, -2, 21, -292, 1257, -164, -729, -130, 320, 560, 120, -135, -1140, 941, 700, -729, 967, -1333, 173, 1825, -1612, 1155, -732, -1333, 3060, -1402, 87, 781, -2269, 2597, 49, -1781, 1817, -2038, 1209, 1815, -2007, 1121, -782, -456, 2310, -1232, -305, 575, -697, 1182, -21, -1163]
4819a163J000M66K30J34j044q40K183l82j152J110k240K013J204k651J896j566
4835h02p14M103l650O26R16k997M661j791k260L214l114K654R79m030K480o95
4851d20j17K499l039J39J389r96J613p69j561J276K61pK29j203m07K102o43p65
4869d19J082k085J843J149k484J707j244n46L513l333N66J097k571L529j376j861
4885a433K301k102J524J577l518J986j72q54K306k096m93J535q95J091r2k133
4901a468J483L62l30O89j532l4J640q34k21M89j758J726Q02j716J024j121l5K101
4919A267k005L18Q43j682K450o60j885K114j635O30J618k358R41K53r96K030j573
4936c30o69J587j087O74L63j517J145M08p24P12j007J12J122j022M71M7j008J097
$$ y = [-1163, -163, 303, 533, 667, -377, -1217, 966, 584, -568, 542, -1698, 315, 1519, -1132, 764, -802, -1516, 2587, -1063, -437, 479, -2518, 2143, 352, -1908, 1306, -1808, 846, 1825, -2205, 275, -420, -537, 1962, -1077, -938, 451, -545, 1068, 299, -1262, 14, 275, 268, 497, -706, -1113, 989, 346, -419, 663, -1422, 421, 1570, -914, 793, -451, -997, 2516, -817, -251, 846, -1725, 1804, 428, -1433, 868, -1234, 290, 1867, -1651, 335, 163, -691, 1615, -481, -974, 561, -334, 757, 665, -1468, 15, 377, 47, 736, -796, -830, 810, -24, -245, 244, -1514, 212, 1014, -702, 322, -799, -834, 1267, -738, -420, 423, -1259, 1191, 531, -1354, 760, -875, -245, 1373, -985, -44, 209, -787, 1243, -330, -999, 588, -499, 175, 538, -979, 166, 574, -150, 562, -445, -333, 789, -233, 238, 285, -723, 374]
4954C74K5p09P94q99J93J102r08q4k5j43P23oj045J009m86r3R65j359L62Q48j104
4975d66R06l48r28J599r44K13N20j348Q53J47p98J201j134J31Q74q96L77m1m55
4994e37O59l69K10j26j84N82l2l96J20J04l3k47L16r9j94L63n37M55j25n63R31
5015B98m98L62K70r22J058q05l0J086j596J103L2j155J262n87m19J160j260J042
5033D01n34j65Q45j127P43o0m03Q93q32M28%q00J248j111O01L03j056J109p69
5052b86M0P63j127J206p09j58R78j240O82mo46J193j232N17O18j203J324r50j08
5071c42Q82j398J333l45p13J339j408J022k90p34J373j182O59J24r94J288j026
5088d12K74R40j458J360q32o8R25j549J514p42p06J543j391Q98N5j363J954j354
$$ y = [374, 399, -310, 484, -415, -222, 880, -28, -112, -137, -280, 443, 437, -608, 401, -85, -178, 787, -572, -210, 638, -466, 440, 92, -836, 763, -181, 32, 552, -796, 57, 204, -594, 607, -527, -396, 478, -418, -41, -82, -537, 122, -247, -37, -163, -347, 235, 203, -193, -73, 31, -2, -249, 67, -32, -226, 137, -400, 55, -70, -633, 298, -200, 162, 432, -490, 568, -237, -267, 819, -777, 326, 358, -797, 465, -122, -541, 619, -641, 401, -133, -298, 547, -580, 163, 103, -300, 593, -239, 189, 189, -611, 637, -474, 127, 430, -626, 483, -286, -246, 517, -610, 596, -113, -271, 707, -533, 149, 145, -501, 692, -540, -23, 595, -608, 716, -234, -342, 540, -858, 475, 130, -583, 756, -652, 370, 80, -654, 719, -463, 196, 320, -674, 614, -412, -138, 802, -656, 704, -128, -196, 729, -820, 694, -48, -754, 789, -602, 296, 351, -1012, 942, -412]
5106d12K30J062k005J781q00l84J287k009J765j40q09J347j604Q35L26j576J830
5123G24j181L86P71j272J077q66j18R17j131J187p46k9Q39j193J506j104n01J792
5141A058j860J023J64j700K376j670L14J147k328K385j104n32J837k572J817P9
5157D34j481K187j920N07J083j707J499q47k38J536j433Q06n73l83O17m93J012
5174F06j013j01J245j488J595p69j046J920j689J543p2j967K327j901Q01J223
5190A214l093K790l22j332K339k723J072J086k247K844k111l80J952j611J082
5205E60o41q77J700q38P63o52n15k46O27J104q83k78O50j918L057k367k02J690
5223G34j516J959k53k672K936j983J34K280l927L286o31j220K683l391J144J622
$$ y = [-412, -182, 880, -1125, 656, -144, -528, 759, -1250, 515, 375, -434, 913, -691, 144, 470, -1106, 724, -457, -71, 700, -572, 505, -361, -479, 438, -693, 494, -252, -281, 558, -635, 871, -233, -734, 1058, -802, 221, 385, -1315, 1061, -609, -295, 852, -1476, 909, -195, -727, 1110, -1462, 355, 434, -1047, 1140, -780, -273, 810, -897, 602, -245, -483, 1053, -380, 426, -147, -530, 87, -406, 606, -407, -508, 737, -751, 844, 75, -971, 949, -740, 803, 731, -1236, 1091, -810, -9, 1214, -1879, 911, 589, -743, 1596, -1127, -55, 1031, -1216, 1628, -483, -863, 1089, -522, 560, -81, -958, 742, -96, 667, 15, -500, -746, -119, 985, 102, -176, 474, -1444, 1613, -754, -956, 734, -782, 1177, 924, -1748, 1188, -795, -661, 1619, -2308, 978, 347, -873, 1810, -1581, -437, 1185]
5239A185k679L067j934q54K739k241J230q0k078K363l71k58k7q38Q20P4L48j074
5257f08J69M18l34J597j540o73J763j880K224o98k332L309j998M86J460l490K664
5274E37J34j659L316l919Q69K451k932K643j523j497L129j972O81O2j943K210
5290E87l2o63N10j151M37R51l70q89K47L19J06J137k039J6J374j545K067l18k580
5309a836L143j832N91J591m002K755J60j347K690l093J47K636k899K164r66j723
5325a821L179j166j32N97k354J945O40r34N19r00j78J574n35j041M15o6L58J281
5343A381j797k78J143j303K041p22j964K414j179J73J540l525K304L80j446K498
5359A660k445j11K252k563J647k28j794K986j245l72J047k118J144O59q06P11
$$ y = [1185, -1494, 1573, -361, -1215, 1524, -717, 513, 433, -1645, 718, 347, 89, 62, -776, 44, 118, 466, -608, -439, -21, -355, 1242, -298, -971, 792, -1088, 1136, 438, -1894, 1415, -583, -97, 1363, -2127, 537, 671, -988, 2328, -1591, -722, 1729, -1203, 1440, -83, -1580, 1549, -423, 258, 320, -1623, 587, 555, -108, 402, -749, -312, 639, 269, -620, -373, -54, 52, 1189, -850, -834, 540, -1005, 1062, 744, -1836, 1307, -525, 66, 1657, -2345, 410, 570, -777, 1913, -1180, -1033, 1603, -1296, 868, -98, -1821, 1358, 192, 60, 657, -1697, 248, 888, -46, 473, -427, -605, 969, 434, -607, -192, -258, 100, 1381, -416, -694, 449, -854, 1187, 465, -1499, 915, -264, -91, 1449, -2076, 228, 608, -838, 1660, -785, -896, 1356, -1207, 440, 212, -1582, 1404, 159, -213, 834, -1284, -140, 519, -287, 424]
5375D24q48N6J252n72p87K27j08L72J118j525n0Q73j269J390l08j367K039q34
5393H3R9J202k833J662M55j481K089j516j74J568j830R34J58j716K333q19n66
5410c52J072j632Q05Q19r54K56j27JP84k29p78N06o13L98P51q63jM43q21R44l16
5431I3j034J322k55j47P04j507P60J99q18J501q43m88J453j154J18L31j197J131
5449A69Pm30Q04q19K60N12j261Q47L35o44N58k86P0L43j155Q7P90k21L78L08r14
5470b62N82l33m11L23o27J001M72r91j55Q76p83L95m06L81J54j22k11N29r63M55
5490i6L07l62N85k44l53N72p38J71L91o57R36k98n24N07o19L2M53l73N28j04M
5511A18J09l59K96o41M55P4p7L88l35J58m4p13M95j42L80K26n08M07m21l58Q54
$$ y = [424, -424, -368, 884, 312, -475, -248, -356, 16, 1134, -391, -441, 432, -837, 553, 245, -1122, 917, 83, 182, 1384, -1449, 213, 668, -813, 1276, -240, -414, 1154, -676, 258, 416, -1300, 1033, 214, -352, 720, -912, -107, 712, -242, 14, -113, -112, 672, 443, -335, 171, -442, -44, 707, -156, -157, 286, -535, 409, 93, -941, 381, 126, -21, 683, -824, -64, 135, -683, 818, -25, -513, 940, -214, -96, 235, -962, 169, 176, -254, 550, -269, -9, 503, -758, 89, 424, -220, 338, 52, 122, 465, -690, -603, 187, -34, 344, 652, -262, 320, -13, -424, -101, -728, 273, 745, -246, -401, 475, -308, 87, -319, 62, 216, 94, -117, 412, -551, -96, 211, -151, 434, 190, -163, 409, -329, -158, 233, -424, 512, 214, -310, 197, -422, -390, 63, -310, 218, 114, 118, 227, -132, 164, -477, -22, 52, -25, 363, 28, 186, 142, -571, -76, -218, 162, 388, -120, 287, -134, -492, 362]
5532C62o24M39J79m69M62n49j27M85o12P18J78n12O62p07j95N96q48R36k17l9
5552A18K84m58L63o44Q4M71l33M68l04j3K77r53R73o69K15O56o06M93l49o36J093
5573E30j221N78M61p31R07p15o2O82j157R11J18p55J165o60k83L75q99Q18j60
5592i8O5R27j267P06k50p71Q61m49O11R3o21N47q12O05k11l78Q31o84Q08j7r44
5613d48P84j065N91Q00j359J459o56k00P87j600J145k23p18J822j258n6N93j309
5631i11J301o02n57J555j223P51N4q95J033j057N71O01p25L99l92L52j56o10P16
5650B05p29P72K38p71R89j716Q95N76j401J824j108k76J862k368J090N6j399K472
5668A211j503j2J135j971J671l81j277J876j150O98M56j532R76n96Q5J096r16
$$ y = [362, -262, 177, 356, -113, 349, -200, -327, 158, -454, 264, 442, -70, 592, -115, -310, 286, -562, 374, 157, 118, 402, -56, 307, -337, -253, 218, -115, 353, 49, 36, 313, -640, 333, -336, -121, 535, -71, 422, 73, -563, 530, -691, -113, 348, -383, 524, -191, -253, 429, -728, 183, 301, -454, 711, 51, -232, 143, -756, 62, -98, -33, 894, -373, 333, 83, -688, 173, -276, 335, 428, -193, 354, -458, 147, -64, -442, 389, -295, 513, 496, -448, 336, -729, -138, 662, -697, 762, 106, -94, 693, -907, 238, 15, -703, 1119, -139, -195, 398, -911, 390, -212, -769, 786, -437, 314, 368, -527, 506, -551, 20, 621, -104, 295, -97, 255, 99, -511, 205, -524, 248, 486, -285, 704, -1012, -117, 459, -942, 882, -226, -502, 1360, -1008, 82, 138, -1261, 1211, -292, -304, 831, -1140, 531, 150, -1127, 749, -401, 297, 753, -779, 197, -399, -314, 782, -134]
5685a34k5K41J38l13K1J3p67J326J00q01J031j672Q68N73j567J541r80j87K455
5704A861k560Q67l8j579L006j692k90J711k606J855M1k006K142j214P60J266k176
5721f52O25k30j57J137r64j57L74N06j89k01m67o56J118N2o8O55j702J076O54
5740G54j850J538j153k8K663k452O89J08k220L503j485q63K132k602K175K37k739
5757a593K213j442M89J950k304P49mq04J389q91n72P98J45K41N1r06m15J095J33
5776C22m53P04j493J109Q80k241J871j353j53K647k363N61M95k605L222j186o77
5793g13J951k373K018L56k734J917j117n4K411k090N99m5q38J485p16p16N07L36
5811A84J79K20r69k82Q22j86l80R02j144Q82O50j705J359j264l20K540j953N06
$$ y = [-134, -159, 82, 220, -93, -72, -59, -826, 500, 600, -201, 830, -842, 26, 599, -968, 573, -407, -594, 1861, -699, 168, 130, -1449, 1557, -135, -425, 1286, -1320, 535, 576, -1430, 712, -502, 258, 1524, -652, -27, -257, -414, 723, -241, -398, -24, 482, 293, 92, -375, -1031, 87, 139, 71, 726, -976, 100, 754, -1096, 442, -711, -739, 1924, -528, 161, 269, -1951, 1552, 67, -796, 1336, -1266, 909, 1146, -1593, 620, -822, -333, 1617, -687, 62, 58, -746, 643, -248, -820, -22, 123, 364, 415, -491, -906, 189, 322, -131, 573, -920, 189, 1069, -1172, 699, -654, -807, 1840, -523, 38, 533, -2072, 1150, -36, -713, 1238, -1135, 883, 1239, -1495, 422, -695, -749, 1662, -428, 171, 126, -712, 773, 57, -659, -152, 184, 363, 583, -386, -668, 154, -32, -412, 490, -654, 228, 878, -827, 532, -732, -1052, 1488, -465, 41]
5829D1O42k296K656j052q66J775j839J516O42k312J459q47k9J921k220P32N02
5846D25q37J136o59o73O36J01L63l0l40n99N05L4m18P64r52P03J006j516P07p53
5866c97n07J948j497N16K99j096J796q10j186J411j551J281R73j960J177n45o26
5883g74J455j131L27O24p32O71n77p76N63M1M04M11k47l71L60m21j62P1k0M75
5903A91P01j254Q02n76o70J497r75N71K73j248J316l60j075R04m96N63O90j398
5921e44R11n04l53R95q76N9N94k07L93l00o62M32l37N30l5j13K72M3l44m4o3j22
5943b75L44K94r3k38j4j32M20p65M5Q40p93Q65j73p61O93m96k2O82o22O10n09
5964a00l24O61o97K36N22P6j45K72p59N74l15n46O35K36k27J41k74K67j75p87
$$ y = [41, 683, -1613, 1043, -9, -875, 900, -939, 577, 1219, -1093, 366, -481, -510, 1411, -809, -77, 425, -412, 724, 65, -608, 28, 129, 492, 462, 122, -477, 28, 62, -356, 408, -544, 159, 1165, -351, 356, -397, -904, 1044, -453, 63, 362, -734, 1062, 252, -934, 477, -1074, 207, 1180, -780, 397, -148, -774, 681, -450, -123, 501, -231, 440, -137, -913, -350, -309, 95, 506, 259, -112, 248, -173, -335, -264, -284, 191, 892, -362, 440, -136, -806, 691, -284, 287, 560, -688, 628, 268, -807, 97, -399, 164, 854, -544, 367, -137, -490, 505, -371, -312, 282, 75, 468, 168, -494, -62, -399, 131, 96, -17, 255, 298, -46, -90, -153, -275, 69, 363, 270, 32, 18, -114, 306, -459, -414, 426, -367, 498, 325, -436, 257, -239, -261, 421, -201, 409, -100, -424, 237, -460, -224, 298, 374, 229, 501, -258, 316, 1, -545, 90, 326, 99, 240, -34, 233, 58, -729]
5984g29N48L64j48J93q1j20K50n83j17m0M05r5M97m09M44n62J54N6m99O83N47
6005G58o05j55l62R1O76m86R8N78j63p9k23n63J31k10K84P90p06K88j40n59J054
6026D97n90j21J2L54l84l67M96M79r82K81p4O26P52r99j55n44M93J45l0J126j330
6047c15O36k23m27K79Nm07J154r00O30l94o82J011q71K69J261j642J415n68n27
6066b96K62N72o58n0Q26l91m8o26O77o46O79j7Q9n60K47J10m20K76q7n05J053
6087D87l11k21M76j146M71L20m20R61q55R11k33j012N89l50J12Q01j370J000j44
6106F6q70J244n29j70O92j193J291m84l8L32k63l65M16o22Q81k61L64q10n7R6
6126b80K46R53j461K54Q10q28J026q66p92J600q93O45M57j789J348n07m06J316
$$ y = [-729, -181, 183, 35, 228, 147, 27, 277, -306, -423, -463, -58, -153, 344, -65, 379, -183, -29, 27, -472, 211, 758, 153, -2, -364, -273, 403, -83, 15, 593, 430, 351, 128, -435, -304, -514, -230, 560, -146, 142, 2, -557, 497, -93, -214, -202, 152, -232, -599, -103, 376, -606, -325, -399, 227, 979, -20, -175, -719, -226, -81, -111, 1015, -315, 321, 98, -329, -50, -45, -452, 702, -198, 432, 38, -644, 367, -504, -235, 1026, -616, 799, 231, -296, -34, 538, -120, -170, 656, 265, 217, -409, 268, -378, 301, 284, 373, -187, 60, 170, -250, 26, -61, -566, 487, 176, -45, 431, -715, -244, 76, -344, 617, -238, 673, 440, -572, 17, -333, -221, 580, -790, 210, 66, -804, 440, -89, -259, 433, -760, 531, 47, 9, 341, 78, -287, 129, -493, 388, 127, 491, -319, -376, -280, -34, 919, -542, -288, 522, -306, 720, -146, -938, 662, -231, 414, 871, -918, 430, -77, -483, 833]
6144H33j637R78O23j186R44j108o30J682j247J062J38r43R70p87K03J9%n41J202
6163E75k67m99J79j80l88J031q38K47M70q92J291o22j207J195q10N81J086k125
6181a173J756n87p63J904j977N73R86j079J634j378j058J737j125M78M28j074
6197g18J174k28l27J17p53M04O86J90o60J06L1l23Q43j048J30P68q75J510p19
6216C08j271J572j561R04J084k214J863o22p17K099k541M85J609j717J659r95
6232e5p65K112j631N98M39j607J574J01q53N41j177P40M99k42o00M25k40j31Q41
6251E69q62j92J281j451K227p89j610J506j502J063O74k420K509n11j710L021
6267A803k808O83R18j112J898j222j703L039j771Q42K35k204K083j113N31M47
$$ y = [833, -804, 174, 797, -389, 555, -553, -1183, 499, -748, 314, 452, -491, 479, -308, -105, -86, -86, -627, 575, 308, -191, -12, -192, -580, 451, -387, -140, 330, -562, 729, 107, -1100, 95, -715, -134, 952, -1173, 583, -4, -767, 1137, -840, -267, 719, -360, 1274, -104, -1162, 575, -550, -72, 356, -718, 456, 228, -99, 18, -735, -331, 355, 545, -115, -9, 22, -301, 542, -506, -376, 392, -483, 1027, 308, -963, 609, -952, -48, 1036, -1178, 685, 63, -654, 1445, -1096, -611, 998, -719, 940, -55, -820, 1292, -339, 259, 698, -909, 665, 766, -87, 454, -723, 17, 516, 274, -326, 99, -141, -272, 569, -293, -485, 796, -655, 1572, 783, -827, 679, -823, 240, 914, -1506, 1003, 492, -1218, 1803, -1005, -322, 596, -516, 1382, 160, -1543, 1496, -275, 567, 802, -1402, 681, -432, 99, 546]
6283E46j102m32J741K71r82L14j1LO69j871j64J079p53K029j174j175J494k14
6301B68l27J218k350J524l47j052K055j390J40P81n21J394j774j99J329q86M6
6318i1J094j785N59P83r19J208r34o7K32M68q59L50k24M22Q9m98l63R18j135J870
6338A118q91j289J906j078j3R52j729N51O22r40J648j580L53J356j263J501r71
6355B53q47J612j011J31N8q71Q08j04o4N28o96m45R80m47O08m09k5j24K68n98
6375c95j05O86l40P46j89r75O16k00Q6R58j692P98M62j027J271r83j26R66j620
6394a063J267n8n99J126l24n97P56j267O11K72k70M94o48K18J20k84%K08J65r2
6414C5J99j41n30N27k18K31J48q42Q34N6m45P91r59l6M60p62J060m02k42O15n48
$$ y = [546, -556, -988, 753, 1024, 42, 356, 345, 348, 1017, -854, -1018, 61, -692, 1337, 163, -1012, 482, 268, -59, 1159, -1191, 333, -14, -1066, 989, -401, -261, 520, -1, 1393, -381, -580, 749, -137, -91, 1003, -782, -223, 560, -359, 849, -85, -152, 80, 548, -311, 39, -185, 237, 326, -172, -535, 383, -752, 1118, 227, -1062, 844, -234, -247, 705, -1024, -473, 149, -791, 857, -723, -370, 986, -277, 1224, 253, -594, 1018, 7, 138, 196, -675, 133, 29, -35, 493, -203, -648, 332, -115, 493, 84, 59, -65, 203, -395, -500, 186, -154, 592, 403, -572, 44, -156, -70, 888, -804, -6, 456, -571, 700, -283, -409, 557, -1063, 204, 146, -453, 673, 349, -248, 508, -759, -148, 124, -146, 348, -300, -82, 38, -246, -246, -38, 127, 35, 234, 93, -437, 90, -128, 103, 251, -591, 243, 299, -146, 645, -314, -350, 110, -652, 408, 6, -236, 379, -169]
6435a69K60M47r32O03Q7l99O10j095O84k5j53J13j03K62Pq6k20q4Q5O9K00K3k04
6458b0l3j47o1K40k54L60QK2j32j73K9K6p8M13j21n6L56m66r7J49k31K35L16l94
6482a09K08k26N3K79o20N18R3j69K17k63m7oj71N9L51k18J9nr7J01K32l86J86
6505aN8M3K56l43k35M44k39j10M15m06o3O08n60K69m1m68Q86Qm17L35l51J50o
6528B32k79N38m15K48j10L6q1k52M85o93O11N48m46n86r9O95K69o91k69M89o8
6549A62J94k32l68j93M24l8J5M22j0l00M09q23P07rn51N49j52m98N66o77Q06J98
6571F01j142R73m18j079J319j54j68N06m94N31l33m15P88n14k38N03l73M58l59
6590hL40k57n2l91L17K23j13l9r7k34O08m38LP18j045Q07m25o1N71p24L77R14
$$ y = [-169, 91, 538, -394, 209, 296, -103, 507, -588, 96, 71, -82, 31, -72, 190, 197, 111, -109, -193, -108, -39, 161, 184, -20, -53, -200, -261, -21, -275, 85, 93, 115, -17, -190, -161, -135, -213, 200, 79, 23, 379, -87, -184, -35, -266, -31, 285, -109, 99, -127, -74, 205, -415, 103, 196, 27, 244, -19, -66, -72, -243, -184, 167, -51, -32, -37, -134, -33, 199, -187, -1, 57, 100, 356, 13, -222, 222, -17, -127, 288, -118, -181, 427, -133, 136, 95, -373, 513, 521, 104, 439, 88, 238, 232, -47, 491, 76, 324, 214, 250, 169, -83, 402, -291, 320, 868, 422, -164, -263, 432, 701, 10, -259, 230, 162, 356, 124, -244, -437, -13, -51, -36, 386, 376, 76, 485, -338, 369, 360, -191, 358, 206, -292, 274, -403, 403, 601, -541, 432, 14, -1065, 254, 100, -68, 438, -56, 475, 142, -273, 515, 1, -237, 266, -107, 351, -8, 332, 75, 23, -368, -51, 172, 59, 20, -77, -311, 297, -141, -138, 580, -465, 342, -83, -144, 427, -297, 80, 994]
6612I94j553P79O9p89J154n76m50N07q95J144j71m93O00o41N35J81q39N05j51
6631i0q7N90l39j33N1m1kJ80n80L62O88n44m32M76j069Q91N37o88O12r16K64R08
6653F38j226R11r3q47J440j093l9R28j565J359m1j081J032q13K55J136j603P96
6671I4kl27P79m01n27M31k39L67J48n76M5Q95p31K4N39j219Q90K11q71J141j263
6692e92J54J389j449Q25n92o38K039j366m2J056j691J460k0j243J262r99L28J001
6710H82j316M36p6l29J198o32o28M46j85L94J26o46j24J060m19j0J81j274R45
6729B9N21j089J331j529J63J824j496M03M5j097J930r71n25J017j486J280P00
6746A050j684J286j271L67J279j615K74L46q82J519k24p76L81L7JL04k17p09Q34
$$ y = [994, -559, 220, 289, -500, 654, 78, -372, 135, -760, 384, 213, -280, 320, -321, 214, 395, -444, 61, -90, -177, 413, 74, -59, -8, -49, -51, 129, -451, -89, 599, 55, -377, 99, -970, -79, 458, -230, 382, -534, -270, 638, -588, 323, 230, -617, 823, -270, -309, 619, -946, 413, 372, -709, 323, -490, -235, 901, -702, 94, 92, -235, 544, 143, -384, 47, -192, 175, 323, -253, -208, 687, -44, -20, 519, -700, 190, 401, -470, 671, -592, -438, 951, -498, 327, -265, -903, 1136, -230, -272, 784, -907, 553, 533, -710, 552, -447, -119, 882, -434, 2, -74, -403, 795, 163, -465, -19, -204, 190, 316, -330, -454, 606, 187, 177, 358, -916, 29, 550, -539, 792, -737, -574, 1250, -246, 157, 202, -895, 1035, 64, -461, 556, -930, 350, 1050, -634, 652, -619, -252, 1027, -588, -314, 32, -850, 669, 445, -331, 50, 87, 88, 392, 175, -534, 300]
6765C00j55R3M07j447R24Q08j281Q92r38r8J366j460Q38j6j317K181r33p14J092
6784E42j464J492J73j689J284o20j66J109j227L54L58o07J049m99k90J06k01M20
6802A24N7o43o8O77j8j67K98q14M52L45o69Q51n28l98J261j153N36J30j203J680
6822G50p87l72J204j651Q68N51j220R93o72O8J104j269J29N02o39Q22j40l28J53
6841F6l84N73M3m11n8K73J70k92M99j011L16N04q97R33n88q4Q97q79J04O34j180
6862g72J270k40p15J071j318O91N59j158R92n18j07Q07r90L71J17k59Q21o63m18
6881d59L16mN03M4m37j17L34j59k84M92m75m5O16m18K19j36r4N38n96k39O83n26
6903b44O44l10n76O93m14J77N49j008Q76m21l11O46n61J59J45l78M38k52n3J58
$$ y = [300, 145, 238, 645, -802, 122, 930, -351, 541, -397, -495, 871, -589, 249, 233, -1084, 1097, 164, -550, 542, -922, 570, 743, -946, 338, -282, -448, 661, -566, -212, 146, -461, 588, 89, -201, -95, -296, 124, 181, -462, -530, 147, 129, -38, 260, -554, -102, 243, -426, 425, -103, -501, 760, -393, 143, 273, -930, 750, -37, -409, 795, -856, 12, 563, -657, 336, -336, -268, 836, -433, -304, 198, -441, 381, 241, -87, 66, -318, 255, 298, -113, -171, 102, 272, -20, 479, -532, -216, 288, -609, 324, -264, -348, 549, -330, -226, 408, -772, 498, 258, -457, 614, -704, -13, 546, -612, 380, -138, -245, 562, -428, -57, 60, -199, 622, -41, -459, -143, -147, 356, 400, -37, -154, 180, 21, -263, 229, -246, -291, 325, -93, 126, -10, -104, 434, -162, -401, 282, -244, 400, 90, -486, 207, -207, -30, 519, -489, 387, -34, -345, 301, -260, -101, 44, -334, 104, -148, -201, -43]
6923d3n3M54m61J16o9k46K78j34P1K0m8M73o29J79J10l35M66j90j37M29n32N26
6945B45q8l10M68l97k2K6K9J95q9k04J13j26J11K25k46J65k00j03J31JJ25p2p4
6968i7q9R2J55J0n3N8l10N15k58O0M9q5j0J48j89J14k56N5J88j44L86m48j03K96
6992H4l91L49K08l11J52k5k42L76l06L6J41l11L73o8j31K66k39J1K67m53L21J46
7014B53j09j78J60k41K71j69m8K04k54p8J42k15L57k53j89M43p6k00O08m39QK72
7036B69n72J80L66m85P34p75K40L43l84L65p4l71N27l92J22J69n48K04K74n57
7056c65P91n52j05K86J24j26J34m54J76J00j63L57k44Q4J25l57n0L29l95L62J56
7077B13o40L38J45k42O59m84l57N65o39M49N08q49L85j30j4M22o58L23J99k84
$$ y = [-43, -96, 358, -103, 13, -56, -302, -24, -158, -87, -67, -115, 358, -271, -92, 18, -317, 149, -41, -178, 251, -281, 245, 157, -153, 315, -82, -104, -78, -49, 146, 57, -147, -34, -160, -49, 176, -70, 95, -105, -208, -77, -76, 49, -23, -97, -186, -94, 61, 71, 18, 76, -234, 281, 23, 83, 132, 47, 37, 185, -4, 110, -146, -91, 97, -47, 339, -109, -212, 84, -307, 42, 250, -61, 91, 66, -176, 200, -106, -70, 71, -240, 133, 65, -66, 200, -39, -28, 239, -214, 107, 253, 144, -34, 126, -115, 156, -13, -61, 143, -111, -189, -47, -262, 95, -158, -347, 96, 20, -180, 428, -11, -3, 269, -303, -123, 243, -242, 492, -283, -43, 300, -84, 281, 207, -164, 363, -29, 93, 262, -286, -82, 192, -365, 426, -126, -231, 55, 179, 53, 187, -267, -91, 9, -154, 203, -41, 43, 168, -189, -239, 90, -305, 57, 213, -427, -89, 56, -186, 473, -11, -368, 197, -442, 7, 515, -334, 51, -79, -93, 329, -329, -6, 193, -91]
7097i1N16n62k25O61m40K12p9m10M24K60k17Pk85J16M22k11k86L73l56J99O83
7118G11j128M20J34o19J151p60l56R80p57N55J23j170J035n65j5J126j532K32
7136d35J189j059J031p96l61P46o65M86l8n69O54j3l28M39p02J08O56l34n5N6
7156A0r7Q6M19o93L85N7p45J273q45m29J023j039R18K15j554J319n76R0J073j658
7176g68N59O97j013J403p79o22J005p07O4M19r53P95K7L4J73o70j38J121o21l8
7196a2K5j90J16N25o91P3K64n46J084q36k05Q22o73M75M39j570J411l90o30J540
7216A031j542J74R50j240J229p65n14J304q17L63j23p72O73J24m07O51o67j09
7234d57P78l07n8j39k60N83M38p14M8J96n21J222o32n98Q99j052J055J27j547
$$ y = [-91, 425, -137, -362, 299, -141, 71, -8, -418, 6, 266, 49, 56, -229, -113, 309, 98, -188, 185, -171, 28, 711, -417, 3, 137, -482, 669, -91, -447, 533, -224, 331, 454, -716, 319, -246, -261, 865, -667, -435, 754, -305, 726, -70, -431, 315, -350, 136, 98, -471, 183, 170, -158, 281, -421, -313, 343, 9, -46, 10, -87, -1, 418, -275, 110, 167, -578, 695, -150, -579, 444, -595, 323, 538, -1016, 303, -273, -183, 890, -768, -209, 488, -525, 878, 99, -523, 482, -225, -161, 258, -695, 100, 127, 161, 334, -336, -474, 647, 26, -12, 13, -177, -61, 464, -227, -154, 110, -436, 648, -188, -393, 429, -244, 231, 670, -900, 511, 121, -509, 1031, -511, -337, 613, -627, 602, -163, -677, 627, -190, 173, 50, -722, -49, 75, -332, 319, -348, -457, 321, 14, -44, -183, -443, 140, 578, -136, -88, 108, -413, 809, 177, -421, 478, -574, 481, 608, -939]
7253i39J216j58n53J563j639K65P40r18J111q34o39J257o64N01L3r86P25R0j24
7272D7L97n52r4N14j98Oj17k89M26j64r2k4L27m94Q51l57j003R89m38L44L80j273
7294h14Q65J78n51J028r27j77R57j052R78o56m46J181o35K38Q0o31P42k15j87
7313d4K61o13l90P67J63m02N00m23P5L28o36L31M05m56j6K55j84N71q84l9Q63
7334D32j013R88j82o72J090p52l62J307r83K5J93o68J195o98L52j23k15P8k21
7353b29K60N11o87J32L86k20l65J59l01Q3L99L30k40O9p27R92m25j54L08l11K41
7374B11k07k36MK63p78J308n20j74K37o38L29J31l4N01n33R1M34q29K82N15n21
7395a64O18r28Q07m7q28P66K4k18K43n59M48N0M13q67K69Q52j356L85N48r78O97
$$ y = [-939, 277, 119, -434, 1129, -510, -245, 495, -423, 688, -146, -785, 472, -192, 309, 342, -644, 81, 171, 47, 444, -108, -202, 312, 114, 120, 3, -286, 140, -24, -116, -140, 187, -307, 544, 187, -816, 173, -265, 79, 459, -814, 51, 229, -322, 706, -221, -398, 559, -493, 485, -171, -617, 564, -71, 167, 247, -384, 358, 143, -44, 217, -396, -786, -19, 144, -258, 242, -181, -106, 222, -414, -83, 322, -134, -150, 105, -79, 492, -392, -431, 432, -581, 407, 225, -447, 643, -109, -471, 836, -147, -122, 71, -597, 598, -100, 252, 129, -86, -8, -229, 31, 542, -145, -13, 373, 153, -212, -53, -354, -271, 128, 458, 218, 287, -440, 552, 127, -27, 281, -30, 211, 4, -232, -228, 35, -743, 565, 45, -129, 108, -530, -201, -70, -104, 397, -136, -45, 389, -440, -158, 357, -164, 454, -474, 333, 286, -542, 224, 248, 30, 273, -286, 162, 212, 625, -242, 27, 879, -477, -92, 456, -522, 175]
7416A75J98k50O9k65L10K11q56O16j35j28Q52r16O01m66j06K14l94K31M67l32
7436I6m10L73O4K85k13j27P6l59M75K32n18j11K40L9r1k09j08L28j55o4P64o85
7458g8M1M84j352P61l16R99l87j63l30J21Mj72L28J14m25j30K42K27k9J29M0j78
7480g0j74M7J44K02ok93k10l8N51j44k93L04K01k62j55K55k95M11n4N5j5k68J83
7503G6L8m19L92L7k13L69l17L87j95k20K72j13l4Q6k48J97k39J2J51j81K6L05
7525A69n40M16j9j23M8j3j0J18o5p3M98n86J07J2NrJ12l26J55m9j68N28o38K91
7549a60L61n30N37k30m18N69k13O4L33m36M2M99o13O70n03j01M55j30k28n7n48
7570f37P49J32k62K39Rn0J91m72L9J62l79P27l20m91M48p6L0m1j61J46L12m74
$$ y = [175, 373, 123, 192, -73, 237, 448, -408, 208, 73, -55, 797, -119, 482, 16, -90, 124, -270, -39, 428, 96, -314, 59, 123, 408, 195, 68, 144, -215, 260, 492, -26, -137, 103, 142, 51, -158, -266, 62, -93, -157, 607, -78, -37, 447, -905, -144, -460, 539, 152, -11, -341, -220, -216, -388, -60, 54, -371, -501, -259, -32, -61, 68, 108, -70, -244, -197, -53, 149, 143, -150, -360, -398, 153, 9, -284, 20, 221, -41, -196, 59, -236, 175, 121, 176, 161, -107, 76, 114, -305, 87, 124, -89, 280, -37, 350, 155, -65, 207, 94, 60, 146, -102, 95, -144, -132, 19, -162, -136, 169, -371, 45, 26, -97, -49, -62, -72, 46, -19, -92, 406, -180, -73, -61, -56, -65, 47, -279, -124, -173, -341, 187, -451, -160, 201, -329, 208, -22, -440, 129, -84, -20, 313, -123, -81, 418, -195, 475, -28, -129, 326, 196, -32, -89, -637, 112, 244, -18, 221, 230, 180, 371, -101, -62, 100, -279, 448, 128, -363, 85, 9, 39, -2, -163, -17, 295, -179]
7592a79N41k30m55Q26m58K3K18p80O13J69n71M31k13k31O98l62j90M19r81Q56
7612A44J35o74N40o04J74O44p99L44K18l80O04l13k15L85j66j23P90j231L30N26
7632C29m16N95j56r35P00J12m56O69q20L73O42r88R04o90n59J284n67ML95j379
7652i59J237M3r04R12n90J54O85p63J16L18k70N52k58m19J57l9j55O05p60L2M41
7673A35l05N18j09r61R91k98k30O09j188N79R30j027M90m04l75J389p47j02L41
7692B36p26Q23J69r56Q46r48K99J019j319O28j41m96R85n83j27N24n34J21O85
7711E05j051L70R6j33O01j06j030P97J10n00P64q43J90R79j157O30j07p89J355
7730F81m96l65N31r46J024O0j137J175j162L85J001j322L33L31o31J023m21n39
$$ y = [-179, 362, 132, -323, 503, 45, 68, 286, -494, 119, 288, -283, 148, -65, -296, 402, 40, -150, 269, -712, 144, 279, -395, 145, -459, -285, 359, -440, -96, 122, -258, 346, 33, -182, 203, 37, -86, 704, -527, -197, 329, -87, 508, 352, -583, 117, 229, -227, 442, -378, -5, 637, -351, 553, -137, -696, 588, 21, 25, 420, -959, 278, 321, -583, 329, -261, -107, 578, -185, -69, 249, -21, 531, 273, -146, 11, -28, -183, 422, -338, -306, 135, -170, 348, 239, -722, 269, -29, -259, 350, -838, -259, 671, -356, 134, -270, -645, 744, -3, -105, 236, -490, 333, 502, -454, 392, -556, -257, 762, -557, 71, -70, -566, 419, -164, -291, 233, -301, -180, 505, -546, -176, -80, -213, 388, 282, -748, 49, 159, -341, 423, -420, -230, 749, -408, 222, 115, -674, 681, 185, -180, 351, -595, 429, 489, -648, 527, -635, -250, 751, -571, -238, 93, -538, 485, 64, -475]
7748d75M60M8J84J54o75K6L83k10K68L9o86K94J86j07N13p31k9R79j042M27n4
7769d8n63J122l70m82O76q05O40L47j158Q85n39R2Q53j187N88J7l62M60m32J00
7789a66L21m67M43K22l09k40K49J64q7j01k87L86J66m37L70l26l76R02o30M62
7809B59j71o28Q98k36n99P83o37L65N83j142Q30n78R2N49n22J20L39m01K98l17
7829a15j54K24o9P0K25j66k42j2K18O3J39k36J52Q6l14K26j63k13N36m54Q5L03
7851A89m62O13l05m28O32l59l5N32o94M95K3l84N96n52J46J1l46N75l42R9O4j21
7873e3K23j3%k00rK59k67K44k29K45j79q0J6Q6R4j77j90K72K56l93K89m2n04O29
7897B77m97J93J95m57M68k3l43J18Q3j2m4j89L54l2qj59l36M62p6K3J12l00J68
$$ y = [-475, -15, 33, 217, 371, -304, -278, 105, -105, 163, 202, -484, -190, -4, -111, 402, -329, -358, 621, -421, 6, -48, -611, 511, 141, -341, 335, -470, 170, 517, -641, 244, -295, -203, 650, -537, 51, 68, -294, 166, -266, -166, 155, -312, 131, 353, 44, -196, 53, 217, 130, 29, -258, 128, 294, -143, 227, -99, -475, 427, -203, 259, 88, -540, 358, 122, -477, 306, -331, 34, 617, -525, 305, -273, -181, 368, -154, -34, 305, -96, 202, -115, -269, -45, -114, -44, 181, 15, -227, -239, -21, 42, 181, -55, 97, 183, -131, 95, -68, -281, 255, -199, -114, 189, -273, 340, 35, -393, 239, -120, -155, 377, -317, 178, 201, -183, 413, -139, 7, 18, -328, 247, -95, 4, 68, -53, 170, 157, 157, -43, -52, 207, -60, 184, -45, 200, 21, -59, -43, 43, 137, -40, -230, 42, 298, -95, 194, 152, -352, 277, -220, -27, 168, -289, 179, 156, -187, -69, 14, 2, -42, -231, 123, 91, 83, -76, -412, 50, -26, -3, 109, -191, -23]
7920b3m3J95l76J40L02j16j39K24n64M11N1j42M24o21K37k2k02L88q1j03L11m08
7942a57K78K5m02L46l28J72N4n4L79l91J13K25k82n2R2J03l13K63k15J83J26j48
7964A7j64L10l75K46K23l16J56r6k12N15l15K48k15k79L53m09J33K43j33L11k41
7985@k26M89m80J01N25l66o4J65n0J49k88k9k5J50R5j9L7j04j21O4O1M3n51L03
8009a41K25k92L44j11k95M48m68K47L3k11N96l17l87N13m91J51M02m12M92k99
8029B7J30K06n99K14K4J5P7J17j78K51l10J03J77n02L70j44n9K13l75m4N41k41
8051A3j39L86n07K51J95m16L08k46N3N91o33j02N65m06P2J76m52L84j22l34P26
8072C63r35M36K88o09O57o1n42N16l23L71K80r47M49K96l05K63q5m18O33k25k24
$$ y = [-23, -66, 129, -247, -107, 195, 79, -60, 164, -400, 11, 62, -80, 344, -277, -40, -62, -264, 124, 43, -60, 251, -157, 121, 146, -256, 90, -238, -66, -12, -66, 313, -78, 35, 260, -22, -74, 18, 121, -192, 71, -144, 39, 165, 17, -147, 163, -212, 34, 257, -59, 97, 1, -211, 304, -11, 237, 22, -257, 96, -313, -180, 63, -70, 241, 0, -226, 263, -217, -116, 409, 43, -21, 144, 94, 243, -45, -74, -99, 51, 146, 127, 164, 60, -61, 3, 64, 107, -444, -141, 84, -208, 136, 25, -270, 178, -290, -43, -10, -221, 375, 58, -329, 184, -307, -156, 246, -166, 326, 27, 157, 363, -236, -22, 2, 17, 94, 211, 33, 284, -26, 77, 254, -248, 122, -22, -81, 132, -243, -287, 254, 13, -126, 260, -247, 4, 199, -217, 91, -155, -102, 489, -144, -246, 319, -87, -15, 161, -291, 93, -29, -363, 363, -572, -136, 152, -457, 200, 139, -403, 113, -210, 161, 441, -506, -57, 239, -66, 197, 112, -306, 327, 102, -122]
8093a22M32o44K97L07m74O84o11k54Q11l37l54L60m80M74M17n84M46n20o9Q83
8113F62r40K66J89q00J116k35p26O37l14k0N20o49K18K06j92O91o97k66O87o20
8133b67L4N24q96M98N24m60K79m62r1Q22o61K29K39p59K53O22o54L71k45k48J035
8154F87o15k24L71o50Q33n1q56Q71m00J1P55j492Q17k5l83R38o73m67Q23n85L52
8175C7K54n84N90j19l12L78q28J12O96j69j09K53o42N65J36p56
$$ y = [-122, 310, -334, -37, 270, -204, 480, -131, -385, 426, 89, -265, 95, -385, 89, 506, -78, 368, -152, -221, 662, -278, -12, 177, -623, 493, 258, -468, 169, -145, -165, 355, -294, -76, 130, -62, 629, -68, -334, 353, -267, -233, 291, -605, -107, 417, -43, 236, -226, -317, 505, -156, 73, 312, -447, -194, 428, -226, 145, -100, -348, 687, 72, -152, 219, -431, 402, 351, -505, 366, -34, -23, 732, -760, 57, 32, -351, 587, -86, -553, 270, -315, 37, 291, -293, 297, 178, -134, 244, -584, -472, 224, 55, -54, 199, -443, 122, 258, -498]
8191d98
$$ Imaginary data points
##PAGE= N=2
##DATA TABLE= (X++(I..I)), XYDATA
0@%%%%%%%%qJ6j6K4l2M0n2O1q1J04j28J60j92K27k70L24l84M50n26O12p10Q20
30D39r44J081j231J399j586J795k027K279k555K858l189L551l946M380m854N369
46B819n935O554p225P961q768R655j0635J1719j2922J4263j5771J7478j9427K1675
60A1441k4306K7434l1219L5912m1907M9874o1062P8143j08841K58409p21415O27058
72I9521N246o07991R84280p39082J72085K33778k72964N15313n70216N6305L28597
83B04872m87195O26029k93598l24257L29519j92438K21005j31295J973J49044
93A03659k20000N03260l74884k33760L08529l82732M32228j08509j90786L84906
103B21911n09433N75883j00448o41574Q36529n86057Q4106O51661r48115M15990
$$ y = [0, 0, 0, 0, 0, 0, 0, 0, 0, -8, 8, -8, 16, -16, 24, -28, 33, -48, 56, -72, 88, -104, 123, -147, 177, -207, 243, -283, 329, -381, 439, -505, 576, -655, 744, -842, 953, -1074, 1205, -1350, 1508, -1681, 1870, -2076, 2304, -2550, 2819, -3116, 3438, -3787, 4174, -4594, 5061, -5574, 6145, -6777, 7486, -8285, 9193, -10234, 11441, -12865, 14569, -16650, 19262, -22645, 27229, -33833, 44310, -64531, 193878, -527537, 99521, 104767, -503224, 481056, -258026, -85941, 147837, -125127, 390186, -180030, -123725, 204872, -282323, 343706, 50108, -274149, 55370, -137068, 83937, -47358, -45385, 103659, -116341, 386919, 12035, -221725, 86804, -295928, 136300, 27791, -162995, 221911, -287522, 288361, 187913, -453661, 382868, -203189, -119083, 532578, -415537, 453]
113D53N6360l27339N64260m56524K12520R6363k85893N51513n87101l8663L78060
124A64009m71768M51349l6180k74582K70764j22840J56114j63868l4528J51605
134I0075k49906L63219j69522k27325K58203k59229K99052n6120j42744L51531
144B57234m30640L42542K7873n89683N63675l02912m5802N08623n27221K53628
154E7317K0484j95348L58743m15505K05121P8618l25252M90781l64193j25422
164b14656L55357l20600K46278L7844j40950J39253j36389J55159j82808q5192
174a46704K14521k39988K47312K0422j90267J95329j74967J49655m6477j42180
184a13344K86518l19090J77406J28146m35068L58980j19119q6548L40076k87714
$$ y = [453, 56813, -270526, 293734, -162790, 49730, 146093, -139800, 411713, -175388, -214051, 164009, -307759, 143590, 107410, -167172, 103592, -19248, 136866, -27002, -61530, 90075, -159831, 203388, 33866, -193459, 64744, -194485, 104567, 48447, -94297, 257234, -173406, 169136, 197009, -392674, 171001, -131911, -177713, 330910, -196311, 57317, 77801, -117547, 241196, -174309, 30812, 109430, -215822, 274959, -89234, -214656, 140701, -179899, 66379, 104223, -36727, 102526, -33863, 121296, -61512, -146704, 67817, -172171, 75141, 95563, -94704, 100625, -74342, 75313, 28836, -113344, 173174, -145916, 31490, 159636, -275432, 83548, -35571, -122119, 217957, -69757]
194f9757J62048l0385j55615K44928l38686J43477J22895k65817L63271j49783
204B6576j18151K19399k01608J13753k1553m9498J03308j61277J60143r0784j18705
215a38397K14732j53842J12372P4765j22089J06094j42079O8048l1900j38254
225a50550K38442j69563O6077J71122k61736J72352m1344r7584J69801j59900
235f2883J07568k7171j09450J79307k08262P6415J20287j67230K05123n5107p4783
246a6186Q7903j39977O2529m9257j0081J16377j15257J22159j0003j08073J27599
257F7733r8747K5761M7620p1450P4937q9785K6303J8105j01105J47005m7007j116
269a746J16315j25661M1444k4771p4666O8251o6336P1687J8161m8255J00701r0996
$$ y = [-69757, 92291, 61906, -93709, 151219, -187467, -43990, 78905, -186912, 176359, 26576, -91575, 127824, -73784, 39969, 18416, -31082, 72226, -89051, 71092, -19692, -138397, 76335, -77507, 34865, 109630, -12459, 93635, -48444, 19604, -12296, -150550, 87892, -81671, -15594, 155528, -106208, 66144, 24800, -72784, 97017, -62883, 44685, 17514, -91936, 87371, -120891, -44476, 75811, -91419, 113704, 58597, -16186, 71717, -68260, -5731, -54988, -65069, 51308, -63949, 58210, 48207, -59866, 67733, -31014, -5253, 42367, -29083, 45854, -43931, -17628, 477, -100628, 46377, -630, -1746, 114569, -11092, 30352, 5581, -69085, -834, -67170, 4517, 22678, -25577, 75124, -15872]
281a5872P854N3110q7275P6290j7991k8848L4660o9005L4498k0159q79P8864m3741
294A506N2411K819p0555L3080n8301p239L3288k0210N2103p672J162J7189m4832
307a5251K8562r006j3721L9079l4340k630o27l4532J7708Q037J7454L0195M052
320C4980N652k4640k4952r816k5880J1737K5551k292K4382J2036k7099Q986j158
333G487j6213K0895l427l660o714j9844N594k4865K2346L8362k0854M9547k754
346D5900m9751K2016m0671j6191J8227k333L1594r069K5600k895m4030M9900k9539
359a242q699M5508m5813J2907j3326j4055J0976l3523P6739j4246j0015Q2667
371H7878j06301J6558K5122r5055P4829k8160O665N9014o4107P5786n9786l0989
$$ y = [-15872, -8018, 45092, -42183, 34107, 16116, -12732, 21928, -47077, -12579, -32738, -33617, 45247, 1506, 53917, 56736, -13819, 19261, -39040, -46279, -12991, -33201, 18902, 11230, 12392, 29581, -15251, 13311, 4305, -9416, 29663, -4677, -7307, -7934, -42466, -24758, -16721, 733, 30928, 34980, 40632, 15992, -8960, -18776, -44656, -32919, -7368, -9660, 14722, 26758, -341, 8645, 7487, -8726, 12169, 8742, 5082, -1632, -21476, -15882, -40747, -18401, 19961, -893, 48654, 45900, -3851, 18165, -22506, -38697, -20470, -22803, 8791, -278, 25322, 22427, -21603, 28297, -1242, -9941, 35567, -10246, 2661, -10665, -24720, -13744, -47267, 29472, 15226, 5211, 87878, -18423, -1865, 23257, -71798, 3031, -25129, -18464, 40550, -23557, 52229, -7557, -38546]
383c8546J08458j15273N9189L6968j17430R0351l9707k8064M6176l5397P4574
394D1299k7418J5404K8710j12811O6581k1070m7584O8685m1929M3713o865R058
406A5773K4371j09640J15164k9050o8439J45008j49019K4314P5553j24443J13941
417C3533o6152J7951J06899j37345J35814q4504j13203J97020j62960L9977R9682
428F6712j52775J35577k1237l9456M6436r6002J06778l6111k7703Q1785j39967
439g5963O1389L7116n9067M7268l2578O5686l0823J6716M2246j87182J33852l10
451A8350j09613J81759j49509L7195J02895j36530J40158j38892Q269J62703k16251
462i9466J78294n8925j82887K72656j56030Q991J22587j73983J60227l4095m8037
$$ y = [-38546, 69912, -45361, 13828, 50796, -66634, 23717, -15990, -44054, 2122, -33275, 41299, 13881, 29285, 57995, -54816, 11765, -9305, -56889, 11796, -30133, 13580, 6715, 15773, 40144, -69496, 45668, 16618, -51821, 93187, -55832, -31518, 44035, -80408, 33533, -32619, -14668, 92231, -45114, 90700, 6196, -107007, 90013, -72947, -32970, 66712, -86063, 49514, 28277, -11179, 35257, -60745, 46033, 9922, -17781, 64004, -75963, -14574, 22542, -36525, 10743, -21835, 43851, 13028, 29744, 71990, -115192, 18660, 18350, -91263, 90496, -59013, -21818, 81077, -55453, 84705, -54187, -45918, 116785, -99466, 78828, 19903, -162984, 109672, -46358, -37367, 85220, -88763, 71464, 37369, -10668]
473a0668N9336j69998J39838K668q1984J29196j18633L2355P6281m9756k458n7129
485e0952R0901m6065L988Q5271k15504J26926N3511j23071J70369j44312M1698
496g240R8682j48746J62425j90354j2359K27331k53221J92933j1384k22793L01632
507A36906j45670j9304J11926k05617J89811m3367o3481J13927k11987J39118
517B262O6394j24632J21731q4575P424O0686k8652j4635j08939J24916j5348m0710
529c4078J37762j91728P1955R3281j19033J14948j39020N0408Q3778j50266J96824
540A14831j96941l9943K78710k63660J62845L4007k47230K82503j27221m1085
550d3184J06555k13804K04451k6371p7266J53654k08591J04662Q5842j33319Q8251
$$ y = [-10668, 48668, -121330, 18508, 21176, -60808, 68388, -50245, -17890, 58391, 8635, 6177, -50952, 39949, -6116, -2128, 83143, -132361, -5435, 48076, -74995, 95374, -48938, -7240, 91442, -57304, 105121, -85233, -97592, 129739, -123482, 69451, 58067, -164726, 136906, -8764, -28068, 83858, -121759, 68052, 24685, -38796, 75131, -136856, 2262, 68656, -55976, 65755, -18820, -11396, 49290, 20638, 6003, -102936, 21980, 6632, -34078, 103684, -88044, -16089, 77192, -41841, 73107, -65913, -15505, 68273, -81993, 114831, -82110, -122053, 156657, -107003, 55842, 89849, -157381, 125122, -2099, -43184, 63371, -150433, 54018, 27647, -49619, 104035, -104556, 106, 85948, -47371, 40880]
561D0880p8718K6343L6211l1122M2284j41448J07905M9550q8210J25075j26499
572c7749J8566O9993q2257Q7322j55170P9474R7605j77904K29165j52513j03811
583a27279K90434k36687Q5480P0643k22834K24394r0286k9101R5957j93811J94442
594F1352k2681q4534J58764j90832O9830P4623j23419Q2980q0778M4537M6134
605C5976n5767Q3834j22977M5284P2275r2835Q3066q4906J9413M2207p3003J17943
617G0510j52823M8686J40953j99636J85172o4912j50565K33452j63808L2150O8997
628D8176j55485J78230q2531j05R0230j91561J69074k1704j00957J55949j52635
639f3319M3104O7458r7265Q1054p2784M3827M4046p2383R1841r8463O107O6022
$$ y = [40880, -37838, -11495, 24716, -6406, 35878, -105570, 2335, 51885, -36325, 88750, -37749, -19183, 50810, -31447, 55875, -99295, -19821, 77784, -100120, 129045, -23468, -127279, 163155, -73532, 11948, 82591, -140243, 84151, -6135, -35236, 60721, -133090, 61352, 38671, -45863, 112901, -77931, -8101, 66522, -56897, 26083, -54695, -10158, 35976, -19791, 64043, -58934, -13650, 58625, -34210, 48856, -36050, -16637, 25570, -47433, 70510, -82313, -33627, 107326, -92310, 92862, 27950, -122615, 110837, -52971, -20821, 48176, -107309, 70921, -11610, -11715, 78515, -113046, 56028, 34324, -66633, 89316, -63319, -20215, 47243, -50022, 31032, -41752, 2075, 46121, -26262, 65579, -32884, -26777, 39245]
651C9245q5571P3393n9297K1916N1023q6421J20655j06617j4650J42146j68170
662g2348J08799j518j27539J59496j04374K7150N0021j13947J50204q4852o112
673a5020R7428j75435J18918k392r4376J28476r5751L4419M0362o7587P6217q0876
685c5617L7926L6499q6698R3893o7337j0952O4042p3831O6681l8168O203N7387
697E0028r1277Q9563n3726n0840J13468j10817N5165K9148q3934J03564o9498
708a9156J8694L7594r4166J08494o1430k0854Q8222j19061P0626P619o1596Q7455
720D2441o3172L4068J4236n6374P0556p5047K1474L9236p5676P9342l4843j2172
732a5931N1468o2363N1698k8033j1990N4125p6794N6190j1350n1224P9806o1314
$$ y = [39245, -46326, 27067, -32230, -10314, 40709, -45712, 74943, -31674, -46324, 95822, -72348, 36451, 34933, -92606, 66890, -37484, -10334, 39687, -74260, 75944, -8908, -15020, 82408, -93027, 25891, 23499, -70877, 57599, -38152, -3733, 36629, -30958, 45259, -35617, 2309, 38808, -47890, 46003, -21334, -32286, 31756, -42075, 24606, -13562, -7359, 50028, -41249, 48314, -5412, -56252, 57216, -53601, 1564, 30712, -53222, 50342, -19156, -462, 37132, -57034, 51460, -9970, -30824, 57398, -61663, 8963, 16582, -45014, 42441, -20731, 13337, 27573, -28801, 41755, -33292, -11818, 27418, -48258, 31084, -3759, -15931, 35537, -26826, 24872, -3161, -15151, 38974, -37820, 18370, 7020, -44204, 35602, -25712]
744b5712K4541L1346n4210O1302m5819L015K8884o7143O4888k8251j7988O2301
756C7154o3309L7627L346l7298N0299m5349K3286P310m1771N2289m5082R408L2414
769B0324m8552N0722j7397j2008L3232m6848K9332j3140j8465M1537m1604K8917
781F050O932l2808M3522l2325O045J9143l3972L2041k0462m607K1514l3142K9850
794G781o533j0138L2640l0701J4767J747k5383K4444j9331M993J2578j7190K1887
807A1561j2410M9J3181k1082J6922l941j0888J4703j4784L229K393l979R158o403
821b291J0998j538r035J1999j5793r64R247j1220Q106J142j698N139n134O817
$$ y = [-25712, -1171, 30175, -24035, 37267, -8552, -5537, 23347, -43796, 21092, -7159, -25147, 37154, -26155, 11472, 14818, -22480, 27819, -17530, 5756, 13066, -28705, 23584, -21498, -12090, 20324, -28228, 22494, 5097, -6911, 26321, -20527, 8805, -4335, -22800, 18737, -22867, 6050, 12982, -19826, 23696, -8629, -2584, 16559, -17413, 14628, -5834, -10441, 11073, -22069, 7781, 1248, -8890, 23750, -6951, 7816, 9563, -15820, 8624, -10707, -5714, 6864, -10326, 11561, -849, -800, 12381, -8701, 8221, 4280, -6608, 8095, -6689, -3460, -1067, -5046, 4112, -2291, 8707, 7169, -1866, 10133, -5660, -6624, 2623, -8597, -491, 651, -1047, 4092, -1042, 5775]
$$ [...]
8191A55
##END NTUPLES=NMR FID
##END=
