##TITLE=1H_X2508
 aceton-d6
 8 sc, 
 28.8.2023
##JCAMPDX= 6.0         $$ Bruker NMR JCAMP-DX V2.0
##DATA TYPE= NMR FID
##DATA CLASS= NTUPLES
##ORIGIN= UXNMR, Bruker Analytische Messtechnik GmbH
##OWNER= root
$$ XWIN-NMR		Version 3.5
$$ Mon Aug 28 14:06:49 2023 Russian Standard Time (UT+4h)  she@DPX200
##.OBSERVE FREQUENCY= 200.13135
##.OBSERVE NUCLEUS= ^1H
##.DELAY= (6, 6)
##.ACQUISITION MODE= SIMULTANEOUS
##.ACQUISITION SCHEME= undefined
##.AVERAGES= 8
##.DIGITISER RES= 18
##SPECTROMETER/DATA SYSTEM= spect
##.PULSE SEQUENCE= zg30
##.SOLVENT NAME= Acetone
##.SHIFT REFERENCE= (INTERNAL, Acetone, 0, 15.7039)
##AUDIT TRAIL= $$ (NUMBER, WHEN, WHO, WHERE, WHAT)
$$ ##TITLE= Audit trail, XWIN-NMR		Version 3.5
$$ ##JCAMPDX= 5.01
$$ ##ORIGIN= Bruker BioSpin GmbH
$$ ##OWNER= she
$$ F:/spectra/data/she/nmr/H-F/1/audita.txt
$$ ##AUDIT TRAIL=  $$ (NUMBER, WHEN, WHO, WHERE, WHAT)
(   1,<2023-08-28 14:05:24.57 +0400>,<she>,<DPX200>,
      <created by zg, POWCHK disabled, PULCHK disabled
       configuration hash MD5:
       00 E9 B6 7A A2 85 ED C7 34 08 36 98 17 FE 4E 26
       data hash MD5: 16K
       FF E4 50 19 A0 1B 88 D3 91 37 F1 B7 EB 6B AA 29>)
$$ ##END=
$$ 
$$ hash MD5
$$ A0 3C 5D 1D F4 4C 24 9E 3A FC C5 9C 59 D2 09 2A
##$RELAX= 
##$RELAX= 
##$RELAX= 
##$RELAX= 
##$RELAX= 
##$RELAX= 
$$ Bruker specific parameters
$$ --------------------------
##$DU= <F:/spectra>
##$EXPNO= 1
##$NAME= <H-F>
##$PROCNO= 1
##$TYPE= <nmr>
##$USER= <she>
##$AMP= (0..31)
100 100 100 100 100 100 100 100 100 100 100 100 100 100 100 100 100 100 
100 100 100 100 100 100 100 100 100 100 100 100 100 100 
##$AQSEQ= 0
##$AQ_mod= 1
##$AUNM= <au_zg>
##$AUTOPOS= <>
##$BF1= 200.13
##$BF2= 200.13
##$BF3= 200.13
##$BF4= 200.13
##$BF5= 200.13
##$BF6= 200.13
##$BF7= 200.13
##$BF8= 200.13
##$BYTORDA= 1
##$CFDGTYP= 0
##$CFRGTYP= 5
##$CHEMSTR= <none>
##$CNST= (0..31)
1 1 145 1 1 1 1 1 1 1 1 1 1 1 1 1 1 1 1 1 1 1 1 1 1 1 1 1 1 1 1 1 
##$CPDPRG= <>
##$CPDPRG1= <>
##$CPDPRG2= <>
##$CPDPRG3= <>
##$CPDPRG4= <mlev>
##$CPDPRG5= <mlev>
##$CPDPRG6= <mlev>
##$CPDPRG7= <mlev>
##$CPDPRG8= <mlev>
##$CPDPRGB= <>
##$CPDPRGT= <>
##$D= (0..31)
0 1.2 0 0 0 0 0 0 0 0.06 0 0.03 0 0 0 0 0.0002 0 0 0 0 0 0 0 0 0 0 0 0 
0 0 0 
##$DATE= 1693217124
##$DBL= (0..7)
120 120 120 120 120 120 120 120 
##$DBP= (0..7)
150 150 150 150 150 150 150 150 
##$DBP07= 0
##$DBPNAM0= <>
##$DBPNAM1= <>
##$DBPNAM2= <>
##$DBPNAM3= <>
##$DBPNAM4= <>
##$DBPNAM5= <>
##$DBPNAM6= <>
##$DBPNAM7= <>
##$DBPOAL= (0..7)
0.5 0.5 0.5 0.5 0.5 0.5 0.5 0.5 
##$DBPOFFS= (0..7)
0 0 0 0 0 0 0 0 
##$DE= 6
##$DECBNUC= <off>
##$DECIM= 32
##$DECNUC= <off>
##$DECSTAT= 4
##$DIGMOD= 1
##$DIGTYP= 9
##$DL= (0..7)
0 120 120 120 120 120 120 120 
##$DP= (0..7)
150 150 150 150 150 150 150 150 
##$DP07= 0
##$DPNAME0= <>
##$DPNAME1= <>
##$DPNAME2= <>
##$DPNAME3= <>
##$DPNAME4= <>
##$DPNAME5= <>
##$DPNAME6= <>
##$DPNAME7= <>
##$DPOAL= (0..7)
0.5 0.5 0.5 0.5 0.5 0.5 0.5 0.5 
##$DPOFFS= (0..7)
0 0 0 0 0 0 0 0 
##$DQDMODE= 0
##$DR= 18
##$DS= 0
##$DSLIST= <SSSSSSSSSSSSSSS>
$$ [...]
##$SUBNAM2= <"">
##$SUBNAM3= <"">
##$SUBNAM4= <"">
##$SUBNAM5= <"">
##$SUBNAM6= <"">
##$SUBNAM7= <"">
##$SUBNAM8= <"">
##$SUBNAM9= <"">
##$SW= 18.05172834244
##$SWIBOX= (0..15)
0 0 2 0 0 0 0 0 0 0 0 0 0 0 0 0 
##$SW_h= 3612.71676300578
##$TD= 16384
##$TD0= 1
##$TE= 0
##$TE2= 300
##$TE3= 300
##$TEG= 300
##$TL= (0..7)
0 120 120 120 120 120 120 120 
##$TP= (0..7)
150 150 150 150 150 150 150 150 
##$TP07= 0
##$TPNAME0= <>
##$TPNAME1= <>
##$TPNAME2= <>
##$TPNAME3= <>
##$TPNAME4= <>
##$TPNAME5= <>
##$TPNAME6= <>
##$TPNAME7= <>
##$TPOAL= (0..7)
0.5 0.5 0.5 0.5 0.5 0.5 0.5 0.5 
##$TPOFFS= (0..7)
0 0 0 0 0 0 0 0 
##$TUNHIN= 0
##$TUNHOUT= 0
##$TUNXOUT= 0
##$USERA1= <user>
##$USERA2= <user>
##$USERA3= <user>
##$USERA4= <user>
##$USERA5= <user>
##$V9= 5
##$VALIST= <valist>
##$VCLIST= <CCCCCCCCCCCCCCC>
##$VD= 0
##$VDLIST= <DDDDDDDDDDDDDDD>
##$VPLIST= <PPPPPPPPPPPPPPP>
##$VTLIST= <TTTTTTTTTTTTTTT>
##$WBST= 1024
##$WBSW= 4
##$XGAIN= (0..3)
0 0 0 0 
##$XL= 0
##$YL= 0
##$YMAX_a= 742256
##$YMIN_a= -726299
##$ZGOPTNS= <>
##$ZL1= 120
##$ZL2= 120
##$ZL3= 120
##$ZL4= 120
##$ABSF1= 10
##$ABSF2= 0
##$ABSG= 5
##$ABSL= 3
##$ALPHA= 0
##$AQORDER= 0
##$ASSFAC= 0
##$ASSFACI= 0
##$ASSFACX= 0
##$ASSWID= 0
##$AUNMP= <proc_1d>
##$AZFE= 0.1
##$AZFW= 0.1
##$BCFW= 1
##$BC_mod= 2
##$BYTORDP= 1
##$COROFFS= 0
##$CY= 11.3945322036743
##$DATMOD= 1
##$DC= 2
##$DFILT= <>
##$DTYPP= 0
##$F1P= 15.7292609196834
##$F2P= 12.9074282941183
##$FCOR= 0.5
##$FTSIZE= 0
##$FT_mod= 4
##$GAMMA= 1
##$GB= 0.15
##$INTBC= 1
##$INTSCL= 1
##$ISEN= 128
##$LB= 0.24
##$LEV0= 0
##$LPBIN= 0
##$MAXI= 10000
##$MC2= 0
##$MEAN= 0
##$ME_mod= 0
##$MI= 1.114404
##$NCOEF= 0
##$NC_proc= 0
##$NLEV= 6
##$NOISF1= 3.799351
##$NOISF2= 2.8
##$NSP= 1
##$NTH_PI= 0
##$NZP= 0
##$OFFSET= 15.70392
##$PC= 1
##$PHC0= -21203.18
##$PHC1= 9.05272
##$PH_mod= 1
##$PKNL= yes
##$PPARMOD= 0
##$PSCAL= 0
##$PSIGN= 0
##$REVERSE= no
##$SF= 200.130013532006
##$SI= 16384
##$SIGF1= 3
##$SIGF2= 2
##$SINO= 400
##$SIOLD= 16384
##$SREGLST= <1H.CDCl3>
##$SSB= 0
##$STSI= 0
##$STSR= 0
##$SW_p= 3612.71676300578
##$SYMM= 0
##$S_DEV= 0
##$TDeff= 0
##$TDoff= 0
##$TI= <>
##$TILT= no
##$TM1= 0
##$TM2= 0
##$TOPLEV= 0
##$USERP1= <user>
##$USERP2= <user>
##$USERP3= <user>
##$USERP4= <user>
##$USERP5= <user>
##$WDW= 1
##$XDIM= 8192
##$YMAX_p= 0
##$YMIN_p= 0
$$ End of Bruker specific parameters
$$ ---------------------------------
##NTUPLES= NMR FID
##VAR_NAME=  TIME,          FID/REAL,        FID/IMAG
##SYMBOL=    X,             R,               I
##VAR_TYPE=  INDEPENDENT,   DEPENDENT,       DEPENDENT
##VAR_FORM=  AFFN,          ASDF,            ASDF
##VAR_DIM=   8192,          8192,            8192
##UNITS=     SECONDS,       ARBITRARY UNITS, ARBITRARY UNITS
##FACTOR=    0.0002768,     1,               1
##FIRST=     0,             0,               0
##LAST=      2.2672688,     0,               0
##MIN=       0,             -726299,         0
##MAX=       2.2672688,     742256,          0
$$ Real data points
##PAGE= N=1
##DATA TABLE= (X++(R..R)), XYDATA
0@%%%%%%%%qQqJ6j8K6l2M0n6O5p5R2j14J37j62J94k27K64l06L56m11M74n43O19
$$ 0 0 0 0 0 0 0 0 0 -8 0 -8 8 -10 16 -16 24 -32 33 -42 50 -64 73 -89 105 -122 142 -164 192 -219 255 -288 331
32C31p04P97r02J016j142J281j436J602j783J982k201K440k699K982l294L636
$$ 331 -373 424 -478 538 -604 677 -759 843 -940 1042 -1159 1281 -1418 1564 -1730 1906
48A906m006M414m863N356n902O512p193P957q825R819j0968J2316j3923J5883
$$ 1906 -2100 2314 -2549 2807 -3095 3417 -3776 4181 -4644 5175 -5793 6523 -7400 8483
62H483j8331K1489k5745L1834m1334N8392r8739L79595M13855k03177m1359j53012
$$ 8483 -9848 11641 -14104 17730 -23604 34788 -63951 315644 729499 526322 484963 331951
74C31951o8945r5834k5413l2869J7412J2245O4098L9430O9468K8997J023l1377
$$ 331951 263006 167172 141759 108890 126302 138547 202645 242075 311543 340540 341563 310186
86C10186o3069j09415r1505j21813j23170j14814q4028n2113r657M2600J03899
$$ 310186 247117 137702 46197 -75616 -198786 -313600 -397628 -449741 -459398 -416798 -312899
97c12899J12960J44680J57396J46449J45905J22617P2002L8746k0868o7108r3913
$$ -312899 -199939 -55259 102137 248586 394491 517108 589110 627856 606988 539880 445967
108D45967j14677j22820j29723j17405q9706q4467m2821P420J8176L6796M6307
$$ 445967 331290 208470 78747 -38658 -128364 -212831 -255652 -248232 -230056 -193260 -146953
119a46953L3892L0299J3508k789j9661m7313o0649p5851p4893m7261l7080q269
$$ -146953 -113061 -82762 -69254 -72043 -91704 -139017 -199666 -275517 -350410 -397671 -434751 -443020
131d43020L2988M1471O7408J03224J14778J20814J12681R6930O9046K6213L264
$$ -443020 -410032 -368561 -301153 -197929 -83151 37663 150344 247274 316320 342533 345797
142C45797k5112n9961p3098r8586j11766r4292q6239o2401k6196p291J2698L0832
$$ 345797 320685 260724 187626 89040 -22726 -117018 -203257 -265658 -291854 -299145 -286447 -255615
154b55615M8797N9617N1943N5179M3041P626m141j6737l2464k7397l0658k9341
$$ -255615 -206818 -147201 -95258 -40079 2962 10588 6447 -10290 -42754 -70151 -100809 -130150
166a30150j4668l137J8599M1423O2222P7627P1677P2724O9267M2582L3324J8904
$$ -130150 -144818 -147955 -129356 -87933 -25711 51916 123593 196317 265584 308166 341490 360394
178C60394j8241m1882o1818p8038q0498p9381o6547n4520m2322j8095k919K0167
$$ 360394 342153 300271 238453 160415 79917 536 -66011 -120531 -162853 -180948 -183867 -163700
190a63700M7490M7043M9838N1632L1871K1658J5247O73j3752k8505l1557l4381
$$ -163700 -116210 -69167 -19329 32303 64174 85832 101079 101752 88000 59495 27938 -6443
202f443l5253j4190j091O941K5411K8290L3579M7077M3093L6970K8256R318j0209
$$ -6443 -41696 -55886 -56977 -50036 -24625 3665 37244 84321 127414 164384 192640 201958 191749
215A91749k9529l6908m4570n8590n3920n2012n5168l5020j5681j417J9054K8242
$$ 191749 162220 125312 80742 22152 -31768 -83780 -138948 -173968 -189649 -191066 -172012 -143770
227a43770L4469M0116M0226M0404L1568K3287J1707j2000j8745k0056l0641k3964
$$ -143770 -109301 -69185 -28959 11445 43013 66300 78007 66007 47262 27206 -3435 -27399
239b7399j6827j8956j0237J220J3406K4400K9792L5267K8567J9721J7507L669
$$ -27399 -44226 -63182 -73419 -72199 -58793 -34393 -4601 30666 59233 78954 96461 100130
251A00130l626p137k6382l5182l4871l9399l3000k1629j1360l664K112J6599K3964
$$ 100130 96504 89367 62985 27803 -7068 -46467 -79467 -101096 -112456 -116120 -114008 -97409 -73445
264g3445K7156L8505L4258K3138J9312N800l648n247j4154k0759k4127k4740k1354
$$ -73445 -46289 -7784 26474 49612 68924 74724 71076 65829 51675 30916 6789 -17951 -39305
277c9305j6917j995Q222Q012J7744K0926J6252K2445K1668J3147O693m463j3557
$$ -39305 -56222 -58217 -49995 -41983 -24239 -3313 12939 35384 57052 70199 76892 72429 58872
290E8872j9062k1090j9310k2219j8863j3418j4917k982J0568J1663J8651K1925
$$ 58872 39810 18720 -590 -22809 -41672 -55090 -70007 -72989 -62421 -50758 -32107 -10182
302a0182J6027J4322J2700J0268M352l868q059j7392k0892j4361j5270j0469j245
$$ -10182 5845 20167 32867 43135 47487 43619 35560 18168 -2724 -17085 -32355 -42824 -44069
315d4069l459P99J0814J4100J8188K0122J8408J2018L827L889q41q044o276j2859
$$ -44069 -47528 -46729 -35915 -21815 -3627 16495 34903 46921 50748 54637 53796 45752 39476 26617
329B6617j9611j4758j4300j0360j230J124K549M095P458J0368Q554J2090R971
$$ 26617 7006 -7752 -22052 -32412 -33642 -32518 -29969 -25874 -18416 -8048 506 12596 22567
342B2567j310j809m084j0406o160n879r106p654o952l059J821O948J2285R000
$$ 22567 21257 19448 15364 4958 -1202 -7081 -16187 -23841 -30793 -33852 -32031 -25083 -12798 -3798
356c798R460J1479M491O713Q792k51l135o136j1670j0948r537o414o289p778k969
$$ -3798 5662 17141 21632 28345 37137 36886 33751 27615 15945 4997 -4540 -10954 -17243 -25021 -27990
371b7990l619j368P324N029M853P436M62k59K402P83N63k270k899l969o452J081
$$ -27990 -31609 -32977 -25653 -20624 -15771 -8335 -7873 -8132 -5730 -4947 -4384 -6654 -9553 -13522 -19974 -18893
387a8893L018P17O698M187J384O741N904O173O835K379m5l851k873q81n166k012
$$ -18893 -15875 -15158 -8460 -4273 -2889 3852 9756 15929 22764 25143 25098 21247 18374 17493 12327 10315
403A0315j821q220l319n73j666L675L220J110J086j77L178K440J991L974k434
$$ 10315 8494 274 -3045 -3618 -5284 -1609 1611 2721 3807 3630 6808 9248 11239 15213 12779
418A2779k174J309k940J387M338m49M10l10o4K259J587L855N90l466K76k700k703
$$ 12779 10605 11914 8974 10361 14699 14250 14660 14350 14286 16545 18132 21987 22577 19111 19387 16687 13984
435A3984K635j844k435q77m283j541N83J169J352k617q90j347m257J542K53l682
$$ 13984 16619 14775 12340 11463 7180 5639 6222 7391 8743 6126 5236 3889 -368 1174 1427 -2255
451b255l92l740m470k22l89J286R3j634k71k576O64K686k365J38j036n815j551
$$ -2255 -2647 -6387 -10857 -11079 -11468 -10182 -10089 -11723 -11994 -14570 -13906 -11220 -13585 -13447 -14483 -20298 -21849
468b1849o77r83J390m68o7k3J005N769L444L327M874q91J10K069j706K17o09m537
$$ -21849 -22526 -23509 -22119 -22587 -22654 -22677 -21672 -15903 -12459 -9132 -4258 -5149 -5039 -2970 -4676 -4459 -5068 -9605
486i605m309m836k110o17j421J892n79j437L761J647K493N551J208J45O9j245
$$ -9605 -13914 -18750 -20860 -21477 -22898 -21006 -21585 -23022 -19261 -17614 -15121 -9570 -8362 -8217 -8148 -9393
502i393R68O11J437R28j844K535L569K663Q092O883M106O165L334K979L741J503
$$ -9393 -8425 -7814 -6377 -5449 -7293 -4758 -1189 1474 9566 16449 20555 26720 30054 33033 36774 38277
518C8277K65m441n806m835p649m550l048o401l039k252l161J674L117L384L281
$$ 38277 38542 34101 28295 23460 15811 11261 8213 1812 -1227 -3479 -6640 -4966 -1849 1535 4816
533D816J213J910P01P19L119r70j486K53l345n18K569J858M197L861K903L685
$$ 4816 6029 7939 8640 9359 12478 11508 10022 10275 6930 6412 8981 10839 15036 18897 21800 25485
549B5485L335N357L430m09j45m852p447n279q165q430p119r481q426o356l567
$$ 25485 28820 34177 37607 37198 37053 32201 24754 19475 11310 2880 -4239 -13720 -22146 -28502 -32069
564c2069N1K13K551K924J025M986M667K506M841J752j058j61j123K31J099J064
$$ -32069 -32018 -31805 -29254 -26330 -25305 -20319 -15652 -13146 -8305 -6553 -7611 -7772 -8895 -8664 -7565 -6501
580f501J948J87K222N113L043N364N152M91O55j187l971l304n157o721q678r989
$$ -6501 -4553 -4366 -2144 2969 6012 11376 16528 17019 17674 16487 12516 9212 4055 -2666 -11344 -21333
596b1333p122o605m468j67j381Q13M188L348O342Q329O738O418L832K813K520
$$ -21333 -28455 -35060 -39528 -39695 -41076 -40263 -36075 -32727 -26385 -18056 -11318 -4900 -1068 1745 4265
611D265J068K646O63j591P84o08j60L789K964L225L512J186J283L65K92o11m662
$$ 4265 5333 7979 8642 7051 7835 7227 7067 10856 13820 17045 20557 21743 23026 23391 23683 23072 18410
628A8410n243o697r209o151n743o369k973k815j974J425L556O447O738O452O828
$$ 18410 13167 6470 -2739 -8890 -14633 -21002 -23975 -26790 -28764 -27339 -23783 -17336 -10598 -4146 2682
643B682M092M768N568J646J878P93l012k153j765j717K73p2L09j64m11K425J068
$$ 2682 6774 11542 17110 18756 20634 21427 18415 16262 14497 12780 13053 12981 13290 13126 12715 15140 16208
660A6208K93J044l027m346l748o120n081m709n824n187n299k443K41J058M829
$$ 16208 16501 17545 14518 10172 6424 304 -4777 -9486 -15310 -20497 -25796 -28239 -27998 -26940 -22111
675b2111M589L686O718N543N021O646L783K086M43j967j438k216j697j200l762
$$ -22111 -17522 -13836 -7118 -1575 3446 10092 13875 15961 16404 14437 12999 10783 9086 7886 4124
690D124j793o39j595J999K102M61J439n91j345r31j922j588l742n138l584n059
$$ 4124 2331 1692 97 2096 4198 4659 6098 5507 4162 3231 1309 -279 -4021 -9159 -12743 -17802
706a7802k736K87j090J467K761J818M461N290N781N955L298L021J095n86J173
$$ -17802 -20538 -20251 -21341 -19874 -17113 -15295 -10834 -5544 237 6192 9490 12511 13606 13020 14193
721A4193j388k771j553m269l373j244j566P72J001N05J165j21J952K048m86P14
$$ 14193 12805 10034 8481 4212 839 -405 -1971 -1199 -198 307 1472 1351 3303 5351 4865 5579
737E579j756m013j852l192k712r18k341j136r07J74L244K692L972M403J332K981
$$ 5579 3823 -190 -2042 -5234 -7946 -8864 -11205 -12341 -13248 -13074 -9830 -7138 -3166 1237 2569 5550
753E550K708K95J983J20k138j943l501k419j381j563N39j147o40J976O41K486
$$ 5550 8258 8553 10536 10656 8518 6575 3074 655 -726 -2289 -1750 -2897 -3537 -1561 -920 1566
769A566L577N89J297Q7j721n35j591j289k112l996j977k244j842J869K24P20K378
$$ 1566 5143 5732 7029 7116 5395 4860 3269 1980 -132 -4128 -6105 -8349 -10191 -8322 -8098 -7378 -5000
786e000N68J989K726J946K432Q0o40o51k246Om25k147j5j092j228J674J318K357
$$ -5000 -4432 -2443 283 2229 4661 4741 4101 3450 1204 1210 785 -1362 -1377 -2469 -3697 -2023 -705 1652
804A652K716J132J750K65N53J633j189j032j778m465k370k228k791o55j570j444
$$ 1652 4368 5500 7250 7515 8068 9701 8512 7480 5702 1237 -1133 -3361 -6152 -6807 -8377 -9821
820i821m32n14K093J855J457K709o8K83J881j99J105R18j241k88p80j05J351R18
$$ -9821 -10253 -10767 -8674 -6819 -5362 -2653 -2721 -2438 -557 -756 349 1267 26 -262 -1042 -1147 204 1122
838A122K192J096p8K287J061Q68K297o36j251j329l062j908k347k488j988l647
$$ 1122 3314 4410 4332 6619 7680 8548 10845 10209 8958 7629 4567 2659 312 -2176 -4164 -7811
854g811k300j317j542J487J128j0J910R70J274K735J962K261J096Q4J029k68J083
$$ -7811 -10111 -11428 -12970 -11483 -10355 -10365 -8455 -7485 -6211 -3476 -1514 747 1843 1927 2956 2688 3771
871C771K057k79P54O97p22J617J223O56J042o99q64j438j795m63k197k872k074
$$ 3771 5828 5549 6303 7000 6278 7895 9118 9774 10816 10117 9253 7815 6020 5557 3360 488 -1586
888a586m072k676q92j846j74n0n94P83Q18K309L093J839K902J360N60K554J362
$$ -1586 -5658 -8334 -9226 -11072 -11246 -11296 -11890 -11107 -10289 -7980 -4887 -3048 -146 1214 1774 4328 5690
905E690J038J837l18k56j25m62Q16k5J0k44j983o54m27j512r4j670k972j828k614
$$ 5690 6728 8565 8247 7991 7866 7404 8220 8195 8205 7961 5978 5324 4897 3385 3291 1621 -1351 -3179 -5793
924e793j898j051j468o34j513r39R50N11K292K907J056K139K184J649K935K175
$$ -5793 -7691 -8742 -10210 -10844 -12357 -13296 -12346 -11835 -9543 -6636 -5580 -3441 -1257 392 3327 5502
940E502J552J126l00J38k36l98Q92j247j507p35k021p67O1j167o46j449j697j164
$$ 5502 7054 8180 7880 8018 7782 7384 8276 7029 5522 4787 2766 1999 2060 893 247 -1202 -2899 -4063
958d063j487m6m65j707m50j305r15J407P14J007J759P43J598J867K355K972J531
$$ -4063 -5550 -5596 -6061 -7768 -8218 -9523 -10438 -9031 -8317 -7310 -5551 -4808 -3210 -1343 1012 3984 5515
975E515J574J122n91R72O73o45L1j463k116j074j345o54o70j110o03j705r91L90
$$ 5515 7089 8211 7620 8592 9265 8620 8651 7188 5072 3998 2653 1999 1329 219 -384 -2089 -3080 -2690
993b690n85L01J01j458m50k04k21Q72K77L43K36q1J436J394J551K443N49N20J275
$$ -2690 -3275 -2974 -2873 -4331 -4781 -4985 -5206 -4334 -4057 -3714 -3478 -3559 -2123 -729 822 3265 3814 4334 5609
1012E609L91R30Q08l85o66j533j352q39j306k96r01j971o12r61m97J122Q3j16
$$ 5609 6000 6930 7738 7353 6687 5154 3802 2963 1657 1361 460 -1511 -2123 -3084 -3581 -2459 -2376 -2492
1030b492N2n86K30J23N13P04o85k89j34o82J151J051J27R00R9J88J128Q59J190
$$ -2492 -2440 -3026 -2796 -2673 -2160 -1456 -2141 -2430 -2564 -3246 -2095 -1044 -917 -17 82 270 1398 2257 3447
1049C447L63l11j03j319m75M43j085o66q57j838m00l2J00O73r5K32jj32J290N48
$$ 3447 3810 3499 3396 2077 1602 2045 960 294 -563 -2401 -2801 -2833 -2733 -2060 -2155 -1923 -1924 -2056 -766 -218
1069b18K78N16j059q28L00l72K45J92n19j71n00N21J104M70J288K95p86P35J78
$$ -218 60 576 -483 -1311 -1011 -1383 -1138 -946 -1465 -1636 -2136 -1615 -511 -41 1247 1542 756 1491 1669
1088A669R9P53n19p51p54q10J79r1L52N80q77J0O73N9J313O81m06o0p45l93j7
$$ 1669 1768 2521 2002 1251 497 -313 -134 -225 127 707 -170 -160 513 572 1885 2566 2160 2100 1355 962 945
1109I45l41m3j029j148j42p77M11J176o8L02K81r0J036P55P36M95n43k11m23m00
$$ 945 604 561 -468 -1616 -1758 -2535 -2124 -948 -1016 -714 -433 -523 513 1268 2004 2499 1956 1745 1322 922
1129I22Q62j02n19R5r25q2Q47L54N39k5m13k54o94J55J7r65m19j158j587R9j69
$$ 922 1784 1682 1163 1258 333 251 1098 1452 1991 1966 1553 1299 605 760 777 -188 -607 -1765 -3352 -3253 -3422
1150c422QM53l78O1K74O80J344O32Q13N49p09K48N43r6N30k41r48k44l65K67M65
$$ -3422 -3414 -2961 -3339 -3278 -3004 -2324 -980 -348 465 1014 305 553 1096 1000 1530 1289 341 97 -268 -1 464
1171D64J30M48o29m86N12l06K38L00j256p89p73p66J08r8Lj41n61M71N37P09J685
$$ 464 594 1042 413 -73 439 133 371 671 -585 -1374 -2147 -2913 -2805 -2903 -2900 -3041 -3602 -3131 -2594 -1885 -200
1192b00M81J03O20j24N59P02M5k6p45n52j92l69O20L55m86J30k83k53R48L20L7
$$ -200 281 384 1004 880 1439 2141 2186 2160 1415 863 671 302 922 1277 791 921 638 385 1333 1653 1690
1213A690j26q60n49m77j77K89o98l65j91q07O30R83M37R00J60p9M64L02Q28Q4
$$ 1690 1564 704 155 -322 -499 -210 -908 -1273 -1464 -2271 -1641 -658 -221 679 839 760 1224 1526 2354 2438
1233B438m78j72j150o56L83m10J15P6p75j4L00N92R24K74K15r0p24L38km04K54
$$ 2438 1960 1788 638 -18 365 -45 70 146 -629 -643 -343 249 1173 1447 1662 1572 848 1186 1184 780 1034
1254A034j013j038j66l65L26N07j3K28l86K92O57R2O70k5r99l94n58m57L15l28
$$ 1034 21 -1017 -1183 -1548 -1222 -715 -728 -500 -886 -594 63 155 825 800 -199 -593 -1151 -1608 -1293 -1621
1274a621m04l44l42O04M97R21J298P6L74N55j22Q31L91m08l87j027q51l69m26
$$ -1621 -2025 -2369 -2711 -2107 -1610 -689 609 685 1059 1614 1492 2323 2714 2306 1919 892 41 -328 -754
1293g54P4m26p04J08n38K84R41J20O6j54p36J3j54N4J11p33j11k73k02J222R00
$$ -754 -680 -1106 -1810 -1702 -2240 -1956 -1015 -895 -829 -983 -1719 -1706 -1860 -1806 -1695 -2428 -2539 -2812 -3014 -1792 -892
1314h92P81J202L05O05J154P92Q99K44l93m01j065m32k72j090m22r55j409j83
$$ -892 -111 1091 1396 2001 3155 3947 4846 5090 4697 4296 3231 2799 2527 1437 1015 60 -1349 -1532
1332a532k57J78N33j09j01j60n4N79N1J09K77r11j64K87J29J008Q44L28P08N61
$$ -1532 -1789 -1611 -1078 -1187 -1288 -1448 -1502 -923 -872 -763 -486 -1397 -1561 -1274 -1145 -137 707 1035 1743 2304
1352B304J127J176Q30R10j74m96j72q83o10l54j504j455j462j299n06m83j29k14
$$ 2304 3431 4607 5437 6347 6173 5677 5505 4622 4012 3658 2154 699 -763 -2062 -2568 -3051 -3180 -3394
1370c394o47J28J35J18J034K70j07J52m88P1N49L19M79J7K32N98L21J223J215
$$ -3394 -4041 -3913 -3778 -3660 -2626 -2356 -2463 -2311 -2799 -2728 -2179 -1860 -1381 -1364 -1132 -534 -213 1010 2225
1389B225L17M94j4m25J88l56n68q40j597j422j421r25l38q85l96j64p50K91Q36
$$ 2225 2542 3036 3022 2597 2785 2429 1861 1021 -576 -1998 -3419 -4344 -4682 -5567 -5963 -6127 -6877 -6586 -5750
1408e750O96J027M73K94L62L68Q13O90K73M97j90J86Q65N33R47R51J87L49J90
$$ -5750 -5054 -4027 -3554 -3260 -2898 -2530 -1717 -1027 -754 -257 -447 -261 604 1137 2084 3035 3222 3571 3761
1427C761M17M43k27j62o85j435o68p92p64k26p88p74k11j68N01Q75P60P54J24
$$ 3761 4178 4621 4394 4232 3547 2112 1444 652 -112 -338 -1126 -1900 -2111 -2279 -1778 -903 -143 611 735
1446G35O83Q57M67Q61N77j71P4j80k5O25J92K67L3j52R8J71K73L90o57n12n77
$$ 735 1418 2275 2742 3603 4180 4009 4083 3903 3878 4503 4695 4962 4995 4843 4941 5112 5385 5775 5118 4606 4029
1467D029j132o21m73p84q50j051q92l59k83M76K07N7L27o4K98P68K24K63P6n80
$$ 4029 2897 2276 1803 1019 169 -882 -1774 -2133 -2416 -1940 -1733 -1676 -1349 -1413 -1115 -347 -123 140 216 -364
1487c64l83j62RJ01m23k21k46n23K11L18P7K55m00n09k44l49n7k80m63o01q46
$$ -364 -747 -909 -900 -799 -1222 -1443 -1689 -2212 -2001 -1683 -1606 -1351 -1751 -2260 -2504 -2853 -2910 -3190 -3653 -4254 -5100
1508e100k78K00k4M27L25j76L35L90N88Q14L05N2r5k30J46J1J78K78m89k6J17
$$ -5100 -5378 -5178 -5202 -4775 -4450 -4626 -4291 -3901 -3313 -2499 -2194 -2142 -2237 -2467 -2321 -2310 -2132 -1854 -2343 -2369 -2252
1529b252J00O52P05M11K67p9L15N32K42M44l1l49K0l31J11O56J39J60J32o6M24
$$ -2252 -2152 -1500 -795 -384 -117 -196 119 651 893 1337 1306 957 977 646 757 1413 1552 1712 1844 1778 2202
1550B202M06O63M20l97j20k54m39J35j44l31l05n93l06K84K62N23L53O7K87o2
$$ 2202 2608 3271 3691 3294 3174 2920 2481 2616 2472 2141 1836 1243 937 1221 1483 2006 2359 2426 2713 2651
1570B651N19O56m6J06k87n22k07j62K1Q8m71k67k14j92L95r7M3j1r45n10l68n48
$$ 2651 3170 3826 3780 3886 3599 3077 2870 2708 2729 2817 2346 2079 1865 1673 2068 1971 2014 2003 1058 548 180 -368
1592c68k82n77p82p13q20qK52J18M85K22J61O12M76Q51Q04O2k1k03k63N6j59R
$$ -368 -650 -1227 -2009 -2722 -3542 -3550 -3298 -3180 -2695 -2473 -2312 -1700 -1224 -373 431 493 472 269 6 62 -97 -88
1614h8j30p61j68P4K3N10J86j02o0n07j00M0l23l00q54p58l68n69J91M37P6L45
$$ -88 -218 -979 -1147 -1073 -1050 -540 -354 -456 -516 -1023 -1123 -1083 -1406 -1706 -2560 -3318 -3686 -4255 -4064 -3627 -3551 -3206
1636c206M15O15J079J004J225P76R3K27N1R0J86l01l77m20q33k30K01J25K71k7
$$ -3206 -2791 -2176 -1097 -93 1132 1908 2001 2228 2279 2369 2555 2254 1877 1457 624 394 595 720 991 964
1656I64lM0j79M37J10m60m77r18q78m46n43k02n8m04m1L08P33J132Q39R74O74
$$ 964 961 1001 822 1259 1369 909 432 -486 -1364 -1810 -2353 -2555 -2613 -3017 -3058 -2750 -2017 -885 -46 928 1602
1677A602P2M88L82J11j06n62p51q39p85k56l6j58P4l16K44N41L69P17M17k88m14
$$ 1602 1674 2162 2544 2655 2549 1987 1236 397 -388 -644 -680 -838 -764 -1080 -836 -295 74 791 1208 920 506
1698E06n42m77l26o44m72p18q28j02J19O20R17N40P83Q00N57Q60Q10L60m8o22
$$ 506 -36 -513 -839 -1483 -1955 -2673 -3501 -3603 -3484 -2864 -1947 -1407 -624 176 733 1593 2403 2763 2715 2093
1718B093n89n49o53j25k31n17j61l6N08R35Q23Q92N97Q0J42o0M8j82j028r53j085
$$ 2093 1504 955 302 177 -54 -571 -732 -768 -260 675 1498 2390 2987 3067 3209 3149 3197 3015 1987 1034 -51
1739e1j303n29k94j48O1rL80O00P50J178Q54M07K4l67j67q3n51l89n25q06l58
$$ -51 -1354 -1883 -2177 -2325 -2264 -2273 -1893 -1293 -543 635 1489 1896 1920 1553 1386 1303 752 363 -162 -968 -1326
1760a326pN81R14O54Q79O02M70P99M05K06l27j014j217j249j455j046r95r69q89
$$ -1326 -1333 -752 162 816 1695 2297 2767 3566 3971 4177 3850 2836 1619 370 -1085 -2131 -3126 -4095 -4984
1779d984p03Q6N53P61J109Q86O31P47N65O19N88j1j25m47m89o9J94N91P07L59
$$ -4984 -5687 -5601 -5048 -4287 -3178 -2292 -1661 -914 -349 270 858 847 722 275 -214 -283 -89 502 1209 1568
1799A568O53R47Q88J128Q53L23k16q76r44j121j383j492j773j902j472j235m53
$$ 1568 2221 3168 4056 5184 6037 6360 6144 5268 4324 3203 1820 328 -1445 -3347 -4819 -6054 -6507
1816f507L33K37O92Q81R17J283J393J400J127M27J74lj27K22J7j7Jk33K65O93
$$ -6507 -6174 -5937 -5245 -4364 -3447 -2164 -771 629 1756 2183 2357 2354 2227 2449 2466 2449 2450 2217 2482 3175
1836C175O82P52M28J3k90p88o46j011j731j814k365k373j954j681r71n73l81J83
$$ 3175 3857 4609 5037 5050 4760 3972 3326 2315 584 -1230 -3595 -5968 -7922 -9603 -10574 -11147 -11528 -11345
1854a1345O27J308J881J922K019J677J069J148J103N63O30J25l09l16m50J08L19
$$ -11345 -10718 -9410 -7529 -5607 -3588 -1911 -842 306 1409 1972 2602 2727 2418 2102 1652 1760 2079
1871B079K30L72l4j1L8k25j00m39j334j550j828j837j496j338j080q11p11K61
$$ 2079 2309 2681 2647 2636 2674 2449 2349 1910 576 -974 -2802 -4639 -6135 -7473 -8553 -9364 -10075 -9814
1889i814R52J538K326K255K409K360K136K148K057J352J128K34j31l22o34j70
$$ -9814 -8862 -7324 -4998 -2743 -334 2026 4162 6310 8367 9719 10847 11081 10950 10628 9994 9824
1905I824k73p38o90n43m98j16k41k95n42j290j265j420j510j211j606j469j217
$$ 9824 9551 8813 8123 7580 7082 6966 6725 6430 5888 4598 3333 1913 403 -808 -2414 -3883 -5100
1922e100j220k27M91R36J498J510J858K125K109K308K068J320Q28J6l73m72r76
$$ -5100 -6320 -6547 -6056 -5120 -3622 -2112 -254 1871 3980 6288 8356 9676 10504 10520 10147 9675 8699
1939H699j205j405j946j773j490j244q26r92p79r23j148p95p38r11p75j285j301
$$ 8699 7494 6089 4143 2370 880 -364 -1190 -2182 -2961 -3884 -5032 -5827 -6565 -7476 -8251 -9536 -10837
1956a0837r73q04m0J93N56J013J048J635K228K222K453K240J381J300P51L86J97
$$ -10837 -11810 -12614 -12654 -12461 -11905 -10892 -9844 -8209 -5981 -3759 -1306 934 2315 3615 4366 4752 4949
1973D949n58j002j350j904j448j515j089o93j048p12l45l54L57L68K27J40j76
$$ 4949 4391 3389 2039 135 -1313 -2828 -3917 -4610 -5658 -6370 -6715 -7069 -6712 -6344 -6117 -5977 -6153
1990f153n4P1J51N90M41M63P91R48J429K074J900K047J803J396J508J097Q85L39
$$ -6153 -6207 -6136 -5985 -5395 -4954 -4491 -3700 -2752 -1323 751 2651 4698 6501 7897 9405 10502 11387 11726
2008A1726l89q43j338j688j340j422j442j312j478r69m99k76K51K89J90L02J6
$$ 11726 11337 10494 9156 7468 6128 4706 3264 1952 474 -495 -994 -1270 -1019 -730 -540 -238 -222
2025b22M25M45K43K98Nk08J98K96O55R03N65Q40O48O24R41O46M59P0p68q50j095
$$ -222 203 648 891 1189 1194 986 1184 1480 2135 3038 3603 4443 5091 5715 6656 7302 7761 7831 7063 6213 5118
2046E118j329j175j495j792j581j608j021n61l61J29KR0N13M64P83P96M51M08
$$ 5118 3789 2614 1119 -673 -2254 -3862 -4883 -5444 -5805 -5676 -5674 -5584 -5071 -4607 -3824 -3028 -2577 -2169
2064b169N7k7L37J74L61K82n3L11L54L76R07N02L44J90k57j96k45n14m47r12j185
$$ -2169 -2112 -2139 -1802 -1628 -1267 -985 -1038 -727 -373 3 910 1412 1756 1946 1689 1493 1248 734 287 -625 -1810
2085a810r57r29l94j83j96J12K6L23P14Q54J023R02M73N54L03K80N06J71K3j15
$$ -1810 -2767 -3696 -4090 -4273 -4469 -4357 -4331 -4008 -3294 -2440 -1417 -515 -42 512 815 1095 1601 1772 1795 1680
2105A680m92l5J13J39L32P4n4L1r9Q8M3k17j60p38p30l95n83k05k09m31k03o5
$$ 1680 1188 1153 1266 1405 1737 1811 1757 1788 1689 1777 1820 1603 1443 705 -25 -420 -1003 -1208 -1417 -1848 -2051 -2116
2127b116J89M81M89O56L72J07L72K86J77L36j28l35l46n49j04j34j62j43l61k07
$$ -2116 -1927 -1446 -957 -301 71 178 550 836 1013 1349 1221 886 540 -9 -113 -247 -409 -552 -913 -1120
2147a120l1l7K86J50j02j4l20j19J91oN9j18k87O7O5L08N23K74K49K24P0L98L26
$$ -1120 -1151 -1188 -902 -752 -854 -868 -1188 -1307 -1116 -1122 -1063 -1181 -1468 -1401 -1336 -1028 -505 -231 18 242 312 710 1036
2170A036K76J33k64j39j84k42j0m4k25j99l27j38K22O7K92O6j64P4N7K37L94K3
$$ 1036 1312 1445 1181 1042 858 616 606 562 337 138 -189 -327 -105 -38 254 320 156 230 287 524 918 941
2192I41J53rj00K51J43K43L32p3n5L8r2K62P1j82q3n31k33j60k25n2k06m56k53
$$ 941 1094 1085 985 1236 1379 1622 1954 1881 1826 1864 1772 2034 2105 1923 1840 1309 1076 916 691 639 433 -23 -276
2215b76l41j47K41j10m9j17k47O4Q3O9K99j25kO3L8L73K88J96J53j45J14J60j4
$$ -276 -617 -764 -523 -633 -682 -799 -1046 -982 -899 -830 -531 -656 -658 -595 -557 -184 104 300 453 308 422 582 568
2238E68J64q6k97k74l56k02pj99p0k87k88l3k8J33J60j37kj12n8K00R7J35N2j68
$$ 568 732 646 349 75 -281 -483 -490 -689 -759 -1046 -1334 -1367 -1395 -1262 -1102 -1239 -1241 -1353 -1411 -1211 -1114 -979 -927 -1095
2262a095Q8J64K53M65L24K36L06R0L33M15K74J44j46k83p6l12j37r4m71k20l88
$$ -1095 -1007 -843 -590 -125 199 435 741 831 1164 1579 1853 1997 1851 1568 1492 1180 1043 949 478 258 -130
2283a30l54J9q8M7k2k62j21qp8J11p2j39k03k92L8J51J48K60J60J35M06L42N45
$$ -130 -484 -465 -553 -506 -528 -790 -911 -919 -997 -886 -958 -1097 -1300 -1592 -1554 -1403 -1255 -995 -835 -700 -294 48 593
2306E93N21K33K20%j96J41j89k09k89o94l76m91l17j20j47k94r9k89N4Q2n5J75
$$ 593 1114 1347 1567 1567 1371 1512 1323 1114 825 131 -245 -736 -1053 -1173 -1320 -1614 -1713 -2002 -1948 -1866 -1921 -1746
2328a746j35k16M9k54J84K57K5L50J31K99O71O24P46O40M93M68L19K39L33O2j62
$$ -1746 -1881 -2097 -2048 -2302 -2118 -1861 -1836 -1486 -1355 -1056 -385 239 985 1625 2118 2586 2905 3144 3477 3539 3377
2349C377l14n97m69l93m62k74m95m56k23l13N7O2q3J85j33j65O8L5J99J26p6J84
$$ 3377 3063 2466 1997 1604 1142 868 373 -83 -306 -619 -562 -500 -583 -398 -531 -696 -628 -593 -394 -268 -344 -160
2371a60J51L12O49N12N82O57L36N34M45L07L87l7l08l52p38m68o16p54p15q71
$$ -160 -9 303 952 1464 2046 2703 3039 3573 4018 4325 4712 4675 4367 4015 3277 2809 2193 1439 724 -147
2391a47q50n24n25j68j89j83j71j20p0K32P1J02Q9o7J54J71K70N91L71N31M90
$$ -147 -997 -1521 -2046 -2214 -2403 -2586 -2757 -2877 -2947 -2715 -2644 -2542 -2453 -2520 -2366 -2195 -1925 -1334 -963 -432 58
2412E8L49O90O38M40L87k4j58j96n12l81o02r34p40j036q16m89m95l06k43k91
$$ 58 407 1097 1735 2175 2562 2538 2380 2184 1672 1291 689 -245 -985 -2021 -2837 -3326 -3821 -4127 -4370 -4661
2432d661L7L3L40M41K04L87K64K13M59M94M82N89L64N17N49N75P24P25M72M76
$$ -4661 -4624 -4591 -4251 -3810 -3606 -3219 -2955 -2742 -2283 -1789 -1307 -718 -354 163 712 1287 2011 2736 3208 3684
2452C684N0R1N2k91j76n69q43p21j014p62n01o31n34m33k98O7J54K82M77K67N01
$$ 3684 3734 3825 3877 3586 3410 2841 1998 1277 263 -499 -1000 -1631 -2165 -2598 -2896 -2829 -2675 -2393 -1916 -1649 -1148
2473a148L36M12O40N14M01M49J53M11M15M03N11L86K30K23pJ39O0k54l88o52q28
$$ -1148 -812 -400 240 754 1155 1604 1757 2168 2583 2986 3497 3883 4113 4336 4329 4468 4528 4274 3886 3234 2406
2494B406p14r26p67p61q67p00n58m48q9N8J63L80K12L08N46M16P48M12K89L66
$$ 2406 1692 766 -1 -762 -1629 -2329 -2887 -3335 -3424 -3366 -3203 -2823 -2611 -2303 -1757 -1341 -593 -181 108 474
2514D74J38K88M30K31L55R0m3K47M0J41J36k88l02n25o40l77p33o64o85q75o26
$$ 474 612 900 1330 1561 1916 2006 1963 2210 2250 2391 2527 2239 1937 1412 772 395 -338 -1002 -1687 -2562 -3188
2535c188n37l34L5p4Q3K73J66N87O70N66P32M30L98M28K75M58L41J59J86j8PJ89
$$ -3188 -3725 -4059 -4024 -4098 -4015 -3742 -3576 -2989 -2319 -1753 -1021 -591 -193 235 510 968 1309 1468 1654 1636 1643 1832
2557A832J67R6Q3k75j52k69k78j79m49n63o19p27m93l57k96m9k08k4J56J63O35
$$ 1832 1999 2095 2178 1903 1751 1482 1204 1025 576 13 -606 -1333 -1826 -2183 -2479 -2528 -2736 -2760 -2604 -2441 -1806
2578a806N36N06N78L48L91M69L58L42K24lk3p4oJ76j18k0n7k40q3q6j25j22l18
$$ -1806 -1270 -764 -186 162 553 1022 1380 1722 1946 1943 1920 1846 1840 2016 1898 1878 1821 1581 1498 1412 1287 1165 847
2601H47m44m56n46j90k76m27j73k93j90J16J32M25L07L09L76K53M01M90K55K56
$$ 847 403 -53 -599 -789 -1065 -1492 -1665 -1958 -2148 -2032 -1900 -1475 -1168 -859 -483 -230 171 661 916 1172
2621A172R4j48qn9NP3j88r2j57j88O1O6p7K7k48k35j06k23j12k08l28k71l30j41
$$ 1172 1266 1118 1110 1051 1056 1129 941 849 692 504 565 631 554 581 333 98 -8 -231 -343 -551 -879 -1150 -1480 -1621
2645a621L2J7K00N9O1K34K20L39L89J91J52N3p1Q0J18qJ3j77j98LJ6K05O0k9R7
$$ -1621 -1589 -1572 -1372 -1313 -1252 -1018 -798 -459 -70 121 273 326 255 335 453 445 458 281 83 86 102 307 367 338 435
2670D35j25j0J56j7L6j86l38j48k33k22M3j86j00j86r8J14K15J64K53L3J33P9
$$ 435 310 300 456 439 475 289 -49 -197 -430 -652 -609 -795 -895 -1081 -1179 -1065 -850 -686 -433 -400 -267 -188
2692a88M9L12J43ool9J9R2J75J93N7R4N8Q9J85K43ok9j27k47p3k75q1k30l68k93
$$ -188 -139 173 316 310 304 265 284 376 551 744 801 895 953 1042 1227 1470 1464 1435 1308 1061 988 713 632 402 34 -259
2718b59k96k20K8o0K8K5j36J20J33J55K81J51J0J02N0J83K33J15J79J2J8J54J63
$$ -259 -555 -775 -747 -807 -779 -754 -890 -770 -637 -482 -201 -50 -40 62 112 295 528 643 822 834 852 1006 1169
2741A169K28J38j34p6j44j79j83j00k78l79n35l56l08k39j36k79j65j98o5J41
$$ 1169 1397 1535 1401 1325 1181 1002 819 719 441 62 -473 -829 -1137 -1376 -1512 -1791 -1956 -2154 -2219 -2078
2761b078K25J43K21J32R0K64K37L92L28J61J52J11J61K50J66J96j4j34r9o6p2
$$ -2078 -1853 -1710 -1489 -1357 -1267 -1003 -766 -374 -46 115 267 378 539 789 955 1151 1137 1003 904 838 766
2782G66n0k80k89l90m46k66k58k30j76l24j79j33Q8K26J98J59K68J81K87N48L57
$$ 766 716 436 147 -243 -689 -955 -1213 -1443 -1619 -1943 -2122 -2255 -2167 -1941 -1743 -1584 -1316 -1135 -848 -300 57
2803E7L94M16K05K44K35K36K77J57J8j20j14j9r7j13j41l46m18l57k89j68k89
$$ 57 451 867 1072 1316 1551 1787 2064 2221 2239 2119 2005 1986 1889 1776 1635 1289 871 514 225 57 -232
2824b32k69k52l21j11RK5K05M5J31K57J43L67N35K29L61K12J15K86J88J99J59
$$ -232 -501 -753 -1074 -1185 -1176 -1151 -946 -901 -770 -513 -370 -3 532 761 1122 1334 1449 1735 1923 2122 2281
2845B281j09j40j65j44o5k28l36k70m39m14k03l89j42l78k85k53k23n2J15rJ08
$$ 2281 2172 2032 1867 1723 1658 1430 1094 824 385 -29 -232 -621 -763 -1141 -1426 -1679 -1902 -1954 -1839 -1848 -1740
2866a740K5O0K68K51L28L76J74K17J60J34K94K09O0N8j58q0r6j64rk88k73k26
$$ -1740 -1715 -1655 -1387 -1136 -808 -432 -258 -41 119 253 547 756 816 874 716 636 540 376 367 79 -194 -420
2888d20m42j43j73j45j58k00k07p8pJ89J13N9J56J00J77K94L86K55K48J70J66
$$ -420 -862 -1005 -1178 -1323 -1481 -1681 -1888 -1966 -1973 -1784 -1671 -1612 -1456 -1356 -1179 -885 -499 -244 4 174 340
2909C40K74J54K70O7J7L3n9lq5L3q2k97k37j01k54J9L8k78n5j54p4J36P4O8J08
$$ 340 614 768 1038 1105 1122 1155 1096 1093 1008 1041 959 662 425 324 70 89 127 -151 -206 -360 -434 -298 -224 -156 -48
2934d8J7J42J55J65K17K03J31K3R0J33J42M3J23j03j76r5j55P1p1j85j49k30j58
$$ -48 -31 111 266 431 648 851 982 1005 1095 1228 1370 1413 1536 1433 1257 1162 1007 1078 1007 822 673 443 285
2957B85j32n4Lk9l10j07J8j7R5k7L7lp1R8J37J54P3r1J3k8o6O6N4j02q8j81j74
$$ 285 153 99 102 73 -237 -344 -326 -343 -248 -275 -238 -241 -312 -214 -77 77 150 59 72 44 -22 44 98 -4 -92 -273 -447
2984d47K5j62K9j03j94j39l9p0J19rM8p1q7O2J44J44J40K5O4lJJ81J24J2M9j10
$$ -447 -422 -584 -555 -658 -852 -991 -1030 -1100 -981 -990 -942 -1013 -1100 -1038 -894 -750 -610 -585 -521 -524 -523 -342 -218 -206 -157 -267
3010b67j3J0QR2m2j21r4j24j5J05l8pl4j26j4J65O6K19k2J08O3J04K22K40J13
$$ -267 -280 -270 -262 -170 -212 -333 -427 -551 -566 -461 -499 -506 -540 -666 -680 -515 -449 -230 -252 -144 -81 23 245 485 598
3035E98J83nQ0P2J36J11M2q8k8j25kr5q2J5k11j80j43m9%l2k8q3j19k7J47O2J42
$$ 598 781 776 856 928 1064 1175 1217 1129 1101 976 974 879 797 812 601 421 278 229 229 197 169 86 -33 -60 87 149 291
3062B91mN8K8N0J45K03L2J21O4p4J48j5L9Oq7j33k14j75j00o4j80k03k75k17j68
$$ 291 287 345 373 423 568 771 803 924 988 914 1062 1047 1086 1092 1005 872 658 483 383 319 139 -64 -339 -556 -724
3087g24j36J1l8j62j21JK5J95O4O4K5KO8K28M8K51L3N5M0M9R1J01M8l1m1j40j9
$$ -724 -860 -849 -887 -1049 -1170 -1169 -1144 -949 -885 -821 -796 -794 -726 -498 -450 -199 -166 -111 -71 -22 69 170 218 187 146 6 -13
3114a3j40l4j44j16k90j49j08q1j8r1n1j11R2J22J02J81P4M8J61Q0J78K29K33
$$ -13 -153 -187 -331 -447 -737 -886 -994 -1075 -1093 -1184 -1235 -1346 -1254 -1132 -1030 -849 -775 -727 -566 -486 -308 -79 154
3137A54J22M3P7J70J26J32Q2L8l9L0p9M3%j12j27k20j65j29r1o2j59l9j62j3K9
$$ 154 276 319 396 566 692 824 906 944 905 935 856 899 899 787 660 440 275 146 55 -7 -166 -205 -367 -380 -351
3162c51Q5Q5J27oJ16R9J11J90J71R0JO1N1J63M6J07K7n5m1jO8n8j20j69j07k86
$$ -351 -266 -181 -54 -60 56 155 266 456 627 717 718 779 830 993 1039 1146 1173 1118 1077 1076 1144 1086 966 797 690 404
3188D04r0j30k43p2k85j56n1k01J9N4m9Rm9J17R4J53J60J03R9k9P3O8J89L1M1
$$ 404 314 184 -59 -131 -416 -572 -623 -824 -805 -751 -800 -791 -840 -723 -629 -476 -316 -213 -114 -143 -70 -2 187 218 259
3213B59l4q4R6N3Mk2p6j20j03j50k7p8j75j69k15j63j83o2K7j9n5k8R0J36J39
$$ 259 225 141 237 290 294 272 196 76 -27 -177 -204 -282 -457 -626 -841 -1004 -1187 -1249 -1222 -1241 -1296 -1324 -1234 -1098 -959
3238i59K04J39R1J35J89J17J79J33K3N1M7Q3J34R1L2m7k6k4J8rp1p8j90j90j60
$$ -959 -755 -616 -525 -390 -201 -84 95 228 251 302 349 432 566 657 689 642 616 592 610 601 530 452 262 72 -88
3263h8j00o6j48l9p0m8k9M5J11J92J48M1J84J26J49K32J58Q7NJ13N0N1K6Q3L2
$$ -88 -188 -254 -402 -441 -511 -559 -588 -543 -432 -240 -92 -51 133 259 408 640 798 885 890 1003 1053 1104 1130 1213 1245
3288A245j26l1m0k6l9m9k11k17j03j72j51j40k43j67j05j42k5j6P3M6K9O7J05
$$ 1245 1119 1088 1048 1022 983 934 723 506 403 231 80 -60 -303 -470 -575 -717 -742 -758 -685 -639 -610 -543 -438
3311d38J74K27Q3R1J14N3QJ09O2K9q3j12m2l6p3k8n7j54j22j79o8j94j07p2k25
$$ -438 -264 -37 46 137 251 304 312 421 483 512 429 317 275 239 166 138 81 -73 -195 -374 -442 -636 -743 -815 -1040
3336a040j59r8p3J2o8J18j9Q9R2J40K51K10J57J01J93R3K02J19J4L2Or2P4k0K8
$$ -1040 -1199 -1297 -1370 -1358 -1426 -1308 -1327 -1238 -1146 -1006 -755 -545 -388 -287 -94 -1 201 320 334 366 372 280 354 334 362
3361C62j2r9j12l1j1l0j38j1j09j72o6k9P6l3o1N3K6O9J44K19J41J58J45R1J63
$$ 362 350 251 139 108 97 67 -71 -82 -191 -363 -429 -458 -382 -415 -476 -423 -397 -328 -184 35 176 334 479 570 733
3386G33J82J56R8K8l0J2o6J4Oj63rj65n8j25o6k9j11j06j29j09r0l5p8o9q5m0
$$ 733 915 1071 1169 1197 1167 1179 1113 1127 1133 970 961 796 738 613 547 518 407 301 172 63 -27 -62 -140 -209 -294 -334
3412c34L6k9J46J34k5J03N3J25J24P3Q7O4q3M5o0r9N4r6j50r7j76j3l0j07j00
$$ -334 -298 -327 -181 -47 -72 31 84 209 333 406 493 557 474 519 459 360 414 318 168 71 -105 -118 -148 -255 -355
3437c55j57p0o4j11J4k9r3m9o0jP8KJ31M7L4R4J32J49K29QQ9L0JJ08K4M2Jp2j11
$$ -355 -512 -582 -646 -757 -743 -772 -865 -914 -974 -975 -897 -895 -764 -717 -683 -589 -457 -308 -79 -71 18 48 49 157 181 223 224 152 41
3466D1j9j46Q7r4Kj7j28k4oM5%N4j34l5l4J09M7N2J2P5J3R9J09P4J65J03Qk1M9
$$ 41 22 -124 -37 -131 -129 -146 -274 -298 -304 -259 -259 -205 -339 -374 -408 -299 -252 -200 -188 -113 -100 -1 108 182 347 450 458 437 486
3495D86J03j4j6l9o9q8j3n7J1l2j06o0j26M9k8k3J4n3o4K3m9mJ00r0J9k7kJ02
$$ 486 589 575 559 520 451 363 350 293 304 272 166 106 -20 29 1 -22 -8 -61 -125 -102 -151 -155 -55 -145 -126 -153 -155 -53
3523e3P6P9J8mOPN2Q3j4m7o3o1J7o9L7j05k1j16LJ04mj9j3J5l5o0Q3L3jk9j1l2
$$ -53 23 102 120 116 122 129 181 264 250 203 140 79 96 27 64 -41 -62 -178 -175 -71 -75 -94 -107 -92 -127 -187 -104 -71 -72 -101 -112 -144
3555a44J9Q5J03k4O9K1J9k3J31J4R6l9p7K7o4J8Ol5l9p4m3O4K8KM6j05rM7L0m
$$ -144 -125 -40 63 39 108 129 148 125 256 270 366 327 250 277 213 231 237 202 163 89 46 110 138 140 186 81 72 119 149 145
3585A45J4k3m9j12P2J8j2k4JqkrP4j2M2j15L9l3j03L7m1J6j30m1p0K3k1O2qMm7
$$ 145 159 136 87 -25 47 65 53 29 30 22 20 11 85 73 115 0 39 6 -97 -60 -101 -85 -215 -256 -326 -303 -324 -262 -270 -266 -313
3616c13l4J03M2L1lj00m5n5P4K8j4j0j05J2N9K6Q7N8r7K8m2L6L4Q8j4Kj09m0N4
$$ -313 -347 -244 -202 -171 -174 -274 -319 -374 -300 -272 -286 -296 -401 -389 -330 -304 -217 -159 -256 -228 -270 -234 -200 -112 -126 -124 -233 -273 -219
3645b19O8K5L6m2O5QK0J61L0L1m1Kj6N8N7J1j19RJ7LJ4L7O1j4m6OO9RO1n3L2r3
$$ -219 -151 -126 -90 -132 -67 -59 -39 122 152 183 142 144 128 186 243 254 135 144 161 164 178 215 276 262 216 222 291 300 361 308 340 247
3677B47n0K6J5l0J0m5p4L5L7J00P6q4L0n1J0M1l1K1j05n9j06J7k6J8k3m7l8p6
$$ 247 197 223 238 208 218 173 99 134 171 271 347 263 293 242 252 293 262 283 178 119 13 30 4 22 -1 -48 -86 -162
3705a62J08M6k7L9n9po9Oj6P2p8q8n9J6J00K7ML9l3O0J3J2J19K9p5K1j07N0k5
$$ -162 -54 -8 -35 4 -55 -62 -131 -125 -141 -69 -147 -235 -294 -278 -178 -151 -147 -108 -141 -81 -68 -56 63 92 17 38 -69 -19 -44
3734d4mJr6J4k2oJ05N9k0Q4l0qJ36%L4p8n3k6kJ1J4M3K4j5o9J29K5M9j7N8Lm8
$$ -44 -48 -47 -143 -129 -151 -157 -52 7 -13 71 41 33 169 169 203 125 72 46 44 55 69 112 136 121 52 181 206 255 238 296 299 251
3766B51j22P4m9k2j02r9J8o2k8Q0k6k5l3rN1nJ7n9m2p3Mn3M2l6p3J5p4Q6J4N7
$$ 251 129 203 154 132 30 -69 -51 -113 -141 -61 -87 -112 -145 -154 -103 -108 -91 -150 -192 -265 -261 -314 -272 -308 -381 -366 -440 -354 -340 -283
3796b83N4n7l8lN0O8rp0%p6k2j2j4J9L9m7j1K2K3O9J39o6L8PJ8R8j6P7k7nk0M4
$$ -283 -229 -286 -324 -327 -277 -209 -218 -288 -288 -364 -386 -398 -412 -393 -354 -401 -412 -390 -367 -298 -159 -225 -187 -180 -162 -64 -80 -3 -30 -35 -55 -11
3828a1N9P6K3L6k7K7J88j7O3N8kk6M4qnJ8l9M8n0k9N1K4QM2K2ln3M1N1m0p8n4
$$ -11 48 124 147 183 156 183 371 354 417 475 473 447 491 483 478 496 457 505 455 426 477 501 509 551 573 570 517 558 609 569 491 437
3860D37l6j9m9Lk7k6l1q4Q6J4J9J1j4p2k2j0l0kp8j00r5j4l2L0k0m5n2k6P8Mn8
$$ 437 401 382 333 336 309 283 252 168 254 268 287 298 284 212 190 180 150 148 70 -30 -125 -139 -171 -141 -161 -206 -258 -284 -206 -202 -260
3891b60O3m4j09p5k5M5n2J3j3q1J1j7O0L0K8l8O1J7P4O1j7J7m3k3M2J0K8J0J0
$$ -260 -197 -241 -350 -425 -450 -405 -457 -444 -457 -538 -527 -544 -484 -454 -426 -464 -403 -386 -312 -251 -268 -251 -294 -317 -275 -265 -237 -227 -217
3920b17K5k6kJ03Q6M2j6j7n1J03n5M3K0Jnn2ON1K9J8pj6Q0r8J37O2k9j4k9P6p0
$$ -217 -192 -218 -220 -117 -31 11 -5 -22 -73 30 -25 18 38 39 34 -18 -12 39 68 86 79 63 143 45 182 244 215 201 172 248 178
3951A78oR3q4k0l1K6k5L4%l2n6k7k6O%l4o7p3Kk8L4lm1K6p3m2P9L6n6M2rn8O1
$$ 178 172 265 181 161 130 156 131 165 165 133 77 50 24 30 30 -4 -71 -144 -142 -170 -136 -139 -180 -154 -227 -269 -190 -154 -210 -168 -177 -235 -174
3984a74O7M3k8j7J5j1j7Q3J2m0P7j8k3J1N3K2k7k6mN4MKQ2J7M2j18M4L2Q0K4J6
$$ -174 -107 -64 -92 -109 -94 -105 -122 -39 -27 -67 10 -8 -31 -20 33 55 28 2 -2 52 56 58 140 157 199 81 125 157 237 261 277
4015B77mjP9K0N9jJ2M0n5L6M8L3oK1n3M9k3o9rk6n1o2lnk1j07P2n4j04n1L2j2
$$ 277 273 272 351 371 430 429 441 481 426 462 510 543 537 558 505 554 531 462 453 427 376 314 311 306 285 178 250 196 92 41 73 61
4047F1J2k8n7l4l4n5j5q2L2r4M4j2q5J45p8k6l1m9LJ18j09ro2o9J1l0j2p5pJ0
$$ 61 73 45 -12 -46 -80 -135 -150 -232 -200 -294 -250 -262 -347 -202 -280 -306 -337 -386 -383 -265 -374 -383 -445 -514 -503 -533 -545 -620 -627 -617
4077f17r2%N3k2pO4k7j14J05N5LQ1J2j10J11L7R2P8Q8m5L2J36J16j0R9L0O2k4
$$ -617 -709 -709 -656 -678 -685 -621 -648 -762 -657 -602 -599 -518 -506 -616 -505 -468 -376 -298 -210 -255 -223 -87 29 19 118 148 210 186
4105A86j3P4j0J2mm6N4q7j2J47o6k3N7n9M5N5M3L9o5k9J51j53J65J5KN0k9MN3
$$ 186 173 247 237 249 245 199 253 166 154 301 235 212 269 210 255 310 353 392 327 298 449 296 461 476 478 528 499 503 556
4134E56P5M5N4m9J0J3n9Qq3ln2j10r6j06p1k6j6j71n9l0P9m9k4K8n2o4JJ3O8r
$$ 556 631 676 730 681 691 704 645 653 570 567 515 405 309 203 132 106 90 -81 -140 -170 -91 -140 -164 -136 -188 -252 -251 -238 -170 -179
4164a79o6L6J8K0M6N1N5M4J4P5N2l4L1k1o3j49o1M7j05o7q2n7m9Pk6M5J3o0O8
$$ -179 -245 -209 -191 -171 -125 -74 -19 25 39 114 166 132 163 142 79 -70 -131 -84 -189 -256 -338 -395 -444 -437 -463 -418 -405 -465 -397
4193c97j7O3N3N5L4N6K7J4J03k7J87l8O3K0R0N7M1Q5j0l6k4p8o6L5j55q6r7j36
$$ -397 -414 -351 -298 -243 -209 -153 -126 -112 -9 -36 151 113 176 196 286 343 384 469 459 423 399 321 255 290 135 49 -48 -184
4221a84k1k8j25JOk7KK4M3P3m8J40j1JJ06pL8J14pK5L8k7L6Q4M3k8l6l9p3Nj09
$$ -184 -205 -233 -358 -357 -351 -378 -376 -352 -309 -236 -284 -144 -155 -154 -48 -55 -17 97 90 115 153 126 162 246 289 261 225 186 113 118 9
4252Ij08j04q8j13m8q5m6kj04R8o1J16Q2N9P2O8N7J10Q4lJ39K7J6N6O5Q5O7m%
$$ 9 -99 -203 -291 -404 -452 -537 -583 -585 -689 -591 -652 -536 -454 -395 -323 -255 -198 -88 -4 -7 132 159 175 231 296 381 448 444 444
4281D44L7kj3j6J5p8j38m1j15j13l1N0j66m2K6n0M2L9Q9Q7O7O4Q2R9J06QM0K3
$$ 444 481 479 466 450 465 387 249 208 93 -20 -51 -1 -167 -209 -183 -233 -191 -152 -63 24 91 155 237 336 442 450 490 513
4309E13K9L9MQ7k5n0j7pq0l5M1j18m7j19j60rj33j28p0j37j2j14mK4K6J6N4P2
$$ 513 542 581 585 672 647 597 580 573 493 458 499 381 334 215 55 46 -87 -215 -285 -422 -434 -548 -552 -528 -502 -486 -432 -360
4337c60L8M8O1J43J0J00K3PK2N2l5O1q8l4o5KJ6j8j28j26j1mj3o5j29j27j3l1
$$ -360 -322 -274 -213 -70 -60 40 63 70 92 144 109 170 82 48 -17 -15 1 -17 -145 -271 -282 -286 -299 -364 -493 -620 -633 -664
4365f64k4j4N5m9O8P5K9J74J01J01O9R6Q9J26j9J10K1j7j8l4J8M7q1R1j22r8K0
$$ -664 -688 -702 -647 -696 -628 -553 -524 -350 -249 -148 -79 17 106 232 213 323 344 327 309 275 293 340 259 350 228 130 150
4392A50n4m1j2o2m3o9l7Njr1K5j9P2O4P3J03N3L5J07NP0Q0N4K5Ml7k2n3J0M3j23
$$ 150 96 55 43 -19 -62 -131 -168 -163 -164 -255 -230 -249 -177 -113 -40 63 116 151 258 263 333 413 467 492 496 459 437 384 394 437 314
4423C14m0o6n6m3J7r6J5n6p8j00rJ8n4K0l9q1M5O4L7N5J6PJ23N5M4P6j3P2J6j16
$$ 314 274 208 152 109 126 30 45 -11 -89 -189 -198 -180 -234 -214 -253 -334 -289 -225 -188 -133 -117 -110 13 68 112 188 175 247 263 147
4453A47N3k5j0m9k8q9n8j3P2r4K5o2q6RlL1m0J4n5OK1oO2%J8Q7k0J26oJ15J07
$$ 147 200 175 165 116 88 -1 -59 -72 0 -94 -69 -131 -217 -208 -211 -180 -220 -206 -261 -255 -234 -240 -178 -178 -160 -73 -93 33 27 142 249
4484B49p6M0k0n9J06o1k6M0j50J1l0m0L6n2l8j2LNJ6jJl9j1rM2L0RpK5k3O9K8
$$ 249 173 213 193 134 240 179 153 193 43 54 24 -16 20 -32 -70 -82 -79 -74 -58 -59 -58 -97 -108 -117 -75 -45 -36 -43 -18 -41 28 56
4516E6JQ1K8m1J5L3oRj2l4j0j00j2O2r0ok8L1n8JR8o7J0K4j08P8Q3l1m7L3o9O0
$$ 56 57 138 166 125 140 173 167 176 164 130 120 20 8 70 -20 -26 -54 -23 -81 -80 18 -49 -39 -15 -123 -45 38 7 -40 -7 -76 -16
4548a6ok7N6K0m3Q9l4rL1J8m2k1K9n3j1kK8m6L8j03J4L3K3P5n7l1Oj3P2O1j09
$$ -16 -22 -49 7 27 -16 73 39 30 61 79 37 16 45 -8 -19 -21 7 -39 -1 -104 -90 -57 -34 41 -16 -47 -41 -54 18 79 -30
4579c0j0j5k0P4n6P2r0Qm2L2k1N3k6k0K3k3l5L4M1l2l2N5J2j04J28M9l4J1k1M3
$$ -30 -40 -55 -75 -1 -57 15 -75 -67 -109 -77 -98 -45 -71 -91 -68 -91 -126 -92 -51 -83 -115 -60 -48 -152 -24 25 -9 2 -19 24
4609B4K1M4j6l8N4j6m0n1JK5n7rm8J2K3jO9k3Lj2l9N9J1L3k5M7om0N8L1P3K6m8
$$ 24 45 89 73 35 89 73 33 -18 -17 8 -49 -58 -106 -94 -71 -72 -3 -26 -23 -35 -74 -15 -4 29 4 51 45 5 63 94 167 193 145
4642A45mN7L6L0kK2l1j13N5J4k2n0%o4o1KJ8q8P1Oq5P0l1L9J5M0j6J5o1N5J9N3
$$ 145 141 198 234 264 262 284 253 140 195 209 187 137 137 73 12 14 32 -56 15 21 -64 6 -25 14 29 69 53 68 7 62 81 134
4674A34m8MoP2n3J9J01j08qn6Ppm5k7n3j02m8m2Q9m3l7j9o6kN2N7Nk1J5rL2O6
$$ 134 86 90 84 156 103 122 223 115 107 51 58 51 6 -21 -74 -176 -224 -266 -177 -220 -257 -276 -342 -344 -292 -235 -230 -251 -236 -245 -213 -147
4706a47PJ8jn9L5Q8n1M9N8q8K9Pl6L1nr4P1p7J2K3p7Jk7K6J5k1j0R2L9K4L6j2
$$ -147 -140 -122 -123 -182 -147 -59 -110 -61 -3 -91 -62 -55 -91 -60 -65 -159 -88 -165 -153 -130 -207 -206 -233 -207 -192 -213 -223 -131 -92 -68 -32 -44
4738d4K0O2O8K1nM2l5J1Q6j6L3n7K5qJ8M7m2Pm5pj7J6L1k8ll8n5J14o3L5O9r4
$$ -44 -24 38 106 127 122 164 129 140 226 210 243 186 211 203 221 268 226 233 188 181 164 180 211 183 180 142 87 201 138 173 242 148
4770A48j1R5j9N9MpQr5K5k8%M1l3l0j4o2kL5n8J5n3Kn6J9N8r9N2j4n0j9K7k2n7
$$ 148 137 232 213 272 276 269 277 182 207 179 179 220 187 157 143 81 79 114 56 71 18 20 -36 -17 41 -58 -6 -20 -70 -89 -62 -84 -141
4803a41K2rlLM6m5mp1M7n4mM9n4j8n1o4J5n9P8m8K6N8ok7R8l7P9J8l6M2OL8K2
$$ -141 -119 -128 -131 -128 -82 -127 -131 -202 -155 -209 -213 -164 -218 -236 -287 -351 -336 -395 -317 -365 -339 -281 -287 -314 -216 -253 -174 -156 -192 -150 -144 -106 -84
4836h4k2M9M7m9RK2K2j6m3l2N1n7PM0p8%Nk5RK9P8k7N3J50q8K6J12MO5R0m6Q3
$$ -84 -106 -57 -10 -59 -50 -28 -6 -22 -65 -97 -46 -103 -96 -56 -134 -134 -129 -154 -145 -116 -38 -65 -12 138 50 76 188 192 257 347 301 384
4868C84k7N8K3m7oJ2p2Rkr8P6j27l9J1m4k1p6m4J7j8j7L5j5J9PqO8R7J5L2O1K3
$$ 384 357 415 438 391 385 397 325 334 332 234 310 183 144 155 111 90 14 -30 -13 -31 -48 -13 -28 -9 -2 -10 58 155 170 202 263 286
4900B86j0J8P2J0K5j15J4m9r2j9p1J9j46j18q6n8l6m0qo1o1L9o9oN4KP6L7O0Q3
$$ 286 276 294 366 376 401 286 300 251 159 140 69 88 -58 -176 -262 -320 -356 -396 -404 -465 -526 -487 -556 -562 -508 -506 -430 -393 -333 -250
4930b50M8M7J36L5L6O2k3L0N2l1J8l0kp2Jq2r2j15m7p1l7l1r4k3rj4O2L8K5R6
$$ -250 -202 -155 -19 16 52 114 91 121 173 142 160 130 128 56 57 -25 -117 -232 -279 -350 -387 -418 -512 -535 -544 -558 -496 -458 -433 -337
4960c37J5O8O9J93L0J05O6J05Q4L3Q3M4N9J8p3K5r7p9K9j14n9o8r4n1l4n4p0m3
$$ -337 -322 -254 -185 8 38 143 209 314 398 431 514 558 617 635 562 587 490 411 440 326 267 199 105 54 20 -34 -104 -147
4988a47q1qLM7K4k6J33O8k2J75M5R5Q3N7O0J8M8K7J2%n4J5n8j30o6q3o6j45l5
$$ -147 -228 -236 -233 -186 -162 -188 -55 13 -9 166 211 306 389 446 506 524 572 599 611 611 557 572 514 384 318 235 169 24 -11
5017a1q8j41l2j03j16o0j3L9m6L1j4J5J11P1K9J48L2J44qM6J06J9J21l8M7o4o
$$ -11 -99 -240 -272 -375 -491 -551 -564 -525 -571 -540 -554 -539 -428 -357 -328 -180 -148 -4 -12 34 140 159 280 242 289 225 219
5044B19q0J5q8k1j12q3p3l8j40m0m7k2p2p6P5j3PO5L0L8M2J14Q9J20M1J02N1J52
$$ 219 139 154 66 45 -67 -150 -223 -261 -401 -441 -488 -510 -582 -658 -583 -596 -589 -524 -494 -456 -414 -300 -211 -91 -50 52 103 255
5072B55N5P1N8J6rL2Jr8L7o3q2n0q5n9l2p3n3j00ol0j1qO0p3J28j8M5M2O0O4J03
$$ 255 310 381 439 455 446 478 479 381 418 355 273 223 138 79 47 -26 -79 -179 -185 -215 -226 -234 -174 -247 -119 -137 -92 -50 10 74 177
5103A77M3O1J20J5R2J1J3pLK1o2n9kl6r6k6q8p5q2m9j12m8Lo1q9R2r5k0ooN1L4
$$ 177 220 281 401 416 508 519 532 525 528 549 487 428 426 390 294 268 180 105 23 -26 -138 -186 -183 -244 -333 -241 -336 -356 -362 -368 -317 -283
5135b83K1J01K2jQ3P4N1L7L0K5J4NJ8M3n2j0k9q9l1o6n2n5p7j23k2q0l2l1ppl8
$$ -283 -262 -161 -139 -140 -57 17 68 105 135 160 174 179 197 240 188 178 149 60 29 -37 -89 -144 -221 -344 -366 -446 -478 -509 -516 -523 -561
5166e61M6LM2O4n5J10L6R3J25M8M8R3P1K8O0O8J8l7Q0m5n4J2j4n2l5p7n3j14p
$$ -561 -515 -512 -470 -406 -461 -351 -315 -222 -97 -49 -1 92 163 191 251 319 337 300 380 335 281 293 279 227 192 115 62 -52 -59
5195e9Qj13ok0Pm8n7O9N3N0O4oM2J27L6R9oR6Q1L4M9O1K6km7oP7p2m4o0r2q8p2
$$ -59 -51 -164 -170 -190 -183 -231 -288 -219 -166 -116 -52 -58 -16 111 147 246 240 336 417 451 500 561 587 585 538 532 609 537 493 433 341 253 181
5228A81p5q8q6Rq3j02k2l1L9m1qK5j3P9K0J15L9L2J0J00M5L9J07j1L1j8m3L7n4
$$ 181 106 18 -68 -59 -142 -244 -266 -297 -258 -299 -307 -282 -295 -216 -196 -81 -42 -10 0 100 145 184 291 280 311 293 250 287 233
5257B33n5r5n2o3n4j16p6o4r9r1m2K6n0n5M0o7L1L5O7M8R3K8J52Q9M8Q9Q0O4O3
$$ 233 178 83 31 -32 -86 -202 -278 -342 -441 -532 -574 -548 -598 -653 -613 -680 -649 -614 -547 -499 -406 -378 -226 -137 -89 0 80 144 207
5286B07N4l3O0MNj4m0k1q1o3r9k7m1p4q8j0n9m8N6m7%L4n6J91N6J32jJ22Q6N3
$$ 207 261 228 288 292 297 283 243 222 141 78 -21 -48 -89 -163 -251 -261 -320 -368 -312 -359 -359 -325 -381 -190 -134 -2 -3 119 205 258
5316B58J47M0Q2J21Mjk9nR3r3o9m1p0j03l0q5r8j12j32Qp1j24OK5L2q2J4R6OO9
$$ 258 405 445 527 648 652 651 622 617 710 617 548 507 437 334 304 219 121 9 -123 -115 -186 -310 -304 -279 -247 -329 -315 -219 -213 -144
5346a44O0O1K9R5R9M6P4m9J27Poj5n7Mk6j02j09j1j30m5p9p1q7o2l9j2q1K6Ok1
$$ -144 -84 -23 6 101 200 246 320 271 398 405 399 384 327 331 305 203 94 83 -47 -92 -171 -242 -329 -391 -430 -442 -523 -497 -491 -512
5376e12O0P9MJ02N4Q5J3K3P2J34J5J02M1n8P3l9O2o5mp9m2j47N1r3m7k3j00j1
$$ -512 -452 -373 -369 -267 -213 -128 -115 -92 -20 114 129 231 272 214 287 248 310 245 241 162 120 -27 24 -69 -116 -139 -239 -250
5404b50j6m4rK9M1K7n6J25N8j7J31j2Q1K5L0R2mL7j5j6O2l1%Jr7m9m1q8q0M8l8
$$ -250 -266 -310 -319 -290 -249 -222 -278 -153 -95 -112 19 7 88 113 143 235 231 268 253 237 299 268 268 269 172 123 82 -6 -86 -38 -76
5435g6q5q8l0j2j8J0K3L1LL8J7J11k4Q3L2m8J48j6lN6m0k0N6q0j0J9k6m9p1m4
$$ -76 -161 -249 -279 -291 -309 -299 -276 -245 -242 -204 -187 -76 -100 -17 15 -33 115 99 96 152 112 92 148 68 58 77 51 2 -69 -113
5465a13jm7QPn6J7r5N8J8k3P1M6%L7O1P0J08oK0O6k6J06l6k6K6Kj0q1N6n9m9q8
$$ -113 -114 -161 -153 -146 -202 -185 -280 -222 -204 -227 -156 -110 -110 -73 -12 58 166 160 180 246 220 326 290 264 290 292 282 201 257 198 149 61
5497F1k9j0k1K3jo5P8p0O3K3rL9j2K4M8J1P8l6M7P6j05ML1K3m0M7q4Pj39p3n9
$$ 61 32 22 1 24 23 -42 36 -34 29 52 43 82 70 94 142 153 231 195 242 318 213 217 248 271 231 278 194 201 62 -11 -70
5528g0o4R6j53k3qo6k7P8q7Q2l7K0j7N8M9Q3m7K4L4MO8l7Q7p0J8Jk5Qm1j3o0k9
$$ -70 -134 -38 -191 -214 -222 -288 -315 -237 -324 -242 -279 -259 -276 -218 -169 -86 -133 -109 -75 -71 -3 -40 47 -23 -5 -4 -29 -21 -62 -75 -135 -164
5560a64j4o1Ln0j3o1k5K0PJ8M2rQ9P1O2L6K6M9R1K7L5N2oN3Kn3N1j8k7p2Jl8j13
$$ -164 -178 -239 -236 -286 -299 -360 -385 -365 -358 -340 -298 -307 -218 -147 -85 -49 -23 26 117 144 179 231 225 278 280 227 278 260 233 161 162 124 11
5593A1L5q7j0l2Jr2j7K7k7N3RM5K0L5N2O2P9j2O6O3J0MM0M2j37R3pp6qj03o3Q4
$$ 11 46 -41 -51 -83 -82 -174 -191 -164 -191 -138 -129 -84 -64 -29 23 85 164 152 218 281 291 295 335 377 240 333 326 250 242 139 76 160
5625A60j75l5l0m4j30O9o7M2j28L6J6J9J4O7J4N0J9K3J46j3Q0J7K5Q0l0J3N2q0
$$ 160 -15 -50 -80 -124 -254 -185 -252 -210 -338 -302 -286 -267 -253 -186 -172 -122 -103 -80 66 53 133 150 175 255 225 238 290 210
5653B10O1l0p3jm9o6m7n1n5l6l4qkOL9j6k3O4mQ5L8J1M2N8J1J26n1P8J5mO8J6
$$ 210 271 241 168 167 118 52 5 -46 -101 -137 -171 -179 -181 -175 -136 -152 -175 -111 -115 -30 8 19 61 119 130 256 205 283 298 294 362 378
5685C78k7k9m6o7p5O8n8o4p0l5p6j8J6o5k3Ll2j2K0L3M8R%k5Q6Q5mJ5L0n4L9l
$$ 378 351 322 276 209 134 202 144 80 10 -25 -101 -119 -103 -168 -191 -188 -220 -232 -212 -179 -131 -122 -122 -147 -61 24 20 35 65 11 50 47
5717D7o3R5m7Pl5l9q2N5r4k9l3r2K6j00M7J9j5mk5L4J1P1N9O4j4P6m5K9J24j9
$$ 47 -16 79 32 39 4 -35 -117 -62 -156 -185 -218 -310 -284 -384 -337 -318 -333 -337 -362 -328 -317 -246 -187 -123 -137 -61 -106 -77 47 28
5747B8L9lJM4j2o9J16l5K4m3q7M2J1o0m5lJ8K6l8M5n2J3N6j8K4J01j1K5N5l4P0
$$ 28 67 64 65 109 97 28 144 109 133 90 3 45 56 -4 -49 -52 -34 -8 -46 -1 -53 -40 16 -2 22 123 112 137 192 158 228
5778B28L8m1L5%P2m5l3JJ8m6M5r2m7J4l9l8K7r2j6K3j1j7K3m1J0J1j8M1Q5p2J3
$$ 228 266 225 260 260 332 287 254 255 273 227 272 180 133 147 108 70 97 5 -11 12 1 -16 7 -34 -24 -13 -31 10 95 23 36
5809C6MlQ2q0m1Q8j1m6k5M1o3j4M6j22L0n8Lk0ON8n7l5M2l8K9L7LL5l3J8J09o0
$$ 36 40 37 119 39 -2 86 75 29 4 45 -18 -32 14 -108 -78 -136 -133 -153 -147 -89 -146 -181 -139 -177 -148 -111 -108 -73 -106 -88 21 -39
5841c9K6P2n6L9k0K7jOM8n3Pm0Or6J21l4r9Mj9N7m0k1L6Km0Q5L5nM7j3K2Mp1J10
$$ -39 -13 59 3 42 22 49 48 54 102 49 56 16 22 -74 47 13 -86 -82 -101 -44 -84 -105 -69 -67 -107 -22 13 8 55 42 64 68 -3 107
5875A07QK5om2Kr8N2L4m0n4J8o8Jk3m2j6l4n0N8o5KJ4k8J37o7J3M6KM7n1mQ8Q
$$ 107 115 140 134 92 94 -4 48 82 42 -12 6 -62 -61 -84 -126 -142 -176 -226 -168 -233 -231 -217 -245 -108 -175 -162 -116 -114 -67 -118 -122 -34 -26
5908b6QJ2L5k3j6Jm9M5p1R0j18K6K2p1pJ5l9m1J1mQ0J4k4%O9PPN9NK3O7K0j0R6
$$ -26 -18 -6 29 6 -10 -9 -58 -13 -84 6 -112 -86 -64 -135 -142 -127 -166 -207 -196 -200 -120 -106 -130 -130 -61 -54 -47 12 17 40 107 127 117 213
5942B13k0N2L4rn5N3K2j5l3%N0p5oK4q5L9n0j6k5l7M1J3K4j1j1o0N1M1k8O7J2
$$ 213 193 245 279 270 215 268 290 275 242 242 292 217 211 235 150 189 139 123 98 61 102 115 139 128 117 57 108 149 121 188 200
5973B00l7L8Kn0R0n6l9rJ7L1l1k1r9j6l2Ml5m1k5j7j8jk7o2Q1m4l5J0p0L2oM9
$$ 200 163 201 203 153 243 187 148 139 156 187 156 135 36 20 -12 -8 -43 -84 -109 -126 -144 -145 -172 -234 -153 -197 -232 -222 -292 -260 -266 -217
6005b17pK6L2n1K3L4P0o7Lok6L8k5L1N3q5l2J1oM0R5m8n9J1k3j8M0LKrM9j5pM7
$$ -217 -224 -198 -166 -217 -194 -160 -90 -157 -154 -160 -186 -148 -173 -142 -89 -174 -206 -195 -201 -161 -66 -114 -173 -162 -185 -203 -163 -160 -158 -167 -118 -133 -140 -93
6039i3O9K8Pk6P2Kj1Q8r9N9K8J1J9M6l2J2n4N9k1rk6N3j2pj9qKn3lpn4P2k9p2
$$ -93 -24 4 11 -15 57 59 48 136 37 96 124 135 154 200 168 180 126 185 164 155 129 182 170 163 144 136 138 85 82 75 21 93 64 -8
6073hK2J9k9k6O1j6OO6J1m9N8J7j8J6k2n2N6k8L3p1M3kL9j03kl0l7P0j04l0k3
$$ -8 14 33 4 -22 39 23 29 95 106 57 115 132 114 130 108 56 112 84 117 46 89 87 126 23 21 -9 -46 24 -80 -110 -133
6104a33n1M6J5q4M1jk2L7K4N6L2l2N8m6J19n1N4M0%J0J1j9R6l6M8j8l6k0o2L5
$$ -133 -184 -138 -123 -207 -166 -167 -189 -152 -128 -72 -40 -72 -14 -60 59 8 62 102 102 112 123 104 200 164 212 194 158 138 76 111
6134A11n4k1o5j2k4J3m9l8J0j6L6pO7p0L3Q1l5O2K7P6J3L5OrJ1K7j2k3PMl7n1
$$ 111 57 36 -29 -41 -65 -52 -101 -139 -129 -145 -109 -116 -49 -119 -86 -5 -40 22 49 125 138 173 179 170 181 208 196 173 180 184 147 96
6166I6j6k3j8q0K8j26M9r7n1%k2n1m5L6j4M2N8K3rO2K9Q6k3O3J5k9R5o3Q4l1J0
$$ 96 80 57 39 -41 -13 -139 -90 -187 -238 -238 -260 -311 -356 -320 -334 -292 -234 -211 -220 -158 -129 -43 -66 -3 12 -17 78 15 99 68 78
6197G8O7p1Kr3l6M8n2n1Lp4Lj9Ll9l0oO1l0L9J5P2l5J22L6N0J9O0L2L3O1m2N1
$$ 78 145 74 76 -17 -53 -5 -57 -108 -105 -179 -176 -195 -192 -231 -261 -267 -206 -236 -197 -182 -110 -145 -23 13 63 82 142 174 207 268 226 277
6229B77K9M2m8%j04M8K3n5m8p6K1q0%m2j3ML0l4o2O5k7pJ0J3K2R3L9K3M4jL0j8
$$ 277 306 348 300 300 196 244 267 212 164 88 109 29 29 -13 -26 -22 8 -26 -88 -23 -50 -57 -47 -34 -12 81 120 143 187 186 216 198
6261A98kN9L0l3Kp4n9j0p3M6q4k9qp3k0M3o0j03K3j6k2J5O0j3J7K2K2L1N9J4O
$$ 198 196 255 285 252 254 180 121 111 38 84 0 -29 -37 -110 -130 -87 -147 -250 -227 -243 -265 -250 -190 -203 -186 -164 -142 -111 -52 -38 -32
6292c2J7L8N8%N3Ol1P8m2j04pJ2k4r2j6K3m4j4J2q0J8nj5Jk1L1M3N0n7R0nL5l8
$$ -32 -15 23 81 81 134 140 109 187 145 41 34 46 22 -70 -86 -63 -107 -121 -109 -189 -171 -176 -191 -190 -211 -180 -137 -87 -144 -54 -59 -24 -62
6325f2J00L0L6%M6JM3l8K2j0m7O7j4o8p3pm2N6j59K7K1l8k7O7rr1k3R5O4q0RL4
$$ -62 38 68 104 104 150 151 194 156 178 168 121 188 174 106 33 26 -16 40 -119 -92 -71 -109 -136 -69 -78 -169 -192 -97 -33 -113 -104 -70
6357g0L2L3L0k3k5M2j3N2Q3o2l7N7k0ml5jj4j6n1jjl5L8Jn2J9j2j6J7N0l4j4L8
$$ -70 -38 -5 25 2 -23 19 6 58 141 79 42 99 79 75 40 39 25 9 -42 -43 -44 -79 -41 -40 -92 -73 -85 -101 -84 -34 -68 -82 -44
6390d4Q5o1j2J08o5J0J8j1L6mj1M6r2J20n8L9MJ6n6mKN1p2L7n2L3j1Rk9j4NK1
$$ -44 41 -20 -32 76 11 21 39 28 64 60 49 95 3 123 65 104 108 124 68 64 66 117 45 82 30 63 52 61 32 18 23 44
6422D4j8M9n7N0M2m0l1l6L8k4L7m7M4m8j2O5j7n3L5qL7q3Q2m5J8rn4qR1j9Jj7
$$ 44 26 75 18 68 110 70 39 3 41 17 54 7 51 3 -9 56 39 -14 21 13 50 -33 49 4 22 13 -41 -49 42 23 24 7
6454Gk2l4L5pn8M3J6k4j7nk0j4L5qq8P0L4J7m7RN6jQL2o6K5NN5j5K3j4j5Ol1N4
$$ 7 -15 -49 -14 -21 -79 -36 -20 -44 -61 -66 -86 -100 -65 -73 -161 -91 -57 -40 -87 -78 -22 -23 -15 17 -49 -24 -19 36 21 44 30 15 21 -10 44
6489D4o9L4On5l5N3K4o9kmJ1M9J9n9j4P4m1M3Mj0N0j5K4k5N2m6J8J9kk0KL0n8
$$ 44 -25 9 15 -40 -75 -22 2 -67 -69 -73 -62 -13 6 -53 -67 7 -34 9 13 3 53 38 62 37 89 43 61 80 78 58 60 90 32
6522C2K4kk8pJ3l6kK6j5k0l6m9O2J3k7qJN6J1m1K6K4J2p1J28p1Q0l4J4L3k7j1
$$ 32 56 54 26 19 32 -4 -6 20 5 -15 -51 -100 -38 -25 -52 -60 -59 -3 8 -33 -7 17 29 -42 86 15 95 61 75 108 81 70
6554G0j6j5J1J0n0m5L3J8k3L8r1l8K4j2K3K2j0J6K5m8P0p6M9L8j4K6o0L6N2k4
$$ 70 54 39 50 60 10 -35 -2 16 -7 31 -60 -98 -74 -86 -63 -41 -51 -35 -10 -58 12 -64 -15 23 9 35 -25 11 63 39
6584C9O2Mq1N1m7pO4q9Q3n0r4N6L9ko8j5J6k8pN1j1l3M3mMrL8j2L1j2N0n7N5J0
$$ 39 101 105 24 75 28 21 85 -4 79 29 -65 -9 30 28 -40 -55 -39 -67 -74 -23 -34 -67 -24 -28 -24 -33 5 -7 24 12 62 5 60 70
6618G0k7J6k8J2O6p4%Kq0J2O7o4l1N9k1Qn5K5k3M2Qpn8J02o1KK5J3r9K5J7k5N6
$$ 70 43 59 31 43 109 35 35 37 -43 -31 36 -28 -59 0 -21 -13 -68 -43 -66 -24 -16 -23 -81 21 -40 -38 -13 0 -99 -74 -57 -82 -26
6651b6qKlL7j0m2O9o9K5m6M2J2J3j8J7Q5l3n2MjL4j0Jj1oJ0ok0N5n1J9NPK8r5
$$ -26 -34 -32 -35 2 -8 -50 19 -50 -25 -71 -29 -17 -4 -22 -5 80 47 -5 -1 -2 32 22 23 12 6 16 10 -10 45 -6 13 18 25 53 -42
6686d2L5Rm8J3N5LkOo0N2J9k4O5n9N9j14O8K1n1O6J1no7N4l0j0O7l6k1o8qL0p
$$ -42 -7 2 -46 -33 22 25 23 29 -31 21 40 16 81 22 81 -33 35 56 5 71 82 77 10 64 34 24 91 55 34 -34 -42 -12 -19
6719a9l6L4J1k9k3M3MM2k2o1K8k3j8K2M5K0PK4Nlk5K7J9q1P1l4j8M6m3J5n1n1
$$ -19 -55 -21 -10 -39 -62 -19 -15 27 5 -56 -28 -51 -69 -47 -2 18 25 49 54 51 26 53 72 -9 62 28 10 56 13 28 -23 -74
6751g4J2K3ONl4J5k9k9N6nL1m3K3KL4l6N9NL2N4q8j0J7M6k7J3m9NK5k9kNl2j5
$$ -74 -62 -39 -33 -28 -62 -47 -76 -105 -49 -54 -23 -66 -43 -41 -7 -43 16 21 53 107 19 9 26 72 45 58 9 14 39 10 8 13 -19 -34
6785c4L1j1l5K5j3n5L9j4K5Jj0MJ6J2M1M9o9O8rm5O2o7Q1J5m9M2n4o3R1n6kNp7
$$ -34 -3 -14 -49 -24 -37 -92 -53 -67 -42 -41 -51 -47 -31 -19 22 71 2 70 61 16 78 11 92 107 58 100 46 -17 74 18 16 21 -56
6818e6P4j7l3J3Po6j8K3J2L5k1k8L4JlK8P3l7nQ2j24P2K6mJ9k7ql1k7P1k2n4j7
$$ -56 18 1 -32 -19 -12 -78 -96 -73 -61 -26 -47 -75 -41 -40 -43 -15 58 21 16 98 -26 46 72 68 87 60 52 21 -6 65 43 -11 -28
6851b8K0o4j5N6n6M2lNr7N0M9n1M9m3L4L3KL6QL4j6L0n5O3M5p1j5L1Qr1P5ok2
$$ -28 -8 -72 -87 -31 -87 -45 -48 -43 -140 -90 -41 -92 -43 -86 -52 -19 -17 19 27 61 45 75 20 83 128 57 42 73 81 -10 65 59 37
6884C7l0n1j5N1L4pj08L0k0M2M2k2j3J6mL1oN2J6n5O0n4P4n8N2K1m8j7rj4M4o0
$$ 37 7 -44 -59 -8 26 19 -89 -59 -79 -37 5 -17 -30 -14 -18 13 7 59 75 20 80 26 100 42 94 115 67 50 41 27 71 11
6916A1Q4j00Oj8k9K0%o7O7q0M3N6j7k9Q4mn1K7K3Lo1O6ok0L0K3n1J4J2qJ6o2N0
$$ 11 95 -5 1 -17 -46 -26 -26 -93 -26 -106 -63 -7 -24 -53 31 27 -24 3 26 29 -32 34 28 8 38 61 10 24 36 28 44 -18 32
6949C2l4l8Kn9M0j0j6M2K3o4L9KJ5J4k4M0j8k8J0k8Q3PqjJ4l9M5k1K7J2r2M1l7
$$ 32 -2 -40 -38 -97 -57 -67 -83 -41 -18 -82 -43 -41 -26 -12 -36 4 -14 -42 -32 -60 23 30 22 21 35 -4 41 20 47 59 -33 8 -29
6982b9n2O5J3k2J2l6K7J6K7k1l8K4J7l6K6J7O4k6J7j0K2J9q2L5oM1l7l4l1Q2J0
$$ -29 -81 -16 -3 -25 -13 -49 -22 -6 21 0 -38 -14 3 -33 -7 10 74 48 65 55 77 96 14 49 43 84 47 13 -18 64 74
7013G4L6q5Mk9q1R9l9L3k2l7R2q4K5J4o2J33p6K7Rm2J2L7k2J3rprj0K1J7k2k9
$$ 74 110 25 29 0 -81 18 -21 12 -10 -47 45 -39 -14 0 -62 71 -5 22 31 -11 1 38 16 29 20 13 4 -6 15 32 10 -19
7045a9O3m7%p1L8M3rm2RJ6K1m7P1K0k5n8L1r7k5J37n2L9j2j9M9kr6O9O4oo3K3
$$ -19 44 -3 -3 -74 -36 7 -2 -44 -35 -19 2 -45 26 46 21 -37 -6 -103 -128 9 -43 -4 -16 -35 14 12 -84 -15 49 43 -20 3
7077CJ0l1QL8n7J9n6N0L6o4K6J3P1o4LpL7nj9m0M3KK2n1k4mL8k8PN9l7J2j6mN
$$ 3 13 -18 -10 28 -29 -10 -66 -16 20 -44 -18 -5 66 2 5 -2 35 30 11 -29 14 16 38 -13 -37 -41 -3 -31 -24 35 -2 10 -6 -10 -5
7112eK7kOMq8Q0M7j5L5k4n9pQ2l2j4k6N0lNm7j7j4K4l4K8j9j3P5m1M9j06O3l5
$$ -5 22 20 26 30 -58 22 69 54 89 65 6 -1 81 49 35 9 59 56 61 14 -3 -17 7 -27 1 -18 -31 44 3 52 -54 9 -26
7145b6O1j7k8J8L3M8o0N9j9J2J5ml7L2k5%o8l6N1Mp8O0o0Qqk1P4p5J14j08L1O4
$$ -26 35 18 -10 8 41 89 29 88 69 81 96 92 55 87 62 62 -6 -42 9 13 -65 -5 -65 -57 -65 -86 -12 -87 27 -81 -50 14
7177A4q9P7nN8n0M2K5j6m5J04Jk6K3m2m3L2p1M1l2m4M5r1JL3m9j2J6ql6L7m6O6
$$ 14 -75 2 -3 55 5 47 72 56 11 115 116 90 113 71 28 60 -11 30 -2 -46 -1 -92 -91 -58 -107 -119 -103 -111 -147 -110 -156 -90
7209i0l8P8N0n8N7M9N1q9N9%j1J08q2N0k4k4MJ4J0r6kk9q0J0PN0o4l5j2j6M0J7
$$ -90 -128 -50 0 -58 -1 48 99 10 69 69 58 166 84 134 110 86 90 104 114 18 16 -13 -93 -83 -76 -26 -90 -125 -137 -153 -113 -96
7241i6K7K3O3j5j4N9M2l3J0L8%N7Kj1NL6p5m0J4pl3m9jq9M4j2r2L1j7jjL6p4Q9
$$ -96 -69 -46 17 2 -12 47 89 56 66 104 104 161 163 152 157 193 118 78 92 85 52 3 2 -87 -43 -55 -147 -116 -133 -134 -135 -99 -173 -84
7275h4L7L3m5L4LJ5J16Nm4P0k3Rk6L0Jm6jk6j3n5Om3l1rQm9n8K3pN6k4J0mPK0
$$ -84 -47 -14 -59 -25 -22 -7 109 114 70 140 117 126 100 130 131 85 84 58 45 -10 -4 -47 -78 -87 -79 -128 -186 -163 -170 -114 -138 -128 -132 -125 -105
7310a05P4L6nO1M8K2qK2o1Q5n6L4J6m2lj6k7j1o5Jj4o1j3m8L2K1l6M2N2l9nP0
$$ -105 -31 5 0 61 109 131 123 145 84 169 113 147 163 121 118 102 75 64 -1 0 -14 -75 -88 -136 -104 -83 -119 -77 -25 -64 -69 1
7342AJ6k1N0P4M5m2J7J2L0rl0J5J1kn9Jn3J1q9j7QJ4j23O4r8K5J6j17J28Nm6L0
$$ 1 17 -4 46 120 165 123 140 152 182 173 143 158 169 167 108 109 56 67 -22 -39 -31 -17 -140 -76 -174 -149 -133 -250 -122 -117 -163 -133
7374a33L7M3N5l3MK3P2m8K4O6j9onK1m7qk5qJ4p2k4o0Rl2k7N9p0JN6k0n4R7K3
$$ -133 -96 -53 2 -31 -27 -4 68 20 44 110 91 85 80 101 54 46 21 13 27 -45 -69 -129 -120 -152 -179 -120 -190 -189 -133 -153 -207 -110 -87
7407h7j6k2J06K8N7l7P1k4O5M4ol1K2l1N4p1n7l9J06r8pj4j0o8lk8K3O0m3PPR6
$$ -87 -103 -125 -19 9 66 29 100 76 141 185 179 148 170 139 193 122 65 26 132 34 27 13 3 -65 -68 -96 -73 -13 -56 -49 -42 54
7439E4n9O4rK9M2PL1rNM3m0k4M1m8km8l0N9p0o8N9r6kl1N9o8l9M1m4M2j5P8j7
$$ 54 -5 59 50 79 121 128 159 150 155 198 158 134 175 127 125 77 47 106 36 -32 27 -69 -71 -102 -43 -111 -150 -109 -153 -111 -126 -48 -65
7472f5O8p1L2K7mM8M8m2J8N6l8l7O2J0o9kK4m1p6J6rk9Np4N5j9n7P8n7Q1k1j8
$$ -65 3 -68 -36 -9 -13 35 83 41 59 115 77 40 102 112 43 41 65 24 -52 -36 -45 -74 -69 -143 -88 -107 -164 -86 -143 -62 -83 -101
7504a01LN0Q0j7%k5O6K3J9K3QL4p0J2O8o1l5k1J3m0n7J5p8k4M3n%m2j4L2J2J1
$$ -101 -98 -48 32 15 15 -10 56 79 98 121 129 163 93 105 173 112 77 56 69 29 -28 -13 -91 -115 -72 -77 -77 -119 -133 -101 -89 -78
7536g8rP7p5N0QJ9L7K1L4j4K9l4K4K4n7N6m3rm1o6L2j5k7n0J9oJk7mL0k4L8oJ2
$$ -78 -87 -10 -85 -35 -27 -8 29 50 84 70 99 65 89 113 56 112 69 60 19 -47 -15 -30 -57 -107 -88 -94 -93 -120 -124 -94 -118 -80 -86 -74
7570g4M4j1O3q0O7l0Q5l6nK1K6pM3ko0N1o1MN7n6J3Qj8Lp1O5o0N5l7j1l5J05j4
$$ -74 -30 -41 22 -58 9 -21 64 28 23 44 70 63 106 104 44 95 34 38 95 39 52 60 42 45 -26 39 -21 34 -3 -14 -49 56 42
7603D2jk4O3k3nO6J4r2O2m3N7pn5J8l7nL3m2J9j3j8j4pL8l8m0O1j7l0J2mK7l7
$$ 42 41 17 80 57 52 118 132 40 102 59 116 109 54 72 35 30 63 21 40 27 9 -5 -12 26 -12 -52 9 -8 -38 -26 -30 -3 -40
7636d0K2k2k3O5o7L7KJ4N4r8oN1l6%J6m7L0J3j3k6K3k2l5M1j8L4kj5l4M8k4L4
$$ -40 -18 -40 -63 2 -65 -28 -26 -12 42 -56 -62 -11 -47 -47 -31 -78 -48 -35 -48 -74 -51 -73 -108 -67 -85 -51 -53 -68 -102 -54 -78 -44
7668d4Qk3M3M1n2RK6kK4k1j7N1p7J1L8pK9n0L5N7o0K1j6J8n2jO4o2NR4j3Lm8Q
$$ -44 -36 -59 -16 25 -27 -18 8 6 30 9 -8 43 -34 -23 15 8 37 -13 22 79 19 40 24 42 -10 -11 53 -9 -4 90 77 80 32 40
7702D0rl1L3M3j01L7M0M4p5J3M8j5o5j7J1N0l4j6J0oj3J2Qj4O0j6K7m8J7J1m7
$$ 40 31 0 33 76 -25 12 52 96 21 34 82 67 2 -15 -4 46 12 -4 6 0 -13 -1 7 -7 53 37 64 16 33 44 -3
7733cL1K2kl8l1k8K4%Rj9M0on2J2L6n4LL0mOkL7L3rl4ll2M3mOoK4k5O8k8Qmk5
$$ -3 28 50 48 10 -21 -49 -25 -25 -16 -35 5 -1 -53 -41 -5 -59 -56 -26 -30 -24 -26 11 44 35 1 -2 -34 9 5 11 5 29 4 72 44 52 48 23
7771B3l3R0k8pk5l1l9P6q0j4M2K%qM2k0j0kl6L4L3j8KNp%K3k8nO0m2J2K0Jo3N9
$$ 23 -10 80 52 45 20 -11 -50 26 -54 -68 -26 -24 -24 -32 10 -10 -20 -22 -58 -24 9 -9 -7 -2 -9 -9 14 -14 -19 41 -1 11 31 32 -31 28
7807B8nk9J0k4Q2q0K2k8M8ok2r5N8M0n9J9OJ4l8L4l3J8PL0nm9P8k7K4o1L8j4M0
$$ 28 23 -6 4 -20 62 -18 4 -24 24 18 -4 -99 -41 -1 -60 -41 -35 -21 -59 -25 -58 -40 -33 -3 -8 -57 21 -6 18 -43 -5 -19 21
7840B1K6r1M5K8m1L4n6RM0o7N3j6J0Pj4K0k4pJ9K5m0j7N9Qn1J6L8j4pJ9kn4M6
$$ 21 47 -44 1 29 -12 22 -34 -25 15 -52 1 -15 -5 2 -12 8 -16 -23 -4 21 -19 -36 23 31 -20 -4 34 20 13 32 30 -24 22
7873B2j9L7m5n5J10l7M1l3lJ0m3L1l0N3m7O5k8k4L4l7k4K3N2o3N%L9qJ2J0k4l0
$$ 22 3 40 -5 -60 50 13 54 21 18 28 -15 16 -14 39 -8 57 29 5 39 2 -22 1 53 -10 -5 -5 34 26 38 48 24 -6
7905fk0N0k3k6KQ1k7p9J4PL4l0J4l7LK0J4L8q4M3JkK8m8nl6L7K4K6o9J07j7p4
$$ -6 -26 24 1 -25 -23 58 31 -48 -34 -27 7 -23 -9 -46 -43 -23 -9 29 -55 -12 -11 -13 15 -33 -38 -74 -37 -13 13 -56 51 34 -40
7938d0M5J7m9K2k0k2M4Pqj7N0jl7J3k2kM7k2Kj3l1N2Mp6N4K6nj5Ol1m9M6J5j5
$$ -40 5 22 -27 -5 -25 -47 -3 4 -4 -21 29 28 -9 4 -18 -20 27 5 7 -6 -37 15 19 -57 -3 23 18 3 9 -22 -71 -25 -10 -25
7972b5L6k0K0n9M1J5nK0JJ0o1O3pOqRo3K2L9m5M0Mm9M8jj2n9j3J5K6l9k3R7p5
$$ -25 11 -9 11 -48 -7 8 3 23 24 34 -27 36 29 35 27 36 -27 -5 34 -11 29 33 -16 32 31 19 -40 -53 -38 -12 -51 -74 23 -52
8006e2N0L2m1K8j2m2O1k6jM4k9n0N0K4o8J15m1m5J0j0pM7p0R7p7pn1j6Q6mj6R
$$ -52 -2 30 -11 17 5 -37 24 -2 -3 41 12 -38 12 36 -32 83 42 -3 7 -3 -10 37 -33 64 -13 -20 -71 -87 -1 -5 -21 -12
8038a2k2K7J8nn1L8jo1R7l9J4J9M1j02J06l4kJ9o0Q1l3o4O7l4j2j8qN0j0pn8P1
$$ -12 -34 -7 11 6 -45 -7 -8 -69 28 -11 3 22 63 -39 67 33 31 50 -10 71 38 -26 41 7 -5 -23 -31 19 9 2 -56 15
8070A5L5n2l1O0m7L7n0O2n6m1Q0rK3j6J7k0K0j4k5JN9Jm8K8j4K1n6j8LK5j2j1
$$ 15 50 -2 -33 27 -20 17 -33 29 -27 -68 12 3 26 10 27 7 27 13 -12 -11 48 49 1 29 15 36 -20 -38 -35 -10 -22 -33
8102c3J3o1Q0pl2qo4Q4M1j5nn1QK9L5rj8J3oL6l4N6n5m4L6L2k6k9J2m2M3Kl3P4
$$ -33 -20 -81 -1 -8 -40 -48 -112 -28 13 -2 -7 -58 -50 -21 14 5 -13 0 -6 30 -4 52 -3 -47 -11 21 -5 -34 -22 -64 -21 -19 -52 22
8136B2l9QK0l6Lj2mj2L6Lj8L0J4m3N0KJ4Jm3M2J1k6L8n6J9N9q0M9rK1l7o9L1J0
$$ 22 -17 -9 11 -25 -22 -34 -38 -50 -14 -11 -29 1 15 -28 22 24 38 39 -4 38 49 23 61 5 24 83 3 52 43 64 27 -42 -11 -1
8170al9k1P5o7N9n0J1O8m5lj1L8J8LNJ2ln7M9n0Q
$$ -1 -40 -61 14 -53 6 -44 -33 35 -10 -13 -24 14 32 35 40 52 49 -8 41 -9 -1
8191a
$$ Imaginary data points
##PAGE= N=2
##DATA TABLE= (X++(I..I)), XYDATA
0@%%%%%%%%qQqJ6j6K4l2M0m8N8p4R0j07J30j55J80k15K52k94L41l91M50n16N89
$$ 0 0 0 0 0 0 0 0 0 -8 0 -8 8 -8 16 -16 24 -24 34 -40 50 -57 73 -82 98 -117 135 -159 182 -209 241 -275 314
32C14o71P60q59R70j089J221j367J526j701J892k101K328k577K849l144L469l825
$$ 314 -357 403 -456 514 -575 646 -721 805 -896 996 -1105 1223 -1354 1495 -1649 1820 -2005
49b005M215m640N111n635O216o866P595q423R372j0466J1752j3287J5153j7489
$$ -2005 2210 -2430 2681 -2954 3262 -3604 3991 -4432 4940 -5526 6226 -7061 8092 -9397
63i397K0502k4562L0367l9426N5707r4305L63677M39693j27817k4039j74932j29022
$$ -9397 11105 -13457 16910 -22516 33191 -61114 302563 742256 614439 590400 415468 286446
75B86446k15944j83407k17432j62691j35888o6313l1070M6379N5487J22513J39248
$$ 286446 70502 -112905 -330337 -493028 -628916 -695229 -726299 -679920 -624433 -501920 -362672
86c62672J52654J62705J52246R0700P0571K3800n677m5198o0657o7223q4603q7410
$$ -362672 -210018 -47313 104933 195633 266204 290004 284327 239129 178472 111249 26646 -60764
98f0764m8359l7047L092L5270L9800N4103N5550L6770L4447R636k1088n9147r2636
$$ -60764 -109123 -146170 -143078 -107808 -68008 -13905 41645 78415 112862 122498 101410 42263 -50373
111e0373j06399j29820j28654r0204q2520n9587j1923K0493O5425J06881J30204
$$ -50373 -156772 -286592 -415246 -505450 -587970 -647557 -659480 -638987 -573562 -466681 -336477
122c36477J49111J42096J29410J10020P8495O0539K1796k0043l4785o8817q5906
$$ -336477 -187366 -45270 84140 194160 272655 333194 354990 334947 300162 231345 145439
133A45439o5187n8247m6932k6341p722J3793K2993M1038N5214L9725L1035J0083
$$ 145439 80252 22005 -24927 -51268 -58990 -45197 -22204 18834 74048 113773 144808 154891
145A54891k2834k9692m7326o6703o3171o9756o8119m7073j9922J3616L6402O5134
$$ 154891 132057 102365 55039 -11664 -74835 -144591 -212710 -259783 -279705 -266089 -229687 -164553
157a64553R1396Q7285R5166J03716Q4570P0299M4450N714j7942m3590o2081o8218
$$ -164553 -73157 14128 109294 213010 297580 367879 412329 418043 400101 356511 294430 226212
169B26212p3641o9822o9134n6000k6762j5015O384L2968K7699K6162K9574J9089
$$ 226212 152571 82749 13615 -42385 -69147 -84162 -77778 -44810 -17111 9051 38625 57714
181E7714J1168k587j8102l2142m9731n0695m8171m0977j6458p541L622L1401M1453
$$ 57714 68882 66295 48193 16051 -33680 -84375 -132546 -173523 -189981 -197522 -193900 -162499 -121046
194a21046N4023P2841P1443O1623M5997K9935J2870j2516k3574l5747n8442o1577
$$ -121046 -67023 5818 77261 138884 184881 214816 227686 215170 191596 155849 97407 35830
206C5830o3130o2083l9547k5292j4307M791J4523K3206L0994L7822L9743K4312
$$ 35830 -27300 -89383 -128930 -154222 -168529 -163738 -149215 -126009 -95015 -57193 -17450 6862
218F862J4631O204j6345k0738j9056k8500k6388k3263j9662m624R467K5254L6625
$$ 6862 21493 27697 11352 -9386 -28442 -56942 -83330 -106593 -126255 -130879 -121412 -96158 -59533
231e9533M2103M7166L8319L4023L5672J7217L473n337k8395m0197m1234m2119
$$ -59533 -17430 29736 68055 102078 137750 154967 158440 153103 124708 84511 43277 1158
243A158l7990l3805k4336j5123p499J1275K1757K7381L7701K9238K0035K1184
$$ 1158 -36832 -70637 -94973 -110096 -117595 -106320 -84563 -57182 -19481 9757 29792 50976
255E0976J0351J053l435j3616k2981k9673k5391j7933j5297r09Q117P401J9000
$$ 50976 61327 62380 58945 45329 22348 -7325 -32716 -50649 -65946 -66855 -58738 -51337 -32337
268c2337K5154K5672L2345K6876J5272O721l787j1783j9862k2061k2549l1859
$$ -32337 -7183 18489 50834 77710 92982 99703 95916 84133 64271 42210 19661 -12198
280a2198k8685j9213j7472l543J0135J1738J7097J9679J9253K0712J8528J4857
$$ -12198 -40883 -60096 -77568 -81111 -70976 -59238 -42141 -22462 -3209 17503 36031 50888
292E0888M742n411r469j9556k0597j2990j7476j6258p890o940L83J1493J8147
$$ 50888 55630 50219 40750 21194 597 -12393 -29869 -46127 -54017 -60957 -60574 -49081 -30934
305c0934K1215J9170J8781J4368Q034R473K596p107q243j7552k2504j4829j2759
$$ -30934 -9719 9451 28232 42600 50634 60107 62703 55596 47353 29801 7297 -7532 -20291
318b0291r908m097q75K191M307J2168J6870J2095J3077Q837k422k014m223j0071
$$ -20291 -30199 -34296 -35171 -32980 -28673 -16505 365 12460 25537 34374 31952 29938 25715 15644
332A5644q633j2247j6298j4297r833l010L38O099J1635O922J0227J6143J1357
$$ 15644 7011 -5236 -21534 -35831 -45664 -48674 -48336 -42237 -30602 -23680 -13453 2690 14047
345A4047J2564J1744J905k284n628q006p378q414p118r720r947k502k414J623
$$ 14047 26611 38355 40260 37976 32348 24342 16964 8550 1432 -8288 -18235 -20737 -23151 -21528
359b1528J0204N253L302N903J947K203K475R4l066q777p541o693p762P1L01k072
$$ -21528 -11324 -6071 -2769 3134 5081 7284 9759 9853 6787 -1990 -9531 -16224 -23986 -23915 -23614 -25686
375b5686M393L201L927J1479J1011R516P261M120L242r26J141J916n912m600m907
$$ -25686 -21293 -18092 -14165 -2686 8325 17841 25102 29222 32464 31538 32679 34595 28683 24083 19176
390A9176r532l118n50j565J605l73q29L87J549N001R10m58J078o120m184P17l154
$$ 19176 9644 6526 5976 4411 6016 5643 4814 5201 6750 11751 12661 12203 13281 7161 2977 3694 540
407E40o27J9l459j307j08L079M777K284M241L93j659L572k47n54K676l836n019
$$ 540 -87 -68 -3527 -4834 -4942 -1863 2914 5198 9439 9832 8173 11745 11498 10944 13620 9784 4765
424D765k927l532o35j036p60j212n079m44L88k071L030k68m131p08l045j666J758
$$ 4765 1838 -1694 -2329 -3365 -4125 -5337 -10416 -10860 -10472 -12543 -9513 -9781 -13912 -14620 -17665 -19331 -17573
441a7573J88J72k402j449J665r68K738L732k754r5m89l383J318Q07m63n53k600
$$ -17573 -17385 -17213 -19615 -21064 -19399 -20367 -17629 -13897 -16651 -16746 -17235 -20618 -19300 -18493 -18956 -19509 -22109
458b2109j16N11K019N900J412J812M419m69K546N138J220J593n34k467j260j456
$$ -22109 -22225 -21714 -19695 -13795 -12383 -10571 -6152 -6621 -4075 1063 2283 3876 3342 875 -385 -1841
474a841J830O64j847J556r66o64M886J913K145L087j514j372q57n16M76k667j695
$$ -1841 -11 653 -1194 362 -604 -1268 3618 5531 7676 10763 9249 7877 7020 6504 6980 4313 2618
491B618j984m100J822K630J560O263L931K650N784M836O177N350K449J158l151
$$ 2618 634 -3466 -1644 986 2546 8809 12740 15390 21174 26010 32187 37537 39986 41144 37993
506C7993k153r18m963k592k954p177l788k914k614J010M77q2j331k173M31j518
$$ 37993 35840 34922 29959 27367 24413 17236 13448 10534 7920 8930 9407 9325 7994 5821 6252 4734
522D734j717m02n586n011k836n065j235J324M24J861J905M289O189N988Q431N218
$$ 4734 3017 2615 -2971 -7982 -10818 -15883 -17118 -15794 -15370 -13509 -11604 -7315 -1126 4862 13293 18511
538A8511J805L360p96k239l84m550n978o646q659o762n436l068j695l804q02n3
$$ 18511 20316 23676 22880 20641 20257 15707 9729 3083 -5576 -12338 -17774 -20842 -22537 -26341 -27143 -27196
554b7196j406L130K199l36J038k063l116j336j150M85m20j41K171J577N664Q802
$$ -27196 -28602 -25472 -23273 -23609 -22571 -24634 -27750 -29086 -30236 -29751 -30171 -30312 -28141 -26564 -20900 -12098
570a2098O343Q754Q083M249N340M240K245R30k946m705p407p785m928o718n780
$$ -12098 -5755 2999 11082 15331 20671 24911 27156 28086 25140 20435 13028 5243 315 -6403 -12183
585a2183l057n196k663Q48O56L480M157K343J883N96K056J739o5J545r51k032
$$ -12183 -15240 -20436 -23099 -22251 -21595 -18115 -13958 -11615 -9732 -9136 -7080 -5341 -5406 -3861 -4812 -6844
601f844J786J245K890O429N171N496N745N171O349M697L886J370l711l540n308
$$ -6844 -5058 -3813 -923 5506 10677 16173 21918 27089 33438 38135 42021 43391 39680 36140 30832
616C0832q109n878p217q857o788o996m869j465J43K309J226J871L875K004L633
$$ 30832 22723 16845 9628 771 -6017 -13013 -17882 -19347 -19204 -16895 -15669 -13798 -9923 -7919 -4286
631d286M224L76P63j52k295k18M55J276J747R38K883K900L913O633L789K673K661
$$ -4286 -62 314 1077 925 -1370 -1588 -1133 143 1890 2828 5711 8611 12524 19157 22946 25619 28280
648B8280j705k406k263n008n468p114q525p906p616m016k512k655Q88Q24J086
$$ 28280 26575 24169 21906 16898 11430 4316 -4209 -12115 -19731 -23747 -26259 -28914 -28026 -27202 -26116
663b6116N015M439M683N641K710J734P80M46J469n42o4r8k186J054K348J559M507
$$ -26116 -21101 -16662 -11979 -6338 -3628 -1894 -1114 -668 801 259 195 97 -2089 -1035 1313 2872 7379
680G379L612J901K504R58J034L47j820k587o182o565m777o563m414k417m214j517
$$ 7379 10991 12892 15396 16354 17388 17735 15915 13328 7146 581 -4196 -10759 -15173 -17590 -21804 -23321
696b3321K1P63M066M573N231M503K541L815K484J386K786p72j821p16k869j279
$$ -23321 -23300 -22537 -18471 -13898 -8667 -4164 -1623 2192 4676 6062 8848 8076 6255 5539 2670 1391
712A391N85L34J452M28J036K346J464L405K087j202j81k663m266k263l991l907
$$ 1391 1976 2310 3762 4190 5226 7572 9036 12441 14528 13326 13145 10482 6216 3953 -38 -3945
728c945l428m680k815j911L15K989J403L122L721J498M228L810J567K484k89j750
$$ -3945 -7373 -12053 -14868 -16779 -16464 -13475 -12072 -8950 -5229 -3731 497 4307 5874 8358 8069 6319
744F319j457k330o23j150j901j29j796J07K989J100K937L061K45J090M5m28J65
$$ 6319 4862 2532 1909 759 -1142 -1271 -3067 -2960 29 1129 4066 7127 7372 8462 8507 8079 8244
761H244k059k040l539m779j577k148j658J120q15K76K092J157L102L179J954J706
$$ 8244 6185 4145 606 -4173 -5750 -7898 -9556 -8436 -9251 -8975 -6883 -5726 -2624 555 2509 4215
777D215r52k42l6j917k4j403l255p79j531n36K044J349K307J809J172K699J535
$$ 4215 3263 3021 2985 1068 1044 -359 -3614 -4393 -5924 -6460 -4416 -3067 -760 1049 2221 4920 6455
794F455K172K368j525p24j357l511j178j711k484j326k469j405l45J39K521Q27
$$ 6455 8627 10995 9470 8746 7389 3878 2700 989 -1495 -2821 -5290 -6695 -7040 -6901 -4380 -3553
810c553L52J582q31M86J605r70j55r09k417r04j078O15J259N8J855J188J129M077
$$ -3553 -3201 -1619 -2450 -1964 -359 -1329 -1484 -2393 -4810 -5714 -6792 -6177 -4918 -4860 -3005 -1817 -688 3389
828C389K616K313K897R9K4O8j142l47j917k424k541m229j510r33j935L82o91j420
$$ 3389 6005 8318 11215 11314 11338 11406 10264 9917 8000 5576 3035 -1194 -2704 -3637 -5572 -5190 -5881 -7301
846g301P77O3Q96J563K37L90r06p79Q13l69R35J273r54J106J588J192L291K644
$$ -7301 -6524 -6461 -5565 -4002 -3765 -3375 -4281 -5060 -4247 -4616 -3681 -2408 -3362 -2256 -668 524 3815 6459
864F459K101J878M74J437P06q5P34k246k895k013l745k237j481k891j825k253
$$ 6459 8560 10438 10912 12349 13055 12970 13704 11458 8563 6550 2805 568 -913 -3804 -5629 -7882
880g882j934k94k61J425Q90m60J224J25L66K448P12O64J081l32Q77J280J579K445
$$ -7882 -9816 -10110 -10371 -8946 -8056 -8516 -7292 -7167 -6801 -4353 -3641 -2977 -1896 -2228 -1351 -71 1508 3953
898C953R82J345J261RK160J457k75L14j551k485j432k234j860k340l098k420l346
$$ 3953 4935 6280 7541 7550 9710 11167 10892 11206 9655 7170 5738 3504 1644 -696 -3794 -6214 -9560
915i560j816O8j009L82O00p53J411J629J657K560J577J404R52M15K066J262J056
$$ -9560 -11376 -11308 -12317 -11935 -11335 -12088 -10677 -9048 -7391 -4831 -3254 -1850 -898 -483 1583 2845 3901
932C901J873l51K4J345K11J305J035m49l26j194j046o70j522q79k156l551j657
$$ 3901 5774 5423 5447 6792 7003 8308 9343 8894 8568 7374 6328 5658 4136 3257 1101 -2450 -4107
949d107k306j729q6j209q43j45k34J374J666K152K503R30J710J766R82K614J576
$$ -4107 -6413 -8142 -8228 -9437 -10280 -10425 -10659 -9285 -7619 -5467 -2964 -2034 -324 1442 2424 5038 6614
966F614k4P86m16l08N02J5N27o16j013k76j380j98N67j497r74j438k371j059r40
$$ 6614 6590 7376 6960 6652 7154 7169 7696 7080 6067 5791 4411 4213 4780 3283 2309 871 -1500 -2559 -3499
985c499j118p02j498q55q86k52J717R90J011J725N28J314K405J495J973J047R5
$$ -3499 -4617 -5319 -6817 -7672 -8558 -8810 -7093 -6103 -5092 -3367 -2839 -1525 880 2375 4348 5395 5490
1002E490K23n87K64L19q55j03j256j828Nm59l06M12r71p93p29p77J64m61m00m56
$$ 5490 5713 5126 5390 5709 4854 4751 3495 1667 1672 1213 907 1319 348 -445 -1174 -1951 -1787 -2248 -2648 -3104
1022c104j913n93k4m45J106M14k77O71O02J281J813J361J630K01L2Q30k36N44
$$ -3104 -5017 -5610 -5634 -6079 -4973 -4559 -4836 -4165 -3563 -2282 -469 892 2522 2723 2755 3585 3349 3893
1040C893N56j362q48r18j335M4r8j45k70p71J8l6J89J417p2o04O4j136j43M70
$$ 3893 4449 3087 2239 1321 -14 30 -68 -213 -483 -1254 -1236 -1272 -1083 334 262 -342 -278 -1414 -1557 -1087
1060a087l51N2o00o26J36K3J275J217J26R00M6j01J427N60J65J77j045o70o13
$$ -1087 -1438 -1386 -1986 -2612 -2476 -2453 -1178 39 165 1065 1111 1010 2437 2997 3162 3339 2294 1624 1011
1079A011l40L25n13k75j38j102O07J057L16J083O8n60J89j07L82mo08l13j523
$$ 1011 671 996 483 208 70 -1032 -425 632 948 2031 2099 1539 1728 1621 2003 1999 1391 1078 -445
1098d45r94L19m63L57M85r75J27L75L13J120M34K79k19q73K66q6j32O92p48r45
$$ -445 -1439 -1120 -1583 -1226 -741 -1716 -1589 -1214 -901 219 653 932 713 -160 106 20 -112 580 -168 -1113
1118a113K25l01O63J077L75L60j95J62M82o6P72j13j383n18j136j030K93n14o55
$$ -1113 -888 -1189 -526 551 926 1286 1091 1253 1735 1669 2441 2328 945 427 -709 -1739 -1446 -1960 -2615
1137b615m86p29J17J62O99J141j46K71K39m59R50Q21k12J37n08m96L48K04J033
$$ -2615 -3101 -3830 -3713 -3551 -2852 -1711 -1857 -1586 -1347 -1806 -856 -35 -247 -110 -618 -1114 -766 -562 471
1156D71L46m1N55k88K88J269J29J08j84j222o32l79m27k07j023o29q09p77P11
$$ 471 817 776 1331 1043 1331 2600 2729 2837 2653 1431 799 420 -7 -214 -1237 -1866 -2675 -3452 -2741
1175b741M04L09R59k25o7Q69M72R20N33j98j41n49MN29k3O81j7p58N00K98M89
$$ -2741 -2337 -2028 -1069 -1294 -1361 -492 -20 900 1433 1235 1094 545 549 1078 1055 1736 1719 961 1461 1759 2248
1196B248R88Ml03m39o33l2m10l79k08j531p84l58n86P39M97k95L28q5M81Q10N39
$$ 2248 3236 3240 2937 2498 1865 1833 1423 1044 836 -695 -1479 -1837 -2423 -1684 -1187 -1482 -1154 -1239 -758 52 591
1217E91Q70k04n19M8p01OO51n69k62k84o16N35M70O24N23l06J68j88l07P53p7
$$ 591 1461 1257 738 786 85 91 742 173 -89 -373 -989 -454 16 640 1163 857 1025 837 530 1283 1206
1238A206p34l36j165o71J32o0K58j87j87K18r2R81R33J20M99l01r12K24j01k55
$$ 1206 472 136 -1029 -1700 -1568 -1628 -1370 -1557 -1744 -1526 -1618 -637 296 416 915 614 -298 -74 -175 -430
1258d30j38r36n80n15j95Q13J68N18O61l35N94Q78M23Q64J36o69k77n08J4J14
$$ -430 -568 -1504 -2084 -2599 -2794 -1981 -1813 -1295 -634 -969 -375 503 926 1790 1926 1257 980 472 486 600
1278F00l54J21o68n25N88K4O75Q66k94j50j83l71K25k73l88o80j364l47m37k87
$$ 600 246 367 -301 -826 -238 -214 461 1327 1033 883 700 329 554 281 -107 -787 -2151 -2498 -2935 -3222
1298c222R40P1m2O84L99J136J404R90Q94O3L9K88k88M15k2q61m43q08p19M25J35
$$ -3222 -2282 -2211 -2253 -1569 -1170 -34 1370 2360 3254 3317 3356 3644 3356 3771 3749 2888 2445 1637 918 1343 1478
1319A478n4j0o05j06k35k5L03p35p52o27j341l33ql50K04j65r2O28Q91J558J196
$$ 1478 1424 1414 809 703 468 443 746 11 -741 -1368 -2709 -3042 -3050 -3400 -3196 -3361 -3453 -2825 -1934 -376 820
1340H20R57J109J49L16J046RP7l10j183q47q59n50j99p16m85o53r06J87j29j51
$$ 820 1777 2886 3035 3351 4397 4406 4483 4173 2990 2143 1284 734 535 -181 -666 -1319 -2225 -2038 -2167 -2318
1360b318K74p38r21m03n22k6q4l35j47m46L51R39P45J581J155N99J221Q14Q93
$$ -2318 -2044 -2782 -3703 -4106 -4628 -4654 -4738 -5073 -5220 -5666 -5315 -4376 -3631 -2050 -895 -296 925 1739 2632
1379B632J207M37m7n56r00m31q47o14l70j243q75o14o38L29K47q2J62m43j38J96
$$ 2632 3839 4276 4229 3673 2773 2342 1495 881 511 -732 -1607 -2221 -2859 -2530 -2283 -2365 -2203 -2646 -2784 -2588
1399b588J60N25j97k91K69k81M25J293P40R68Q92N91J175J163J197J073J09J11
$$ -2588 -2428 -1903 -2100 -2391 -2122 -2403 -1978 -685 55 1023 1915 2506 3681 4844 6041 7114 7223 7334
1417G334m16o37p5p47r69o29j509j132n17m03R2k42k27n5l95L19N48N8L45k08
$$ 7334 6918 6281 6206 5459 4490 3861 2352 1220 703 300 392 150 -77 -132 -527 -208 340 398 743 535
1437E35o04K8K9K60O11J57J92Q1M37J003N78N92O16l76k51j71n17j54q16j198
$$ 535 -69 -41 -12 248 859 1016 1208 1289 1726 2729 3307 3899 4515 4139 3888 3717 3200 3046 2230 1032
1457A032j227j385q75o32m39j86o64n26J64j34M00O07M1pk58j62K39Q8K94J11
$$ 1032 -195 -1580 -2455 -3087 -3526 -3712 -4376 -4902 -4738 -4872 -4472 -3865 -3824 -3831 -4089 -4251 -4012 -3924 -3630 -3519
1477c519l90J15J31L70R20N13K77L44p4Q9L22J58P6o46p59l66o95j37R0l39J5
$$ -3519 -3909 -3794 -3663 -3293 -2373 -1860 -1583 -1239 -1313 -1224 -902 -744 -668 -1314 -2073 -2439 -3134 -3271 -3181 -3520 -3505
1498c505k06j74P08N53O83O02K64K48K4K93P65kLJ87l51M2M98M66O55K78R1K87
$$ -3505 -3711 -3885 -3177 -2624 -1941 -1339 -1075 -827 -803 -510 255 253 256 443 92 134 632 1098 1753 2031 2122 2409
1520B409K18N74N20J17J05m87m59R5j30OJ46k93k20j84K52O81K93L09K02l73P7
$$ 2409 2627 3201 3721 3838 3943 3456 2997 3092 2962 2968 3114 2821 2601 2417 2669 3350 3643 3952 4154 3781 3858
1541C858k2j01K23m10q03m51o29k52rP6j7m25k95L72J1L97K61l52j57n12l52J60
$$ 3858 3836 3735 3958 3548 2745 2294 1665 1413 1404 1480 1463 1038 743 1115 1126 1523 1784 1432 1275 763 411 571
1563E71o3j57l25m23k5j52L28P32j04j00L3m09q9K5k87l38r85r44n60n19r0j55
$$ 571 508 351 26 -397 -422 -574 -246 486 382 282 315 -94 -183 -158 -445 -783 -1768 -2712 -3272 -3791 -3881 -4036
1585d036l76K6l08N1Q37M69N24L63k4K01j2M04N01p6m1q7k06M76M87N15P97J6
$$ -4036 -4412 -4386 -4694 -4643 -3806 -3337 -2813 -2450 -2474 -2273 -2285 -1881 -1380 -1456 -1497 -1584 -1790 -1314 -827 -312 485 501
1607E01JL31K30L18l6k35n34j082o59k59n17k45l14m43p2L4N69R85O39O02L57
$$ 501 502 833 1063 1381 1345 1110 576 -506 -1165 -1424 -1941 -2186 -2500 -2943 -3015 -2981 -2412 -1427 -788 -186 171
1628A71L03N74L59M02L91m34l04m4j89K89L04K18L05j60J87M91L18L24j19p31
$$ 171 474 1048 1407 1809 2200 1766 1462 1418 1229 1518 1822 2040 2345 2185 2372 2863 3181 3505 3386 2655
1648B655m03j119p30l47q35q21q71p30j41K8O10P40K05N57N55N74R02M59J77J56
$$ 2655 2252 1133 403 56 -779 -1600 -2471 -3201 -3342 -3314 -2704 -1964 -1759 -1202 -647 -73 829 1288 1465 1621
1668A621o00m68k44k00J98k92k36J32j71N32Q69N01L72M0k45j06l97k91m45r37
$$ 1621 1021 553 309 109 307 15 -221 -89 -260 272 1141 1642 2014 2054 1809 1703 1306 1015 570 -367
1688c67r58j043o45o1m8K74N81J98M82R32R40J063O56K13j5n02j85j13m08k74
$$ -367 -1325 -2368 -3013 -3074 -3122 -2848 -2267 -2069 -1587 -655 285 1348 2004 2217 2202 1700 1515 1402 994 720
1708G20o89n71L1PN61R22N44N25L72L99N55J29N1l10j151r91q75q88k93n89m92
$$ 720 31 -540 -509 -502 59 981 1525 2050 2422 2821 3376 3505 3556 3246 2095 1104 229 -659 -952 -1541 -2033
1729b033j81k25M05P88Q28Q78K82J38K07k79M3j84p10q53r19p95k14P2M04N89
$$ -2033 -2214 -2439 -2034 -1246 -418 460 742 880 1087 808 851 667 -43 -896 -1815 -2610 -2824 -2752 -2348 -1759
1749a759M36P15Q38J132J316N89L75j3p00o37o24p58p85j277j125p61o46J34M67
$$ -1759 -1323 -608 230 1362 2678 3267 3642 3629 2929 2292 1668 910 125 -1152 -2277 -3038 -3684 -3550 -3083
1768c083M05M66K32L84O17M59K60M8n85o75o91m87Nk7J56L64M33J011J469J540
$$ -3083 -2678 -2212 -1980 -1596 -979 -520 -260 -212 -797 -1472 -2163 -2650 -2645 -2672 -2516 -2152 -1719 -708 761 2301
1788B301J705J023P46N10J14m0l62r09j289j775j836j232j179p32l78n34j98P7
$$ 2301 4006 5029 5775 6285 6399 6359 5997 5088 3799 2024 188 -1044 -2223 -2955 -3333 -3867 -4065 -3988
1806c988L90Q68N94M89N2k78k70j98j19N2m21k42J76L11J027J400J467J491J091
$$ -3988 -3598 -2730 -2136 -1647 -1595 -1873 -2143 -2341 -2460 -2408 -2829 -3071 -2895 -2584 -1557 -157 1310 2801 3892
1825C892R78R63N91M91k67j138j490j953k028j590j848j653j452j301p39j90M87
$$ 3892 4870 5833 6424 6915 6648 5510 4020 2067 39 -1551 -3399 -5052 -6504 -7805 -8544 -8734 -8247
1842h247R72O93O93Q20N42R26P66N31M58K9M1L68N88J097J204J180J295J077J364
$$ -8247 -7275 -6582 -5889 -5069 -4527 -3601 -2835 -2304 -1846 -1817 -1776 -1408 -820 277 1481 2661 3956 5033 6397
1861F397J643J028P22R0p46j103j471j706j691k141k249k061j818r70l53J33P45
$$ 6397 8040 9068 9790 9880 9134 8031 6560 4854 3163 1022 -1227 -3288 -5106 -6076 -6429 -6296 -5551
1878e551N47R75J332J554J760J519J190Q19L04L89O95M20O14L79J75O25N24Q01
$$ -5551 -5004 -4029 -2697 -1143 617 2136 3326 4145 4449 4838 5533 5953 6567 6946 7121 7746 8270 9071
1896I071J129M78J96k75q15r33j365j731j974k863k828k511k337j542j203q61
$$ 9071 10200 10678 10874 10599 9784 8851 7486 5755 3781 918 -1910 -4421 -6758 -8300 -9503 -10364
1912a0364k20N3P26J425J703J890J620J263J232Q11Q30Q79K07o4k52m13k6p3J70
$$ -10364 -10584 -10531 -9805 -8380 -6677 -4787 -3167 -1904 -672 139 969 1848 2055 1991 1739 1326 1300 1227 1397
1931A397L06j24k64l56m42l77q15j367j655k232k088j904j771j374j271q75k36
$$ 1397 1703 1579 1315 959 517 140 -675 -2042 -3697 -5929 -8017 -9921 -11692 -13066 -14337 -15212 -15448
1948a5448J47J152K048J899K446K166K071K364J973J813J575O52K90m8j38J0j33
$$ -15448 -15301 -14149 -12101 -10202 -7756 -5590 -3519 -1155 818 2631 4206 4858 5148 5100 4962 4972 4839
1965D839j80k14n94j73J2k1O7k93o73q12j162j057q47j155r23j129q58k21K56
$$ 4839 4659 4445 3851 3678 3690 3669 3736 3443 2770 1958 796 -261 -1108 -2263 -3186 -4315 -5173 -5394 -5138
1984e138R09J525J343J789J986K019K321J963J781J361K98J93j71m34m81j032
$$ -5138 -4229 -2704 -1361 428 2414 4433 6754 8717 10498 11859 12157 12350 12179 11745 11264 10232
2000A0232j276j222j436q42o71o35n48q15q00o55q70n33o34j123j024j170r00
$$ 10232 8956 7734 6298 5456 4785 4150 3602 2787 1987 1332 462 -71 -705 -1828 -2852 -4022 -4922
2017d922l29k22J68N05M09Q93J141J554J834J385J240Q09K91L03O3m19o73j259
$$ -4922 -5251 -5473 -5305 -4800 -4391 -3498 -2357 -803 1031 2416 3656 4465 4756 5059 5122 4703 4030 2771
2035B771j430j410j484q66q81q06n93p30l86J26n7K23P0l62j28l22j5K40K2K23
$$ 2771 1341 -69 -1553 -2419 -3300 -4106 -4699 -5429 -5815 -5689 -5746 -5523 -5453 -5815 -5943 -6265 -6280 -6040 -6018 -5795
2055e795K31K61Q52J059J223J556J037R90R93P15P85M33k1k46r41q85q47q96p18
$$ -5795 -5564 -5303 -4451 -3392 -2169 -613 424 1414 2407 3122 3907 4340 4319 4073 3132 2247 1400 504 -214
2074b14p22q87n08m47L5M01L50M01K67J70L64K66L13N04j68r6J8j02M90M55M89
$$ -214 -936 -1823 -2331 -2778 -2743 -2342 -1992 -1591 -1324 -1154 -790 -524 -211 293 125 29 47 -55 435 890 1379
2095A379N06J99M63N51L93N78J48k47l38p30n72n69p05p20p93r30n10l88M6J94
$$ 1379 1885 2084 2547 3098 3491 4069 4217 3970 3632 2902 2330 1761 1056 336 -457 -1387 -1897 -2285 -2239 -2045
2115b045M1K35K18J32N16M85L77K28j62j31m3j16K55kj27M1j89J37L38K08L14
$$ -2045 -2004 -1769 -1551 -1419 -903 -418 -41 187 25 -106 -149 -265 -10 -12 -139 -98 -287 -150 188 396 710
2136G10R3l50l6j63k5L6m25l32n02m28kl8J44L46n4K40L36L66P31M11L36J82j00
$$ 710 803 453 417 254 229 265 -160 -492 -994 -1422 -1424 -1462 -1318 -972 -1026 -786 -450 -84 647 1058 1394 1576 1476
2159A476J66J60p7J61k20l96j36k42R0O5pl2k08k21J23o3J50Ml86r0k10j25J87
$$ 1476 1642 1802 1725 1886 1666 1270 1134 892 982 1047 1040 1008 800 579 702 639 789 793 407 317 107 -18 169
2182A69J13L4Pj58J53K42K22L87N7j17O5j64L8J70k81j12l68m95j70k06o6j58
$$ 169 282 316 323 165 318 560 782 1169 1226 1109 1174 1010 1048 1218 937 825 457 -38 -208 -414 -480 -638
2204f38l13k12l21j61N8k3l3o5l20k5J68J71L14J31K7J03J31L61L65K25K68r3
$$ -638 -951 -1163 -1484 -1645 -1587 -1610 -1643 -1708 -2028 -2053 -1885 -1714 -1400 -1269 -1242 -1139 -1008 -647 -282 -57 211 118
2226A18j06R0oJ87M4k59j24k26j41J54q8J1ql40m9j31j7J70j10k07j62j91J68
$$ 118 12 102 96 283 327 68 -56 -282 -423 -269 -357 -346 -354 -694 -743 -874 -891 -721 -831 -1038 -1200 -1391 -1223
2249a223J81J46K56P7J70K91K83N53L95J17K27kn8J79J4J7j40l63j73k30j12J53
$$ -1223 -1042 -896 -640 -563 -393 -102 181 734 1129 1246 1473 1471 1413 1592 1606 1623 1483 1120 947 717 605 758
2271G58j38j27j97k95%o1r2o5l80m21k79k96Mp6j73R7p2J19L44L70N67L91K04
$$ 758 620 493 296 1 1 -60 -152 -217 -597 -1018 -1297 -1593 -1589 -1665 -1838 -1741 -1813 -1694 -1350 -980 -413 -22 182
2294A82L13J92L44K60J24ok01l59p8l9j11L6k79j54j31j26J43P4k00j51l64l68
$$ 182 495 687 1031 1291 1415 1409 1208 849 771 732 621 657 378 224 93 -33 110 184 -16 -167 -531 -899
2316h99q0l48q7o9l45r9m9J84N49M04M82N84L76O71N78N97N31J64Q4M6k32P0j53
$$ -899 -979 -1327 -1414 -1483 -1828 -1927 -1976 -1792 -1243 -839 -357 227 603 1274 1852 2449 2980 3144 3228 3274 3042 3112 2959
2339B959j77k40l90l16j45k07k4j30l25k36m10l68j26m15l59m19n09j84j57L6
$$ 2959 2782 2542 2152 1836 1691 1484 1460 1330 1005 769 359 -9 -135 -550 -909 -1328 -1837 -2021 -2178 -2142
2359b142L04J80L89M27M87P69O95N67N57K09J08J31kj3k81m50m26o83m16l06m27
$$ -2142 -1838 -1658 -1269 -842 -355 414 1109 1676 2233 2442 2550 2681 2679 2666 2385 1935 1509 826 410 104 -323
2380c23k50n45m37k76m49j85k19m44l70m07m64l3j07k8K66Q3L87M82O79R88Q24
$$ -323 -573 -1118 -1555 -1831 -2280 -2465 -2684 -3128 -3498 -3905 -4369 -4402 -4509 -4537 -4271 -4188 -3801 -3319 -2640 -1652 -828
2401h28P68P39M36N93N09K19K00k28l58l30n82l78l55n25l82n30l99j88k39q2
$$ -828 -60 679 1115 1708 2217 2436 2636 2408 2050 1720 1138 760 405 -120 -502 -1032 -1431 -1619 -1858 -1940
2421a940jl85j82k33j69J87K9Q1J90Q6M95O20P55R30P78P91Q27O52P70O50L14
$$ -1940 -1941 -2326 -2508 -2741 -2910 -2723 -2694 -2613 -2423 -2337 -1842 -1222 -467 463 1241 2032 2859 3511 4281 4931 5245
2442E245J75j30m00l40n12m35n37q78o44p08o04k58l82k32k83l77j90q1j01J16
$$ 5245 5420 5290 4890 4550 4038 3603 3066 2188 1544 836 232 -26 -408 -640 -923 -1300 -1490 -1571 -1672 -1556
2462a556r9q1R4J5L77M52N48O51M88N83P11O41P21N91J49R7j72l14k64n37o81
$$ -1556 -1655 -1736 -1642 -1627 -1250 -798 -250 401 889 1472 2183 2824 3545 4136 4285 4382 4210 3896 3632 3095 2414
2483B414p84j039q21p76o72l24n28m02m04l21J23P4l3J79j0J01J43J34M41M14
$$ 2414 1630 591 -230 -1006 -1678 -2002 -2530 -2932 -3336 -3657 -3534 -3460 -3493 -3314 -3324 -3223 -3080 -2946 -2505 -2091
2503b091L64M67L83N38P73O96O90M81K56K94K4K1j02m81m55q04p91p48n94o04
$$ -2091 -1727 -1260 -877 -339 434 1130 1820 2301 2557 2851 2875 2896 2794 2313 1858 1054 263 -485 -1079 -1683
2523a683m61o01l91k09m8J38K32J45K59J29J63M61K90M58L87J40M09L14N52O81
$$ -1683 -2144 -2745 -3136 -3345 -3393 -3255 -3023 -2878 -2619 -2490 -2327 -1866 -1576 -1118 -731 -591 -182 132 684 1365
2543A365M68N55L88J74K92K65M6N4l64n56n46p15m22o35p10n22o64l55k35j39
$$ 1365 1833 2388 2776 2950 3242 3507 3553 3607 3243 2687 2141 1426 1004 369 -341 -863 -1527 -1882 -2117 -2256
2563b256J61J01P9K14J56L86M51K24L03J76L8L31K56K83M17J83J97K38J60K69
$$ -2256 -2095 -1994 -1915 -1701 -1545 -1159 -708 -484 -181 -5 33 364 620 903 1320 1503 1700 1938 2098 2367
2583B367K55P9k2l60l10k92n11l50n76o18o28o17k71j75j65N0p1j5K69K39M30
$$ 2367 2622 2701 2679 2319 2009 1717 1206 856 280 -338 -966 -1583 -1854 -2029 -2194 -2144 -2215 -2230 -1961 -1722 -1292
2604a292L78K02K04J00N6K84K04J38J93l6N0J24J82L73Q7M7M3j63n3o9j52j68
$$ -1292 -914 -712 -508 -408 -352 -68 136 274 467 431 481 605 787 1160 1247 1294 1337 1174 1121 1052 900 732
2626G32m35n08m10l76j92j59k02j60j00J1K45J84L78K54O5K18R9J57K81Q7K0n1
$$ 732 297 -211 -621 -997 -1189 -1348 -1550 -1710 -1810 -1799 -1554 -1370 -992 -738 -673 -455 -356 -199 82 169 189 138
2648A38j04K3J86P2K60N4mJ73M8J62J62l2p6k46k44q3k38j42j46l60j95j46p6
$$ 138 34 57 243 315 575 629 625 798 846 1008 1170 1138 1062 816 572 489 251 109 -37 -397 -592 -738 -814
2671h14J81R5R6P5r3J52J79J03J98q5m5q5j05J25Q2O4J35p3J09K17J88L17K24
$$ -814 -633 -538 -442 -367 -460 -308 -129 -26 172 87 42 -43 -148 -23 59 123 258 185 294 511 699 1016 1240
2694A240l9J03n1p6J30j03r4k78m12k31j93j01nk19k20k7k10O3J12p6J2j43n3
$$ 1240 1201 1304 1253 1177 1307 1204 1110 832 420 189 -4 -105 -110 -329 -549 -576 -786 -723 -611 -687 -675 -818 -871
2717h71n2l9J71P4j4ON3J77L52K22K84K28J5J85J43J71J50j03j66k55l10k22j53
$$ -871 -923 -962 -791 -717 -731 -725 -672 -495 -143 79 363 591 606 791 934 1105 1255 1152 986 731 421 199 46
2740D6k25k91l60l51j26k13L0n4j71nj43oJ95J21J94J00o0K14K04L53M27K48K33
$$ 46 -179 -470 -830 -1181 -1307 -1520 -1490 -1544 -1715 -1720 -1863 -1869 -1674 -1553 -1359 -1259 -1319 -1105 -901 -548 -121 127 360
2763C60K42K34K97L24J51K40j24j58q0j97r0k06l65l52m36l42k00j42j07j37j90
$$ 360 602 836 1133 1457 1608 1848 1724 1566 1486 1289 1199 993 628 276 -160 -502 -702 -844 -951 -1088 -1278
2784a278o5m0J56K95J04J13K05J39L62L17L71L75J28K55K89J72M62J23J01m1j53
$$ -1278 -1343 -1383 -1227 -932 -828 -715 -510 -371 -9 308 679 1054 1182 1437 1726 1898 2360 2483 2584 2543 2390
2805B390j20o9k14j18m26n34l57m55l24k26l72j91l09k39n1L8J46J57OJ28K28
$$ 2390 2270 2201 1987 1869 1443 909 552 97 -227 -453 -825 -1016 -1325 -1564 -1615 -1577 -1431 -1274 -1268 -1140 -912
2826i12J89M80K52L17J74J15K44K51J10K49jm6r3k12j18j06k46k54m78m73k99
$$ -912 -723 -243 9 326 500 615 859 1110 1220 1469 1468 1422 1329 1117 999 893 647 393 -85 -558 -857
2847h57l81k09j82l93k57j64j74K18nJ58J32P1K66L26K83M87K52K68J71J86K85
$$ -857 -1238 -1447 -1629 -2022 -2279 -2443 -2617 -2399 -2404 -2246 -2114 -2043 -1777 -1451 -1168 -681 -429 -161 10 196 481
2868D81L58N7J88n1n9J8j34J6q9k80k98k58k78j18k29j10k30k18p3p5J21J27J01
$$ 481 839 896 1084 1033 974 992 858 874 785 505 207 -51 -329 -447 -676 -786 -1016 -1234 -1307 -1382 -1261 -1134 -1033
2891a033J67R9J78L57L17L17L25J02K04J97K08K81J84J3Pj81q6m1l1r0j87l08
$$ -1033 -866 -767 -589 -232 85 402 727 829 1033 1230 1438 1719 1903 1916 1923 1742 1656 1615 1584 1494 1307 999
2913I99j79k69n8j57j67j93j78j64j1J0O8J34p3J7Q3Q2L15J26J44J47q3J52J00
$$ 999 820 551 493 336 169 -24 -202 -366 -377 -367 -299 -165 -238 -221 -138 -56 259 385 529 676 593 745 845
2936H45R3J15Ok15o8k24Mp3k26n7k76l50o6j96l2J9k52j27q4p7J55P5J6P4p9N7
$$ 845 938 1053 1059 844 776 552 556 483 257 200 -76 -426 -492 -688 -720 -701 -953 -1080 -1164 -1241 -1086 -1011 -995 -921 -1000 -943
2962i43J49L2K93k1K3O7p6J12J30N0rj28j08l0o6Jk0p2j73q1j7M3N2jO0p8J14
$$ -943 -794 -762 -469 -490 -467 -400 -476 -364 -234 -184 -193 -321 -429 -459 -525 -524 -544 -616 -789 -870 -887 -844 -792 -793 -733 -811 -697
2989f97R8J05J96R4L5J40N7Q2K18Q6J08m6n9N0k0R0P1m0j03r3j49O6PM4o7j27
$$ -697 -599 -494 -298 -204 -169 -29 28 110 328 414 522 476 417 467 447 537 608 568 465 372 223 289 296 340 273 146
3015A46m0MP0J92O7mM2k3J48K12O4K04L2q3O9K6J33Lm5m0j33j95l6l7n7j39k34
$$ 146 106 110 180 372 439 435 477 454 602 814 878 1082 1114 1031 1100 1126 1259 1262 1217 1177 1044 849 813 776 719 580 346
3042C46k20j46j7q3k5j59p7j01p6R3M6J43p6O2O5Q8J45J43R9L0m3k6J12l0P9o2
$$ 346 126 -20 -37 -120 -145 -304 -381 -482 -558 -465 -419 -276 -352 -290 -225 -137 8 151 250 280 237 211 323 293 372 310
3068C10j80j31j74o2o2j64j29j79k53q8p2l5J2j02j53nJ2J23J58M2J37N1R6K07
$$ 310 130 -1 -175 -237 -299 -463 -592 -771 -1024 -1112 -1184 -1219 -1207 -1309 -1462 -1467 -1455 -1332 -1174 -1132 -995 -944 -848 -641
3092f41J67K56K05K1J13R7P8K08K9Mn8j18r5n0o4m4j66j78q2j21L1n6K7k9j10
$$ -641 -474 -218 -13 8 121 218 296 504 533 537 479 361 266 216 152 108 -58 -236 -318 -439 -408 -464 -437 -466 -576
3117e76k8Q5M4J60J58J3Q8N4K05K45J63J64J06J10J13J52J51J05m4qq7j58j0j62
$$ -576 -604 -519 -475 -315 -157 -144 -56 -2 203 448 611 775 881 991 1104 1256 1407 1512 1468 1460 1373 1215 1205 1043
3141A043m4k00k43j82k26k0r0n9j50r8j08M5L6j7J66m2L6n1Q3R9J87N4J13k0M3
$$ 1043 999 799 556 374 148 128 38 -21 -171 -269 -377 -332 -296 -313 -147 -189 -153 -204 -121 -22 165 219 332 312 355
3166C55K15R0R7J13o5j11p4k9l0j18j61k16k34j95j26j44q8j66j65o4n2m2J15
$$ 355 570 660 757 870 805 694 620 591 561 443 282 66 -168 -363 -489 -633 -721 -887 -1052 -1116 -1168 -1210 -1095
3189a095L6jL4p6J57KJ78J60mJ24L2K33J32J60J36J03m3R0M5O2J4j67o9j70j69
$$ -1095 -1059 -1060 -1026 -1102 -945 -943 -765 -605 -609 -485 -453 -220 -88 72 208 311 268 358 403 465 479 312 243 73 -96
3214i6q8p6q8j43k09j62L8J4QN1L7o0J35O9J40J40J10J01K5Q1K07J70J71J45P0
$$ -96 -184 -260 -348 -491 -700 -862 -824 -810 -802 -751 -714 -774 -639 -570 -430 -290 -180 -79 -54 27 234 404 575 720 790
3239G90N4R0J43J83N8n6m8j32r3j24o5j65j81j87j91j70Kp0p5m6l2qJ8O8K12k0
$$ 790 844 934 1077 1260 1318 1262 1214 1082 989 865 800 635 454 267 76 -94 -92 -162 -237 -283 -315 -323 -305 -237 -25 -45
3265d5K4Q6M6Q4J33R6J39L5MQ8M1J35J27J4q2q7o2j03j06j61j47k63k44k02k00
$$ -45 -21 65 111 195 328 424 563 598 602 690 731 866 993 1007 925 838 776 673 567 406 259 -4 -248 -450 -650
3290f50m7j51j26j00j35m6J65K8J08M4K7N9J16R7J63L6J37PR7J43R3R6O2N2%o3
$$ -650 -697 -848 -974 -1074 -1209 -1255 -1090 -1062 -954 -910 -883 -824 -708 -611 -448 -412 -275 -268 -171 -28 65 161 223 275 275 212
3316B12l5M2p3r0j70j94j73j26m5j81j23j35q3L6J6J24J21P4M8J43J63J79J81
$$ 212 177 219 146 56 -114 -308 -481 -607 -652 -833 -956 -1091 -1174 -1138 -1122 -998 -877 -803 -755 -612 -449 -270 -89
3339h9J99P0O8J42J05J29J14J12O7j6J12KL2K4j05p4j12j89j05j04q7j15k29j09
$$ -89 110 180 248 390 495 624 738 850 917 901 1013 1015 1047 1071 966 892 780 591 486 382 295 180 -49 -158
$$ [...]
8191C6
##END NTUPLES=NMR FID
##END=
