##TITLE=1H_X2401
 aceton-d6
 8 sc, 
 25.1.2023
##JCAMPDX= 6.0         $$ Bruker NMR JCAMP-DX V2.0
##DATA TYPE= NMR FID
##DATA CLASS= NTUPLES
##ORIGIN= UXNMR, Bruker Analytische Messtechnik GmbH
##OWNER= root
$$ XWIN-NMR		Version 3.5
$$ Wed Jan 25 16:21:09 2023 Russian Standard Time (UT+4h)  she@DPX200
##.OBSERVE FREQUENCY= 200.13135
##.OBSERVE NUCLEUS= ^1H
##.DELAY= (6, 6)
##.ACQUISITION MODE= SIMULTANEOUS
##.ACQUISITION SCHEME= undefined
##.AVERAGES= 8
##.DIGITISER RES= 18
##SPECTROMETER/DATA SYSTEM= spect
##.PULSE SEQUENCE= zg30
##.SOLVENT NAME= Acetone
##.SHIFT REFERENCE= (INTERNAL, Acetone, 0, 15.7039)
##AUDIT TRAIL= $$ (NUMBER, WHEN, WHO, WHERE, WHAT)
$$ ##TITLE= Audit trail, XWIN-NMR		Version 3.5
$$ ##JCAMPDX= 5.01
$$ ##ORIGIN= Bruker BioSpin GmbH
$$ ##OWNER= she
$$ F:/spectra/data/she/nmr/H-F/1/audita.txt
$$ ##AUDIT TRAIL=  $$ (NUMBER, WHEN, WHO, WHERE, WHAT)
(   1,<2023-01-25 16:19:53.59 +0400>,<she>,<DPX200>,
      <created by zg, POWCHK disabled, PULCHK disabled
       configuration hash MD5:
       00 E9 B6 7A A2 85 ED C7 34 08 36 98 17 FE 4E 26
       data hash MD5: 16K
       32 D3 64 59 3E F2 6B E1 44 F6 97 37 2E BD 07 BA>)
$$ ##END=
$$ 
$$ hash MD5
$$ 86 70 7C D8 80 3C 0E 08 12 46 3F B7 86 4D D8 65
##$RELAX= 
##$RELAX= 
##$RELAX= 
##$RELAX= 
##$RELAX= 
##$RELAX= 
$$ Bruker specific parameters
$$ --------------------------
##$DU= <F:/spectra>
##$EXPNO= 1
##$NAME= <H-F>
##$PROCNO= 1
##$TYPE= <nmr>
##$USER= <she>
##$AMP= (0..31)
100 100 100 100 100 100 100 100 100 100 100 100 100 100 100 100 100 100 
100 100 100 100 100 100 100 100 100 100 100 100 100 100 
##$AQSEQ= 0
##$AQ_mod= 1
##$AUNM= <au_zg>
##$AUTOPOS= <>
##$BF1= 200.13
##$BF2= 200.13
##$BF3= 200.13
##$BF4= 200.13
##$BF5= 200.13
##$BF6= 200.13
##$BF7= 200.13
##$BF8= 200.13
##$BYTORDA= 1
##$CFDGTYP= 0
##$CFRGTYP= 5
##$CHEMSTR= <none>
##$CNST= (0..31)
1 1 145 1 1 1 1 1 1 1 1 1 1 1 1 1 1 1 1 1 1 1 1 1 1 1 1 1 1 1 1 1 
##$CPDPRG= <>
##$CPDPRG1= <>
##$CPDPRG2= <>
##$CPDPRG3= <>
##$CPDPRG4= <mlev>
##$CPDPRG5= <mlev>
##$CPDPRG6= <mlev>
##$CPDPRG7= <mlev>
##$CPDPRG8= <mlev>
##$CPDPRGB= <>
##$CPDPRGT= <>
##$D= (0..31)
0 1.2 0 0 0 0 0 0 0 0.06 0 0.03 0 0 0 0 0.0002 0 0 0 0 0 0 0 0 0 0 0 0 
0 0 0 
##$DATE= 1674649193
##$DBL= (0..7)
120 120 120 120 120 120 120 120 
##$DBP= (0..7)
150 150 150 150 150 150 150 150 
##$DBP07= 0
##$DBPNAM0= <>
##$DBPNAM1= <>
##$DBPNAM2= <>
##$DBPNAM3= <>
##$DBPNAM4= <>
##$DBPNAM5= <>
##$DBPNAM6= <>
##$DBPNAM7= <>
##$DBPOAL= (0..7)
0.5 0.5 0.5 0.5 0.5 0.5 0.5 0.5 
##$DBPOFFS= (0..7)
0 0 0 0 0 0 0 0 
##$DE= 6
##$DECBNUC= <off>
##$DECIM= 32
##$DECNUC= <off>
##$DECSTAT= 4
##$DIGMOD= 1
##$DIGTYP= 9
##$DL= (0..7)
0 120 120 120 120 120 120 120 
##$DP= (0..7)
150 150 150 150 150 150 150 150 
##$DP07= 0
##$DPNAME0= <>
##$DPNAME1= <>
##$DPNAME2= <>
##$DPNAME3= <>
##$DPNAME4= <>
##$DPNAME5= <>
##$DPNAME6= <>
##$DPNAME7= <>
##$DPOAL= (0..7)
0.5 0.5 0.5 0.5 0.5 0.5 0.5 0.5 
##$DPOFFS= (0..7)
0 0 0 0 0 0 0 0 
##$DQDMODE= 0
##$DR= 18
##$DS= 0
##$DSLIST= <SSSSSSSSSSSSSSS>
$$ [...]
##$SUBNAM2= <"">
##$SUBNAM3= <"">
##$SUBNAM4= <"">
##$SUBNAM5= <"">
##$SUBNAM6= <"">
##$SUBNAM7= <"">
##$SUBNAM8= <"">
##$SUBNAM9= <"">
##$SW= 18.05172834244
##$SWIBOX= (0..15)
0 0 2 0 0 0 0 0 0 0 0 0 0 0 0 0 
##$SW_h= 3612.71676300578
##$TD= 16384
##$TD0= 1
##$TE= 0
##$TE2= 300
##$TE3= 300
##$TEG= 300
##$TL= (0..7)
0 120 120 120 120 120 120 120 
##$TP= (0..7)
150 150 150 150 150 150 150 150 
##$TP07= 0
##$TPNAME0= <>
##$TPNAME1= <>
##$TPNAME2= <>
##$TPNAME3= <>
##$TPNAME4= <>
##$TPNAME5= <>
##$TPNAME6= <>
##$TPNAME7= <>
##$TPOAL= (0..7)
0.5 0.5 0.5 0.5 0.5 0.5 0.5 0.5 
##$TPOFFS= (0..7)
0 0 0 0 0 0 0 0 
##$TUNHIN= 0
##$TUNHOUT= 0
##$TUNXOUT= 0
##$USERA1= <user>
##$USERA2= <user>
##$USERA3= <user>
##$USERA4= <user>
##$USERA5= <user>
##$V9= 5
##$VALIST= <valist>
##$VCLIST= <CCCCCCCCCCCCCCC>
##$VD= 0
##$VDLIST= <DDDDDDDDDDDDDDD>
##$VPLIST= <PPPPPPPPPPPPPPP>
##$VTLIST= <TTTTTTTTTTTTTTT>
##$WBST= 1024
##$WBSW= 4
##$XGAIN= (0..3)
0 0 0 0 
##$XL= 0
##$YL= 0
##$YMAX_a= 247534
##$YMIN_a= -227022
##$ZGOPTNS= <>
##$ZL1= 120
##$ZL2= 120
##$ZL3= 120
##$ZL4= 120
##$ABSF1= 10
##$ABSF2= 0
##$ABSG= 5
##$ABSL= 3
##$ALPHA= 0
##$AQORDER= 0
##$ASSFAC= 0
##$ASSFACI= 0
##$ASSFACX= 0
##$ASSWID= 0
##$AUNMP= <proc_1d>
##$AZFE= 0.1
##$AZFW= 0.1
##$BCFW= 1
##$BC_mod= 2
##$BYTORDP= 1
##$COROFFS= 0
##$CY= 11.3945322036743
##$DATMOD= 1
##$DC= 2
##$DFILT= <>
##$DTYPP= 0
##$F1P= 2.36226072786647
##$F2P= -0.459571619588291
##$FCOR= 0.5
##$FTSIZE= 0
##$FT_mod= 4
##$GAMMA= 1
##$GB= 0.15
##$INTBC= 1
##$INTSCL= 1
##$ISEN= 128
##$LB= 0.24
##$LEV0= 0
##$LPBIN= 0
##$MAXI= 10000
##$MC2= 0
##$MEAN= 0
##$ME_mod= 0
##$MI= 1.114404
##$NCOEF= 0
##$NC_proc= 0
##$NLEV= 6
##$NOISF1= 3.799351
##$NOISF2= 2.8
##$NSP= 1
##$NTH_PI= 0
##$NZP= 0
##$OFFSET= 15.70392
##$PC= 1
##$PHC0= -19190.63
##$PHC1= 10.20079
##$PH_mod= 1
##$PKNL= yes
##$PPARMOD= 0
##$PSCAL= 0
##$PSIGN= 0
##$REVERSE= no
##$SF= 200.130013532006
##$SI= 16384
##$SIGF1= 3
##$SIGF2= 2
##$SINO= 400
##$SIOLD= 16384
##$SREGLST= <1H.CDCl3>
##$SSB= 0
##$STSI= 0
##$STSR= 0
##$SW_p= 3612.71676300578
##$SYMM= 0
##$S_DEV= 0
##$TDeff= 0
##$TDoff= 0
##$TI= <>
##$TILT= no
##$TM1= 0
##$TM2= 0
##$TOPLEV= 0
##$USERP1= <user>
##$USERP2= <user>
##$USERP3= <user>
##$USERP4= <user>
##$USERP5= <user>
##$WDW= 1
##$XDIM= 8192
##$YMAX_p= 0
##$YMIN_p= 0
$$ End of Bruker specific parameters
$$ ---------------------------------
##NTUPLES= NMR FID
##VAR_NAME=  TIME,          FID/REAL,        FID/IMAG
##SYMBOL=    X,             R,               I
##VAR_TYPE=  INDEPENDENT,   DEPENDENT,       DEPENDENT
##VAR_FORM=  AFFN,          ASDF,            ASDF
##VAR_DIM=   8192,          8192,            8192
##UNITS=     SECONDS,       ARBITRARY UNITS, ARBITRARY UNITS
##FACTOR=    0.0002768,     1,               1
##FIRST=     0,             0,               0
##LAST=      2.2672688,     0,               0
##MIN=       0,             -227022,         0
##MAX=       2.2672688,     247534,          0
$$ Real data points
##PAGE= N=1
##DATA TABLE= (X++(R..R)), XYDATA
0 0 0 0 0 0 0 0 0 0 0 0 8 -8 8 -8 8 -16 16 -16 24 -24 32 -32 40 -48 55 -62 72 -80 92 -101 116 -129 142
33 142 -160 180 -197 220 -242 267 -297 326 -359 392 -430 472 -517 567 -619 679 -744 817 -899
52 -899 992 -1096 1216 -1355 1514 -1707 1936 -2219 2572 -3021 3614 -4421 5569 -7300 10143
67 10143 -15466 28311 -106404 -144640 164460 -73161 55986 -138561 186132 -123169 -33321
78 -33321 157541 -141580 57721 -67522 169372 -180417 58697 78964 -128004 105155
88 105155 -68088 84056 -157610 160266 -27269 -120346 126368 -59611 56452 -122626
98 -122626 161946 -108211 -16264 120857 -102528 32189 -51722 151049 -162010 46177
108 46177 63802 -89502 60091 -45855 77379 -141272 133500 -17460 -88626 80065
118 80065 -26745 47698 -110988 135913 -84011 -9866 79909 -63955 14309 -45843 128797
129 128797 -134030 35065 43158 -48771 26477 -29813 69803 -115027 102512 -11852 -53276
140 -53276 35828 -4880 40533 -92900 96715 -58723 2261 38126 -34351 6379 -34609
151 -34609 96539 -97979 29503 21109 -18225 9663 -17509 50290 -85721 80420 -15273
162 -15273 -32003 10598 10347 25575 -74681 72339 -41324 6717 13994 -9666 -627 -27138
174 -27138 75226 -68456 20631 5066 4011 -651 -16925 36735 -59077 57768 -20280 -12197
186 -12197 -3111 12247 19604 -52656 47908 -29068 15879 278 -1542 -2895 -15280 50751 -46998
199 -46998 13491 -3020 11373 -5235 -13867 22805 -35891 38784 -17510 -2769 -6592 12623
211 12623 14398 -34103 28379 -17893 16760 -5821 -234 -4511 -7055 30539 -30151 6244 -5177
224 -5177 13389 -4538 -10811 12379 -16886 25386 -12770 -364 -5173 10195 10177 -21784 12745
237 12745 -10069 14612 -7647 -3046 -3202 -695 16127 -17184 2417 -3209 11841 -1718 -7071
250 -7071 3708 -3719 14570 -8089 -3407 -2372 7208 4980 -12944 1872 -2704 9946 -4414
263 -4414 -5271 -1548 4356 8468 -8187 -1946 346 9291 -463 -6033 -2410 3619 6370 -5043 -6249
278 -6249 -22 5520 2224 -6485 -3514 3103 6728 -720 -6631 173 6324 3981 -4528 -4808 2134
293 2134 5779 -267 -6042 -4717 6141 3180 -2794 -7004 1699 6319 1451 -3633 -5104 6113 4382
308 4382 527 -7780 148 5823 1900 -3917 -6497 3115 4180 336 -6024 -3400 6507 3380 -1939
323 -1939 -5729 2041 6480 908 -3515 -4966 5115 3588 -753 -7597 -398 5263 1742 -4062 -5436
338 -5436 3459 4820 807 -5615 -1567 5465 4743 -3594 -4380 563 6276 50 -4991 -3592 2508 5428
354 5428 -3202 -5102 -953 5923 2563 -4603 -2410 1835 6428 -581 -4601 -1679 3711 5810 -6862
369 -6862 -2132 -1550 6770 -1019 -4981 -1119 -437 9661 -6000 -1828 -2253 7926 2206 -6836 1560
384 1560 -2237 8328 -3721 -2416 -4156 3145 7971 -10750 1348 -3188 9284 -3250 -2938 1457
398 1457 -4172 14147 -9550 1329 -5349 10045 449 -9906 6661 -8058 11330 -7115 1954
411 1954 -7684 4313 11828 -15598 6001 -4659 12766 -8199 506 3032 -9619 18109 -12667
424 -12667 3134 -9767 13828 -1085 -13436 12552 -12136 14311 -9781 7310 -11117 5145
436 5145 15735 -20827 9707 -6422 14927 -14405 4685 3625 -15544 21729 -13538 4050
448 4050 -13818 19900 -2379 -17153 18852 -13763 14963 -12776 13427 -15327 3984 19562
460 19562 -25577 11457 -8683 18558 -20929 9051 4371 -19495 25536 -13685 5137 -17460
472 -17460 27317 -5968 -20013 24139 -14720 11800 -14509 19880 -21577 2563 23780 -27640
484 -27640 9517 -7702 23216 -27179 12385 6773 -20675 24580 -11810 6270 -21589 31862
496 31862 -9018 -21084 24629 -13148 8105 -15022 24770 -26445 3114 26866 -27205 5567
508 5567 -4030 27353 -34375 15385 9886 -22624 20208 -7718 7704 -29060 36785 -10012 -22106
521 -22106 22688 -8628 6009 -17533 30927 -29835 4232 26968 -24492 1281 -1721 30082
533 30082 -40628 17737 11021 -23256 15030 -2706 8422 -35162 41351 -8839 -22991 19006
545 19006 -1071 4029 -21827 36012 -29738 2554 23521 -17711 -3918 -2661 32573 -42319
557 -42319 16996 10703 -19623 9585 974 9970 -38052 43421 -7974 -22581 15309 4529 1962
570 1962 -26094 40458 -30738 936 20452 -11324 -8637 -4187 37222 -43892 15959 10312 -13365
583 -13365 3694 2259 13290 -39428 41649 -7489 -19533 9756 6973 2548 -28604 40187 -28606
596 -28606 794 16350 -5720 -9803 -5808 38696 -41204 13081 9402 -7468 -1813 2140 15175
609 15175 -38237 35758 -4763 -16592 3647 9369 4566 -29217 36150 -22450 609 11938
621 11938 -1687 -8798 -7581 36861 -36710 10036 7080 -3289 -4768 1061 15610 -35101 30715
634 30715 -3224 -12539 -481 10753 6178 -27803 30955 -16623 413 6917 1362 -7333 -9856
647 -9856 32555 -29256 5766 3773 1761 -5080 -1784 14796 -27243 23953 -2725 -7787 -2843
660 -2843 9806 6244 -23119 22711 -11495 429 3363 2203 -6409 -8523 26103 -21306 2346
673 2346 2719 4600 -4844 -2682 12807 -19877 17077 -2223 -4005 -5060 7762 6104 -17918 14431
687 14431 -7833 2709 154 1916 -4610 -5366 19030 -14598 1013 1049 5864 -3839 -3403 9035
701 9035 -13199 11583 -2455 -1862 -5576 5881 5746 -12909 7995 -4265 4343 -1797 1539 -2631
715 -2631 -2748 11805 -8450 -109 -644 5115 -2000 -3329 4082 -6973 7803 -2032 -1809 -3759 4679
730 4679 4632 -8399 3705 -1863 4601 -2053 147 -1937 -674 6689 -4944 -1176 -1398 4587 -802
745 -802 -2968 820 -1909 5114 -1741 -1511 -1654 3143 3192 -4684 714 -1031 3919 -1146 -1683 -1599 780
762 780 3806 -2980 -1711 -783 3832 335 -2319 -1169 1193 3381 -1068 -2503 -213 2232 1898 -2824
778 -2824 -1642 324 2647 131 -3317 -570 1793 2295 -1648 -1982 502 2534 1055 -2045 -1966 2055
794 2055 2005 -494 -3285 268 1687 1271 -1710 -2636 1534 1748 1366 -3876 110 2105 1898 -1025 -2797
811 -2797 1321 1609 1288 -2669 -1985 2050 1567 -404 -3427 606 1894 1141 -1350 -2461 2171 1274 1525
828 1525 -3688 161 1796 1436 -878 -3222 1528 1016 1347 -2847 -1358 1704 1885 -379 -2805 470
844 470 2219 1320 -1700 -2019 1680 1696 466 -3212 -356 1828 1302 -1261 -2815 1289 1639 927 -2523
861 -2523 -791 1501 2389 -1167 -1817 -209 2425 872 -2205 -1171 258 2760 -1062 -1858 -1157 2338
877 2338 1405 -1813 -1269 191 2906 -220 -1404 -1332 1252 3104 -2580 -878 -1235 3305 -150 -2185
893 -2185 -175 -1147 4466 -2496 -283 -2205 3481 1323 -2950 727 -1598 4230 -2167 463 -2791
908 -2791 1109 3976 -4184 513 -2435 4984 -2073 -938 716 -2662 6031 -3660 1421 -4303 5195
923 5195 845 -4387 2629 -3478 5769 -4621 3221 -4785 1507 5303 -5806 2143 -3830 7695
937 7695 -5106 1069 1008 -4060 7008 -4571 2919 -7137 7677 -184 -5621 4278 -4347 6694
951 6694 -6940 6695 -6838 1694 6545 -6806 3050 -5387 10765 -8883 3162 756 -4851
964 -4851 7259 -5221 4586 -10344 11172 -1942 -5842 5285 -4257 7129 -9111 10664 -9957
977 -9957 2558 7231 -7506 2975 -6571 14151 -13705 5999 350 -5056 6703 -5086 6910
990 6910 -14278 15148 -3950 -5112 4762 -3273 7137 -11484 14038 -12750 3563 6737 -7063
1003 -7063 2169 -6995 16787 -17256 8246 301 -4754 5539 -4033 8453 -17853 18463 -5245
1016 -5245 -4976 3306 -1068 6314 -13895 17308 -14611 4108 5599 -4790 632 -7162 18981 -19706
1030 -19706 10065 -541 -3632 3821 -3018 9203 -20731 21494 -7279 -4275 1756 1475 5083
1043 5083 -15836 20852 -16532 4850 4028 -1282 -2075 -7319 21187 -21196 9975 -1405 -845 612
1057 612 -2299 10212 -21527 21450 -7708 -2517 -290 3328 4388 -16004 21776 -17067 5253
1070 5253 2746 1272 -4984 -6197 21811 -22047 9271 -1097 1469 -3306 -145 10662 -21719
1083 -21719 20228 -6593 -1015 -3396 5561 4138 -16067 20640 -16178 6204 31 3502 -6340
1096 -6340 -5194 20713 -21350 9417 -2099 3859 -6192 2101 9926 -20819 18403 -5200 102
1109 102 -6648 7992 3671 -15898 17994 -12779 5562 -2639 5908 -6418 -5101 18406 -17730
1122 -17730 7815 -3137 5785 -7179 2798 7826 -17699 15705 -4287 344 -7834 9518 1964
1135 1964 -13869 15118 -9465 4070 -3588 7796 -6977 -4592 15921 -13609 5320 -4054 7898
1148 7898 -7880 2369 6052 -13413 12199 -4340 2257 -8655 9531 706 -10225 11080 -7029
1161 -7029 3992 -4278 8053 -7354 -2883 12419 -9943 2896 -3856 8560 -7922 2011 4577
1174 4577 -9364 8425 -3289 3262 -8586 8359 447 -6822 6627 -4653 3882 -4272 6598
1187 6598 -6581 -962 8331 -6518 1355 -3045 7431 -6492 1848 2763 -5976 5702 -2271 2998
1201 2998 -7666 6908 398 -4526 3125 -2738 3931 -4433 5172 -5184 417 4673 -3424 615
1215 615 -2889 6120 -4474 1471 610 -2970 3797 -1682 1938 -5627 5066 308 -2741 1093 -1473
1230 -1473 3351 -3271 3333 -3693 1057 2564 -1529 -237 -2176 4454 -2495 577 -726 -771 2293
1245 2293 -1071 536 -3080 3044 537 -1483 -102 -700 2510 -1587 1175 -2323 1122 1480 -774
1260 -774 -724 -1382 2882 -974 -25 -1330 448 1459 -368 -613 -1202 1644 816 -837 -901 -23 1584 -55
1278 -55 -831 -1046 955 1135 -632 -1019 -374 1480 275 -609 -1229 731 1144 119 -1501 9 700 1022
1296 1022 -678 -1234 446 638 1119 -2042 -99 496 1213 -473 -1313 369 591 1175 -1264 -790 563
1313 563 1174 181 -1889 479 374 1153 -856 -1244 763 283 1442 -2385 353 317 1241 -366 -1528
1330 -1528 807 106 1474 -1669 -347 185 1206 92 -1794 438 280 1305 -1027 -1032 682 458 1206
1347 1206 -2127 255 399 1137 -333 -1664 827 209 1334 -1826 -196 232 1254 -147 -1473 316
1363 316 467 1254 -1134 -743 474 847 518 -1502 -181 659 784 -248 -1488 509 605 795 -1232 -576
1381 -576 530 1126 -171 -1224 -21 886 768 -934 -764 216 1175 -43 -904 -928 1438 394 -296 -1211
1399 -1211 267 1230 -163 -168 -1410 1132 831 -229 -1084 -390 1616 -317 -192 -937 124 1185 -179
1416 -179 -246 -1907 2370 -77 -318 -978 80 1661 -1316 1339 -2613 1648 601 -122 -1095 -975 2942
1433 2942 -1849 904 -1439 534 939 -224 356 -3040 3752 -907 -298 -924 292 1758 -2502 3071
1449 3071 -3863 2041 524 144 -1204 -1607 4571 -3631 1934 -1766 966 253 -125 1233 -4464 4842
1465 4842 -1484 -111 -1226 666 1839 -3374 4331 -4762 2267 706 203 -1491 -1906 6097 -5404
1480 -5404 2643 -1602 1156 -548 162 2165 -6043 5958 -1825 153 -1909 1490 1760 -4208 5365
1495 5365 -5233 2440 403 721 -1878 -2069 6924 -6541 3215 -1554 1202 -1228 719 2699 -7404
1510 -7404 6922 -1733 -26 -2799 2877 1528 -5194 6076 -4905 1980 -50 1749 -2509 -2207
1524 -2207 7281 -6529 2886 -1320 1428 -1681 1085 2753 -7766 7317 -1673 -321 -3046 3980
1538 3980 568 -5467 6888 -4992 1406 -288 3190 -3978 -1867 7634 -6366 2132 -1215 2569
1552 2569 -2969 1528 2721 -7449 6822 -1675 196 -3888 4777 -39 -5169 6794 -4941 1555
1566 1555 -871 4398 -5274 -1155 7645 -6190 1441 -891 3554 -4589 2279 2848 -7194 5714
1580 5714 -861 603 -4868 5268 112 -5034 6083 -4329 1775 -1542 4876 -5640 -682 7181
1594 7181 -6065 1427 -1054 4126 -5562 3103 2490 -6922 5140 -323 959 -5978 6138 149
1608 149 -5162 5326 -3277 1850 -2845 5786 -5386 -1051 6558 -5064 1393 -2097 5125 -5750
1622 -5750 2956 2146 -6043 4615 -466 1354 -6274 6289 40 -4979 4754 -2529 1458 -2993 5854
1637 5854 -4932 -1583 6420 -4242 801 -2281 5482 -5331 2013 2350 -5209 3846 -626 1811
1651 1811 -5983 5482 265 -4196 3714 -2019 1522 -2855 5164 -4232 -1511 5636 -3386 313 -2141
1666 -2141 5281 -4659 1235 2348 -4265 2958 -611 2099 -5588 4452 740 -3401 2330 -1357 1696
1681 1696 -2696 4064 -3178 -1262 4343 -2386 28 -1770 4122 -3209 535 1944 -3401 2370 -355
1696 -355 1529 -4393 3247 1178 -2873 1414 -764 1520 -2196 2889 -2174 -993 3054 -1255 -316
1711 -316 -1523 3117 -1765 -117 1141 -2015 1681 -260 910 -2988 2103 1119 -1940 629 -544
1726 -544 1320 -1475 1815 -1661 -460 1962 -501 -569 -1157 2297 -850 -295 386 -882 1073 -12
1742 -12 229 -1687 1116 1057 -1188 22 -417 1132 -634 633 -1042 -103 1354 -302 -543 -787 1492
1759 1492 -183 -367 -166 -333 772 177 -364 -794 462 1006 -696 -378 -227 848 58 -255 -543 16
1777 16 1051 -324 -452 -486 870 279 -370 -465 -73 794 204 -747 -215 241 871 -462 -516 -44 491 616
1797 616 -846 -202 -43 1029 -393 -444 -248 380 711 -622 -343 -176 910 132 -874 34 74 864 -451
1816 -451 -504 37 296 880 -1141 38 -88 1017 -363 -547 25 125 965 -899 -69 -303 973 76
1834 76 -857 88 19 892 -514 -447 21 307 804 -1095 34 -91 903 -231 -689 117 52 987 -1001 17
1854 17 -328 955 2 -771 50 43 922 -589 -384 -31 513 464 -825 -129 118 698 -116 -699 57 254
1874 254 754 -783 -170 -115 842 -35 -637 -103 174 774 -525 -357 -165 738 124 -424 -512 435 516 -118
1894 -118 -578 -158 612 222 -283 -585 204 667 -54 -524 -315 603 317 -277 -388 -177 807 -64 -64 -996 866
1915 866 325 -191 -430 -296 970 -438 469 -1096 447 529 49 -466 -689 1267 -362 143 -582 4
1933 4 625 -112 251 -1531 1388 72 -183 -495 -172 1148 -1098 1276 -1615 687 347 310 -604 -1052
1951 -1052 2132 -1270 657 -920 557 10 62 737 -2213 1923 -284 236 -1084 319 1146 -1681
1967 -1681 1989 -2119 986 -52 821 -912 -1365 3056 -2216 1159 -1294 1252 -802 256 1335
1982 1335 -3139 2567 -655 762 -2004 1112 1152 -2349 2617 -2418 1349 -737 1534 -1163 -1691 3736
1998 3736 -2887 1690 -1792 1929 -1505 511 1810 -3997 3313 -1175 1456 -3066 2053 985 -2953
2013 -2953 3232 -2681 1758 -1733 2707 -1716 -1953 4291 -3199 1840 -2384 2960 -2226 467 2268
2028 2268 -4426 3706 -1722 2222 -3847 2664 912 -3357 3779 -3026 2106 -2394 3595 -2274 -2037
2043 -2037 4710 -3388 1804 -2589 3649 -2813 455 2647 -4601 3640 -1873 2751 -4467 2896 1013
2058 1013 -3471 3744 -3170 2596 -3043 4095 -2693 -1721 4526 -3325 1740 -2751 4172 -3530 846
2073 846 2550 -4342 3114 -1542 3043 -5049 3238 1062 -3352 3218 -2673 2732 -3609 4453 -2728
2088 -2728 -1481 3938 -2770 1632 -2917 4338 -3664 1211 1910 -3724 2677 -1200 2714 -4992 3496
2103 3496 701 -3030 2668 -1968 2304 -3666 4592 -2740 -1342 3325 -1949 1176 -3021 4573 -3696
2118 -3696 1359 1167 -2565 1828 -983 2722 -4878 3562 74 -1981 1665 -1247 1859 -3364 4541
2133 4541 -3004 -765 2583 -1106 469 -2750 4636 -3804 1498 585 -1517 953 -695 2686 -4708
2148 -4708 3449 -392 -948 622 -700 1551 -2910 4021 -2969 -125 1759 -562 115 -2230 4113
2163 4113 -3521 1586 213 -961 429 -331 2481 -4491 3281 -490 -274 -305 -88 1456 -2702 3506
2179 3506 -2670 390 735 152 -176 -1899 3403 -2886 1551 -376 -372 150 -127 1946 -3852 2966 -689
2196 -689 110 -674 197 1112 -2292 2997 -2400 597 186 624 -402 -1552 2718 -2042 1186 -629 52
2213 52 81 -79 1377 -2833 2216 -517 233 -653 96 958 -1667 2230 -1949 596 66 663 -500 -1163
2231 -1163 2021 -1349 795 -676 265 -75 86 805 -1866 1363 -222 290 -627 -32 767 -951 1330
2248 1330 -1424 542 94 441 -418 -761 1302 -737 533 -616 253 -30 276 231 -1066 729 110
2265 110 137 -526 -64 541 -326 484 -779 223 278 146 -232 -530 715 -171 224 -497 74 162 279 -183
2285 -183 -491 314 287 -2 -381 -56 281 192 -93 -334 -34 517 -59 -181 -315 332 241 -95 -272 -136 370
2306 370 194 -348 -192 91 384 -97 -269 -88 148 434 -403 -76 -202 634 -188 -158 -172 82 483 -373 -15
2327 -15 -347 562 65 -319 -107 0 486 -210 -146 -158 191 431 -461 -7 -222 646 -195 -176 -91 -6 596 -482
2349 -482 118 -443 646 -36 -258 -111 -63 543 -316 -55 -279 318 282 -350 -74 -135 537 -139 -210 -119 27
2370 27 539 -467 55 -337 590 -41 -230 -83 -47 548 -304 -21 -305 439 143 -214 -199 12 396 -66 -201
2391 -201 -144 162 354 -253 -166 -109 412 49 -276 -102 41 400 -185 -142 -220 378 99 -136 -352 207 241 7
2413 7 -256 -128 266 82 86 -458 140 180 256 -375 -173 283 111 39 -350 42 141 195 -40 -540 397 100 120
2436 120 -418 -4 325 -213 421 -707 316 -20 447 -491 -313 664 -277 252 -537 396 -240 323 106
2455 106 -782 557 1 315 -738 268 336 -429 628 -785 415 -236 739 -626 -438 990 -557
2472 -557 385 -696 774 -677 500 282 -1050 658 -19 539 -1251 719 277 -667 679 -666 393
2489 393 -542 1072 -738 -610 1189 -618 346 -835 1075 -971 528 453 -1225 730 -52 745 -1667
2506 -1667 1111 207 -806 738 -488 329 -829 1530 -932 -723 1280 -410 97 -911 1507 -1246
2522 -1246 458 594 -1135 520 -86 1056 -2099 1385 116 -757 561 -288 361 -1171 1992 -1258
2538 -1258 -610 1185 -124 -237 -900 1866 -1593 472 682 -957 177 25 1342 -2403 1469 207
2554 207 -689 315 -162 576 -1499 2174 -1347 -453 951 52 -311 -954 2040 -1786 593 583 -762
2571 -762 -107 173 1430 -2672 1575 278 -666 -11 124 707 -1887 2394 -1292 -381 573 442 -334 -1215
2589 -1215 2234 -1826 721 224 -332 -290 198 1430 -2627 1634 138 -492 -136 242 682 -1937 2421
2606 2421 -1264 -382 491 552 -310 -1402 2391 -1736 603 71 -26 -367 -4 1528 -2437 1419 37
2623 37 -228 -280 136 718 -1758 2172 -1163 -326 442 532 -297 -1355 2327 -1660 535 40 132 -497 -14
2642 -14 1549 -2301 1249 33 55 -547 202 746 -1526 1736 -977 -123 240 439 -168 -1167 1878 -1365
2660 -1365 527 -36 0 -326 -25 1323 -2058 1125 60 43 -551 199 702 -1340 1405 -726 -134 121
2678 121 452 -75 -1046 1475 -892 349 -85 9 -103 -84 1028 -1607 920 22 57 -439 153 519 -1017
2697 -1017 1136 -627 -106 51 500 -205 -794 1062 -535 167 -124 70 -86 -66 700 -1118 600 38
2715 38 84 -312 -7 438 -656 821 -569 -9 119 374 -219 -528 797 -340 91 -67 56 -70 16
2734 16 479 -771 323 165 44 -218 -103 405 -423 503 -427 -6 112 200 -154 -377 497 -179 106 -120
2754 -120 2 -30 145 166 -483 184 217 -38 -142 -98 273 -195 256 -266 -66 211 84 -46 -312 338 -52
2775 -52 84 -125 -59 81 115 46 -304 107 215 -68 -55 -139 189 -28 82 -138 -155 326 -67 24 -283 240 37
2798 37 1 -52 -168 229 41 -2 -214 65 214 -91 16 -165 150 95 -29 -61 -191 388 -157 59 -216 141
2820 141 132 -83 44 -283 322 -35 5 -186 19 218 -122 41 -211 165 119 -91 -35 -189 383 -167 64 -174
2842 -174 71 194 -183 124 -333 395 -104 25 -151 5 254 -159 91 -241 221 70 -59 -50 -144 322 -134
2863 -134 48 -167 46 230 -194 85 -296 374 -96 6 -116 -42 256 -166 84 -262 260 15 -35 -86 -56
2884 -56 235 -87 24 -154 82 185 -112 -5 -173 289 -39 -26 -92 -29 229 -97 46 -230 256 23 -2 -144
2906 -144 32 159 -32 -2 -157 120 74 18 -149 -42 153 30 -100 -90 44 115 -21 -52 -108 133 67 7 -205
2929 -205 89 98 29 -85 -81 155 -29 160 -250 58 51 170 -157 -108 172 -20 90 -189 87 -73 159 28 -284
2952 -284 144 39 139 -270 59 128 -137 225 -289 152 -130 329 -245 -174 291 -130 191 -356 353 -320 277
2973 277 57 -360 214 -38 336 -581 317 60 -179 253 -251 207 -348 634 -385 -215 386 -127 185 -519
2993 -519 690 -586 359 100 -377 218 -144 576 -925 581 -49 -187 218 -225 282 -633 940 -571
3011 -571 -221 414 -91 156 -691 1028 -843 377 181 -375 167 -274 940 -1273 780 -60 -169 136
3029 136 -198 474 -932 1213 -720 -138 337 3 103 -804 1300 -1083 414 221 -308 20 -261 1184
3047 1184 -1617 901 -33 -132 -56 -99 668 -1263 1408 -750 -56 125 204 119 -960 1443 -1155 496
3065 496 92 -159 -64 -259 1274 -1727 991 -12 -113 -181 4 764 -1526 1543 -709 -67 -57 429 90
3084 90 -1168 1577 -1095 452 -110 127 -215 -307 1293 -1651 921 -94 54 -329 89 688 -1474 1533
3102 1533 -704 -22 -194 636 -55 -1140 1598 -1030 397 -259 482 -445 -257 1243 -1458 757 -176
3119 -176 353 -557 158 620 -1236 1285 -691 148 -318 666 -116 -1003 1453 -991 434 -359 624 -627
3137 -627 -151 1178 -1361 644 -202 598 -821 278 572 -1045 995 -560 330 -547 734 -133 -781
3154 -781 1128 -813 534 -523 681 -609 36 887 -1161 653 -313 680 -930 429 358 -817 794
3171 794 -504 413 -703 825 -213 -599 813 -578 517 -648 708 -530 47 632 -890 611
3187 611 -435 713 -835 416 218 -606 706 -513 439 -668 815 -281 -418 614 -394 449
3203 449 -632 679 -474 64 443 -646 478 -420 678 -689 292 118 -366 521 -531 443 -572
3220 -572 662 -322 -235 395 -303 379 -522 533 -407 152 280 -443 317 -283 525 -527 211 94 -215
3239 -215 369 -411 372 -398 488 -219 -143 270 -207 314 -407 350 -291 180 112 -307 213 -164 322 -352 120
3260 120 47 -121 234 -278 201 -211 295 -145 -106 159 -128 220 -272 195 -168 164 19 -165 117 -51 167
3281 167 -193 65 14 -6 117 -141 40 -13 128 -71 -92 106 -35 100 -136 38 -40 97 -12 -131 55 16
3303 16 58 -90 -12 2 41 31 -73 -43 115 16 -6 -83 64 31 35 -5 -82 66 41 22 -102 26 82 -3 -5 -56 36 61
3331 61 20 -34 -87 149 -30 27 -89 31 76 -42 52 -144 133 -25 25 -108 14 84 -39 30 -112 76 6 8
3355 8 -39 -73 145 -43 45 -88 47 86 -57 62 -151 158 -45 55 -96 8 102 -45 47 -137 129 -10 43
3378 43 -62 -38 105 -45 36 -107 37 55 -22 18 -115 129 -40 11 -69 -12 75 -36 40 -127 102 -17 39 -88
3402 -88 17 73 -13 37 -89 52 34 30 -44 -32 89 22 -19 -35 1 51 4 -7 -52 64 24 32 -102 33 37 19 -20 -62
3430 -62 41 6 59 -110 4 -2 90 -72 -39 27 -4 51 -86 26 -56 104 14 -100 44 24 83 -100 24 34 -2
3455 -2 76 -97 69 -69 174 -114 -20 51 -20 103 -172 149 -152 159 -20 -107 41 -14 154 -227 122 -14 -33
3478 -33 57 -63 68 -166 280 -135 -53 57 16 93 -223 280 -219 163 11 -68 17 -25 253 -341 220 -20 8
3501 8 5 10 56 -246 379 -197 -77 54 106 -9 -257 392 -298 120 39 -12 -89 -33 355 -425 222 -35 63 -109
3525 -109 58 98 -323 429 -209 -37 -5 190 -69 -260 466 -345 108 51 67 -210 16 454 -548 224 20
3546 20 106 -250 166 154 -435 461 -183 1 -169 347 -118 -315 462 -341 114 -40 171 -322 47 436 -563
3567 -563 210 33 147 -383 251 171 -503 471 -140 39 -294 497 -138 -378 519 -278 102 -144 354 -368
3587 -368 5 472 -522 184 6 242 -449 258 207 -530 460 -127 48 -383 538 -142 -443 543 -255 73
3607 73 -221 475 -419 -36 501 -462 95 -36 354 -511 229 243 -451 352 -84 108 -407 525 -88 -410 472
3628 472 -189 84 -267 497 -386 -55 482 -402 65 -36 399 -529 182 264 -418 241 -51 129 -434 452
3648 452 -16 -419 385 -121 95 -299 453 -305 -104 420 -324 51 -85 394 -446 145 240 -330 184 -26
3668 -26 139 -397 400 7 -349 272 -39 75 -281 371 -198 -128 316 -217 15 -107 355 -350 45 177 -214
3689 -214 114 -50 138 -317 297 17 -258 180 -5 65 -234 292 -140 -100 259 -129 11 -98 294 -245 0
3710 0 180 -132 84 -76 154 -236 191 34 -157 112 -5 85 -191 174 -85 -51 149 -94 4 -56 191 -162
3732 -162 -25 112 -88 42 -51 98 -152 129 25 -106 38 1 79 -128 96 -32 -8 75 -67 22 -32 120
3754 120 -77 -26 72 -49 55 -56 45 -65 79 34 -93 38 -14 66 -93 42 -11 -7 36 -66 24 -26 70 -21
3778 -21 -28 32 -14 64 -43 8 21 34 24 -63 52 -12 44 -33 6 20 5 58 -67 28 -6 34 5 -52 41 -15 52 -51 -15
3807 -15 41 -2 31 -77 38 -29 19 -10 -44 30 -21 52 -77 28 6 8 19 -59 61 -37 62 -46 -24 59 -16 50 -67
3834 -67 57 -12 22 12 -52 66 -30 76 -87 48 17 -1 28 -70 74 -44 67 -49 -32 52 -40 47 -84 47 -16
3859 -16 3 6 -64 61 -32 78 -81 40 11 -9 41 -87 86 -56 60 -44 -10 53 -38 72 -69 60 -6 36 -2
3884 -2 -44 66 -20 53 -60 31 2 9 25 -79 76 -42 53 -67 -1 34 -31 46 -77 51 -22 36 -21 -38 51 -25 40
3911 40 -51 46 -7 24 15 -55 51 -15 56 -53 19 26 -15 41 -53 42 -25 37 -26 -15 25 4 14 -54 41 -23 45 -10 -22 19
3941 19 -10 41 -68 12 -3 20 -14 -34 11 -24 41 -31 9 -12 29 -7 -48 40 -17 53 -32 24 -8 19 37 -48 34 -3 56 -38
3971 -38 14 7 5 14 -22 30 -39 79 -35 -27 12 -3 41 -76 76 -64 29 16 -25 11 -33 101 -118 45 -18 26 -9 -21
3999 -21 53 -106 142 -64 3 -16 45 37 -102 143 -97 74 8 19 -21 -25 153 -169 83 -43 52 -55 4 81 -172
4024 -172 178 -84 40 -65 86 36 -149 177 -141 83 -46 65 -62 -39 204 -216 117 -41 90 -92 28
4045 28 117 -222 223 -98 62 -121 157 31 -193 251 -151 112 -85 137 -89 -61 241 -236 125 -63 136
4066 136 -138 44 124 -256 237 -108 48 -154 172 22 -242 260 -155 82 -131 194 -124 -91 266 -221 103
4087 103 -83 201 -191 53 159 -236 193 -84 103 -190 182 30 -226 261 -141 89 -147 223 -159 -101
4107 -101 295 -215 66 -86 231 -260 44 175 -234 136 -76 136 -259 185 35 -204 177 -85 97 -171
4127 -171 234 -141 -73 237 -162 42 -56 239 -248 75 169 -182 98 -20 153 -281 230 38 -168 107 -25
4148 -25 86 -210 253 -115 -74 152 -101 31 -112 244 -238 73 92 -129 75 -37 161 -290 225 1 -127
4169 -127 71 18 96 -230 259 -115 -54 90 -8 15 -135 268 -193 54 65 -32 19 -54 166 -248 184 -19 -71
4192 -71 36 7 86 -215 244 -124 -12 50 7 -9 -132 238 -181 39 32 4 -10 -66 169 -206 140 -25 -16 -6 -14
4217 -14 117 -177 198 -114 39 32 6 27 -97 206 -139 50 5 32 -14 -49 135 -165 93 -26 -2 -29 -15 105
4241 105 -155 129 -73 28 -4 -6 34 -88 133 -111 48 -23 27 3 -32 83 -89 74 -15 5 -16 -7 75 -99 85
4266 85 -30 14 7 1 51 -74 105 -51 22 -24 31 10 -38 36 -67 46 -23 -6 -10 -10 39 -43 26 -15 10 -2 -26 25 -42
4295 -42 43 -21 5 -1 16 15 -21 13 -25 33 -19 6 3 2 20 -2 11 1 22 23 -26 16 -4 8 11 -19 13 -17 27 -33 8 -6 19
4328 19 -7 -16 8 -11 5 -5 -16 3 -1 21 -20 5 15 -15 25 -32 31 -10 37 -9 7 22 0 29 -15 27 -8 19 -2 8 4 -2
4360 -2 19 -16 6 8 -3 17 -31 22 -12 16 -12 -17 12 -20 27 -36 32 -34 20 -19 -12 5 -8 29 -29 20 3 0 18 -12 23 -3 18
4393 18 -2 -13 20 -9 34 -35 27 -24 33 -9 -2 16 -10 22 -36 29 -24 15 2 -14 4 -13 14 -26 -6 3 -23 17 -30 15 -12
4424 -12 18 -10 -8 14 -3 37 -32 35 -21 36 0 5 14 5 25 -15 16 -6 20 0 16 4 3 8 -2 0 8 -14 8 -18 21 -17 20 -21
4458 -21 4 10 -8 6 -27 20 -22 27 -14 9 -19 4 13 1 1 2 25 -5 -3 9 10 24 7 23 6 1 27 -19 29 -20 34 -21 8 -17
4492 -17 -2 5 -25 25 -24 33 -28 -3 -17 -3 -5 -6 15 -4 -6 11 -8 0 -12 30 -17 12 11 3 23 -6 50 -30 42 -7 20 -25 13 15
4526 15 -12 17 -12 10 0 23 -7 11 10 -7 -11 9 -22 -9 -6 22 -37 26 4 4 -33 32 -2 -37 26 -3 15 -30 45 -30 10 2 0
4559 0 -10 6 25 -32 24 18 -23 23 18 5 -30 51 11 -40 40 7 20 -46 66 -60 -9 20 -3 -18 -30 53 -55 21 -1 -10 -5
4590 -5 14 16 -43 42 4 -41 30 8 -6 -29 70 -30 -9 54 -9 2 -11 95 -70 35 21 1 -16 14 37 -57 47 5 -21
4619 -21 18 11 9 -27 52 -35 -40 50 -35 12 -47 80 -88 8 29 -24 -10 -2 57 -94 47 16 -27 1 15 13 -48 60 5 -44
4649 -44 48 -13 10 -34 57 -45 -19 55 -32 9 -4 64 -66 44 25 -45 -2 20 12 -51 42 8 -39 38 2 -13 -31 38 -5
4678 -5 -42 60 -29 27 -15 66 -44 21 48 -33 14 17 38 -38 42 7 -41 17 13 -8 -12 35 10 -41 66 -9 5 -5 24 -17 -20
4709 -20 50 -43 15 -17 42 -39 16 14 -25 12 16 -2 -13 22 7 -37 32 -1 -11 13 15 -3 -20 64 -29 20 -11 45 -29 7 24 -17
4741 -17 11 2 13 -19 15 11 -16 -3 11 -18 -2 -5 17 -37 28 -33 1 -11 13 -7 -17 31 -37 23 -22 28 -32 19 3 -11 -2 17
4773 17 0 11 14 18 -12 35 -8 5 -4 4 23 -16 33 -27 28 -38 26 -24 10 10 -10 8 -12 23 -19 6 -4 -11 8 -5 -1 -12 -1 9
4807 9 -23 16 -25 26 -13 25 -6 1 20 -10 35 -29 43 -19 27 5 9 5 -2 13 -3 8 10 -8 18 1 27 -2 8 0 -19 21 -33 22
4841 22 -39 27 -26 8 -4 -9 3 -20 27 -24 29 -8 4 2 6 8 5 9 18 -6 32 -21 37 -21 23 -5 7 25 -18 44 -31 38 -29 33
4875 33 -20 3 -5 -5 11 -16 -5 -8 5 9 -16 11 -22 -6 -3 -7 13 -29 45 -36 32 -19 41 2 -2 11 -5 19 -17 31 -13 31 -7 12
4909 12 9 15 3 0 3 18 -26 23 -17 15 -18 19 -4 -3 14 -20 32 -42 25 -34 19 -8 9 1 0 11 -11 9 -2 -4 3 -1 3 0 8 11 -16
4946 -16 28 -19 39 -22 37 -34 27 10 0 13 -11 27 -30 29 -18 19 -6 6 -3 -2 5 -1 -15 2 -16 17 -29 12 -21 8 3 -11 18
4979 18 -22 30 -39 40 -43 32 -9 10 5 -8 25 -5 17 4 24 2 6 19 -6 15 -2 -4 21 -13 34 -34 29 -35 13 -6 -8 2
5011 2 -25 40 -51 34 -31 17 -18 12 3 -23 18 -20 3 -2 0 13 -20 30 -18 4 13 4 22 -39 53 -52 57 -33 27 -17 13 20 -36
5044 -36 42 -32 28 -25 20 -3 -15 30 -37 6 -10 -10 5 -30 42 -56 40 -38 12 -9 -8 33 -64 51 -47 47 -34 30 -3 -11 49
5075 49 -32 25 -17 23 8 -9 52 -35 39 -18 8 -15 -12 44 -72 64 -48 45 -39 31 -4 -32 45 -61 38 -49 36 -41 5
5104 5 22 -37 28 -16 12 -11 10 34 -64 57 -22 31 -23 22 17 -36 78 -69 54 -43 64 -38 8 22 -37 32 -23 31
5132 31 -36 20 9 -40 39 -37 28 -26 16 4 -56 66 -59 47 -55 55 -50 -4 46 -44 44 -42 64 -56 46 3
5158 3 -26 29 -23 33 -24 45 -8 -26 56 -41 36 -41 40 -35 -4 52 -57 59 -60 66 -82 53 -2 -37 24 -22 45 -62
5186 -62 52 -28 -26 25 -37 6 -40 46 -21 -13 58 -51 50 -46 82 -71 49 17 -21 42 -32 75 -70 90 -19 16
5212 16 30 -4 25 -40 56 -27 -7 29 -28 40 -52 54 -52 26 15 -48 52 -48 67 -88 73 -36 7 22 -5 25
5238 25 -53 71 -50 24 16 1 14 -19 47 -36 16 44 -27 53 -24 68 -56 50 -6 -3 29 -21 39 -59 70 -59 32 -2
5266 -2 12 -9 -22 37 -33 4 19 -22 7 -20 44 -44 28 17 -20 40 -17 59 -60 66 -36 43 7 6 18 -28 51 -39 37 1
5296 1 9 -5 4 25 -26 13 13 -20 7 -24 41 -46 47 -20 4 2 -16 11 -47 51 -71 28 -22 8 -24 0 15 -19 19 -4 -9 6 -2
5329 -2 24 -22 31 3 -5 20 -6 42 -33 57 -42 26 -16 22 -1 -6 24 -25 30 -23 32 -14 4 5 -6 -3 13 -21 9 -29 26 -34 26
5362 26 -23 0 -3 -9 14 -28 45 -43 35 -20 34 -16 16 -2 8 2 -3 3 15 11 17 -6 12 4 2 -1 -18 31 -36 33 -34 26 -29 18 -6
5397 -6 -11 12 -13 12 -20 15 -17 19 -7 0 -13 18 -4 20 -12 33 -15 26 -20 15 -7 8 22 -1 41 -24 43 -36 39 -20 26 -7
5429 -7 4 7 -3 14 -5 3 8 -4 6 -17 1 -1 -12 25 -27 31 -35 39 -44 34 -14 10 15 -2 26 -23 43 -21 38 -20 25 -2 5 10
5463 10 -3 1 22 -9 21 -16 45 -31 28 6 3 18 -26 40 -50 54 -42 33 -35 17 -3 -12 17 -35 14 -17 16 -6 8 5 -16 11
5495 11 7 -1 31 -8 51 -39 77 -35 41 -8 20 22 -18 64 -43 58 -24 42 -29 29 17 -30 21 -10 13 -1 1 21 -43 52
5525 52 -35 15 -12 1 20 -48 69 -72 76 -44 56 -29 20 35 -43 61 -36 36 -36 44 16 -13 58 -19 27 0 36
5552 36 15 -44 78 -56 65 -36 55 -30 8 47 -77 69 -55 68 -72 64 -12 -35 52 -32 32 -39 44 -28 -42
5577 -42 70 -59 49 -27 65 -38 2 82 -79 87 -62 94 -85 68 -18 -40 70 -37 59 -62 89 -51 4
5600 4 55 -43 29 -29 63 -66 9 70 -80 59 -58 81 -98 66 7 -55 72 -61 77 -109 115 -59 12 51
5624 51 -17 50 -45 84 -80 27 44 -58 45 -25 70 -83 68 22 -71 87 -62 80 -114 131 -65 -4 46 -44
5648 -44 46 -90 129 -106 40 9 -24 26 -25 68 -91 63 7 -53 59 -46 62 -110 120 -52 -12 72 -37 62
5672 62 -90 138 -113 53 16 -9 16 -15 94 -99 71 -10 -23 28 -25 38 -86 100 -31 -47 57 -45 49 -84
5696 -84 127 -119 28 26 -24 20 -37 93 -136 81 -20 -10 4 10 36 -80 88 -22 -19 42 -1 37 -61 113 -75 21
5722 21 31 -31 23 -48 111 -121 90 -29 11 -11 9 38 -74 82 -36 -10 -4 22 -1 -51 68 -41 1 29 -27 17
5748 17 -35 90 -103 65 -8 1 10 4 62 -88 104 -46 21 -6 31 -3 -23 61 -31 4 27 -3 -9 -21 71 -65 38 3
5776 3 -6 16 -16 46 -83 78 -47 25 -17 16 -1 -32 60 -50 11 6 25 -18 -7 38 -22 8 33 -6 10 -23 49 -56 67
5805 67 -17 7 1 11 24 -49 66 -37 31 -19 26 -21 8 20 -20 -3 5 -14 -8 -11 21 -38 23 8 -19 15 -27 31 -53 57 -35
5836 -35 25 -13 15 -2 -2 34 -12 15 12 13 -3 7 22 -11 7 22 -25 33 -18 39 -43 47 -10 8 10 -7 17 -23 36 -26 14 -18
5868 -18 13 -12 5 3 -6 -6 11 -21 25 -12 15 -29 21 5 -19 25 -22 32 -30 48 -26 29 -7 16 15 -4 15 -6 19 -4 9 3 -2
5901 -2 3 -4 -10 13 -19 27 -36 38 -34 27 -46 9 -14 -15 15 -32 22 -26 40 -29 25 -2 17 2 5 -2 3 10 18 -17 28 -10 12 -3 10
5936 10 16 -7 26 -37 40 -33 46 -28 36 -10 0 1 -13 12 -25 10 -21 4 -10 9 -10 4 1 -1 -25 32 -21 34 -20 24 -30 16
5968 16 -9 -4 22 -17 30 -40 51 -41 33 -17 24 1 0 20 -14 -6 -10 -6 -7 -16 11 -22 1 13 -7 12 -34 22 -63 40 -49 23 -26
6001 -26 10 3 -34 46 -49 41 -28 36 -42 9 24 -22 14 -11 15 0 2 30 -50 54 -39 25 -19 22 12 -52 72 -75 56
6030 56 -53 50 -47 20 25 -53 44 -49 51 -48 16 4 -62 42 -36 16 -41 26 11 -71 90 -63 63 -62 75 -50
6056 -50 -1 63 -71 77 -61 94 -82 51 11 -45 57 -42 45 -62 61 -2 -57 83 -63 44 -66 77 -54
6079 -54 -29 83 -85 66 -86 111 -99 57 12 -50 58 -66 65 -93 90 -19 -31 61 -48 42 -58 83
6101 83 -42 -24 90 -75 66 -60 118 -114 41 35 -66 60 -67 97 -128 107 -44 -19 29 -38 47 -77 93
6124 93 -75 -9 43 -52 27 -67 91 -116 43 22 -47 68 -74 107 -144 136 -46 -15 34 -21 46 -108 137 -91
6148 -91 28 16 -9 17 -52 99 -95 51 13 -43 44 -45 101 -145 130 -60 -25 33 -36 57 -141 157 -128 54
6172 54 -17 8 -8 -59 121 -132 81 -21 -5 8 -32 87 -124 127 -43 0 30 -25 79 -125 171 -137 59 -7
6196 -7 10 24 -64 145 -156 95 -43 12 -24 -16 77 -145 110 -48 -2 -3 -23 58 -130 150 -115 61 -6 -10 28 -95
6222 -95 153 -166 131 -58 33 -24 1 78 -122 131 -61 34 -5 19 40 -94 118 -82 31 7 5 31 -94 146
6246 146 -138 96 -47 22 -17 -29 87 -125 127 -83 29 -40 29 28 -77 93 -62 24 -7 10 21 -63 124 -115
6270 -115 65 -17 19 -2 -25 90 -111 124 -69 49 -39 41 14 -65 85 -61 24 -28 28 -26 -35 57 -80 28 -21
6295 -21 7 -3 -26 70 -112 77 -55 44 -42 29 16 -63 72 -62 44 -46 50 -22 0 46 -38 20 1 13 1 4 48 -49
6323 -49 50 -28 24 -19 -4 26 -65 66 -52 42 -54 39 -34 2 39 -47 14 -23 29 -39 17 3 -21 18 -6 -10 -1 -1 28 -53 60
6354 60 -42 32 -28 31 3 -22 46 -45 52 -27 44 -34 29 -5 -5 22 -19 -1 2 4 16 -27 28 -22 16 -11 -12 5 -22 44 -44 47
6386 47 -47 41 -32 22 3 -22 26 -11 14 -15 19 0 7 13 -4 -2 14 -4 39 -22 37 -29 37 -20 23 -5 -10 26 -24 38 -34 34
6418 34 -18 24 -2 -2 2 -4 1 2 -11 17 -25 16 -15 13 -14 -7 12 -22 37 -26 45 -36 49 -17 25 1 1 15 -23 30 -14 18 -4 16
6452 16 3 2 3 5 -15 16 -19 28 -32 41 -42 24 -21 -3 -12 -28 33 -46 42 -50 19 -37 21 -21 1 7 -2 7 1 5 3 -18 25 -24 25
6487 25 10 -8 14 -18 49 -35 59 -29 49 -32 22 -8 -7 37 -30 24 -28 40 -30 11 4 -13 -4 -1 4 -13 -3 20 -47 40 -34 22 -44
6520 -44 30 -4 -36 38 -38 47 -58 70 -50 44 4 -12 26 -5 45 -39 32 6 -8 24 -2 13 -35 46 -15 -33 42 -37 38
6549 38 -69 76 -68 28 14 -17 32 -57 77 -85 59 -31 6 3 -5 37 -48 63 -31 -7 32 -13 35 -55 93 -56 27
6576 27 23 -21 36 -65 115 -123 94 -40 2 -9 -13 57 -109 91 -58 9 -16 -5 25 -69 85 -79 19 8 -28 39
6602 39 -74 124 -129 71 -32 2 3 -39 93 -136 129 -62 40 -31 19 28 -79 93 -71 47 -3 0 19 -68 109
6627 109 -98 66 -8 -5 16 -40 97 -138 131 -80 22 -35 16 29 -97 115 -86 41 -33 29 -10 -45 92 -80
6651 -80 41 -5 8 11 -27 101 -114 100 -47 25 -19 20 47 -99 124 -90 58 -41 68 -38 -32 85 -72 39
6675 39 -17 28 -35 -10 62 -94 63 -30 16 -23 19 38 -90 98 -87 65 -56 66 -33 -9 72 -79 58 -30 65
6700 65 -57 29 36 -48 51 -15 25 -23 25 24 -64 79 -54 46 -34 54 -19 -25 64 -83 66 -70 61 -79 44 2 -48
6727 -48 43 -36 17 -46 45 -7 -33 57 -34 31 -23 48 -12 -24 79 -75 77 -50 69 -62 47 21 -39 65 -36 59
6753 59 -57 61 -30 -10 30 -19 8 -31 43 -33 -26 47 -57 31 -35 40 -53 11 35 -66 54 -46 59 -77 61 -25
6779 -25 -19 21 -18 7 -19 44 -25 0 32 -27 20 -6 12 -18 0 48 -58 57 -26 29 -44 42 -10 -29 42 -30 15 -41 47 -43
6809 -43 7 6 -12 -2 4 -1 -8 2 36 -44 32 -15 10 -10 18 27 -34 59 -31 38 -15 51 -25 9 16 5 13 9 12 -8 -3 20 -13 4 14
6844 14 -14 16 -16 21 -41 46 -31 14 -20 12 -7 -10 27 -23 7 -8 13 -21 14 1 -2 -3 21 -17 11 -21 28 -21 30 -7 1 21
6876 21 -1 25 -26 51 -34 31 -16 25 -16 9 12 -11 5 7 1 -2 4 14 -14 -3 7 -13 18 -15 40 -37 41 -36 22 -16 12 11 -1
6909 -1 22 -20 32 -4 20 -6 12 13 -1 -3 25 -4 22 -21 24 -15 20 -12 11 -2 -4 18 -28 26 -38 25 -32 15 -21 3 -5 -6 5
6942 5 4 15 5 -10 4 0 8 -5 3 15 -18 27 -29 34 -25 44 -24 21 -3 14 14 -12 22 -21 34 -10 18 -7 16 -10 3 -5 15 -10
6976 -10 15 -12 4 -24 20 -16 4 1 -8 16 -27 35 -43 39 -35 26 -27 20 -4 -10 11 -5 29 -4 22 -6 21 11 -7 8 12 4 -1
7009 -1 -7 39 -32 35 -26 26 -24 7 5 -25 43 -26 34 -38 45 -30 14 4 -4 4 -18 21 -22 20 10 -22 19 2 16 -16 20 18 -25
7042 -25 42 -28 44 -50 60 -39 15 20 -20 21 -34 53 -38 27 -6 4 -5 -2 3 -25 23 2 -32 16 -25 20 -56 48 -41 -7 20
7073 20 -18 28 -34 74 -76 41 -10 14 -13 9 31 -52 45 -9 7 9 2 16 -28 53 -27 1 15 -16 26 -53 83 -80 56
7102 56 -27 6 -23 -26 48 -80 60 -44 8 -45 23 2 -52 62 -27 16 -10 12 6 -45 75 -62 44 -12 16 -4 -21 78
7130 78 -93 89 -55 51 -43 42 0 -62 79 -55 28 -38 52 -28 -29 66 -54 28 -29 25 -27 -32 65 -98 71 -51
7156 -51 59 -59 31 28 -69 92 -80 66 -60 61 -48 -13 74 -59 42 -29 57 -40 -9 71 -68 66 -34 48
7180 48 -44 22 48 -88 95 -77 85 -91 66 -30 -18 61 -76 51 -68 61 -63 3 28 -69 54 -29 57 -44
7204 -44 16 28 -78 80 -57 82 -73 63 -15 -28 75 -75 84 -70 93 -72 31 25 -45 55 -47 61 -61
7227 -61 41 3 -64 59 -65 38 -62 46 -16 -42 80 -83 74 -86 89 -69 7 22 -51 49 -62 70 -68
7250 -68 57 -2 -27 43 -31 42 -35 46 -17 -16 69 -67 69 -54 73 -46 8 35 -41 61 -63 73 -82 64 -18
7275 -18 -13 22 -34 35 -63 38 -34 -7 27 -40 35 -41 43 -37 -3 30 -43 57 -50 71 -62 57 -12 -11 43 -26 47 -44
7303 -44 66 -42 19 14 -3 32 -14 35 -15 11 23 -40 46 -49 36 -49 25 -9 -24 26 -43 41 -73 60 -53 21 5 -11
7331 -11 13 -21 36 -26 23 -1 -13 17 -20 24 -22 17 13 -21 40 -26 45 -46 65 -29 22 8 -25 22 -34 44 -43 22 -7 -3 6
7362 6 0 3 -20 3 -8 -29 20 -37 27 -40 19 -19 1 24 -22 36 -34 60 -43 33 -10 0 14 -1 22 -12 36 -1 1 3 -8 12
7394 12 -17 9 9 -13 26 -41 40 -29 39 -43 18 -10 -16 17 -25 37 -36 15 -18 3 -14 -4 -1 -3 1 7 -12 22 -23 22 -12 39 -8
7427 -8 7 27 -21 35 -30 32 -34 29 -23 3 -9 -2 6 -17 14 -11 12 -12 -4 3 -13 -7 -7 -5 6 -25 30 -35 35 -29 14 -12 2 9 -11
7462 -11 32 -27 27 -28 23 -21 24 5 10 3 -7 -1 11 -7 13 -11 19 -6 7 4 -13 10 -29 31 -35 36 -34 32 -27 5 -4 -9 7
7495 7 -24 19 -34 -1 -11 -6 -12 0 -5 8 -8 15 -10 20 -18 27 -28 33 -12 0 14 -13 33 -27 54 -30 27 -16 20 -11 5 15
7527 15 -18 6 4 -2 4 -10 1 -25 16 -12 -25 23 -24 28 -49 43 -57 33 -14 22 -6 -20 26 -46 37 -27 32 -25 16 12 -18 36
7559 36 -5 1 -1 -9 27 -32 48 -34 24 -19 15 0 -27 41 -72 56 -38 28 -47 17 1 -44 27 -25 20 -37 22 4 -26 36 -25
7590 -25 16 -20 15 2 -25 64 -63 55 -46 40 -32 17 26 -49 59 -48 55 -57 62 -20 -23 29 -35 27 -37 38 -10
7617 -10 -33 42 -60 43 -45 42 -51 -9 39 -71 61 -72 62 -72 69 -16 -16 40 -28 41 -42 62 -39 -5 44 -12
7643 -12 16 -24 57 -31 -6 51 -57 53 -53 63 -74 46 -13 -50 44 -56 50 -68 78 -66 0 16 -23 9 -36
7668 -36 44 -51 2 25 -45 21 -36 46 -62 32 17 -41 52 -44 69 -88 75 -44 8 19 -16 29 -37 63 -61 34 6
7695 6 -18 -5 -8 33 -44 24 10 -46 24 -27 39 -68 60 -30 -9 0 -19 22 -54 75 -73 33 -28 9 -25 -12 29 -38 21
7724 21 -14 -4 5 2 17 -41 42 -28 -4 24 -6 29 -47 71 -64 34 -14 22 -10 -2 41 -50 35 -22 16 -19 5 -5 -28 31 -13
7755 -13 4 3 -10 8 -42 40 -43 24 -19 1 2 -14 50 -53 47 -24 35 -28 24 4 -23 24 -11 11 -9 20 3 -21 32 -8
7785 -8 -5 -2 -7 10 -36 35 -40 44 -30 10 -10 9 5 -35 25 -29 24 -22 14 -8 -8 9 -5 -2 19 -4 28 -16 36 -19 36 -14 11 13
7819 13 -7 35 -42 38 -28 19 -18 3 -3 -2 6 -11 -5 2 -8 5 -6 4 -12 -6 5 -23 23 -21 22 -36 36 -21 10 5 0 23 0 22
7853 22 -2 24 2 1 5 24 -4 7 -7 17 -16 31 -17 20 -7 14 -21 -6 23 -24 24 -25 16 -32 0 -4 1 -3 -2 -4 2 -4 11 -13 12
7888 12 -6 -1 -1 -3 19 -18 33 -27 28 -21 31 -7 11 20 -15 20 4 21 8 12 3 6 16 -1 0 15 -14 13 -37 29 -20 29 -16 6
7922 6 -9 -7 19 -30 26 -20 20 -21 17 -18 -5 6 9 0 7 3 16 -5 20 -3 24 3 6 20 -14 35 -26 46 -27 41 -19 22 -4 2
7956 2 12 -10 25 -15 15 -12 7 -4 0 1 -6 -4 4 -5 13 -11 24 -14 27 -6 7 3 -1 22 -16 43 -24 36 -10 37 8 15 1 2 15 -6
7992 -6 6 -5 2 17 -7 -5 1 -1 15 -9 14 -31 27 -22 22 -22 23 -5 -5 7 -17 18 -28 27 -15 15 -5 7 -6 -8 16 4 -2 24
8026 24 -3 18 -11 23 -14 29 0 -7 33 -16 25 -30 41 -27 21 -4 -2 0 -25 11 -30 15 -12 -8 -7 2 7 -15 14 2 -10 14 -26 26
8060 26 -33 38 -24 12 3 -1 17 -20 41 -30 40 -6 29 -8 18 12 -12 19 2 6 3 5 26 -21 32 -17 5 -1 -10 20 -42 43 -39 23
8094 23 -24 33 -23 0 21 -34 33 -17 20 -23 28 8 -12 33 -5 3 8 11 20 -28 51 -17 36 -10 34 -6 -5 35 -35 36 -27 50 -46
8127 -46 48 0 -8 26 -9 8 -27 30 -14 -20 25 -24 14 -18 23 -20 3 39 -32 34 -42 63 -53 47 4 -19 32 -13 52 -45
8157 -45 69 -29 10 21 -8 22 -23 37 -27 4 21 -24 36 -23 44 -58 29 -4 -37 27 -36 55 -86 61 -43 6 9 -12
8185 -12 7 -41 48 -56 18 12
8191A2
$$ Imaginary data points
##PAGE= N=2
##DATA TABLE= (X++(I..I)), XYDATA
0 0 0 0 0 0 0 0 0 0 0 0 8 -8 8 -16 16 -24 25 -32 40 -49 64 -73 88 -105 127 -146 173 -201 233 -269 309 -353
32 -353 402 -457 518 -584 656 -739 828 -925 1030 -1149 1277 -1415 1566 -1732 1910 -2109
48 -2109 2323 -2557 2818 -3099 3412 -3760 4144 -4574 5056 -5605 6231 -6959 7808 -8824
62 -8824 10061 -11605 13596 -16287 20167 -26398 38888 -114439 151636 2871 -42727 -18785
74 -18785 21943 82910 -208321 247534 -145489 15279 3565 60327 -27718 -116753 211979
85 211979 -178417 80757 -14093 4496 -32720 -5687 136688 -227022 159280 -31879 4428
96 4428 -43945 38437 52680 -157091 192250 -112436 5673 -3679 64588 -34913 -101886 179742
108 179742 -138842 57724 -20668 31198 -47091 2487 113343 -175145 112683 -19388 18906
119 18906 -58330 37686 44330 -124802 141548 -83905 10593 -20944 69363 -35184 -79019
130 -79019 137331 -94454 40100 -27532 46761 -49657 4022 84493 -122795 69885 -16222
141 -16222 32817 -63479 29663 33366 -80426 89127 -59144 19051 -26281 60723 -30573 -51028
153 -51028 91269 -59783 30138 -30523 43707 -46381 11741 52976 -85587 44330 -9621
164 -9621 33466 -62005 30950 23399 -51446 54614 -36275 20165 -31083 54094 -24852 -35987
176 -35987 55841 -33234 23054 -36228 39249 -34918 12665 28136 -52983 30739 -10574 33689
188 33689 -49879 24607 12383 -24806 30761 -27579 17928 -24988 40349 -22782 -21739 31589
200 31589 -16300 15840 -30692 29764 -21972 12418 13151 -30321 19704 -7285 26604 -36789
212 -36789 15856 5670 -9659 14112 -20423 12805 -16178 27399 -17833 -11871 16911 -3978
224 -3978 10626 -22692 19027 -10007 10486 3469 -17941 11729 -4164 17273 -25249 6825
236 6825 3059 -667 5139 -15579 9596 -6183 16444 -12334 -4999 8587 2107 5610 -14572
249 -14572 7813 -2213 7439 -2586 -11396 5689 1012 7512 -14203 820 4152 3815 1159 -10063
263 -10063 5012 2200 8242 -8132 -4022 4185 5087 405 -9483 -14 3323 4972 -5154 -6643
277 -6643 2764 5676 1701 -6070 -2531 5482 5217 -1117 -7142 1019 6231 2014 -5979 -4705 2839
292 2839 5223 -1847 -5975 -2686 6304 4307 -4751 -4170 1731 8305 -1003 -3643 -4168 5741 4435 -3111
308 -3111 -6028 -1354 7631 -542 -4301 -5174 3853 5501 -1565 -4451 -2154 7195 3638 -4170 -3943 1381
324 1381 7132 -1681 -4452 -3962 4413 3984 -3604 -5372 -793 7495 155 -3669 -4146 4704 5232 -889
340 -889 -5105 -1094 5737 3215 -4820 -4872 1889 4920 -203 -6577 -1383 3060 5225 -3174 -5025 1528
356 1528 5666 2519 -5514 -2008 3348 4332 -784 -6646 243 2801 4563 -6401 -4173 3155 3214 2230
372 2230 -8250 2745 318 7436 -3241 -5978 3466 2890 4943 -10477 1875 499 3641 -409
386 -409 -7466 2181 -386 9266 -9436 -1972 4390 2527 3495 -10254 7392 -4916 9750 -4195
400 -4195 -7340 4540 -137 8173 -16349 8185 -2882 3849 1226 -7547 4610 -4497 16442 -15119
414 -15119 512 4993 1705 2447 -12578 12844 -12454 12746 -4464 -8348 4698 -720 12428
427 12428 -22618 15066 -4751 3661 2326 -7299 6322 -9729 23049 -21306 2095 5252 760
440 760 691 -13404 18630 -20007 16629 -3015 -8738 3686 1206 15974 -29719 21203 -5378
453 -5378 1452 1335 -5719 7082 -16319 29673 -25984 2866 5396 2176 -634 -14340 25124 -26630
467 -26630 21000 -2810 -8643 1252 4095 16944 -37038 27329 -6429 -1888 -133 -717 5199 -21434
481 -21434 36837 -27682 1491 6188 6637 -4346 -15244 30737 -30494 20783 -3094 -6325 -3496
494 -3496 6391 17031 -40573 29854 -6133 -2646 -2418 5259 2439 -23071 41360 -28022 -1203
507 -1203 6762 11853 -10971 -15771 35994 -34151 17818 -1694 -1824 -11090 9363 20153 -43803
520 -43803 30694 -4466 -520 -7940 11731 591 -24977 43035 -27948 -2633 4668 17040 -17286
533 -17286 -14989 39112 -35690 15228 239 3019 -18217 13069 23175 -46015 28541 -962
545 -962 1832 -16151 17210 738 -27363 40132 -23665 -3099 -721 22881 -19534 -14736 38703
558 38703 -32258 12586 -12 7979 -22993 14725 23976 -46351 25865 878 3645 -23140 22072
571 22072 913 -29585 38792 -19762 -2623 -6233 30011 -21326 -15744 38257 -27847 9832
583 9832 -3517 13906 -26199 13428 23323 -43106 22051 370 7430 -26639 22909 2396 -28221
596 -28221 34992 -16202 -728 -10539 32418 -20376 -16711 34680 -22210 6307 -6554 17772
608 17772 -26333 10444 22678 -36718 16041 1615 11111 -27640 20135 5455 -25144 28275
620 28275 -12901 1018 -13315 30643 -17711 -16803 29867 -17390 5026 -8692 19567 -24323
632 -24323 8710 20743 -30163 11683 1616 13258 -27268 16624 6759 -21400 20729 -9781
644 -9781 2729 -15075 26947 -12664 -15940 23117 -10683 5203 -11183 18598 -18329 6189
656 6189 15610 -22307 7836 539 12620 -23486 11815 6088 -15456 13796 -6653 2692 -12562
669 -12562 21918 -8569 -13521 17004 -5189 3614 -11071 15654 -13318 3525 10798 -15304 4263
682 4263 -672 12048 -18707 7518 4674 -8182 8294 -5486 3368 -8967 16373 -6581 -9741
695 -9741 10863 -1888 2627 -10260 11370 -8637 2473 6386 -9839 2459 -807 10699 -13741
708 -13741 4082 3656 -2708 3748 -4582 3353 -5877 10335 -4667 -6121 5156 236 2128 -7627
722 -7627 5987 -4034 2761 3108 -6472 1709 506 7454 -9265 1451 2653 74 1178 -4259
736 -4259 2234 -2911 6321 -3633 -3605 2084 2022 1702 -5379 2499 -540 2895 326 -4011 1300 938 3998
753 3998 -5414 -439 1426 1271 555 -4015 953 -54 3904 -2690 -2279 1147 2754 1083 -3559 -150
769 -150 1388 2593 -1259 -3209 570 2035 1194 -2792 -1952 1795 1780 410 -3439 122 2466 1718 -1671
786 -1671 -2129 1231 2264 295 -2341 -1706 2065 1881 -1457 -2689 97 2858 -2 -1116 -2558 2326
802 2326 1866 321 -2814 -792 3554 312 -991 -3028 1524 1942 -142 -2084 -2092 2698 1506 -1087
818 -1087 -2487 378 3240 -185 -893 -2401 2428 1551 -209 -2384 -1253 3454 -336 -559 -3271 1749
834 1749 1803 -28 -1755 -1683 2837 1355 -649 -2513 580 2666 285 -1806 -2016 1882 1646 -698 -2465
851 -2465 -808 2975 291 -1021 -2548 1758 2116 20 -2038 -878 2246 1481 -1141 -2444 766 1666
867 1666 942 -2940 -648 836 2203 -752 -2411 242 1892 1789 -2434 -941 861 2273 -91 -2518
883 -2518 -145 717 2750 -2448 -2021 897 1433 1545 -4057 1343 -575 3243 -899 -2619 1019 726
899 726 3405 -4950 1191 -480 2307 -314 -2693 889 -1398 5207 -4240 -771 709 1769 1629 -4956
915 -4956 3842 -3066 4446 -1357 -2452 733 -171 5326 -8035 3710 -1819 2824 -761 -2382 2148
930 2148 -3894 8617 -6800 778 -101 2748 883 -6099 6589 -6255 6029 -2274 -1566 -493
944 -493 9 7114 -11058 6413 -2676 3373 -1807 -1102 3011 -6737 11795 -8984 1936 -1590 4399
959 4399 -417 -7255 9470 -9199 7825 -3616 431 -2479 1220 8386 -13847 9164 -3822
972 -3822 4326 -3955 1132 2585 -9222 14915 -11422 3052 -3299 7249 -2721 -7759 12792 -12196
986 -12196 9648 -5214 3685 -5829 2777 9417 -16284 11093 -5252 6081 -7201 3877 1813
999 1813 -10562 16719 -12647 4159 -4902 10151 -4906 -7730 15043 -14011 10272 -6230 6403
1012 6403 -9457 4334 10306 -18332 11713 -5379 7760 -11003 7258 1277 -11526 17304
1024 17304 -12222 4905 -7262 13314 -7102 -7380 15734 -14833 10518 -7485 8942 -12789
1036 -12789 6432 10317 -19578 12661 -5471 9502 -14858 11320 130 -12178 17261 -11167
1048 -11167 5126 -10419 17169 -9235 -7475 15205 -13008 9373 -9041 11970 -14509 6895
1060 6895 9802 -18095 11637 -5543 10748 -16784 13126 -1066 -11656 16142 -9800 4353
1072 4353 -11757 19878 -11350 -6952 14707 -10449 6674 -8913 14601 -16341 7006 9458
1084 9458 -15716 8681 -4801 12189 -18470 13355 -1544 -9646 13441 -8571 4953 -12725
1096 -12725 20858 -12546 -4968 12541 -8093 4960 -8724 15885 -17713 7412 8323 -12821
1108 -12821 4912 -3136 12963 -19408 12509 -531 -7550 9178 -5754 5357 -13268 19564
1120 19564 -10993 -3891 9036 -4997 3690 -8445 14718 -16428 7536 6168 -9877 2261
1132 2261 -945 11512 -18301 11685 -213 -5833 5624 -2530 4158 -12883 17841 -9108 -3425
1145 -3425 5391 -1448 2505 -8704 13472 -13805 7092 3014 -5654 384 -449 10178 -15694 10102
1159 10102 -1380 -2681 2434 -733 2665 -10787 15238 -7727 -2560 2713 1456 997 -7720 11541
1173 11541 -10657 5691 1135 -2315 -1344 -219 8622 -12298 7242 -1901 98 103 9 1466 -7490
1188 -7490 11472 -6156 -1333 915 2698 17 -5748 8402 -7653 4508 -20 -745 -2187 144
1202 144 6980 -9334 4712 -1816 2180 -1572 225 1178 -4835 7934 -4604 65 -983 3164
1216 3164 -135 -4007 4881 -4776 3764 -934 -196 -1948 564 4830 -6268 2757 -1348 2624 -1658
1231 -1658 -1 603 -2648 5051 -3217 169 -1523 2999 -172 -2670 2016 -2032 2805 -1122 -318
1246 -318 -1123 897 2722 -3414 866 -610 2099 -858 -679 24 -825 2936 -2061 -155 -1137 2371
1262 2371 7 -1601 247 -313 2031 -900 -656 -625 1199 1143 -1472 -677 212 1341 -65 -1321 -391
1279 -391 674 1360 -1082 -834 -75 1439 247 -1002 -748 654 1289 -380 -1262 -196 1316 213 -365
1296 -365 -1576 975 561 631 -1499 -651 1507 364 -88 -1670 800 720 568 -949 -1138 1122 741 45
1314 45 -1772 186 1257 24 -170 -1778 1411 285 706 -1450 -704 1800 -132 367 -2126 1224
1330 1224 360 610 -969 -1108 1271 367 424 -1940 481 959 372 -338 -1572 1348 354 566 -1400 -638
1348 -638 1643 -117 269 -2097 1134 512 462 -1069 -941 1369 324 310 -1850 663 708 607 -807 -1154
1366 -1154 1007 584 177 -1273 -444 1267 222 -192 -1418 578 987 172 -816 -869 1135 647 -94 -1430
1384 -1430 287 900 549 -1063 -701 497 1039 -213 -1011 -507 1199 768 -1064 -527 -65 1646 -592
1401 -592 -425 -796 646 1287 -946 -710 -384 1583 -45 -1035 -49 -208 1523 -578 -351 -1067 1301 1271
1419 1271 -1965 343 -723 2244 -1497 307 -759 -190 2343 -1838 173 -1431 2867 -889 -1026
1434 -1026 662 -961 2212 -1436 647 -2099 1905 1468 -2964 1227 -1165 2808 -2690 1424 -802
1449 -802 -1146 3460 -2579 920 -2624 4368 -1841 -1258 1620 -1729 2631 -2309 2129 -3441 2345 1823
1465 1823 -3574 1693 -1459 3465 -3695 2313 -811 -1840 4363 -3133 1179 -3332 5684 -2807 -1753
1480 -1753 2884 -2485 2717 -2905 3656 -4934 2805 2347 -4106 1775 -1549 4248 -5028 3252 -919
1495 -919 -2226 4511 -3153 1418 -4040 6637 -3528 -1829 3608 -2968 2687 -3044 4742 -6310
1509 -6310 3327 2939 -4636 1375 -966 4887 -6622 4124 -558 -2585 3893 -2236 1263 -4653 7252
1524 7252 -3576 -2071 3637 -2574 2270 -2992 5065 -6796 3590 3069 -4948 1179 -307 4653
1538 4653 -7618 5369 -836 -2909 3515 -969 555 -5272 8452 -4027 -2180 3130 -1193 1240
1552 1240 -3199 5738 -7063 3655 2548 -4078 459 5 4829 -8082 6003 -1406 -2285 2743
1566 2743 -75 61 -5633 9367 -4744 -2019 2624 219 -229 -3019 6527 -7392 3216 2533 -2942
1581 -2942 -843 359 5237 -8194 5615 -1299 -1590 1813 268 121 -5682 9512 -5191 -1418
1595 -1418 2066 912 -922 -2717 6883 -7809 3421 2244 -2012 -2105 913 5651 -8694 5274
1609 5274 -930 -911 323 900 784 -6377 9202 -4739 -826 710 1725 -634 -3305 6846 -7446
1624 -7446 3546 1414 -1187 -2522 1066 5522 -8465 4923 -587 -758 -239 1292 923 -6422 8628
1639 8628 -3787 -1237 313 2154 -339 -3885 6612 -6396 2933 950 -523 -2384 577 5258
1653 5258 -7390 4050 -616 -188 -553 1134 893 -5651 7432 -3022 -1330 10 2300 -192 -3963
1668 -3963 5947 -5190 2221 644 43 -2254 108 5033 -6118 2816 -471 583 -920 742 937
1683 937 -4412 5666 -2140 -1200 -118 1870 127 -3297 4421 -3730 1547 751 -226 -1701 -79 4268
1699 4268 -4762 1611 -58 713 -919 369 832 -3203 3953 -1220 -1005 -448 1638 419 -2588 2627
1715 2627 -2038 1092 455 -324 -1101 -81 3096 -3172 748 -52 829 -646 79 422 -1929 2715 -781
1732 -781 -722 -673 1532 343 -1786 1200 -847 736 232 -439 -670 57 1928 -1759 -41 57 741 -110
1750 -110 -442 149 -864 1728 -551 -627 -472 1112 366 -1137 251 -217 632 195 -619 -384 283 1086
1768 1086 -729 -619 255 565 283 -770 -74 -121 1048 -367 -677 -125 633 469 -750 -275 56 664
1786 664 155 -833 -174 487 517 -252 -883 440 276 566 -875 -279 347 627 -91 -908 306 183 708
1805 708 -672 -443 219 574 283 -1059 67 432 384 -113 -935 542 96 698 -908 -373 613 303 152
1824 152 -1159 592 -36 786 -733 -470 371 346 451 -1222 246 286 453 -207 -873 522 134 623 -845
1843 -845 -376 639 203 264 -1196 573 29 717 -705 -480 461 237 495 -1239 355 159 589 -362
1861 -362 -719 411 301 398 -795 -278 529 303 51 -918 293 296 481 -595 -498 439 329 279 -1026 234
1881 234 175 636 -492 -509 173 529 201 -661 -252 357 613 -372 -449 -104 688 130 -417 -436 242 667 -140
1902 -140 -609 -107 498 425 -584 -201 -116 741 -44 -393 -431 316 930 -884 5 -444 1060 -313 -140 -297
1922 -297 -205 1139 -573 -133 -717 1107 87 -668 118 -392 1009 -410 105 -852 495 1130 -1277 324
1940 324 -624 1457 -948 305 -204 -651 1576 -912 307 -1471 2019 -470 -724 435 -570 1171
1956 1171 -1032 1099 -1699 836 1106 -1313 298 -835 2065 -1835 963 -348 -830 1760 -1065
1971 -1065 736 -2317 3069 -1089 -788 778 -651 1293 -1756 2355 -2779 1266 1167 -1302 125 -960
1987 -960 2931 -3008 1677 -443 -803 1561 -1044 1232 -3242 3911 -1597 -690 850 -754 1509 -2454
2003 -2454 3507 -3884 1830 1051 -1228 -49 -1130 3853 -4369 2638 -745 -574 1023 -688 1691
2018 1691 -4318 4920 -2013 -599 535 -281 1622 -3308 4523 -4492 2141 769 -969 -90 -1473
2033 -1473 4618 -5340 3392 -1096 -417 720 -408 1905 -5094 5720 -2357 -582 351 136 1427
2048 1427 -3766 5176 -4755 2067 662 -608 -284 -1746 5188 -5781 3610 -1374 85 294 -341
2063 -341 2086 -5349 6087 -2781 -183 -103 766 941 -3727 5488 -4917 2000 484 54 -1001 -1547
2079 -1547 5395 -5892 3387 -1312 619 -461 -49 2214 -5367 5848 -2761 274 -755 1234 640
2094 640 -3364 5047 -4681 2161 183 373 -1484 -872 4872 -5567 3130 -1057 766 -1005 498
2109 498 1972 -5110 5383 -2374 455 -1459 1890 328 -3086 4430 -4064 2146 -547 1218 -2034
2124 -2034 -330 3992 -4697 2702 -1240 1257 -1615 1160 1203 -4350 4790 -2075 524 -1958 2609
2139 2609 -259 -2657 3851 -3401 1984 -1105 1953 -2514 113 3202 -3739 2191 -1438 1759 -1952
2154 -1952 1447 521 -3279 3961 -1825 627 -1993 2677 -626 -2014 3185 -2898 1743 -1188 2209
2169 2209 -2790 381 2706 -3014 1564 -1423 2266 -2403 1572 142 -2317 2887 -1453 859 -2203
2184 -2203 2613 -754 -1310 2164 -2209 1642 -1209 2038 -2629 692 2038 -2369 1237 -1311 2225
2199 2225 -2354 1627 -169 -1655 2135 -1041 820 -2146 2382 -625 -886 1255 -1423 1331 -1067
2214 -1067 1536 -2003 587 1450 -1686 836 -1112 1855 -1758 1207 -278 -1100 1628 -768 620
2229 620 -1776 1992 -490 -552 604 -751 922 -752 1063 -1437 471 954 -914 338 -795 1377
2245 1377 -1028 638 -331 -574 1168 -581 344 -1206 1376 -318 -279 130 -364 625 -366 473 -958
2262 -958 411 580 -419 -131 -358 806 -345 105 -211 -264 775 -305 45 -621 718 62 -199 -122 -171
2281 -171 490 -50 -14 -522 368 313 -120 -357 -24 333 145 -212 -232 -27 490 -59 -335 -104 219 344 -290
2302 -290 -187 -76 367 156 -371 -213 243 242 -15 -429 108 79 404 -378 -202 94 331 129 -557 222 -98
2323 -98 555 -387 -137 -18 265 310 -585 48 45 363 -124 -384 131 50 432 -448 -157 108 270 169 -647 316
2345 316 -175 593 -446 -142 13 168 386 -680 200 -117 496 -217 -268 59 99 400 -456 -91 77 301
2365 301 79 -512 209 -66 505 -375 -183 90 159 325 -642 210 -130 504 -253 -234 -8 182 318 -439 -84
2386 -84 34 353 -72 -325 -26 131 315 -237 -258 113 228 185 -468 52 52 355 -176 -242 -23 263 206 -287
2408 -287 -161 102 399 -191 -142 -172 390 -1 3 -325 47 342 14 -217 -310 442 55 -68 -252 -13 290 5
2430 5 -7 -454 245 356 -236 -110 -278 616 -338 233 -339 -46 465 -125 25 -693 911 -225 -42 -181
2450 -181 46 316 -271 457 -816 435 321 -154 -225 -279 887 -698 437 -334 -89 420 -102 196 -1081
2469 -1081 1316 -449 -41 -172 119 246 -543 978 -1271 581 279 21 -537 -176 1189 -1167 626
2486 626 -273 -29 132 115 321 -1396 1560 -461 -107 -210 293 243 -783 1357 -1523 654 237 185 -766
2505 -766 -114 1437 -1570 814 -265 60 -235 463 339 -1702 1728 -376 -214 -452 694 107 -1047
2522 -1047 1629 -1523 597 57 549 -1031 -108 1674 -1796 930 -371 363 -715 835 264 -1852
2538 -1852 1882 -359 -223 -748 1223 -211 -1136 1791 -1435 387 -28 943 -1346 -178 1884 -1843
2554 -1843 834 -452 709 -1066 896 333 -1884 1860 -442 -10 -1020 1503 -416 -1071 1789 -1386
2570 -1386 339 -108 1228 -1645 -89 2005 -1864 660 -379 1043 -1502 1041 500 -1933 1687
2585 1687 -367 315 -1535 1795 -455 -992 1546 -1209 463 -439 1453 -1780 88 1787 -1733 606
2601 606 -396 1105 -1626 1089 510 -1965 1623 -321 397 -1717 1891 -341 -1103 1445 -1002 548
2617 548 -713 1593 -1625 -19 1585 -1409 535 -530 1166 -1464 939 466 -1749 1494 -324
2632 -324 388 -1645 1809 -312 -1112 1357 -861 476 -828 1707 -1606 -38 1406 -1093 293 -591
2648 -591 1288 -1381 752 345 -1291 1145 -331 425 -1372 1440 -219 -858 1117 -840 508 -672
2664 -672 1414 -1409 -15 1273 -959 226 -505 1203 -1233 582 348 -1051 830 -184 383 -1200
2680 -1200 1083 8 -740 767 -627 507 -565 1002 -1045 -14 1013 -793 205 -445 953 -986
2696 -986 539 174 -789 616 -21 221 -981 894 38 -514 407 -330 352 -386 691 -707 -30 731
2714 731 -522 161 -399 736 -623 350 36 -563 538 -59 93 -721 701 3 -391 245 -180 192
2732 192 -201 429 -479 -90 589 -335 21 -310 522 -317 131 30 -374 451 -93 70 -482 473 23 -189
2752 -189 83 -129 148 -29 186 -367 10 401 -193 -81 -126 291 -89 -30 29 -265 360 -66 0 -297 255
2773 255 107 -151 22 -144 176 39 16 -246 40 286 -129 -97 -48 128 97 -118 34 -232 350 -34 -109 -111
2795 -111 83 237 -225 50 -165 217 70 -106 -112 -7 249 -128 -90 -24 13 192 -189 13 -170 296 5 -208
2817 -208 50 -90 318 -270 82 -190 188 127 -218 10 -63 299 -135 -43 -26 25 246 -207 16 -117 245 15
2839 15 -234 119 -142 356 -296 80 -157 158 168 -278 100 -166 341 -188 -8 -75 36 230 -224 25 -122
2860 -122 233 5 -202 78 -122 331 -252 18 -110 118 168 -291 144 -178 344 -186 -10 -77 88 201 -217
2881 -217 29 -82 240 -45 -98 -9 -30 244 -168 -44 -58 139 110 -247 82 -120 262 -125 -32 -91 96 155 -183
2904 -183 3 -72 239 -111 -26 -112 88 108 -69 -89 -63 175 30 -134 -47 58 129 -50 -64 -46 106 84 -72 -106
2928 -106 -2 209 -106 -12 -133 190 -42 35 -121 -64 183 -13 -32 -245 261 -42 8 -119 17 77 -27 120
2950 120 -305 119 151 -17 -105 -131 330 -217 157 -152 -21 131 1 92 -445 487 -172 87 -195 93 83 -179
2972 -179 393 -543 275 20 141 -272 -100 492 -474 306 -204 67 -84 137 150 -677 670 -243 136 -344
2992 -344 295 56 -384 661 -727 406 -165 388 -450 -80 669 -714 487 -332 261 -335 332 194
3010 194 -886 865 -308 186 -528 538 -2 -603 941 -845 454 -331 664 -610 -195 930 -925
3027 -925 578 -492 550 -632 437 267 -1032 984 -387 298 -759 801 -103 -702 1113 -884
3043 -884 442 -451 956 -824 -241 1150 -1016 558 -555 874 -946 515 383 -1088 936 -424
3059 -424 515 -1046 972 -134 -704 1052 -874 488 -583 1096 -946 -221 1208 -1072 523 -565
3075 -565 1035 -1178 559 514 -1186 851 -351 689 -1360 1128 -87 -721 890 -657 530 -789
3091 -789 1250 -955 -183 1055 -866 446 -570 1089 -1240 641 449 -1080 715 -232 693 -1499
3107 -1499 1280 -155 -665 658 -397 448 -976 1400 -984 -127 775 -514 264 -638 1154 -1164
3123 -1164 612 257 -779 551 -236 689 -1428 1289 -256 -482 531 -264 390 -979 1485 -1049
3139 -1049 -33 590 -225 55 -624 1242 -1165 560 104 -401 253 -185 707 -1311 1124 -332 -193
3156 -193 242 -199 377 -869 1322 -1077 196 308 -60 -40 -529 1167 -1134 620 -100 -118 1 -41 654
3175 654 -1195 974 -321 28 -32 -91 400 -791 1097 -928 303 90 11 12 -508 997 -994 665
3193 665 -235 -12 -50 -25 519 -1049 865 -336 116 -180 22 327 -671 874 -734 299 -33 121 24
3212 24 -462 797 -743 576 -347 119 -18 -17 382 -794 724 -349 218 -200 63 196 -442 636 -601
3231 -601 269 -50 137 -26 -345 585 -513 410 -300 106 1 -47 293 -572 506 -280 209 -194 24 133
3251 133 -248 409 -442 221 -27 93 -51 -198 356 -280 252 -186 47 50 -16 166 -362 337 -155 138 -135
3272 -135 -11 90 -104 203 -286 164 -28 67 -74 -83 155 -85 114 -122 -23 71 22 25 -176 155 -17 39 -50
3295 -50 -34 80 -23 79 -172 73 39 26 -60 -22 62 36 28 -49 -44 103 30 -53 -42 23 91 -51 16 -82 62 43 -20
3322 -20 -72 1 102 -26 -33 -33 12 67 -29 -25 -75 107 37 -80 16 -52 156 -100 47 -93 68 74 -58 6 -69 153 -82
3349 -82 18 -50 34 85 -52 14 -85 120 14 -55 15 -50 149 -111 43 -92 66 69 -119 33 -98 161 -97 18
3373 18 -87 40 71 -72 13 -80 135 -29 -4 -24 -12 112 -69 16 -66 79 71 -86 35 -69 126 -61 20 -82
3397 -82 58 70 -49 -7 -75 132 -56 16 -57 30 74 -11 -28 -34 67 34 -64 -37 -3 57 -18 -25 -50 38 51 -9 -54 -4 106
3426 106 -44 26 -81 67 11 28 -57 -17 60 12 -9 -87 100 -33 53 -72 2 17 6 64 -136 41 39 30 -45 -58 115
3453 115 -59 75 -73 13 16 37 21 -166 166 -87 103 -142 58 21 -48 145 -217 128 -29 110 -122 -27 172
3476 172 -141 115 -87 76 -68 106 64 -256 211 -70 110 -218 140 18 -123 224 -246 128 -99 209
3496 209 -213 -32 209 -188 129 -110 133 -207 193 46 -294 227 -23 79 -299 281 -40 -197 270 -207
3516 -207 86 -167 353 -281 -48 246 -162 100 -125 257 -322 247 51 -296 197 -5 123 -379 388 -86
3536 -86 -208 287 -155 31 -204 492 -392 -88 326 -161 -1 -148 418 -475 272 80 -248 102 46 206 -501
3557 -501 477 -106 -162 194 -57 1 -238 567 -467 -45 314 -90 -74 -122 493 -599 307 110 -226 -13 100
3578 100 272 -664 528 -98 -153 77 38 39 -378 637 -449 -49 242 -24 -109 -169 558 -607 298 141 -210
3599 -210 -54 121 337 -739 584 -58 -166 14 138 60 -475 700 -402 -81 158 112 -155 -230 591 -558
3619 -558 217 84 -110 -121 96 354 -701 498 -48 -109 -50 136 72 -490 660 -370 -80 115 162 -177
3639 -177 -260 603 -499 153 100 -25 -153 60 391 -634 395 14 -68 -85 131 153 -471 575 -288 -60
3659 -60 56 164 -115 -274 531 -420 111 56 7 -164 49 347 -551 283 48 -41 -136 98 150 -402 424 -186
3681 -186 -63 9 170 -59 -258 413 -279 80 6 51 -123 27 280 -406 206 38 -11 -120 91 132 -316 309
3703 309 -127 -62 6 137 -37 -258 322 -171 32 -26 62 -67 -36 213 -278 138 11 41 -104 30 108 -178
3725 -178 205 -96 -26 5 105 -21 -169 209 -102 -3 -16 39 -48 -17 154 -172 60 11 51 -86 -5 79 -102 106
3749 106 -77 -11 5 36 -8 -110 111 -69 23 -11 -22 12 -27 91 -126 52 8 30 -41 -24 67 -57 66 -62 17
3774 17 20 7 8 -78 59 -9 17 -19 -48 51 -6 31 -73 32 6 -8 14 -54 49 -27 33 -53 -10 39 -22 15 -66 31 0
3803 0 8 6 -66 66 -20 19 -42 9 49 -23 49 -79 54 -3 32 -35 -11 73 -50 41 -52 30 -5 -7 9 -89 80 -29 4
3832 4 -41 -9 49 -61 50 -88 50 -4 4 -26 -39 91 -69 36 -76 36 -3 -21 8 -81 92 -40 16 -41 -8 61
3858 61 -47 57 -69 55 -2 -3 -8 -41 88 -69 63 -69 38 7 -27 24 -88 87 -66 28 -53 -17 43 -53 37
3883 37 -81 57 -9 4 -12 -48 66 -53 45 -74 38 20 -12 18 -68 78 -51 31 -40 -1 47 -33 22 -62 66 -7
3909 -7 2 -18 -7 49 -29 39 -69 37 3 -2 1 -41 60 -54 26 -51 2 18 -8 20 -52 63 -26 24 -48 19 8 -10 22 -58
3939 -58 36 -10 30 -37 -9 45 -18 17 -40 37 -14 15 -18 -20 33 -16 14 -65 46 -12 17 -15 -33 33 -26 59 -61 14 9 16 -21
3970 -21 -35 52 -33 37 -36 7 -15 29 25 -78 57 -18 43 -61 27 17 -37 78 -70 51 -24 74 -51 -39 59 -70 45
3997 45 -67 73 -81 53 30 -104 79 -38 82 -125 73 -18 -68 88 -80 52 -92 135 -111 -29 92 -67
4019 -67 43 -102 140 -158 94 32 -97 58 -39 145 -200 150 -33 -57 92 -68 77 -143 217 -140 -22
4040 -22 93 -76 41 -132 207 -221 103 44 -125 45 -50 176 -299 194 -28 -69 73 -64 85 -217 273
4061 273 -168 -20 91 -42 41 -148 267 -256 120 56 -99 41 -35 225 -320 231 -18 -80 46 -19 106 -272
4083 -272 321 -157 -37 56 16 18 -195 285 -268 95 19 -77 -6 -57 213 -345 225 -21 -68 21 8 104 -298 348
4107 348 -176 -61 51 54 -13 -203 335 -260 70 30 10 -62 -46 256 -324 184 -17 -10 -43 21 97 -271 307 -157
4131 -157 -27 11 98 -37 -190 309 -242 55 13 60 -139 -17 244 -313 134 -6 37 -115 55 111 -253 239
4153 239 -107 15 -40 122 -24 -156 272 -212 78 -32 80 -137 5 228 -295 132 -20 73 -169 85 102
4174 102 -222 194 -80 29 -111 143 -22 -159 209 -142 71 -87 116 -110 -14 164 -229 126 -61 95
4194 95 -171 103 68 -175 173 -78 52 -133 169 -21 -137 176 -93 57 -106 128 -103 -13 143 -154 73
4215 73 -95 134 -149 50 58 -140 125 -98 73 -139 141 -35 -104 116 -69 57 -109 125 -92 -31 106 -111
4237 -111 52 -69 120 -119 21 58 -93 84 -93 83 -90 93 -19 -52 85 -53 58 -83 88 -65 5
4258 5 55 -76 32 -48 70 -78 -2 37 -64 48 -69 60 -72 45 -3 -49 41 -43 53 -67 53 -28 14 13 -35
4283 -35 27 -33 45 -39 -4 27 -33 37 -26 31 -20 5 17 -38 32 -32 32 -38 12 -11 3 1 -28 3 -15 16 -10 -7 -3 -11 0 -15
4315 -15 -14 8 -21 14 -33 15 -14 19 6 -16 26 -3 6 -21 10 -4 16 -4 -9 10 -1 2 -15 -26 22 -32 23 -20 16 9 6 23 -40
4348 -40 51 -12 21 -21 3 -13 -5 1 -9 2 -19 7 -12 -22 14 -10 14 -10 5 11 -8 26 -29 38 -13 29 -11 1 12 -14 32 -35
4380 -35 24 -17 14 -21 -8 6 -16 8 -32 4 10 -7 2 -44 24 -14 10 -13 -12 3 -15 16 -41 31 -30 17 -24 -2 5 -11 17 -25
4412 -25 12 2 19 11 -6 19 1 6 2 -7 11 -7 17 -43 17 -35 10 -22 -4 -3 -16 16 -34 20 -12 16 -18 -2 -4 -7 -4 5 -11 3 19
4447 19 5 -23 8 -7 6 -21 4 -5 -4 27 -26 29 -18 32 -21 20 2 8 -4 -19 19 -14 30 -23 7 -9 13 2 -24 1 -3 -10 0
4480 0 -22 10 -24 20 -23 -3 -6 -7 7 -23 26 -19 30 -23 35 -12 11 11 -27 10 -25 20 -13 8 3 -10 25 2 3 3 10 6 -38 34 -22
4515 -22 16 -29 25 -24 1 22 -19 11 -21 22 -46 27 -5 0 -13 -11 -16 7 16 2 -4 18 -9 -10 2 35 -24 2 30 -12 -5 -17 46 -54
4549 -54 30 2 -3 -18 17 6 -28 39 -17 -3 -13 23 -23 9 10 -34 4 24 -5 -22 3 26 -70 25 3 -11 -28 26 13 -69 63
4580 63 -25 4 -22 63 -23 -4 33 -16 14 -2 18 -31 14 17 -57 17 16 -22 -23 16 13 -75 59 -28 -10 -39 61 -31 -46 63 -44
4611 -44 1 -13 39 -53 10 38 -54 3 1 -4 -28 12 27 -74 59 -22 -9 -15 40 -6 -48 85 -52 10 -23 47 -46 -4 61 -52
4641 -52 3 5 15 -56 -2 36 -68 28 -14 -28 -17 7 16 -82 66 -42 -9 -4 28 -29 -29 67 -62 11 11 27 -47 12 35 -59 23
4672 23 26 -19 -6 15 30 -59 54 -2 -6 4 8 -4 -47 72 -52 5 4 13 -43 -7 30 -59 7 20 -25 -19 7 14 -57 22 13 -29 10
4705 10 0 10 -43 71 -41 -9 4 9 -5 -9 39 -38 7 26 0 -26 11 11 -28 -1 28 -36 18 -9 26 -51 38 -13 -19 4 -2 8
4737 8 -42 37 -39 7 -1 1 -22 1 23 -17 -2 16 -14 0 3 21 -17 22 13 -23 37 -13 27 -31 43 -35 11 -7 -4 4 -6 18 -29 -6
4771 -6 -9 3 -14 -2 5 -18 4 21 -19 19 -23 27 -42 31 -20 0 -4 -15 11 -35 30 -40 13 -24 16 -13 6 8 2 12 -3 4 7 0 15
4806 15 -19 11 9 1 14 -20 36 -44 27 -36 11 -24 -2 -3 -15 23 -17 19 -23 15 -6 4 8 -9 7 2 -5 11 -18 20 -26 27 -14
4839 -14 18 -5 6 15 -27 37 -18 34 -24 19 -3 22 5 -11 13 -12 7 1 -20 11 -23 10 -12 -8 -2 -20 25 -48 26 -36 28 -23
4871 -23 2 -11 -5 16 -29 20 -30 18 -8 14 -3 -5 2 -10 -15 15 -18 11 -30 7 -23 14 -5 -5 13 -24 26 -38 25 -33 23 -26 1
4904 1 -7 -17 2 -26 -6 -20 -9 -8 -18 12 -15 -6 -5 -12 18 -30 27 -34 39 -20 22 -11 1 8 -17 13 -32 19 -19 16 -20 3 -7 -7
4938 -7 10 5 -9 10 -13 22 -18 21 -16 14 -8 -16 13 -24 21 -40 35 -29 20 -21 -3 -11 -11 -2 -11 10 -8 20 -16 -3 20 6 2 8 -4
4973 -4 26 -14 27 -30 41 -23 16 -12 9 -9 -29 23 -36 27 -35 21 -15 5 -10 -9 2 2 5 -3 -8 15 -26 9 -21 10 -11 -8 10 -33
5007 -33 34 -43 35 -42 39 -24 10 10 -28 18 -21 35 -32 26 -1 -6 9 -2 5 -13 -8 0 -24 27 -32 25 -44 25 -28 -6 14 -30 39
5040 39 -37 52 -55 47 8 -10 19 -7 21 -21 24 1 -21 30 -19 28 -30 20 -16 -6 42 -45 54 -39 59 -58 37 -2 -22
5069 -22 18 -29 54 -60 54 -27 5 9 -15 4 -31 38 -27 -20 16 -43 34 -46 53 -60 20 6 -24 36 -37 66 -76 63
5097 63 -39 11 8 -7 30 -45 46 -39 5 0 -22 16 -31 45 -45 29 12 -32 29 -41 68 -85 62 -41 6 0 -19 33 -65
5126 -65 76 -61 26 -15 3 -1 -19 41 -46 31 1 -13 26 -18 58 -65 72 -23 3 13 -13 33 -74 94 -67 48 -30
5153 -30 20 -6 -22 52 -67 31 -21 -1 -12 -4 39 -64 44 -11 -3 16 -24 24 -77 85 -71 31 -26 13 -19 -46 76
5180 76 -71 63 -26 37 -23 18 38 -42 41 -20 8 -5 -2 31 -53 74 -48 15 -7 5 3 -53 79 -103 58 -53 33
5207 33 -29 0 36 -64 52 -30 26 -26 25 7 -38 57 -23 -2 -4 5 10 -36 76 -82 56 -41 25 -19 3 61 -72 60
5235 60 -47 40 -50 33 -1 -37 32 -28 3 -12 18 -1 -46 41 -54 19 -23 11 -15 -20 70 -74 55 -40 36 -49 17 5 -33
5264 -33 50 -16 27 -27 43 1 -1 32 -10 11 -5 21 1 -35 56 -50 51 -44 43 -26 10 18 -49 47 -37 41 -55 40 -39 -18
5294 -18 -9 -9 3 -16 17 -2 -13 26 -24 17 -13 16 -5 -3 36 -42 58 -36 51 -38 50 0 2 20 -19 14 -34 30 -25 4 8 -4
5326 -4 2 3 -2 3 -14 18 -50 29 -34 23 -22 -6 5 -29 23 -39 36 -43 28 -29 14 -7 -5 -1 1 16 7 7 14 -10 12 0 5 -7 -7 18 -27
5363 -27 48 -20 31 -39 21 -20 2 14 -26 20 -18 27 -19 7 -19 -4 -6 9 -13 0 -10 19 -19 36 -27 25 -18 8 -4 -20 15
5394 15 -22 31 -31 35 -28 30 -13 10 9 5 11 9 1 -3 0 18 -8 -2 -4 -9 13 -19 20 -44 29 -43 24 -38 11 -26 -21 10 -26 16 -30 27
5430 27 -22 22 -11 -3 0 4 -20 2 -22 20 -28 23 -25 4 -12 -6 5 -15 19 -34 40 -39 36 -30 7 -18 -17 8 -20 1 -30 -11 -20
5463 -20 -20 -3 -18 -5 -18 -5 1 -36 27 -43 38 -41 29 -37 20 -4 -22 33 -23 37 -40 31 -22 9 -4 -9 -6 -2 12 -13 -13 30 -27
5496 -27 32 -31 13 -17 3 8 -40 42 -43 53 -63 59 -40 15 6 -23 17 -31 37 -46 11 -5 -8 11 -9 29 -29 25 19 -36 43
5527 43 -39 65 -66 63 -27 2 13 -36 42 -61 72 -81 47 -16 -7 -10 -17 37 -49 29 -13 -28 8 -33 32 -65 64 -37
5555 -37 -24 25 -40 49 -91 103 -97 53 -16 2 -4 -32 65 -87 73 -35 13 -1 4 32 -67 69 -22 -20 16 -20 30 -84
5583 -84 93 -89 32 -9 -4 4 -63 85 -120 79 -57 29 -29 14 29 -70 92 -58 14 0 0 -1 -63 100 -87 25
5609 25 12 4 0 -64 121 -135 100 -47 49 -26 13 56 -107 116 -68 47 -41 28 -14 -52 89 -81 31 5 13 -25
5635 -25 -49 105 -122 80 -47 27 -36 1 73 -129 132 -79 71 -61 63 -9 -44 101 -77 44 -22 44 -24 -15
5659 -15 83 -102 71 -20 21 -24 7 70 -141 122 -74 55 -67 66 4 -72 117 -95 56 -51 70 -63 -13
5682 -13 65 -89 44 -39 27 -30 13 61 -103 111 -44 38 -36 42 21 -83 133 -95 69 -67 89 -74 -6 71
5706 71 -79 41 -42 49 -67 24 30 -79 61 -32 13 -47 21 19 -90 117 -82 33 -59 73 -61 -25 77 -81 48
5731 48 -39 66 -78 53 20 -55 53 -13 17 -37 50 15 -63 85 -46 30 -35 45 -24 -31 72 -73 51 -56 65
5756 65 -86 40 17 -66 32 -16 34 -57 53 -8 -37 43 -24 5 -21 30 -8 -35 78 -60 41 -38 61 -56 27 25 -47
5783 -47 33 -24 41 -63 55 -18 -15 17 -10 -12 -16 34 -11 -32 41 -39 12 -25 28 -28 -9 44 -58 39 -45 46 -65 43 -14
5812 -14 -20 12 -8 22 -28 45 -18 3 21 -4 2 2 5 7 -11 44 -52 39 -27 37 -35 22 16 -30 38 -22 33 -34 35 -26 2 3 -11 -13
5846 -13 -2 -5 -17 -20 18 -39 9 -18 2 -9 -11 30 -41 32 -33 23 -28 31 -17 2 24 -1 13 -14 24 -6 0 11 -6 1 4 -12 14
5879 14 -21 35 -42 22 -38 20 -16 6 5 -28 20 -32 20 -33 16 -26 -4 -12 -13 -3 0 -9 0 -19 19 -20 23 -5 16 12 -8 24 -33 40
5913 40 -28 38 -25 36 -5 4 2 -10 9 -10 5 -20 6 -11 1 -9 -17 -6 12 -8 29 -31 31 -31 30 -30 18 8 12 13 -22 34 -34
5946 -34 38 -16 21 -17 23 -16 -5 0 -5 3 -3 -9 10 -16 15 -3 3 0 -11 12 -25 34 -48 45 -39 26 -33 7 -6 -27 12 -25 24 -34
5980 -34 32 -19 6 5 1 -7 -1 10 -3 -20 25 -26 29 -21 31 -40 11 12 -37 26 -46 55 -57 54 -41 18 3 -9 15 -17 47
6011 47 -37 14 0 -21 -8 -24 27 -45 10 15 -33 25 -45 48 -76 63 -38 1 4 -15 42 -58 83 -76 39 -10 7 2
6039 2 -23 49 -60 40 7 -15 14 -23 63 -98 68 -23 0 21 -29 70 -94 106 -94 44 -26 2 7 -55 75 -104
6065 -104 56 -37 -8 -13 -13 61 -92 62 -28 -15 18 -22 74 -110 129 -73 45 -9 17 8 -83 113 -117 70 -49 32
6091 32 -26 -12 49 -104 76 -40 -1 -3 3 33 -100 112 -83 22 -8 10 14 -81 140 -141 76 -57 47 -42 1 75
6117 75 -123 89 -61 52 -40 43 33 -72 105 -60 40 -18 34 4 -77 124 -129 80 -46 47 -50 -11 93 -133
6141 -133 111 -81 69 -88 61 -1 -95 83 -73 37 -53 61 -36 -41 89 -102 67 -51 51 -60 -9 95
6163 95 -135 113 -96 84 -94 81 2 -81 107 -80 82 -90 120 -69 -24 74 -80 67 -63 69 -83 -2
6185 -2 69 -130 95 -90 90 -97 71 10 -93 121 -112 93 -118 123 -77 -7 87 -84 56 -73 112 -105
6207 -105 30 59 -96 76 -65 89 -100 52 28 -103 122 -105 97 -116 134 -81 -24 89 -92 84 -98
6228 -98 111 -122 46 25 -79 55 -50 64 -110 59 22 -83 90 -70 80 -106 95 -45 -40 93 -97 93
6250 93 -106 129 -106 54 28 -72 56 -48 70 -94 56 -17 -61 50 -44 47 -71 72 -21 -47 65 -77 45
6273 45 -85 105 -99 23 12 -57 44 -63 82 -107 67 -26 -22 30 -17 19 -57 61 -19 -21 57 -44 38 -46 79
6298 79 -41 11 37 -47 40 -60 79 -97 63 -37 -11 6 -8 18 -55 60 -45 -5 10 -10 -3 -28 41 -39 -9 27 -48
6325 -48 38 -38 54 -76 46 -24 -10 11 -25 31 -63 77 -33 15 -9 24 -1 -7 29 -15 20 11 -21 28 -20 32 -49 22 3
6354 3 -27 31 -39 38 -68 60 -30 14 -18 3 2 -34 25 -32 28 2 16 7 -3 11 -9 9 14 -27 36 -29 47 -31 44 -26 10
6385 10 16 -5 25 -29 45 -45 22 -12 16 -2 9 1 1 4 5 -17 9 -23 20 -27 7 -1 -32 19 -40 38 -38 44 -32 25 -20 13 -1
6418 -1 -9 17 -21 24 -7 -3 -4 -3 6 9 0 14 -34 30 -37 34 -42 27 -19 22 0 -13 28 -36 40 -41 30 -39 23 -29 -2 -5 -1 -5 -9 -14 10
6455 10 -32 22 -11 18 -13 6 10 -18 47 -38 43 -45 48 -33 35 7 1 26 -17 16 -24 24 -25 -9 -6 -5 -9 -12 5 0 -20 17 -34 25
6489 25 -33 37 -39 14 7 -18 32 -44 44 -59 51 -37 14 -16 8 4 -17 34 -22 22 -3 8 5 -10 30 -19 8 19 -20 19 -25
6520 -25 45 -77 58 -44 20 -27 2 11 -43 44 -58 27 -42 35 -41 -2 24 -28 9 -5 2 -3 -1 39 -69 63 -34 16 -8
6549 -8 11 23 -72 95 -70 66 -56 61 -31 6 46 -56 49 -49 32 -45 12 16 -63 41 -41 24 -33 18 5 -86 94
6576 94 -95 63 -78 75 -36 -32 82 -78 73 -72 90 -70 40 25 -49 54 -37 49 -63 38 17 -52 82
6599 82 -69 55 -62 56 -24 -44 99 -97 79 -90 104 -99 34 30 -81 56 -57 71 -100 57 -22 -56
6621 -56 51 -53 42 -76 57 -25 -45 90 -93 81 -78 96 -78 21 46 -79 81 -65 101 -122 94 -27
6643 -27 -39 37 -38 46 -76 79 -43 -33 62 -51 45 -75 82 -68 1 61 -84 74 -73 93 -126 83 -30
6666 -30 -37 41 -36 47 -90 105 -53 -14 29 -23 34 -31 76 -50 -3 49 -47 40 -52 86 -91 62 -17 -30 35 -51 55
6693 55 -94 113 -90 10 0 -6 2 -44 80 -75 25 18 -28 10 -9 46 -78 41 0 -31 24 -25 58 -88 111 -73
6719 -73 37 2 5 12 -41 88 -82 61 -13 7 -17 1 37 -55 48 2 -17 15 -23 28 -79 75 -59 1 -3 -19 26 -63
6747 -63 89 -92 72 -27 12 -15 8 27 -62 54 -16 13 1 24 8 -38 48 -32 -9 23 -6 22 -51 81 -68 59 -8
6774 -8 6 -13 -8 50 -78 67 -34 15 -26 34 -13 -31 28 -35 -10 10 -27 4 -33 48 -48 17 16 -12 7 -27 65 -63 58
6803 58 -21 34 -16 20 4 -26 38 -11 2 8 8 -13 -4 14 -20 -3 29 -25 17 -32 32 -62 31 -15 2 0 0 5 -39 41 -29 4 -18
6836 -18 19 -23 3 0 -16 -25 25 -30 23 -15 30 -23 1 20 -25 26 -16 39 -35 31 -25 16 -3 13 -19 -13 10 -9 -16 9 -16 2
6868 2 6 -3 -7 -16 30 -39 40 -27 22 -33 17 -9 1 7 -11 4 -23 20 -25 13 -1 -2 4 12 -3 9 -10 34 -28 41 -22 14 1 4 10 -28
6904 -28 26 -28 16 -44 16 -30 7 -14 -6 -5 -6 6 -4 -9 6 -16 11 -17 -12 -12 -14 18 -21 24 -50 32 -30 29 -23 10 6 -15 24 -26
6938 -26 20 -29 15 -18 4 -10 0 -15 6 -9 6 -16 8 -28 8 -25 -5 -11 -7 -1 -31 25 -49 23 -34 30 -38 18 -14 -12 7 -11
6970 -11 20 -14 12 -3 8 1 1 -2 -5 -6 11 -21 29 -27 33 -31 27 -27 14 14 -16 13 -27 19 -38 30 -34 9 -28 6 -9 -19 2
7003 2 -21 -12 7 -23 -2 -25 7 -27 -2 4 -29 15 -24 42 -53 31 -20 22 -13 8 6 -20 37 -24 18 -10 17 -14 -11 10 -12 -7 5
7036 5 -20 -5 -27 24 -40 32 -22 -4 -20 -14 21 -56 58 -52 29 -28 33 -28 -10 17 -31 10 -10 13 -18 -1 37 -21 28 -14
7066 -14 5 -7 9 34 -57 66 -59 42 -44 41 -15 -21 42 -51 38 -44 34 -63 8 3 -42 0 -24 17 -29 12 18 -48 46 -38
7096 -38 40 -47 27 -18 -35 61 -62 47 -57 77 -75 31 21 -17 26 -21 52 -67 40 2 -28 20 -16 27 -55 44
7122 44 -14 -41 39 -68 31 -83 77 -80 28 10 -54 40 -51 80 -107 65 -32 -18 30 -6 30 -65 73 -36 -17
7147 -17 30 -21 48 -69 86 -59 12 29 -34 43 -77 108 -109 74 -31 -5 8 -19 46 -88 88 -61 -3 1 -26
7172 -26 9 -74 75 -70 0 26 -46 33 -62 97 -111 66 -13 3 18 -37 88 -113 104 -73 40 -15 -3 31 -60
7197 -60 87 -77 29 -6 -21 -5 -51 73 -102 50 -26 -9 14 -41 78 -129 98 -73 26 -29 -11 29 -90 89
7221 89 -93 48 -30 8 -7 -30 65 -84 56 -14 -13 9 -28 75 -94 100 -48 26 -1 -11 53 -84 93 -100 55
7246 55 -43 28 -13 -38 49 -82 49 -43 2 1 -23 25 -83 68 -46 11 5 -16 33 -85 92 -80 49 -51 14 -13
7272 -13 -33 56 -75 57 -37 33 -20 8 24 -45 54 -31 16 -4 -5 27 -58 73 -75 37 -23 10 1 -42 55 -83 52 -63
7300 -63 24 -49 12 1 -50 51 -40 28 -21 6 15 -18 39 -45 19 -11 -1 19 -33 59 -67 56 -42 19 -31 12 29 -46 52
7329 52 -41 38 -27 24 -12 -7 22 -32 7 -19 -11 0 -33 32 -59 36 -32 -10 -9 -21 22 -74 45 -52 36 -35 32 -18 -2 25 -29
7360 -29 29 -10 19 3 7 21 -22 27 3 -15 -12 -25 24 -49 45 -57 22 -28 5 -3 -29 16 -40 12 -31 9 -27 -5 -14 -21 -6 1 -14
7393 -14 -14 -30 12 -30 32 -26 19 -10 -9 25 -28 42 -33 41 -27 32 -5 2 2 -7 8 -16 0 2 -5 -10 -15 3 -12 -7 15 -28 26 -37 31
7428 31 -43 35 -31 13 -11 -14 16 -29 23 -31 28 -14 15 -19 5 -3 -6 9 0 -7 22 -6 33 -19 16 7 4 28 -18 31 -21 26 -32 20
7462 20 -21 6 -23 -6 6 -20 -1 -18 13 -4 1 4 -19 4 3 -11 12 -21 25 -23 37 -34 28 -18 6 7 -14 27 -28 33 -32 30
7494 30 -22 21 2 -3 9 -5 9 20 -3 3 -6 25 -20 -1 10 -10 -5 -20 29 -47 32 -40 34 -47 11 -12 -25 22 -10 17 -32 25
7526 25 -12 10 12 -4 7 -3 -5 0 -1 23 -19 40 -28 23 -19 16 -4 -29 30 -23 46 -31 49 -37 17 -4 -3 -2 -25 32 -34 -5 -7 -22
7560 -22 1 -19 16 -24 14 9 -24 51 -41 53 -52 60 -41 13 19 -9 29 -32 55 -62 34 -12 5 -14 -2 32 -41 31 -2
7589 -2 -14 21 -24 32 -47 48 -41 5 18 -30 37 -53 83 -79 49 -39 -2 -19 -16 39 -68 59 -17 -1 -9 -5 20 -55 52
7618 52 -26 15 13 -24 47 -57 83 -73 52 -23 2 1 -29 47 -89 69 -56 5 -26 4 10 -65 59 -24 9 -4 -5 15
7646 15 -58 77 -57 18 -14 -6 7 -46 74 -103 80 -52 30 -28 14 22 -63 75 -47 29 -24 29 -7 -39 68 -42
7672 -42 22 4 19 -5 -39 75 -84 43 -45 22 -33 -3 27 -78 64 -56 29 -40 36 -18 -30 35 -34 10 -10 22 -19
7699 -19 -8 54 -65 33 -12 12 -19 -8 35 -78 53 -47 37 -48 58 -19 -26 37 -32 21 -41 39 -49 0 7 -37 1 -26 1
7728 1 -42 -12 12 -63 40 -50 20 -45 25 -6 -31 51 -46 29 -44 58 -50 21 4 -23 8 -19 18 -28 19 2 -19 27 -29
7757 -29 20 -31 23 -1 -37 45 -46 35 -55 52 -41 10 12 -26 25 -35 45 -52 17 -23 -13 -10 -18 8 -25 -1 4 -14 28 -25 27 -29
7789 -29 32 -16 2 26 -32 35 -36 42 -50 34 -20 -4 8 -17 7 -24 14 -9 -17 6 -18 1 -6 -7 -13 -19 29 -32 30 -36 20 -38 13
7822 13 -8 -10 7 -28 14 -19 13 -8 4 -4 6 -4 7 4 7 -17 31 -22 29 -13 15 -3 -12 7 -25 19 -34 20 -31 4 -31 -8 -14
7855 -14 -10 -12 4 -13 2 -6 14 -15 3 -2 -13 18 -19 25 -36 36 -26 8 -13 0 11 -19 13 -20 13 -5 2 -11 8 0 -3 -3 21 -18
7889 -18 20 -20 23 -31 7 -15 -9 -9 -21 13 -27 19 -37 19 -11 15 3 -1 2 -11 -2 10 -13 13 -6 26 -20 -2 0 2 23 -21 31 -31
7923 -31 23 -37 23 -1 9 7 -9 -2 -21 6 1 0 -7 1 -11 -4 -16 1 -30 10 -29 22 -27 21 -28 11 -7 -11 17 -26 22 -22 25 -21
7957 -21 19 -5 19 3 4 8 8 3 3 -6 9 -3 13 -13 5 5 -4 16 -25 24 -29 32 -30 22 -12 2 -6 -21 5 -20 13 -24 -7 -21 -2
7992 -2 -12 -9 -9 5 -12 -1 -14 10 -21 22 -11 18 8 0 20 -24 35 -31 29 -25 23 -16 6 -7 -17 7 -21 11 -17 2 -4 -19 -7
8025 -7 -12 -11 -6 -12 -1 -26 22 -33 28 -24 18 -20 9 12 -31 32 -27 31 -24 26 -20 1 20 7 5 -7 18 -8 -5 18 -18 19 -16 9
8059 9 -10 -18 10 -50 30 -44 25 -45 33 -26 -13 8 -18 6 -33 39 -30 5 8 -4 0 -8 21 -15 0 29 -25 20 -28 38 -38 28 -16
8092 -16 -6 17 -26 21 -44 36 -44 18 -8 -7 1 -8 21 -19 10 -10 -13 0 -29 4 -39 15 -17 -23 12 -13 21 -40 50 -37 20 -19 15
8125 15 2 -15 42 -42 39 -12 17 -1 10 9 -22 38 -3 -20 -2 -11 12 -45 50 -38 15 -6 9 -11 -23 44 -67 34 -42 32
8155 32 -42 4 11 -54 33 -35 9 -26 5 -5 -33 40 -37 12 -16 19 -1 -27 65 -65 50 -33 40 -35 7 30 -70 60 -57
8184 -57 31 -53 27 -16 -43 31 -42
8191d2
##END NTUPLES=NMR FID
##END=
