##TITLE=1H_X2309
 CDCl3, 8 sc, 
 23.9.2020
##JCAMPDX= 6.0         $$ Bruker NMR JCAMP-DX V2.0
##DATA TYPE= NMR FID
##DATA CLASS= NTUPLES
##ORIGIN= UXNMR, Bruker Analytische Messtechnik GmbH
##OWNER= root
$$ XWIN-NMR		Version 3.5
$$ Wed Sep 23 12:47:35 2020 Russian Standard Time (UT+4h)  she@DPX200
##.OBSERVE FREQUENCY= 200.1315066352
##.OBSERVE NUCLEUS= ^1H
##.DELAY= (6, 6)
##.ACQUISITION MODE= SIMULTANEOUS
##.ACQUISITION SCHEME= undefined
##.AVERAGES= 8
##.DIGITISER RES= 18
##SPECTROMETER/DATA SYSTEM= spect
##.PULSE SEQUENCE= zg30
##.SOLVENT NAME= CDCl3
##.SHIFT REFERENCE= (INTERNAL, CDCl3, 0, 15.7039)
##AUDIT TRAIL= $$ (NUMBER, WHEN, WHO, WHERE, WHAT)
$$ ##TITLE= Audit trail, XWIN-NMR		Version 3.5
$$ ##JCAMPDX= 5.01
$$ ##ORIGIN= Bruker BioSpin GmbH
$$ ##OWNER= she
$$ F:/spectra/data/she/nmr/H-F/1/audita.txt
$$ ##AUDIT TRAIL=  $$ (NUMBER, WHEN, WHO, WHERE, WHAT)
(   1,<2020-09-23 12:46:44.14 +0400>,<she>,<DPX200>,
      <created by zg, POWCHK disabled, PULCHK disabled
       configuration hash MD5:
       00 E9 B6 7A A2 85 ED C7 34 08 36 98 17 FE 4E 26
       data hash MD5: 16K
       CC 36 E4 5A 1A BE A1 D9 61 EB 30 1D 2B D4 82 0C>)
$$ ##END=
$$ 
$$ hash MD5
$$ 0D 22 3D C7 AD 0B B4 B7 FF F6 12 CF CB 89 45 F3
##$RELAX= 
##$RELAX= 
##$RELAX= 
##$RELAX= 
##$RELAX= 
##$RELAX= 
$$ Bruker specific parameters
$$ --------------------------
##$DU= <F:/spectra>
##$EXPNO= 1
##$NAME= <H-F>
##$PROCNO= 1
##$TYPE= <nmr>
##$USER= <she>
##$AMP= (0..31)
100 100 100 100 100 100 100 100 100 100 100 100 100 100 100 100 100 100 
100 100 100 100 100 100 100 100 100 100 100 100 100 100 
##$AQSEQ= 0
##$AQ_mod= 1
##$AUNM= <au_zg>
##$AUTOPOS= <>
##$BF1= 200.13
##$BF2= 200.13
##$BF3= 200.13
##$BF4= 200.13
##$BF5= 200.13
##$BF6= 200.13
##$BF7= 200.13
##$BF8= 200.13
##$BYTORDA= 1
##$CFDGTYP= 0
##$CFRGTYP= 5
##$CHEMSTR= <none>
##$CNST= (0..31)
1 1 145 1 1 1 1 1 1 1 1 1 1 1 1 1 1 1 1 1 1 1 1 1 1 1 1 1 1 1 1 1 
##$CPDPRG= <>
##$CPDPRG1= <>
##$CPDPRG2= <>
##$CPDPRG3= <>
##$CPDPRG4= <mlev>
##$CPDPRG5= <mlev>
##$CPDPRG6= <mlev>
##$CPDPRG7= <mlev>
##$CPDPRG8= <mlev>
##$CPDPRGB= <>
##$CPDPRGT= <>
##$D= (0..31)
0 1.2 0 0 0 0 0 0 0 0.06 0 0.03 0 0 0 0 0.0002 0 0 0 0 0 0 0 0 0 0 0 0 
0 0 0 
##$DATE= 1600850803
##$DBL= (0..7)
120 120 120 120 120 120 120 120 
##$DBP= (0..7)
150 150 150 150 150 150 150 150 
##$DBP07= 0
##$DBPNAM0= <>
##$DBPNAM1= <>
##$DBPNAM2= <>
##$DBPNAM3= <>
##$DBPNAM4= <>
##$DBPNAM5= <>
##$DBPNAM6= <>
##$DBPNAM7= <>
##$DBPOAL= (0..7)
0.5 0.5 0.5 0.5 0.5 0.5 0.5 0.5 
##$DBPOFFS= (0..7)
0 0 0 0 0 0 0 0 
##$DE= 6
##$DECBNUC= <off>
##$DECIM= 32
##$DECNUC= <off>
##$DECSTAT= 4
##$DIGMOD= 1
##$DIGTYP= 9
##$DL= (0..7)
0 120 120 120 120 120 120 120 
##$DP= (0..7)
150 150 150 150 150 150 150 150 
##$DP07= 0
##$DPNAME0= <>
##$DPNAME1= <>
##$DPNAME2= <>
##$DPNAME3= <>
##$DPNAME4= <>
##$DPNAME5= <>
##$DPNAME6= <>
##$DPNAME7= <>
##$DPOAL= (0..7)
0.5 0.5 0.5 0.5 0.5 0.5 0.5 0.5 
##$DPOFFS= (0..7)
0 0 0 0 0 0 0 0 
##$DQDMODE= 0
##$DR= 18
##$DS= 0
##$DSLIST= <SSSSSSSSSSSSSSS>
$$ [...]
##$SUBNAM2= <"">
##$SUBNAM3= <"">
##$SUBNAM4= <"">
##$SUBNAM5= <"">
##$SUBNAM6= <"">
##$SUBNAM7= <"">
##$SUBNAM8= <"">
##$SUBNAM9= <"">
##$SW= 16.880792210976
##$SWIBOX= (0..15)
0 0 2 0 0 0 0 0 0 0 0 0 0 0 0 0 
##$SW_h= 3378.37837837838
##$TD= 16384
##$TD0= 1
##$TE= 0
##$TE2= 300
##$TE3= 300
##$TEG= 300
##$TL= (0..7)
0 120 120 120 120 120 120 120 
##$TP= (0..7)
150 150 150 150 150 150 150 150 
##$TP07= 0
##$TPNAME0= <>
##$TPNAME1= <>
##$TPNAME2= <>
##$TPNAME3= <>
##$TPNAME4= <>
##$TPNAME5= <>
##$TPNAME6= <>
##$TPNAME7= <>
##$TPOAL= (0..7)
0.5 0.5 0.5 0.5 0.5 0.5 0.5 0.5 
##$TPOFFS= (0..7)
0 0 0 0 0 0 0 0 
##$TUNHIN= 0
##$TUNHOUT= 0
##$TUNXOUT= 0
##$USERA1= <user>
##$USERA2= <user>
##$USERA3= <user>
##$USERA4= <user>
##$USERA5= <user>
##$V9= 5
##$VALIST= <valist>
##$VCLIST= <CCCCCCCCCCCCCCC>
##$VD= 0
##$VDLIST= <DDDDDDDDDDDDDDD>
##$VPLIST= <PPPPPPPPPPPPPPP>
##$VTLIST= <TTTTTTTTTTTTTTT>
##$WBST= 1024
##$WBSW= 4
##$XGAIN= (0..3)
0 0 0 0 
##$XL= 0
##$YL= 0
##$YMAX_a= 255739
##$YMIN_a= -237952
##$ZGOPTNS= <>
##$ZL1= 120
##$ZL2= 120
##$ZL3= 120
##$ZL4= 120
##$ABSF1= 10
##$ABSF2= 0
##$ABSG= 5
##$ABSL= 3
##$ALPHA= 0
##$AQORDER= 0
##$ASSFAC= 0
##$ASSFACI= 0
##$ASSFACX= 0
##$ASSWID= 0
##$AUNMP= <proc_1d>
##$AZFE= 0.1
##$AZFW= 0.1
##$BCFW= 1
##$BC_mod= 2
##$BYTORDP= 1
##$COROFFS= 0
##$CY= 11.3945322036743
##$DATMOD= 1
##$DC= 2
##$DFILT= <>
##$DTYPP= 0
##$F1P= 16.9975609425685
##$F2P= -3.02152046262296
##$FCOR= 0.5
##$FTSIZE= 0
##$FT_mod= 4
##$GAMMA= 1
##$GB= 0.15
##$INTBC= 1
##$INTSCL= 1
##$ISEN= 128
##$LB= 0.24
##$LEV0= 0
##$LPBIN= 0
##$MAXI= 10000
##$MC2= 0
##$MEAN= 0
##$ME_mod= 0
##$MI= 1.114404
##$NCOEF= 0
##$NC_proc= 0
##$NLEV= 6
##$NOISF1= 3.799351
##$NOISF2= 2.8
##$NSP= 1
##$NTH_PI= 0
##$NZP= 0
##$OFFSET= 15.70392
##$PC= 1
##$PHC0= -10126.47
##$PHC1= 11.4009
##$PH_mod= 1
##$PKNL= yes
##$PPARMOD= 0
##$PSCAL= 0
##$PSIGN= 0
##$REVERSE= no
##$SF= 200.130013532006
##$SI= 16384
##$SIGF1= 3
##$SIGF2= 2
##$SINO= 400
##$SIOLD= 16384
##$SREGLST= <1H.CDCl3>
##$SSB= 0
##$STSI= 0
##$STSR= 0
##$SW_p= 3612.71676300578
##$SYMM= 0
##$S_DEV= 0
##$TDeff= 0
##$TDoff= 0
##$TI= <>
##$TILT= no
##$TM1= 0
##$TM2= 0
##$TOPLEV= 0
##$USERP1= <user>
##$USERP2= <user>
##$USERP3= <user>
##$USERP4= <user>
##$USERP5= <user>
##$WDW= 1
##$XDIM= 8192
##$YMAX_p= 0
##$YMIN_p= 0
$$ End of Bruker specific parameters
$$ ---------------------------------
##NTUPLES= NMR FID
##VAR_NAME=  TIME,          FID/REAL,        FID/IMAG
##SYMBOL=    X,             R,               I
##VAR_TYPE=  INDEPENDENT,   DEPENDENT,       DEPENDENT
##VAR_FORM=  AFFN,          ASDF,            ASDF
##VAR_DIM=   8192,          8192,            8192
##UNITS=     SECONDS,       ARBITRARY UNITS, ARBITRARY UNITS
##FACTOR=    0.000296,      1,               1
##FIRST=     0,             0,               0
##LAST=      2.424536,      0,               0
##MIN=       0,             -237952,         0
##MAX=       2.424536,      255739,          0
$$ Real data points
##PAGE= N=1
##DATA TABLE= (X++(R..R)), XYDATA
0@%%%%%%%%%%%%qJ6j6J6j7K5l2L4m2N4o3P3q8J04j21J38j60J84k10K40k74L10
$$ 0 0 0 0 0 0 0 0 0 0 0 0 0 -8 8 -8 8 -9 16 -16 18 -24 30 -33 40 -48 56 -65 73 -87 97 -113 127 -147 163
34A63l49L95m44N01n64O29o97P72q57R52j055J167j288J420j564J723j899K092
$$ 163 -186 209 -235 266 -298 331 -366 406 -451 501 -554 613 -675 745 -819 904 -995 1097
52A097k307K544k807L106l443L829m277M798n419O176p118Q329r955J2264j5832
$$ 1097 -1210 1334 -1473 1633 -1810 2019 -2258 2540 -2879 3297 -3821 4508 -5447 6817 -9015
67i015K2150l6763J36560R5912m9390R6285j8553o1877j3624P7174j8025p2969
$$ -9015 13135 -23628 112932 208844 159454 255739 237186 175309 161685 238859 220834 147865
79A47865K824O9261l1737o5669J3856N9221l5076o6011K4849N5092m5810n9142
$$ 147865 150689 219950 188213 122544 136400 195621 160545 94534 119383 174475 128665 69523
91F9523L4369M5550n3600n1970L9961L9609n9312m5541M9712K6989o5462l3876
$$ 69523 103892 149442 95842 43872 83833 123442 64130 18589 68301 95290 29828 -4048
103d048N0530J7099o4500k5774N5652P348o8767j0856N1260k997o3116n555N5049
$$ -4048 46482 63581 -919 -26693 28959 36307 -32460 -43316 7944 4947 -58169 -63724 -8675
116h675j0873o5277P846N2034k1224n7468J3576M9923k6279n7763K5722M5909
$$ -8675 -19548 -84825 -76979 -24945 -46169 -103637 -90061 -40138 -66417 -124180 -98458 -52549
128e2549l4259m7358L1698M0397l9382m2410L8132L5477m5109l2208M4484K5782
$$ -52549 -86808 -134166 -102468 -62071 -101453 -143863 -105731 -70254 -115363 -147571 -103087 -77305
140g7305m7153k4174M7299J8978m9784j6004N1970J0651n1108n220N0258M790
$$ -77305 -124458 -148632 -101333 -82355 -132139 -148143 -96173 -85522 -136630 -141850 -91592 -86802
152h6802n0017J663N3584m211m8564J1661M9996j0126m3602J7320M9569j7876
$$ -86802 -136819 -135156 -81572 -85783 -134347 -122686 -72690 -82816 -126418 -109098 -59529 -77405
164g7405m2713K8364M3492k3953l5727L2573M0291l0676l1599M0106L3426l6777
$$ -77405 -120118 -91754 -48262 -72215 -107942 -75369 -35078 -65754 -97353 -57247 -23821 -60598
176f0598k2872M2986K6784l8665j8086M7196J9698m1587r719M8233J1909m1773
$$ -60598 -83470 -40484 -13700 -52365 -70451 -23255 -3557 -45144 -54863 -6630 5279 -36494
188c6494l243M7712O474m3510M549M8885l054m1924J1108M6507r445m1179J7719
$$ -36494 -39737 7975 14449 -29061 -24512 24373 21319 -20605 -9497 37010 27565 -13614 4105
201D105M5510j8512l7920K6020L8611k3197l3939K9795L5179l0006k8660L5029
$$ 4105 49615 31103 -6817 19203 57814 34617 678 30473 65652 35646 6986 42015
213D2015K7716l3366k2063L6004K2865l6765j8186M0615J5050l9252j1154M1058
$$ 42015 69731 36365 14302 50306 73171 36406 18220 58835 73885 34633 23479 64537
225F4537R192m1101n685M2839K103m4034K573M2052n558m1156Q034M0268j2694
$$ 64537 73729 32628 26943 69782 71885 27851 30424 72476 66918 25762 33796 74064 61370
238F1370m0296J4631L7134j9761l5700J9716L2082k2646l3458K4461K8650k9470
$$ 61370 21074 35705 72839 53078 17378 37094 69176 46530 13072 37533 66183 36713
250C6713k8218K8405K3576l2225k3922L1582K0048l7028j8367L5745J1736l8235
$$ 36713 8495 36900 60476 28251 4329 35911 55959 18931 564 36309 48045 9810
262I810j2580L6496P034l9714n888L7584p04m0002J155L5482n645l8177O316L5739
$$ 9810 -2770 33726 40760 1046 -4842 32742 32038 -7964 -6809 28673 23028 -15149 -8833 26906
276B6906j2463l6584J2632L2742j7759l3322J7260L0508k1667l1359K3382K6302
$$ 26906 14443 -22141 -9509 23233 5474 -27848 -10588 19920 -1747 -33106 -9724 16578
288A6578k6730k5851K6252K2250k9964k1986L0133J8270l3431j5264L2863J1411
$$ 16578 -10152 -36003 -9751 12499 -17465 -39451 -9318 8952 -24479 -39743 -6880 4531
300D531l4178j1086L4958O846l6278l758L6155M45l5926J811L4646l843l5460
$$ 4531 -29647 -40733 -5775 1071 -35207 -38965 -2810 -2365 -38291 -36480 -1834 -5677 -41137
313d1137P560L4638j0669l2750J2464L1861j4223l0270J6835K9790j9375k7607
$$ -41137 -33577 1061 -9608 -42358 -29894 1967 -12256 -42526 -25691 4099 -15276 -42883
325d2883K2734K5630k2935k3247K5730K2617k7494j9201L0150J7318l0517j2704
$$ -42883 -20149 5481 -17454 -40701 -14971 7646 -19848 -39049 -8899 8419 -22098 -34802
337c4802L1991J1994l1631r016L3928O145l2428j919L3272J122l1753J974L2552
$$ -34802 -2811 9183 -22448 -31464 2464 8609 -23819 -25738 7534 8656 -23097 -21123 11429
350A1429l074l1606P940L1574r187k9407J1460L0281j3313k8180J6991K8049j8892
$$ 11429 8355 -23251 -15311 16263 7076 -22331 -10871 19410 6097 -22083 -5092 22957 4065
363D065k5065K1468K3515k1725k1706K4863K0103k5728j6599K6924J4660k6954
$$ 4065 -21000 468 23983 2258 -19448 5415 25518 -210 -16809 10115 24775 -2179
375b179j1499K7995J0389k8741p834K9707M863k8728k489K9613Q78k9809J492
$$ -2179 -13678 14317 24706 -4035 -11869 17838 22701 -6027 -8516 21097 21975 -7834 -6342
388f342L0108m011k9758P564K8720q926k7720J0771K7238j3722k5527J5973K3765
$$ -6342 23766 19755 -10003 -2439 26281 17355 -10365 406 27644 13922 -11605 4368 28133
401B8133j7794k1937J8648K0147k0046j9112K2078J6374k3635j4568K3718J2817
$$ 28133 10339 -11598 7050 27197 7151 -11961 10117 26491 2856 -11712 12006 24823
413B4823k4874j0929K6007R120k7499p064K7371M065k7093k751K7956L37k8241
$$ 24823 -51 -10980 15027 24147 -3352 -10416 16955 21020 -6073 -8824 19132 19469 -8772
426h772J864K7074m882k6721O795K5373q615k5424J0253K4356j3277k2769J4526
$$ -8772 -6908 20166 15284 -11437 -4642 20731 12116 -13308 -3055 21301 8024 -14745 -219
439b19K1174j6661k0561J7607J8910j9397j7848K1063J4958k2259j4092K2144
$$ -219 20955 4294 -16267 1340 20250 853 -16995 4068 19026 -3233 -17325 4819
451D819J2221k4012j0374K4441Q277k5589o237K4891L627k5416k313K6237m71
$$ 4819 17040 -6972 -17346 7095 15372 -10217 -16454 8437 12064 -13352 -15665 10572 10101
464A0101k6287K645K5318m900k5197O559K4070q738k4405J0586K2788j2863k1205
$$ 10101 -16186 -13541 11777 6877 -18320 -11761 12309 3571 -20834 -10248 12540 -323 -21528
477b1528J3423K0021j5356j9503J6110J7730j7758j6334J9200J4315j9881j3287
$$ -21528 -8105 11916 -3440 -22943 -6833 10897 -6861 -23195 -3995 10320 -9561 -22848
489b2848K0781J1599k2428r401K3098P368k3766n261K3756L305k4162j733K4569
$$ -22848 -2067 9532 -12896 -22297 801 8169 -15597 -20858 2898 6203 -17959 -19692 4877
502D877j094k3906K872K3078m175k2697N938K2020p480k1624R414K0301j0625
$$ 4877 3783 -20123 -17251 5827 1652 -21045 -15107 6913 -567 -22191 -12777 7524 -3101
515c101j8953J1709J8949j3637j7805J5407J6326j6651j4641J8201J3253j8645
$$ -3101 -22054 -10345 8604 -5033 -22838 -7431 8895 -7756 -22397 -4196 9057 -9588
527i588j1911K0326J0493k0879p844K1154O622k1056m254K1492L271k1185j218
$$ -9588 -21499 -1173 9320 -11559 -19403 1751 8373 -12683 -16937 4555 7826 -13359 -14577
540a4577K1899n41k0622K223K0858l210k0443N449K0606o587j9723R067J9255
$$ -14577 7322 6781 -13841 -11618 9240 6030 -14413 -8964 11642 5055 -14668 -5601 13654
553A3654r752j7857J1501J8100j3126j5793J5010J4963j5041j3148J6642J2260
$$ 13654 3902 -13955 -2454 15646 2520 -13273 1737 16700 1659 -11489 5153 17413
565A7413j6795j0402J8566R048j8437o803J9132O280j9327l939K0140K885j9958
$$ 17413 618 -9784 8782 17830 -607 -7410 11722 18002 -1325 -5264 14876 17761 -2197
578b197q49K0541l73j9577K203K0260l384j9735N446J9401o628j8404Q689J7885
$$ -2197 -3046 17495 17122 -2455 -252 20008 16624 -3111 2335 21736 15108 -3296 5393 23278
592B3278r403j6888J0908J6271j2557j4588J3594J3499j4400j2438J5531J1183
$$ 23278 13875 -3013 7895 24166 11609 -2979 10615 24114 9714 -2724 12807 23990
604B3990j6423r826J7355P823j7680o876J7731N797j8686l966J8722K262j8909
$$ 23990 7567 -2259 15096 22919 5239 -1637 16094 21891 3205 -761 17961 20223 1314
617A314j466J8373l37j8592J527J8618l750j8783M833J7200o628j7468P729J5987
$$ 1314 -152 18221 17884 -708 819 19437 15687 -3096 1737 18937 12309 -5159 2570 18557
631A8557r509j6004J0259J4472j2356j3688J2116J2053j3799j1797J3773R874
$$ 18557 9048 -6956 3303 17775 5419 -8269 3847 15900 2101 -9696 4077 13951
643A3951j5086r312J5202O963j6231p159J5695N171j7521l952J6888J912j7898
$$ 13951 -1135 -10447 4755 11718 -4513 -11672 4023 9194 -8327 -12279 4609 6521 -11377
656a1377j561J6975q22j7784J574J7072m169j6978M554J5615o254j5839O898J4366
$$ -11377 -12938 4037 3215 -14569 -12995 4077 -92 -17070 -12516 3099 -3155 -18994 -12096 2270
670B270q745j4339R046J2889j0390j2369J0484J1315j2327j0849J2613R302j3598
$$ 2270 -6475 -20814 -11768 1121 -9269 -21638 -11154 161 -12166 -23015 -10402 -1100 -14698
683a4698q430J4435O978j5119o303J5595M774j6146k955J6135J931j6008n55J6059
$$ -14698 -23128 -8693 -1715 -16834 -23137 -7542 -2768 -18914 -21869 -5734 -3803 -19811 -20366 -4307
697d307n51j5769K198J5805l376j4740M393J4974m937j4179P035J4081p558j3091
$$ -4307 -4858 -20627 -18429 -2624 -6000 -20740 -16347 -1373 -6310 -20489 -13454 627 -6931 -20022
711b0022R162J2949r375j1287J1012J1522j1479r635J2855R174j2574p376J4181
$$ -20022 -10860 2089 -7286 -18573 -7561 3961 -7518 -17153 -4298 4876 -7698 -15074 -893
724h93O884j3635n046J5001M357j4402k065J5180J973j4621PJ5368m70j4409K461
$$ -893 5991 -7644 -12690 2311 6668 -7734 -9799 5381 7354 -7267 -7260 8108 7638 -6771 -4310
739d310J5070l007j3903M306J4452m829j3421O843J3246p055j2177Q511J1982
$$ -4310 10760 7753 -6150 -1844 12608 7779 -5642 1201 14447 7392 -4785 3726 15708
752A5708q890j0762J0317J0410j0983q774J1828Q194j2168o991J3200N893j3338
$$ 15708 6818 -3944 6373 16783 5800 -2974 8854 17048 4880 -2111 11089 16982 3644
765C644m819J3748L699j3794k366J3850J654j4098n47J3855n83j3686J565J3468
$$ 3644 -1175 12573 16272 2478 112 13962 15616 1518 971 14826 14243 557 2122 15590
779A5590k687j3154L259J2968m892j2741N779J1724o825j1638P521J0708q897
$$ 15590 12903 -251 3008 15976 11084 -1657 4122 15846 9021 -2617 4904 15612 6715
792F715j0214R503Q804j0574q242J0523P049j1338o467J1559N024j1966m627J1869
$$ 6715 -3499 6004 14808 4234 -4008 6515 13564 2226 -4241 7318 12342 376 -4251 7618
806G618L089j2296k708J2217J544j2761o43J2328o49j2835J425J2424k787j2448
$$ 7618 10707 -1589 -4297 7920 9464 -3297 -3940 8388 7739 -5096 -3671 8753 5966 -6482
820f482L505J2078m908j1683N662J0809o564j0720P216R740p998r050Q589Q090
$$ -6482 -2977 9101 4193 -7490 -1828 8981 2417 -8303 -1087 8653 655 -8395 194 8284
834H284r261p392R306O782j0208o078J0706M947j0900m262J1353L143j1737k494
$$ 8284 -977 -8369 937 7719 -2489 -8567 2139 7086 -3814 -8076 3277 6420 -5317 -7811
848g811J2094J449j2300j37J2035n28j2096J615J1948k719j1486L449J1219m342
$$ -7811 4283 5732 -6568 -6705 5330 4802 -7294 -5679 6269 3550 -7936 -4487 6732 2390
862B390j0545N143J0140n838r855O772R036p422q560Q164P955q841p134R154O658
$$ 2390 -8155 -3012 7128 1290 -8565 -1793 7243 -179 -8739 -575 7380 -1461 -8595 559 7217
877G217j0073n801J0402M842j0563m251J1038L248j1287k408J1300J226j1415
$$ 7217 -2856 -8657 1745 6587 -3976 -8227 2811 6059 -5228 -7636 3664 4890 -6525
890f525l84J1104m54j1368J318J1080k647j0774L165J0383m286j0140M846R562
$$ -6525 -6909 4195 3741 -7627 -6309 4771 2124 -8650 -5485 4898 612 -9528 -4682 4880
904D880n659r437O382Q552o994q351P428P519q059p031Q464O324r187n538R365
$$ 4880 -779 -10216 -3834 4718 -2276 -10627 -3199 4320 -3739 -10770 -2306 4018 -5169 -10707 -1342
919a342M498r827l848J0232K881j0514k085J0458J034j0515j07J0335n15j0529
$$ -1342 3156 -6671 -10519 -287 2594 -7920 -10005 453 1487 -9028 -9135 1200 685 -9844
933i844J425J0206k144r775K687R678l439r342M110R184m894q622N635Q203n936
$$ -9844 -8419 1787 -357 -10132 -7445 2233 -1206 -10548 -6438 2746 -2148 -10770 -5135 3068 -2868
948b868p806O901P280p506o325Q208N886q599m941R048M307r100l301R656K599
$$ -2868 -10674 -3773 3507 -3999 -10324 -2116 3770 -4829 -9770 -722 3585 -5515 -8816 840 3439
963C439r427j824R666J254r321k57R652Rr575J144R572j604r083K544R505l211
$$ 3439 -5988 -7812 1854 3108 -6213 -6470 3182 3191 -6384 -5240 4332 2728 -6355 -3811 5694 2483
979B483q808M179Q830m780q092N776P811o000p159O974O811p143n612P734N459
$$ 2483 -6325 -2146 6684 1904 -6188 -412 7399 1399 -5760 1214 8025 882 -4730 3004 8463
994H463p929m472Q368M205q311l132R015K641q794j972R282J348r204k72R526
$$ 8463 534 -3938 4430 8635 324 -2808 6207 8848 54 -1918 7364 8712 -492 -764 8762
1009H762j13r417J158R338j745q859K504R115l349q459M139Q254m540p614N258
$$ 8762 8649 -768 390 9728 7983 -876 1628 10743 7394 -1065 3074 11328 6788 -826 4432
1024D432P222n699o880O440O206o809n539P211N051p692m550P809L865q276l160
$$ 4432 11654 5955 -925 5515 11721 4912 -627 6584 11635 3943 -607 7202 11067 2791 -369
1039c69Q512K426q571k065Q761J104q941m43Q776l43q967R82Q419j628q651K195
$$ -369 8143 10569 1998 -67 8694 9798 857 414 9190 8847 -120 862 9281 7653 -998 1197
1055A197Q171l273q154L512P588m395p361M672O642n500o622N736N669o303n515
$$ 1197 9368 6095 -2059 1453 9041 4646 -2715 1957 8599 3099 -3523 2213 7882 1579 -3936
1070c936O316M888p087m578O949L671p673l317P572K341q091k240Q198R65q502
$$ -3936 2380 7268 181 -4397 2552 6223 -1450 -4767 2805 5146 -2945 -5185 3013 3978 -4524
1085d524n68Q079m71q422Q36P934j728q064K082P580l085p539L089P021l901o865
$$ -4524 -5092 2987 2516 -5906 -5070 2864 1136 -6928 -4846 2734 -351 -7890 -4801 2220 -1681 -8546
1101h546M118O331m993o222N134N545n755n507O077M840o869m299O889L680p573
$$ -8546 -4428 1903 -3090 -9312 -4178 1367 -4388 -9895 -3818 1022 -5847 -10146 -3257 423 -7150
1116g150l118P560K328p800j817P858R12p874m05P695j73p731P33P512j267p466
$$ -7150 -10268 -2708 -380 -8180 -9997 -2139 -1227 -9101 -9506 -1811 -1984 -9715 -8982 -1470 -2737 -10203
1132a0203J977P260k497p014K968P028l520o626M259O507m700o008N415N645n553
$$ -10203 -8226 -966 -3463 -10477 -7509 -481 -4001 -10627 -6368 139 -4561 -10569 -5154 491 -5062
1147e062n071O245M721o416l798O781L612o847k700P282K436p131j508P551J119
$$ -5062 -10133 -3888 833 -5583 -9381 -2600 1012 -5835 -8535 -1253 1183 -5948 -7456 95 1214
1162A214p130l72P624Q7p304R43P523r94p220K045P358k216o824L141O957l305
$$ 1214 -5916 -6288 1336 1423 -5881 -4938 2585 1591 -5629 -3584 3774 1558 -5266 -2125 4832 1527
1178A527o267M202O328m301n547N059N358n026m663N926M336n772l522O317L394
$$ 1527 -4740 -538 5790 1489 -4058 1001 6359 1333 -3330 2596 6932 1160 -2362 3955 7349
1193G349o344k602O836K302o597j503P082J206o807n97P197K03o931O07P005q47
$$ 7349 1005 -1597 5239 7541 944 -559 6523 7729 922 325 7522 7725 794 1401 8406 7559
1209G559o841J659O734j975o485K655O385l181n890L618N752m093n329M594M926
$$ 7559 718 2377 9111 7136 651 3306 9691 6510 620 4238 9990 5897 568 5162 10088
1224A0088n015m557N306M008n598l577N700L220o083k827O049K241o397j806O372
$$ 10088 5073 516 5822 9830 4232 655 6355 9575 3492 665 6714 8955 2558 752 7124
1239G124J164o657r21O637O4o853L15O454j046o797J523O322k312o432K511N909
$$ 7124 8288 1631 710 7347 7411 558 873 7327 6281 -516 1007 7329 5017 -1415 1096 7005
1255G005l439n728L282N184m059n220M104M516m676m620M733L815n293l845N382
$$ 7005 3566 -2162 1120 6304 2245 -2975 1129 5645 969 -3651 1082 4897 -396 -4241 1141
1270A141L059o069k880N914K040o467j773O347R30o750p42O546k13o669L69O286
$$ 1141 4200 -1869 -4749 1165 3205 -3262 -5035 1312 2242 -4508 -5250 1296 1083 -5586 -5217 1069
1286A069j033o519J451O001k045n987K251N648k905n599L034N284l688n021L922
$$ 1069 36 -6483 -5032 969 -1076 -7063 -4812 836 -2069 -7668 -4634 650 -3038 -8059 -4137
1301d137M634m412m429M787L893n148l551N479L081n760k565N801K119n937j611
$$ -4137 497 -3915 -8344 -3557 336 -4812 -8363 -2884 197 -5563 -8128 -2327 -208 -6145 -7756
1316g756O160J045o041o40O116J37n922L57N936o87n900J356N860j581n604K204
$$ -7756 -1596 -551 -6592 -7232 -1116 -979 -6901 -6544 -608 -1295 -7195 -5839 21 -1560 -7164 -4960
1332d960N615k558n107K955N288l394m654L818M693m024m164M648L829m651l293
$$ -4960 655 -1903 -7010 -4055 1233 -2161 -6815 -2997 1696 -2328 -6492 -1844 1985 -2666 -5959
1347e959N164L020n090k422N429K275n460j477N761J300n590n39N862K66n508
$$ -5959 -795 2225 -2865 -5287 142 2417 -3043 -4520 1241 2541 -3049 -3588 2274 2540 -2968
1362b968K40N844m71n603J194N675j262n416K031N357k136n085K773N132l118
$$ -2968 -2728 3116 2645 -2958 -1764 3911 2649 -2767 -736 4621 2485 -2600 173 5305 2187
1377B187m447L592M390l698m027M425L639m449l133M929K839m961k281N130K078
$$ 2187 -2260 1332 5722 2024 -2003 2422 6061 1612 -1521 3408 6247 1286 -995 4135 6213
1392F213n152j590N350J268n295q48N514M68n429o5N593l10n662R72N424j294
$$ 6213 1061 -529 4821 6089 794 -54 5460 5928 499 434 6027 5717 55 1027 6451 5157
1408E157n342J823N195k297n056K671M696l221m348L383M098l804l878L982L319
$$ 5157 -185 1638 6833 4536 -520 2151 6847 3626 -722 2661 6759 2955 -923 3059 6378
1423F378m223l235M310K723m654k555M678K104n105j800N027J216n442r56N291
$$ 6378 2155 -1080 3230 5953 1299 -1256 3422 5526 421 -1379 3648 4864 -578 -1534 3757
1438C757K63n471l0N321q03n399R16N094j536n236J742M751k347m716K340M390
$$ 3757 4020 -1451 -1481 3840 3037 -2362 -1446 3648 2112 -3124 -1382 3369 1022 -3694 -1354 3036
1454C036l002m230K903L902l523l801L605L262m040l184M144K648m540k537M617
$$ 3036 34 -4196 -1293 2609 -914 -4715 -1110 2152 -1888 -5072 -928 1720 -2820 -5357 -740
1469g40J975m940j624M739J130n022q59M961K81n081l5M941m32m974P78M729j149
$$ -740 1235 -3705 -5329 -590 540 -4482 -5341 -380 -99 -5180 -5215 -274 -706 -5680 -4902 -173 -1322
1486a322m771J591M499j923m355K229M170k521l973K854L833l140l537L547L289
$$ -1322 -6093 -4502 -3 -1926 -6281 -4052 118 -2403 -6376 -3522 311 -2829 -6366 -2819 470
1501D70l657k943L988K732m057k341M483K009m504j358M629J343m623p62M931
$$ 470 -3187 -6130 -2142 590 -3467 -5808 -1325 684 -3820 -5178 -549 794 -3829 -4591 340
1516C40M28m667R8M872k69m566Q25M769r25m443J531M593j617m154K088M329k193
$$ 340 768 -3899 -3801 1071 802 -3764 -2939 1830 905 -3538 -2007 2586 969 -3185 -1097 3232 1039
1533A039l823K786L861k868l472L500L303l480k852M044K594l903k116M393J826
$$ 1039 -2784 2 3863 995 -2477 1023 4326 846 -2006 2038 4632 729 -1387 3006 4832
1548D832m359j323M552J201m460n83M555M59m470l4M528j50m464N69M587q73m395
$$ 4832 473 -850 3702 4903 443 -140 4415 4874 404 370 4898 4748 284 853 5440 4567 172
1565A72J324M261j571m161K062L999k462l703K727L587l028l250L172K988l498
$$ 172 1496 5757 4186 25 2087 6086 3624 -79 2648 6235 3207 -43 3129 6117 2619
1580B619k780L653K360l795k134L861J691l993j562L960J144m238q56M138M67
$$ 2619 -161 3492 5852 2057 -77 3784 5475 1482 -80 3880 5024 786 -70 4068 4535
1595D535m344l37M403k99m419N00M282j060m310J248M008j686m094J877L673k357
$$ 4535 191 -146 4257 3958 -461 39 4321 3261 -1049 199 4207 2521 -1573 304 3977 1620
1611A620l672K418L281k834l202K838K769l254k717L252K211l511k196L619J741
$$ 1620 -2052 366 3647 813 -2389 449 3218 -36 -2753 499 2710 -801 -2997 622 2363
1626B363m002j544L944J112m263q23M020M39m226l51M258l42m247M05M022r43
$$ 2363 -1639 -3183 761 1873 -2390 -3213 807 1246 -2980 -3331 927 585 -3662 -3257 765 -178
1642a78m093J132L753j560l821J831L459k082l429K235L133k627k919K700K690
$$ -178 -4271 -3139 614 -946 -4767 -2936 523 -1559 -4988 -2753 380 -2247 -5166 -2466 224
1657B24l005k542L136K274l387k101L489J801l676j573L771J173l896q69L990
$$ 224 -2781 -5323 -2187 87 -3300 -5401 -1912 -111 -3787 -5360 -1589 -416 -4312 -5181 -1191
1672a191M75m048q2L957j94l810M63L982q85l751J118L696j334l564J828L416
$$ -1191 -716 -4764 -4846 -889 -1083 -4893 -4430 -448 -1333 -5084 -3966 -270 -1604 -5168 -3340 76
1688G6j873l256K225L209k343k949K636K895k759k513L127K365l142k032L612
$$ 76 -1797 -5053 -2828 381 -1962 -4911 -2275 620 -2139 -4652 -1525 840 -2302 -4334 -722
1703g22J763l591j255L763J181l819n82L911M74l734l8L887p5l644M32L860o21
$$ -722 1041 -2550 -3805 -42 1139 -2680 -3262 649 1123 -2611 -2649 1238 1163 -2481 -2049 1811 1190
1720A190l512J007L735j068l557J624L491j629l161K103L268k349k743K634K788
$$ 1190 -2322 -1315 2420 1352 -2205 -581 2910 1281 -1880 223 3491 1142 -1601 1033 3821
1735C821k730k315L107K210l047j814L363J627l303j221L446J155l456o56L526
$$ 3821 1091 -1224 1883 4093 1046 -768 2595 4222 919 -302 3144 4299 843 187 3713
1750C713O62l508k58L627M1l409K07L691n48l459Q86L490j082l397J523L216j681
$$ 3713 4375 867 609 4236 4277 868 1075 4766 4218 759 1645 5135 4053 656 2179 5395 3714
1767C714l070J944K911k148k703K363K506k572k292K668J992k796j923L015J526
$$ 3714 644 2588 5499 3351 648 3011 5517 2945 653 3321 5313 2517 594 3609 5135
1782E135l089j405L138R91l251q71L205N73l487l86L355n7l470J14L427o95l525
$$ 5135 2046 641 3779 4770 1519 648 3853 4426 939 553 3908 3851 381 495 3922 3227 -298
1799b98P56L244j110l309J221L008j653l163J760K712k196k701K199K336k538
$$ -298 458 3702 2592 -717 504 3512 1859 -1304 456 3168 972 -1729 470 2806 268
1814B68k340K477J876k857j903K835J505l206j459L036R96l290r71L148N52l435
$$ 268 -2072 405 2281 -576 -2479 356 1861 -1345 -2804 232 1228 -2062 -3033 115 667 -2768
1830b768m49L242j6l462J70L259o49l346P38L137j187l119J287K852j600k844
$$ -2768 -3217 25 9 -3453 -3283 -24 -673 -4019 -3281 -144 -1331 -4450 -3163 -311 -1911 -4755
1846d755J707K533j929k554K007K347k314k154K382J932k549j855K698J545k805
$$ -4755 -3048 -515 -2444 -4998 -2991 -644 -2958 -5112 -2730 -798 -3347 -5202 -2504 -959 -3764
1861c764j309K909J104l000q54L184N46l161k03L218Ol074L57L168n44k948Q03
$$ -3764 -5073 -2164 -1060 -4060 -4914 -1730 -1184 -4345 -4548 -1330 -1324 -4398 -4041 -873 -1417 -4365 -3562
1878c562K998r02k746J205K796j204k564J677K546j608k308J955K396j997j980
$$ -3562 -564 -1466 -4212 -3007 -211 -1415 -3979 -2302 244 -1364 -3672 -1717 679 -1318 -3298
1893c298K406K041k376j628K780J530k625j123L049J016k877o16L100O26k864
$$ -3298 -892 1149 -1227 -2855 -75 1455 -1170 -2293 756 1772 -1105 -1721 1379 2005 -859
1908h59j65L023K26k910K30L141l59k776O21K918o94k694J122K819j237k563J639
$$ -859 -1024 1999 2225 -685 -455 2686 2327 -449 172 3090 2396 -298 824 3643 2406 -157 1482
1925A482K551j612k350J924K303k075j963K258J930k340j609K510J478k619j224
$$ 1482 4033 2421 71 1995 4298 2223 260 2518 4448 2108 499 3009 4487 1868 644
1940F44K639J020k763p61K775N53k834l29K828R2k922J57K744l48k881M83K846
$$ 644 3283 4303 1540 779 3554 4107 1273 944 3772 3864 942 1099 3843 3495 614 1097 3943
1957C943r44k737R88K615j283k712J454K382j725k429J838K057k140j939K048
$$ 3943 2999 262 1250 3865 2582 -130 1324 3706 1981 -448 1390 3447 1307 -632 1416
1972A416J721k419j588K333J198k510j244K538Q67k723q95K667M67k789m46K649
$$ 1416 3137 718 -870 1463 2661 151 -1093 1445 2312 -411 -1306 1361 1828 -961 -1407 1242
1988A242J63k974K6K760m24k842M14K743q19k748R56K545j309k582J412K231j655
$$ 1242 1405 -1569 -1543 1217 793 -2049 -1635 1108 289 -2459 -1503 1042 -267 -2849 -1437 794 -861
2005h61k205J713K012j946j884J931J719k182j609K189J334k308j303K406J022
$$ -861 -3066 -1353 659 -1287 -3171 -1240 479 -1703 -3312 -1123 211 -2097 -3400 -994 28
2020B8k434q43K572O08k670m17K684J62k650R6K700l83k624N59K592o66k481R20
$$ 28 -2406 -3249 -677 -69 -2739 -3156 -472 -310 -2960 -2864 -164 -547 -3171 -2612 -20 -686 -3167 -2247
2038b247K377j101k208J312K194j372k075J641J975j626j798J836J802j929j464
$$ -2247 130 -971 -3179 -1867 327 -1045 -3120 -1479 496 -1130 -2928 -1092 710 -1219 -2683
2053b683K166J392k189j180K480R90k379p33K533N89k500k46K571J66k546J73
$$ -2683 -517 875 -1314 -2494 -14 976 -1403 -2136 397 986 -1514 -1760 811 977 -1569 -1396
2069a396K588j81k566N30K567o26k371Q49K428r89k274J269K191j282k101J606
$$ -1396 1192 1011 -1555 -1025 1542 916 -1455 -606 1822 833 -1441 -172 2019 737 -1364 242
2085B42K054j726j780J833J729j942j518K172J346k214j107K372R80k365q26K458
$$ 242 2296 570 -1210 623 2352 410 -1108 1064 2410 196 -911 1461 2441 76 -750 1708
2101A708N84k473k92K516J55k547R1K427k04k513N01K375o28k358Q15K301j021
$$ 1708 2292 -181 -473 2043 2198 -349 -258 2169 1965 -548 -47 2328 1700 -658 157 2458 1437
2118A437k214J142K180j283k142J552J874j682j810J768J666k037j461K006J298
$$ 1437 -777 365 2545 1262 -880 672 2546 864 -946 822 2488 451 -1010 996 2294
2133B294k177j131K196Q92k301p75K344M44k357l28K266J34k402qK342j42k387
$$ 2294 117 -1014 1182 2074 -227 -1002 1342 1786 -571 -899 1367 1501 -901 -909 1433 1291 -1096
2150a096K63K320n79k313O92K286j008k195J046K057j256k021J473J734j558j727
$$ -1096 -833 1487 908 -1405 -713 1573 565 -1630 -584 1473 217 -1804 -331 1403 -155 -1882
2166a882J676J551j884j305J869J170k009j049K016R31k113p87K191N87k263m32
$$ -1882 -206 1345 -539 -1844 25 1195 -814 -1863 153 1084 -1029 -1816 375 962 -1301 -1733
2182a733K273K86k356nK264r9k266K95K290n47k189O88K237j000j980J075J965
$$ -1733 540 826 -1530 -1535 729 630 -1636 -1341 949 402 -1787 -1099 1138 138 -1842 -767 1198
2199A198j235j864J412J638j335j664J574J553j649j408J797J348j889j148K017
$$ 1198 -37 -1901 -489 1149 -186 -1850 -276 1277 -372 -1780 17 1365 -524 -1672 345
2214C45R04k014p99K206N82k190l89K244K34k303J0K251j29k282L34K225n36k099
$$ 345 1249 -765 -1564 642 1224 -966 -1355 889 1123 -1180 -1170 1081 952 -1330 -996 1229 693 -1406
2232a406O10K190r04j981R86J872j131j844J324J648j293j676J510J519j662j386
$$ -1406 -796 1394 490 -1491 -505 1367 236 -1608 -284 1364 71 -1605 -95 1424 -238 -1624
2248a624J746J276j910j099J937R13k045p73K121N22k111m04K159K37k196l0K105
$$ -1624 122 1398 -512 -1611 326 1239 -806 -1579 542 1064 -1047 -1451 708 945 -1251 -1281 824
2265H24j10k137K75K115m42k082N36K063q09j921R07J935j091j765J157J718j274
$$ 824 714 -1423 -1148 967 525 -1557 -1021 1042 233 -1688 -781 1154 63 -1702 -545 1173 -101
2282a01j664J443J499j523j376J625J291j753j041J807R54j886p85J975N94j990
$$ -101 -1765 -322 1177 -346 -1722 -97 1194 -559 -1600 207 1161 -725 -1510 465 1059 -931
2298i31l74K029K87k037j41K068k0j997K54J981k70j983N06J996o45j823O97J938
$$ -931 -1305 724 1011 -1026 -1167 901 881 -1116 -862 1119 849 -1134 -628 1368 723 -1100 -403 1535
2316A535r03j722J102J724j196j598J343J570j465j284J569J228j606j037J752
$$ 1535 632 -1090 12 1736 540 -1058 285 1855 390 -894 675 1903 297 -740 1012
2331A012R17j752p14J800O25j757n10J966L32j925k09K023J15k078J92K033l04
$$ 1012 1929 177 -537 1263 1888 131 -379 1587 1919 -6 -215 1808 1923 -155 37 2070 1766
2348A766j927M42J992p27j841Q42J798r77j683J047J584j175j545J290J383j429
$$ 1766 -161 281 2273 1546 -295 547 2345 1368 -315 732 2316 1141 -404 886 2269 840
2364H40j322J537J180j689r88J594R79j781r07J852N95j899n46J878L79k000k38
$$ 840 -482 1055 2235 546 -442 1152 2131 350 -557 1295 1890 -9 -555 1323 1702 -298 -536
2381e36J911jj990R9J891l06k011M01J893o84j855O62J773r23j778R29J581j108
$$ -536 1375 1374 -616 -517 1374 1068 -943 -542 1351 667 -1188 -526 1247 324 -1454 -525 1056 -52
2399e2j543J214J281j368j404J525J093j621j053J563Q80j758p67J656O27j806
$$ -52 -1595 -381 900 -468 -1872 -347 746 -875 -1928 -365 515 -1243 -2010 -354 273 -1533
2415a533n65J792L53j881k84J839P4j905R0J864l41j840M13J778n26j768O46J685
$$ -1533 -2098 -306 47 -1834 -2118 -279 -205 -2110 -2020 -156 -497 -2337 -1924 -146 -672 -2440 -1794 -109
2433a09p91j593Q95J500j024j404J133J322j160j244J319J236j420j095J517J073
$$ -109 -900 -2493 -1598 -98 -1122 -2526 -1393 -71 -1231 -2475 -1156 80 -1340 -2435 -918 155
2449A55j633q13J710O70j692m89J806L52j692k35J895M8j744J89J721j55j682
$$ 155 -1478 -2291 -581 89 -1603 -2092 -286 66 -1626 -1861 34 82 -1662 -1473 248 93 -1589
2466a589L64J712l96j562N83J678p00j515R10J554q53j500J126J428j128j239
$$ -1589 -1225 487 91 -1471 -888 790 90 -1425 -515 1039 186 -1314 -188 1240 112 -1127
2482a127J376J194j397r56J502R88j612o61J667P08j680m22J707L95j679k19J791
$$ -1127 249 1443 46 -910 592 1580 -32 -693 974 1682 2 -420 1287 1682 3 -216 1575
2499A575R8j656j8J755j53j681L83J671m08j620N19J722p30j530Q08J535r54j405
$$ 1575 1673 17 -1 1754 1601 -80 303 1974 1566 -54 465 2187 1457 -73 735 2270 1316 -89
2517h9J091J308j209j251J304J116j439r61J460Q39j541p11J568N75j590n09J530
$$ -89 1002 2310 1101 -150 1154 2270 831 -130 1330 2169 628 -83 1485 2060 470 -39 1491
2534A491L86j605k20J603J5j594j23J646j84j645L26J614m64j679N80J523p53
$$ 1491 1877 272 52 1655 1670 76 -47 1599 1415 -230 96 1710 1246 -433 147 1670 917
2551I17j494P32J386r39j370J014J211j116j231J210J004j243j019J261R09j400
$$ 917 -577 155 1541 602 -768 246 1457 341 -890 320 1324 81 -938 323 1232 -168
2567a68p95J348O78j545n90J532L83j557l45J639J08j699l3J622j33j632K51J572
$$ -168 -963 385 1063 -482 -1072 460 843 -714 -1059 580 688 -1011 -1044 578 445 -1187 -936 636
2585F36l94j635N41J503o80j441P19J321q76j279R34J182j060j156J172R37j164
$$ 636 242 -1393 -852 651 -29 -1470 -751 570 -306 -1585 -651 531 -529 -1685 -513 424 -740
2602g40j036J284Q98j407p14J357P04j513n27J498L76j497k96J578J30j618qJ543
$$ -740 -1776 -492 406 -1001 -1715 -358 346 -1167 -1694 -196 180 -1317 -1613 -35 95 -1523 -1531 12
2620A2j54j468K41J489l64j469M91J487o87j341O88J369q42j232Q29J249r28j173
$$ 12 -142 -1610 -1369 120 -244 -1713 -1222 265 -422 -1763 -1075 294 -548 -1780 -951 298 -630 -1803
2638a803J106J094j131j009J265R33j343o92J413O10j441m70J538L30j511j74
$$ -1803 -697 397 -734 -1743 -478 455 -888 -1580 -167 443 -998 -1468 70 400 -1111 -1285
2654a285J529J38j460l5J574j17j490L36J459l16j475N15J460n39j374O65J425
$$ -1285 244 382 -1078 -1113 461 344 -1146 -810 649 333 -1142 -627 833 294 -1080 -415 1010
2671A010q15j203Q87J214r20j122J135J010j109r13J265Q91j265o98J332O84j415
$$ 1010 195 -1008 -121 1093 173 -949 186 1196 87 -826 439 1330 65 -633 699 1383 -32
2688c2m17J436L82j425j87J491J82j413l7J448r0j372J71J487k68j403M41J381
$$ -32 -449 987 1369 -56 -243 1248 1430 17 -20 1428 1338 -34 137 1624 1356 -47 394 1775
2706A775m88j339O28J327p58j155Q03J183r41j026R92J027j017j012J210P73j221
$$ 1775 1287 -52 576 1903 1145 -10 793 1976 1035 9 1001 2028 1011 -1 1209 1982 761
2723G61o39J204O54j353n08J294L87j382k62J368J64j413j34J476p2j428O4J401
$$ 761 122 1326 1980 627 119 1413 1800 418 156 1524 1688 275 141 1617 1545 117 181 1582
2741A582k20j488L45J359m72j377N36J217p19j252P94J071q75j101R40Q76j081
$$ 1582 1362 -126 219 1578 1106 -271 265 1482 763 -489 305 1376 501 -600 340 1216 135
2758A35r26J071O88j162o85J145N41j251n04J289K74j375l23J416O1j371j64J370
$$ 135 -791 280 968 -194 -879 266 807 -444 -948 341 615 -760 -1083 333 394 -977 -1141 229
2776B29j89j358J30J347l74j341M05J210n59j267O18J110p07j128P61J012q58
$$ 229 40 -1318 -1188 159 -215 -1556 -1151 59 -500 -1767 -1149 -39 -746 -1874 -1113 -101 -959
2793i59j008R08Q57r40q69R91P82j078p79J177O13j212m54J184M13j312k44J345
$$ -959 -1967 -1059 -202 -1142 -2011 -1020 -238 -1316 -2095 -918 -305 -1517 -1971 -787 -374 -1686 -1930 -585
2811e85J08j322L3J358j03j196Q3J305l14j188L97J260n13j172O34J121n84j088
$$ -585 -477 -1799 -1766 -408 -511 -1707 -1624 -319 -633 -1821 -1424 -164 -677 -1849 -1215 -94 -678 -1766
2829a766P76J044p93r14R54Q27q74p64J111P59j089o20J247N51j206l50J250M27
$$ -1766 -990 54 -739 -1653 -699 128 -746 -1510 -399 360 -729 -1349 -102 449 -757 -1107 143 570
2847E70j290j87J306K17j213r3J342N4j290K06J265j50j140L20J234m37j093N47
$$ 570 -720 -907 399 616 -597 -690 652 706 -584 -378 887 737 -403 -83 1151 714 -379 168
2865A68J166n48j025P17R83p39q59P97R05q30q30J045P23j040n99J118N50j124
$$ 168 1334 786 -239 478 1461 722 -137 660 1565 735 -95 950 1673 633 34 1152 1702 578
2883E78m26J163L83j217k35J205J19j124p1J257q2j217J45J190k91j154K94J114
$$ 578 152 1315 1698 481 246 1451 1570 446 375 1632 1550 333 478 1668 1377 223 517 1631
2901A631l81j158N10J101n72j128P06R89q51r41Q57P93r08q05J032N26r81o78
$$ 1631 1250 92 602 1703 1131 3 709 1698 847 -94 763 1556 648 -157 875 1401 420 -258
2919b58J122M74j110m67J113L34j253k21J080J91j214j36J256j26j216R2J225
$$ -258 864 1338 228 -239 874 1208 -45 -266 814 1005 -209 -345 911 785 -431 -339 886
2936H86k89j167K62J121m43j169N38J005o08j015P21Q99q27q89P85Q46r31p32
$$ 886 597 -570 -308 813 370 -799 -261 744 136 -879 -158 741 -86 -975 -190 656 -275 -1007
2954a007R09O51j001o49J070M34j004n02J161L48j177l10J176J98j207j13J198
$$ -1007 -98 553 -448 -1097 -27 407 -597 -1099 62 410 -767 -1077 99 297 -910 -1023 175
2971A75j9j128P1J215k63j112K67J126l86j080N02R82m92r76O41R11o72q59P23
$$ 175 156 -972 -901 314 51 -1061 -794 332 -54 -1134 -632 350 -142 -1118 -477 434 -238 -1097 -374
2990c74P61p34p53Q70O42r19n29Q96N20r65m55J031M57j171j94J125J40j122l9
$$ -374 387 -347 -1100 -230 412 -507 -1036 -140 380 -585 -1040 -9 448 -723 -917 208 348 -774 -813
3009h13J119n5j059O0J115r9j117L28R80l63j019M10J046n67r21N42R51o72p91
$$ -813 306 251 -808 -748 367 268 -849 -521 459 96 -923 -513 533 -34 -955 -413 538 -134 -925
3028i25P03Q29q13p41Q91O20r48n79R89M47r47m61J016M19j166j72J065J48j074
$$ -925 -222 607 -206 -947 -56 564 -384 -963 26 473 -474 -935 81 500 -666 -838 227 375 -699
3047f99p6J066m8j047J57J051k59j032K99J009l89r69M59R31m88r55O46Q73o61
$$ -699 -775 291 243 -804 -647 404 145 -887 -588 421 32 -937 -478 453 -35 -990 -344 529 -132
3066a32q44O84Q44q15p69R73O14q92n60R75M46r74l91J077L15j082j42J019J68
$$ -132 -976 -292 552 -263 -1032 -59 555 -337 -897 78 524 -450 -841 236 551 -531 -673 346 514
3085E14j047o0R99N7j039J04J086j65j009K52J009k86r56M49R06n12q53O04Q34
$$ 514 -533 -593 406 463 -576 -472 614 449 -560 -308 701 415 -541 -92 814 302 -551 53 887
3104H87o14p53P41P15p67o29Q83N92q75n01R45L96r29l39R88K92r06k33R84J89
$$ 887 273 -480 261 976 209 -420 463 1055 180 -321 624 1020 91 -248 740 1032 126 -107 877 1066
3124A066j021n8R61O5j011J29R85j42r62K43R51l26r01M19Q66m67q51O07P46n95
$$ 1066 45 -13 948 1013 2 131 1116 974 12 255 1206 880 -21 398 1264 797 -54 553 1299 704
3144G04p39O52P01p24o45P19N58p17o02Q73M58q72m40R39K80r62k27R20J66j011
$$ 704 -35 617 1318 594 -51 668 1226 509 -93 780 1238 366 -74 865 1145 183 -44 876 1042 31
3164C1n0R52L0j081Q7R86k13r24J59R65l90r22M05Q56n97q36N49P60n69q30O44
$$ 31 -19 933 963 -118 -31 955 742 -182 -23 942 552 -370 35 891 294 -542 7 767 198 -632 12
3185A2O92q01n83O92N54q75m86Q28M25r29l78Q74K57r15l48R86J19j010l3R06
$$ 12 704 -97 -680 12 566 -309 -795 33 458 -471 -849 25 282 -633 -981 5 124 -886 -919 -13
3205a3J3j066R2R29k52q96K53Q72m03q47M12P50m31q56N54O52n35p11O28O84p65
$$ -13 0 -1066 -974 -45 -297 -1193 -940 -68 -471 -1318 -906 -156 -587 -1443 -889 -237 -772 -1483 -855 -171 -936
3226i36n68P38N17p46n39R03M17q96l52R41K16q48j83Q87J29r52M7R07J7r61J71
$$ -936 -1504 -766 -249 -995 -1534 -631 -214 -1110 -1462 -521 -305 -1153 -1336 -449 -320 -1272 -1225 -318 -301 -1262 -1091
3247a091Q90j35q93L06Q84l55o80L20Q79m30p94N41Q20n07p49P09O61o99n77P95
$$ -1091 -201 -336 -1229 -923 -39 -394 -1074 -754 125 -305 -1099 -558 262 -245 -994 -285 376 -323 -900 -105
3267a05N68p35l98Q02M27p92l37R42K37p57k45R95J37q91mQ92M9q90J06R29j37
$$ -105 463 -272 -670 132 559 -233 -570 372 609 -148 -393 602 739 -152 -156 736 785 -105 1 930 793
3288G93q35K62Q32k97p43L41Q09m07p19M96P44n79o30O71O12o68n78P37M86p85
$$ 793 -42 220 1052 755 12 353 1162 755 36 532 1276 697 67 738 1350 682 104 841 1327 542
3308E42m12P84L68p67l37Q72K02q17k24R19L8q53o2Q79m0r63J24Q57k02q61K19
$$ 542 130 914 1282 515 178 1050 1252 435 211 1130 1168 315 253 1132 1092 129 253 1110 908 47 266
3329B66Q42l61q29L40P67m21q15M54O55n57o66O51M89o84n48O67M27p51l82P07
$$ 266 1108 747 -82 258 1025 604 -211 243 898 341 -325 326 815 131 -417 250 677 -74 -456 251
3349B51K90p73k90Q00J84q51k60Q63P6q49r4Q46L7r87J21Q52j81q56K39Q01l29
$$ 251 541 -232 -522 278 462 -389 -649 214 290 -559 -653 193 230 -757 -636 216 35 -821 -582 219 -110
3370a10p67L06P53m20p02M75O47n48o33O09N95o57m82O81M17p12l39O68M15p44
$$ -110 -877 -571 182 -238 -940 -465 182 -366 -999 -390 205 -452 -934 -253 164 -548 -887 -219 196 -548
3390e48l15Q40K30q11k18Q32J20p95l4Q14L7p94J15Q52j96p63K02Q22k69p31L54
$$ -548 -863 -23 207 -604 -822 10 130 -665 -699 115 152 -642 -527 325 129 -634 -432 390 121 -610 -256
3411b56O95l23o58N11N73l97p17N73N92n81m66O61M36o76l51O70L77p84k13P81
$$ -256 439 116 -542 -31 542 145 -572 1 593 12 -454 207 643 -33 -384 286 663 -121 -334 447
3431D47K10q18j32Q38P9p82m0Q16m0p79J05P66j49p66K34P85l54o81L14P56n04
$$ 447 657 -161 -293 545 624 -158 -198 618 578 -201 -96 670 521 -245 -11 774 420 -261 53 809 305
3452C05o34M39O90n53o40N54N94o07n52O84M07p06l43P04L63q73j84P20J86p73
$$ 305 -329 110 800 247 -393 161 755 148 -404 280 687 -19 -362 342 705 -168 -352 368 554 -219
3472b19k13Q45jp77K7P37j24p68J73P42j86p88K34O80k44p30L45P07m38o51L47
$$ -219 -432 413 412 -365 -338 399 275 -493 -320 422 236 -552 -318 362 118 -612 -267 440 2 -649 -302
3493c02O79n14o19N19N30o18m42N84M35o86l63O44L27o87k27O84J90p25j43O74
$$ -302 377 -137 -756 -237 293 -325 -767 -183 252 -434 -797 -153 174 -513 -740 -56 134 -591 -734 -60
3513f0J14o93n0P91j24o84R6P18j39p17K44O74k58o96L28O91m09n59M34O29m71
$$ -60 54 -639 -689 102 -22 -706 -610 108 -31 -748 -504 170 -88 -784 -456 235 -174 -733 -299 330 -141
3534a41n75M99N38n36m54O16L78n76l17O12L43o64k38O51L12p89j31P76O4o93
$$ -141 -716 -217 321 -215 -669 -53 325 -251 -568 44 387 -277 -515 136 448 -341 -472 304 368 -325
3554c25j5P24kp09R9P24j06o93K34O33k15o83L11O55l65n66M68N56n19m64M74
$$ -325 -340 384 382 -327 -228 496 390 -303 -69 564 349 -334 -23 632 267 -299 169 725 206 -258 216
3575B16N13m69m71N76L77o27k86O17L06o39k37P04J73p04j35O91J03o72l7O71
$$ 216 729 260 -211 365 742 115 -171 446 752 113 -124 580 753 49 -86 605 708 36 -1 670
3595F70m6o83R4P35k20o79K14O80k67p11L67N49l84n33L93N57m30n26M29M38m95
$$ 670 624 -59 35 770 550 -129 85 765 498 -213 154 703 319 -214 179 736 306 -220 209 647 152
3616A52m81O84L01n78m10O14K81o86j90O13J86p30j66O70Q4o98l8P39j28o21O5
$$ 152 -329 355 656 78 -332 282 563 -123 -313 300 486 -244 -410 260 344 -354 -392 347 219 -402 -337
3637c37O45j97o24K29N47k23o64L20N90l72n77L90N17m60m03L55N03n14m33N14
$$ -337 308 111 -513 -284 263 40 -624 -304 286 -86 -663 -273 244 -216 -619 -264 239 -275 -708 -194
3657a94L89n12m36O56L62p29k26O50J62o45p0O19J06o68m1O36k2n87J5O96j30
$$ -194 195 -317 -753 -97 265 -464 -690 -40 122 -523 -593 26 132 -536 -577 59 37 -550 -535 161 31
3678C1n68J47O26k44n86K82O25l52n17L42N96m06m75M19N01n28l93O16K82n10
$$ 31 -537 -390 236 -8 -594 -312 313 -39 -556 -214 382 -24 -499 -80 421 -107 -500 116 398 -112
3698a12l24O42K05n16k47O02J36n56j11O11R0o10l4O33j5o50J48N71j30n57K03
$$ -112 -436 206 411 -105 -352 250 386 -170 -281 330 420 -190 -224 409 394 -256 -108 463 333 -224 -21
3719b1N79k32n51K69N50l45m63L12N11m68m18M56M24m95m01N27L16n64k71N73
$$ -21 558 326 -225 44 594 249 -214 98 609 141 -277 179 603 108 -293 234 550 -14 -285 288
3739B88K66n64k42N49J87o19j19O04K7n99M6N60r5o04M8O26j47o14K08N53j98
$$ 288 554 -10 -252 297 484 -135 -254 350 377 -222 -176 384 289 -315 -267 359 212 -402 -194 359 161
3760A61n81K85M69k46o16M02M56m05m31M20M04m56m00N13L09n46k90N86J14m64
$$ 161 -420 -135 334 88 -528 -126 330 -75 -506 -86 318 -138 -538 -25 284 -262 -552 34 148 -316
3780c16k05N11J87n88j34N69J22o16l4N84lo22J08N62j54n52J91N58k25m73K15
$$ -316 -521 -10 177 -411 -545 24 146 -470 -504 80 77 -545 -437 125 -29 -581 -390 168 -57 -530 -315
3801c15N09k98m46L59M15l83l50L59M28m59k83L83L45m24l66O44K08n18k83O13
$$ -315 194 -104 -550 -191 224 -159 -509 -150 278 -181 -464 -81 264 -160 -526 118 326 -192 -475 138
3821A38J34n68l0O09L3n57k5O38j17m43ON91r7n69K09N13j01n54K90M80l02m18
$$ 138 272 -296 -326 283 316 -241 -266 372 255 -188 -182 409 312 -257 -48 465 364 -190 100 580 278 -140
3843a40L45M43l90l73M10L89m77k92M74L08m77l00N60J96n38r3N32J25n62m9N38
$$ -140 205 648 258 -115 295 684 207 -85 389 697 220 -80 480 676 138 45 577 702 140 91 629
3864F29j4n42M0N21m7n58J22M45r1n09K09N05k14m84K33N06l31m70L57M19m48
$$ 629 615 73 113 634 587 29 151 596 505 -4 205 710 496 12 245 751 420 -50 307 726 278
3885B78l34L87L08m14l54M17L45n22k23M24K15m62k23N13N7n02p7N20kn60J7N32
$$ 278 -56 331 639 225 -129 288 633 111 -112 312 527 65 -158 355 412 -90 -167 353 351 -209 -192 340
3907C40o3n38RN72j77n08R1M74k49m30J93M71k68m23K33L47l50l21L23L33m13
$$ 340 277 -261 -252 320 143 -365 -274 200 -49 -479 -286 185 -83 -506 -273 74 -276 -597 -274 59 -354
3928c54l18M39J91m26k49M52K05m88j61M42J06n12k6M45P1n27j5N19m2n52R3N23
$$ -354 -672 -233 -42 -468 -717 -265 -60 -548 -709 -267 -161 -673 -699 -254 -183 -710 -725 -206 -248 -800 -707 -184
3950a84j52m52J81M92k52m80K77M07k04m34L83K87l13l23L79K95l06k39L02K74
$$ -184 -336 -788 -607 -115 -367 -847 -570 -163 -367 -801 -418 -131 -444 -767 -388 -93 -399 -638 -336 -62
3970f2l79k20M52J66l94j40M71J38m66r1N24L2m59J5M89k8m26P3M72j13l73J07
$$ -62 -441 -661 -209 -43 -437 -577 -106 32 -434 -525 -1 31 -428 -413 76 48 -378 -305 167 54 -319 -212
3992b12M60j65l86K07M41k68l89L32M08k62l50L14L56l34l06M12K74m28k06M26
$$ -212 248 83 -303 -96 345 77 -312 20 428 166 -184 130 486 152 -154 258 532 104 -102 324
4012C24K34n29p1M72Q9m34r6N26K3m78K7M57l6m61N9M96j88m13J72M17k15l57
$$ 324 558 29 -42 430 519 85 -11 515 538 60 87 544 508 47 106 602 414 1 173 590 375 18
4034A8K17L65k25m19K56M32l17l63L51L17l44l12L53K80m23j88L63J90m25q5L96
$$ 18 235 600 375 -44 212 644 327 -36 315 632 288 -24 329 609 186 -2 361 551 126 41 437
4055D37L4m00r4M60O8m88rM37o8m49J09M00j26m39J20M24j54l46J95L30k38l39
$$ 437 471 71 -23 437 505 17 8 445 377 -72 37 437 311 -128 -8 416 262 -84 111 441 203 -136
4077a36K66L21l44l11L39K64l12k42K70L62m46k43M13J66l93j46M24J0l75j50
$$ -136 130 451 107 -204 135 399 87 -155 115 477 31 -212 201 367 -26 -172 252 262 -113 -263
4097b63M81P5m42j5L88M6m45P8M04j41l98J31L77j78l19J44M19k67m08K74L75
$$ -263 218 293 -149 -164 224 270 -175 -97 307 166 -232 -101 276 98 -221 -77 342 75 -333 -59 316
4118C16l22l26L44L05l93k37L85J99m19j48L60J81m32j31L74Q1l64j32M22K0m08
$$ 316 -6 -332 12 317 -76 -313 72 271 -148 -296 64 245 -187 -318 56 137 -227 -359 63 83 -325
4139c25K9M36j07m07P9L57j2m84J60M02k13k94J93L00k55l04K59L02l27k66L23
$$ -325 -296 140 33 -374 -295 62 50 -434 -274 128 -85 -379 -186 114 -141 -445 -186 116 -211 -477 -154
4160a54J36k20k43L47J91l89j52L57J65l10k10M36R5m54o7M38Qm15L6L58o0l29
$$ -154 -18 -238 -481 -134 57 -332 -484 -127 38 -272 -482 -46 49 -405 -472 -34 -26 -441 -405 -47 -107 -436
4182d36K4L16k4l62J25L97j99l11K01L11k27k71K02L14k31l00L31K52k90k01K66
$$ -436 -412 -96 -120 -482 -357 40 -159 -470 -269 42 -185 -456 -254 60 -171 -471 -140 112 -178 -379 -113
4203a13K19l58j29L60J38l23j57M48J6l56k9L85L9m26M7L71j3l75J00L37q8l65
$$ -113 106 -252 -381 -21 117 -206 -363 85 101 -255 -284 101 140 -286 -239 132 119 -256 -156 181 93 -272
4225b72J73L50j74l43J87L55j98k87K40K70k66k65L25K16k75k41L38K12l23j10
$$ -272 -99 251 77 -266 -79 276 78 -209 31 301 35 -230 95 311 36 -205 133 345 22 -88
4245h8K49J54l19p1L26R2l59o9M67k3l73j3L83q0l03O1L01r7l25K08K75j62k93
$$ -88 161 315 -4 -75 251 343 -16 -85 382 359 -14 -27 356 276 -27 34 335 238 -87 121 396 234 -59
4268e9J51K67j82k28K12K84k03l00K69J91k86j99L23J71l29j24L38J18l80o8L19
$$ -59 92 359 177 -51 161 445 242 -58 211 402 116 -83 240 411 82 -42 296 414 34 -34 285
4289B85N7l73k3L59k5k93l9L88r5l01M0L45j05l25J30K98j14l15J60L06k73l09
$$ 285 342 -31 -54 305 280 -13 -52 336 241 -60 -20 325 220 -105 25 323 209 -106 54 360 87 -222
4311b22L06K33k36k64K29K24k58j81K56J28k76q8K55J55l78p5L92J2l64p2M15
$$ -222 84 317 81 -183 46 270 12 -169 87 215 -61 -149 106 261 -117 -192 200 212 -152 -224 191
4332A91j6l87P5K97n4l12j4L59j18l30J83K74j34l15K00K16j68k72K44K27k43
$$ 191 175 -212 -137 160 106 -206 -220 139 21 -309 -126 148 14 -301 -101 115 -53 -325 -81 146 -97
4353i7j97K10J84j84k74L31J88l34j27K66J50l65j5K89N8l11p7L27O1k99rL43
$$ -97 -294 -84 100 -84 -358 -27 161 -173 -300 -34 116 -249 -264 25 83 -228 -305 22 83 -216 -225 118
4375A18q6l23O9L47q1l68J61K78j21l51K16K55j29l08J57K69k42j57K62J57k25
$$ 118 32 -291 -222 125 44 -324 -163 115 -6 -357 -141 114 -15 -323 -166 103 -139 -296 -34 123 -102
4396a02j72K84J26k69j69L17J24k23j66L10Q3l10k1L66m7l61J3L88Ml55Q4K56
$$ -102 -274 10 136 -133 -302 15 139 -84 -250 60 143 -167 -188 178 131 -230 -217 171 175 -180 -96 160
4418A60o6l08J87K31j38k58J86K06j98j74K19K03k89r6K14J95k99j29K49J37k61
$$ 160 94 -214 -27 204 66 -192 -6 200 2 -172 47 250 -39 -135 79 274 -25 -154 95 232 -29
4439b9r8K64R6k76j02L00J20l73n2L40j1k90L1L65r6l04P9K65j45k75J74K44j18
$$ -29 -127 137 233 -43 -145 155 275 -98 -150 190 179 -111 -80 285 189 -115 -36 229 84 -191 -17 227 109
4462A09k55J87J98j91k12J57J64j60k34K73J73k13k09K56J37k04j64L03M6k54
$$ 109 -146 41 239 48 -164 -7 157 -3 -237 36 209 -4 -213 43 180 -24 -188 115 161 -93
4482i3p0K94P0l31pK64m7k74N6L23r8k57O9K10o3k14J23K05j48k36J54J92j34
$$ -93 -163 131 201 -130 -137 127 80 -194 -138 185 87 -170 -101 109 46 -168 -45 160 12 -224 -70 122 -12
4505a2j82J07J84j29j99J97K05k62j42K59Q2k22q2K51R4l11n3K78K5k64L8K03
$$ -12 -194 -87 97 -32 -231 -34 171 -91 -233 26 108 -114 -196 55 149 -162 -215 63 88 -176 -138 65
4527F5L8k74N2K76j28k07M9K78p0k56J06K40j60k45J82K18j46j98J64J45j80j20
$$ 65 103 -171 -119 157 29 -178 -129 149 79 -177 -71 169 9 -236 -54 164 18 -180 -16 129 -51 -171
4549a71K16J28j92j24K06J32k07j41K80O6k21m9K18L8k32l0K75L2l30qL10n3j84
$$ -171 45 173 -19 -143 63 195 -12 -153 127 193 -28 -77 141 179 -53 -83 192 224 -106 -114 196 143 -41
4572d1K7K33q2k18R1K46j76j83J84J67j74j83J60K05k01k04J98K30j87k03K89
$$ -41 -14 219 137 -81 10 256 80 -103 81 248 74 -109 51 256 55 -149 49 279 92 -111 178
4593A78Lj63j20K10J58k44n2K22J5k44o4K62J5k38k5K37k6k47P3K82j30k22N7
$$ 178 181 18 -102 108 266 22 -30 192 207 -37 -101 161 176 -62 -87 150 124 -123 -50 232 102 -120 -63
4616f3K18r4k38J61K02k02j94J80K12j86k45K55J60k23j31J66J18j84j30K50M3
$$ -63 155 61 -177 -16 186 -16 -210 -30 182 -4 -249 6 166 -57 -188 -22 96 -88 -218 32 75
4637G5j81p4K56N6k69o4L16l2k50N7J57K6k55O3K28j20j87R3K50j77j50Q5K25
$$ 75 -106 -180 76 132 -137 -201 115 83 -167 -110 47 73 -182 -119 109 -11 -198 -105 145 -32 -182 -97 128
4660A28j44j95J59J60j40k31J92J73j81n0J38J17j85r1K04N7k27l4K35K2k11k4
$$ 128 -16 -211 -52 108 -32 -263 -71 102 -79 -129 9 126 -59 -150 54 111 -116 -150 85 107 -104 -128
4682a28K16j3k17M0K42m4j76l5K54o1k59J38J46o4k56J55K07j15k20K15J17j00
$$ -128 88 75 -142 -102 140 96 -80 -115 139 78 -181 -43 103 39 -217 -62 145 30 -190 25 142 42
4704D2j93J63J06j39j96J92J71k57o2J57Q7k13o6K36K7k49PJ70N9k00rJ98k8k06
$$ 42 -151 12 118 -21 -217 -25 146 -111 -173 -16 71 -142 -208 28 55 -194 -187 -17 42 -158 -167 31 3 -203
4728b03J01J66j06j90J42J25q3j33N1J70r4j73J83J27k00j28J37J42j48r6J55
$$ -203 -102 64 -42 -232 -90 35 -48 -181 -130 40 -54 -227 -44 83 -117 -245 -108 34 -114 -210 -55
4749e5J50j99j02K11P0j64q4J38O3j93LK41j8j72KJ83k2j59J3K01l9j70O4J91
$$ -55 95 -104 -206 5 75 -89 -173 -35 28 -165 -162 79 61 -111 -109 74 52 -107 -94 107 68 -102 -38 153
4773A53j58j35J14J20r7r9J60R7j23j34J79P4r6j31K24O8j73p4J75J23k58o1K29
$$ 153 -5 -140 -26 94 -3 -102 58 155 32 -102 77 151 55 -76 148 216 43 -31 144 267 9 -52 177
4796A77P4k35%K26M1k80N8J79j6j87O8J48l5k28Q2K26j69j18J02J66j00r2J19
$$ 177 251 16 16 242 283 3 61 240 224 37 105 253 218 -10 72 298 129 11 113 279 179 87 206
4819B06Q0j66r3J40O7j44p8J84O2j75o0J38Q4k05pJ42Lj73J1J83k0j49JJ65o1
$$ 206 286 120 27 167 234 90 12 196 258 83 23 161 245 40 33 175 178 5 16 199 179 30 31 196 135
4844A35j66M1J46o7j60O9J76j41r3L4J75q8j67J02J03j10j23J58J12j45j20J47
$$ 135 -31 10 156 89 -71 -2 174 33 -60 -26 149 61 -106 -4 99 -11 -134 24 136 -9 -129 18
4866A8O0j28j13J81L8j57m9K15q7j24NJ82k8j42M1J25k5j93O4J58m5j43P0J40
$$ 18 78 -50 -163 18 56 -101 -150 65 -22 -146 -141 41 13 -129 -88 37 12 -181 -117 41 -4 -147 -77 63
4890F3j25j11Q6J58j12j76J42R0j00j39J89J27j92o5J42O3j43j08J91jr5n1K03
$$ 63 -62 -173 -87 71 -41 -217 -75 15 -85 -224 -35 92 -100 -165 -23 40 -103 -211 -20 -21 -116 -167 36
4913C6k3j35o2J75J1j93R2J28j8j90O7J30rj69O8J66j28j10J21J18j90j27J75
$$ 36 13 -122 -184 -9 2 -191 -99 29 11 -179 -112 18 9 -160 -92 74 -54 -164 -43 75 -115 -242 -67
4936f7P4Qk13J65P2j70n1J14J04j18m5R7O5j67m1J53L7j48J4J30l8j29K2J61j1
$$ -67 7 15 -198 -33 39 -131 -182 -68 36 -82 -127 -30 35 -132 -173 -20 17 -131 -117 13 -25 -154 -132 29 18
4961A8j56N4J35j0k14J24P3m5j48J39J42j29j56J53J21j53j03J24O1j33k3J09
$$ 18 -138 -84 51 41 -173 -49 24 -21 -169 -30 112 -17 -173 -20 101 -52 -155 -31 30 -103 -126 -17
4983a7J28j42j21K07L9j79j1J78K9j72L2J65J0k27N3J05K7j48M3J51q3j07P6J07
$$ -17 111 -31 -152 55 94 -85 -96 82 111 -61 -29 136 146 -81 -28 77 104 -44 -1 150 67 -40 36 143
5007A43q1r2J03O8k6j16N5J35j01j04J20P3j21m9J10N5j18MJ25O1k13M6J27Lj55
$$ 143 62 -30 73 141 115 -1 54 189 88 -16 104 177 56 7 117 172 54 58 183 244 31 77 204 207 52
5032E2J5J55m8j09M6R2k8j08N2Q2l6j26N9J46j00j17J05J63j65j50J10P7j04j09
$$ 52 67 222 174 65 111 203 175 67 119 201 165 39 98 244 144 27 132 295 130 -20 90 167 63 -46
5056d6Q9R7p4j15J72J0j39m3J44Nj45j09K46J2k09J6J68r8r3J2J30p2j01N0J45
$$ -46 43 140 66 -49 123 133 -6 -49 95 100 -45 -154 92 104 -105 -89 79 -19 -112 -100 30 -42 -143 -93 52
5081E2j2j86K4J66j30j35Q5J13n4j19J51J0r9j25J86N2j47n4J63rj45j3J35Nj43
$$ 52 40 -146 -122 44 -86 -221 -136 -23 -77 -196 -45 -35 -134 -259 -73 -21 -168 -222 -59 -68 -213 -226 -91 -86 -229
5106b29JN9R2j67JJ90m5j52j2K09k9j88R1J03r2j18P9J75r0o5O1J06j32o9J18
$$ -229 -228 -169 -77 -244 -243 -53 -98 -250 -262 -53 -82 -270 -179 -76 -168 -286 -207 -32 -122 -187 -126 -20 -152 -221 -103
5131a03J39j56p9J44Q0j47l4O1J03r2o0J13Q6j98L3J36N3j33OJ13k9o9l2J85m2
$$ -103 36 -120 -199 -55 25 -122 -156 -95 8 -84 -144 -31 55 -143 -110 26 79 -54 -48 65 36 -33 -65 120 78
5156G8j02O6J35pj79O9J43p5r6O9J57j50n5O7J73k16K2P5N4p2r6J50L7j42j1J25
$$ 78 -24 42 177 170 -9 60 203 128 32 101 258 108 53 120 293 77 99 174 228 156 60 210 247 105 94 219
5182B19N2o9n5O7N8j40rR7j3j26j8J60Q7j89l2J07mj86J31J17q0j08N8R5n1j75
$$ 219 271 202 147 214 272 132 123 220 207 81 63 223 310 121 89 196 192 6 137 254 174 66 124 219 168 -7
5208gJ31P9r8p4O7O4j16o2J05M5j54pJ22j5q1l3N5L6j51LJ24nj56N2Q0j6r9KQ8
$$ -7 124 203 105 31 98 162 46 -16 89 134 -20 -27 95 80 -1 -34 21 57 -94 -91 33 28 -128 -76 4 -12 -111 -109 -21
5237b1k5j15J27L3p0r8O5J07r1j42J96Jl1j29J03M7j01p7J00K4m7k5R2Oj10j5
$$ -21 -46 -161 -34 -1 -71 -169 -104 3 -88 -230 -34 -33 -64 -193 -90 -43 -144 -221 -121 -97 -144 -169 -77 -71 -181 -196
5263a96J52K4j22nJ23l4j08M1J00m0o2KQ2pr5N8R0o6o6L3P5q4k5J04K0n8k6K9
$$ -196 -44 -20 -142 -147 -24 -58 -166 -125 -25 -65 -127 -125 -43 -50 -145 -87 3 -63 -129 -96 -21 -105 -130 -26 -6 -64 -90 -61
5291f1R1o7p8P5Q2o6q5J03j7k0o7J18L1r6j0J15mj72R6J01n5j30J00N3oo4j1J32
$$ -61 30 -37 -115 -40 42 -24 -109 -6 -23 -43 -110 8 39 -57 -67 48 44 -128 -32 69 14 -116 -16 37 31 -33 -44 88
5319H8l9j35P7Q3p0l4M0J24r6m7L3N2o0m9J00J9j12m1J36J3n9j3O5m2k3KQ7Jj11
$$ 88 49 -86 -9 74 4 -30 10 134 38 -9 24 76 16 -33 67 86 -26 -67 69 82 23 10 75 33 10 12 99 100 -11
5348a1O1P3jj69J17M1j2j00O6P9m4p2oJ02k4o2Q4M7q5o3M0J35j47k7R7m0n1l9
$$ -11 50 123 122 -47 70 111 99 -1 65 144 100 28 22 124 100 38 122 169 84 21 61 196 49 22 119 79 28 -11
5376a1J04M5r6jP2j2r4L7J01m1q2KJ10n9j05P4K5Oj17O3J02j29RK5M0j2j62J23
$$ -11 93 138 42 41 113 101 7 44 145 104 22 24 134 75 -30 44 69 75 -42 21 123 -6 3 28 68 56 -106 17
5404A7N2q7m2M2K7m1m6R0n4mp8J13K1j01mP1J9j50M1R8J5j40m2P6Mo3L9O0o3k0
$$ 17 69 -18 -60 -18 9 -32 -78 12 -42 -46 -124 -11 10 -91 -95 -24 -5 -155 -114 -16 -1 -141 -183 -107 -103 -166 -127 -67 -130 -150
5434a50L9J00o2j38P2M0Np4P5J7q8j4O4P4r8p8J32J3p1oP9Kj06n7J42K9r8kQ0
$$ -150 -111 -11 -73 -211 -139 -99 -94 -168 -93 -76 -164 -178 -114 -40 -138 -216 -84 -71 -142 -148 -69 -67 -173 -230 -88 -59 -157 -159 -79
5463g9j5n1J5R9L0j09JR5m0m1M2P3j7q5M2J24n9r9P0Q6j26j4Q0O0q9l0R0O2o3
$$ -79 -94 -145 -130 -31 -1 -110 -109 -14 -54 -95 -53 20 3 -82 -40 84 25 -74 -4 82 -44 -58 22 82 -7 -37 53 115 52
5492E2k7O5L4j31K8L7M7q0P0L5Lo9NR3n2k3j2N9pq1K2R2m5j4l8O6n2j1Q0ok8l7
$$ 52 25 90 124 -7 21 58 105 25 95 130 133 64 69 162 110 87 75 134 127 46 68 160 115 101 63 129 77 66 146 140 112 75
5524G5J11j8o1o5P6O1r2o1R4rn5l0J34p9l4L3L6m2j15J3Q9K4r5K1M7Oj31J28j2
$$ 75 186 168 107 42 118 179 87 26 120 111 56 26 160 81 47 80 116 74 -41 -28 61 85 -10 11 58 64 -67 61 49
5553D9m2l1J6Q6l8p7L4N2n1j5K0O2r2k3MN8q5J0L8Lk8p5J03J0j15J5J22j4j09
$$ 49 7 -24 -8 78 40 -37 -3 49 -2 -17 3 65 -27 -50 -46 12 -73 -63 -25 -22 -50 -125 -22 -12 -127 -112 10 -4 -113
5582a13K4K9Mm5J2N7j0o4M6M0k6q5M2N7o2l1Q1Qn7j2L6P7p4m2P7M8o2m7M4L0k2
$$ -113 -89 -60 -56 -101 -89 -32 -42 -106 -60 -20 -46 -131 -89 -32 -94 -125 -44 -36 -93 -105 -69 8 -66 -108 -31 17 -45 -92 -48 -18 -40
5613d0r6J27kj4m9J30r4j6j0N6k1m5K6N4%q0R8J0o7K8lO2o4q0J33j2n0l1Q1K3
$$ -40 -136 -9 -11 -25 -74 56 -38 -54 -64 -8 -29 -74 -48 6 6 -74 24 34 -33 -5 -8 54 -10 -90 43 31 -19 -50 31 54
5643E4k9o7R7roj30R8qkQN5n1n0L0M3j6k5l2J02k4j51P3P6j0o7N1P2o9r5R4M0
$$ 54 25 -42 55 46 40 -90 8 0 -2 6 61 10 -40 -10 33 17 -8 -40 62 38 -113 -40 36 26 -41 10 82 13 -82 12 52
5674E2l3m8M6M6j25J4O5N0n1m4N0L1o5r2Q1O9k9m9N7k0r6NJ27m1q5L6J12m9p5
$$ 52 19 -29 17 63 -62 -48 17 67 16 -28 22 53 -12 -104 -23 46 17 -32 25 5 -91 -86 41 0 -85 -49 63 14 -61
5703f1J6N0k2k0JN8j8m3K0N4k3n6L6mj3n6J4J31q9k4J01o3l6p6R5J7m6j8N5M7
$$ -61 -45 5 -17 -37 -36 22 4 -39 -19 35 12 -44 -8 -12 -25 -81 -67 64 -25 -49 52 -11 -47 -123 -28 -11 -57 -75 -20 27
5733B7j17RJ05j2p6N1L3j3j01L6Q5n3l1j4O5m6m3Q3P5p1m8R3K5n3m8Q0K5n9n3
$$ 27 -90 -81 24 12 -64 -13 20 7 -94 -58 27 -26 -57 -71 -6 -52 -95 -12 63 -8 -56 37 62 9 -39 41 66 7 -46
5762d6O9pm9l2Q9J3Jm8J03m7q1LM0O2j07M5JN7n0K1M3l5k8O3J0r0o2J35O9o9p1
$$ -46 23 16 -33 -65 24 37 38 -10 93 46 -35 -32 8 70 -37 8 9 66 16 37 80 45 17 80 90 0 -62 73 142 73 2
5793BP4oK5q4N8M7p2m3O6K6l2r8J10Nk9K3jL8j26L0R5l2r9M8M7n7k0OJ02l3n8
$$ 2 76 70 95 11 69 116 44 1 67 93 61 -37 73 78 49 72 71 109 -17 13 108 76 -23 25 72 15 -5 1 103 70 12
5824A2k0P8k7r1N9P8r5k5R7J5m2n5L0N2p2k5J7P3n0j2kL9o1n8J24Nr5RN1l9j6
$$ 12 -8 70 43 -48 11 89 -6 -31 66 81 39 -16 14 66 -6 -31 -14 59 9 -3 -5 34 -27 -85 39 44 -51 -42 9 -30 -46
5855d6K8K0J0j32O3O8m8r2P0N2q4mN9L0p1l8P4m9QJl2N7l4j7M3K9n8l5R9m8pm6
$$ -46 -18 2 12 -120 -57 11 -37 -129 -59 -7 -91 -95 -36 -6 -77 -115 -41 -90 -82 -81 -113 -56 -90 -107 -64 -35 -93 -128 -29 -77 -84 -130
5887a30J41k7r6kR1k0l2l1Q3m3q4M9N6j6q0N1J9J4m3L9K9Mm0L8L1q7QQ6j3j7o3
$$ -130 11 -16 -112 -114 -23 -43 -75 -106 -23 -66 -150 -101 -45 -61 -141 -90 -71 -57 -100 -61 -32 -28 -68 -30 1 -86 -78 8 -5 -22 -85
5918h5Q1j3j5l5M7M6p2K2P6oq0JR0n6j2j1L2lp5N4Q3k3p2LN5l3KK0R0j03jL8P2
$$ -85 -4 -17 -32 -67 -20 26 -46 -24 52 46 -34 -33 57 1 -11 -22 10 7 -68 -14 69 46 -26 -23 32 -1 1 21 111 8 7 45 117
5951A17k8n1N0K5l1l4N9k6l5O0j8L3n9j6N4L0r8OQ4j9n3k0J07l7p6J8O5Ol3J3
$$ 117 89 38 88 113 82 48 107 81 46 106 88 121 62 46 100 130 32 38 122 103 50 30 137 100 24 42 107 113 80 93
5981I3Ol6LmN0n2o8P7nl7jMJ06q0r0R7nRm6J4K9p8J9QM9p2kK9J6n3m5P5Kn1K7
$$ 93 99 63 66 62 112 60 -8 69 64 27 26 30 136 56 -34 63 58 67 21 35 64 -14 5 13 62 -10 -12 17 33 -20 -65 10 12 -39 -12
6016a2N0n4l7M6L7o7Kk6Q0k5o9L8N9j01K0K7jN3r5N5Pl9n2P9J6k3m8N4j2J0M4
$$ -12 38 -16 -53 -7 30 -37 -35 -61 19 -6 -75 -37 22 -79 -59 -32 -33 20 -75 -20 -13 -52 -104 -25 -9 -32 -80 -26 -38 -28 16
6047A6j7l4k9P0k9l4j8l1M0L1m1P6m2L5n2N3Mm3n5J19m6l4NO9J6p5mM7l2Kk3Q5
$$ 16 -1 -35 -64 6 -23 -57 -75 -106 -66 -35 -76 0 -42 -7 -59 -6 -2 -45 -100 19 -27 -61 -56 13 29 -46 -50 -3 -35 -33 -56 29
6079B9j0q4M1L5l6N9l8M2k9o6NJ06n6m4OO3l2k4N3L9l3o4K1O0l5Ll4Q0n6m2O3
$$ 29 19 -65 -24 11 -25 34 -4 38 9 -57 -52 54 -2 -46 -40 23 -9 -33 20 59 26 -38 -17 43 8 11 -23 57 1 -41 22
6110B2k2k2k3O9k5n2JO8j6j3n9P8K3q8m3J33m1m7NR9j07n2O4P8k6n8K7j2L4k5
$$ 22 0 -22 -45 24 -1 -53 -52 16 0 -13 -72 6 29 -59 -102 31 -10 -57 -52 47 -60 -112 -48 30 4 -54 -27 -39 -5 -30
6140c0JQ6l2r7P0M9n0m9L3oK6m9K7L6j9n1N6k1k1k4N9K3m5L5K0rn4n5J79l5j7
$$ -30 -29 57 25 -72 -2 47 -3 -52 -19 -25 1 -48 -21 15 -4 -55 1 -20 -41 -65 -6 17 -28 7 27 18 -36 -91 88 53 36
6171C6l8N8o0K5k0L3j6k5L1pN8j36J04M2l7n2N9N4p7n9O8K9m7j1P2N2q7o5Q1M5
$$ 36 -2 56 -4 21 1 34 18 -7 24 17 75 -61 43 85 48 -4 55 109 32 -27 41 70 23 12 84 136 49 -16 65 110
6201A10r7M9K6M0q1l0N2ql2QN9o1p2Q6Rop7R7k8j0n2O5j8j2l0P2rK0m6qK5q4O2
$$ 110 13 62 88 128 47 17 69 61 29 37 96 35 -37 49 58 52 -25 72 44 34 -18 47 29 17 -13 59 50 70 24 16 41 -43 19
6234A9j2M3r8L2N7k7m2j6M1J7r2L0J01m5m5M5o2J5k4jK8rl2L9Q7q6j1l6N7k9p9
$$ 19 7 50 -48 -16 41 14 -28 -44 -3 14 -78 -48 53 8 -37 8 -54 -39 -63 -64 -36 -45 -77 -38 49 -37 -48 -84 -27 -56 -135
6265a35Q4J8o0lL1Oqm6R1n4n0J8L2L8m7n1Q2Mn4O7J2l5r1J9R1m2Jl8N1J9m0j3
$$ -135 -51 -33 -93 -96 -65 -59 -67 -113 -22 -76 -126 -108 -76 -38 -85 -136 -54 -50 -104 -37 -25 -60 -151 -132 -41 -83 -82 -120 -69 -50 -90 -103
6297a03M4k7j0J9Q3l8k9M8j3j7J7P1m7l0K8L7l3K3r7J47j9k2l3L8J5n0J5O4l3
$$ -103 -59 -86 -96 -77 6 -32 -61 -13 -26 -43 -26 45 -2 -32 -4 33 0 23 -74 73 54 32 -1 37 52 2 17 81 48
6326D8n9L3M6jp9L6L2K2p5O5Q2j05o7Q7M8m5l0K2M1l5k9O9L6o8j7K6K1r7M0M5
$$ 48 -11 22 68 67 -12 24 56 78 3 68 150 45 -22 65 113 68 38 60 101 66 37 106 142 74 57 83 104 7 47 92
6356I2J3p2J3J9J2j9L0K1l0J4o0K4On8k0N6j6J3q1Q2Kk8P5l3m8j3RL0n5L8kM1
$$ 92 105 33 46 65 77 58 88 109 79 93 33 57 63 5 -15 41 25 38 -43 39 41 13 88 55 7 -6 3 33 -22 16 14 55
6388E5j01MQ1k1m9k7J8L8r2J4R1j1o6O5J9p7%k6J13n1m5PL3j2m7M1J4l6pnO5m4
$$ 55 -46 -42 39 18 -31 -58 -40 -2 -94 -80 11 0 -66 -1 18 -59 -59 -85 28 -23 -68 -61 -28 -40 -87 -46 -32 -68 -75 -80 -15 -59
6420e9l6R0j4m1j9K3L7n7%K1mk1j7P0%p9O7J0l2o6O3jM7p0O0O6n3rj6l4J3jj0
$$ -59 -95 -5 -19 -60 -79 -56 -19 -76 -76 -55 -59 -80 -97 -27 -27 -106 -39 -29 -61 -127 -64 -65 -18 -88 -28 38 -15 -24 -40 -74 -61 -62 -72
6453g2O4j09M6M5J5l1L3K4K3o6l2L9Q2j20K3L3K5n3nJ10p1m6L4Q1k6o3M6N4o8
$$ -72 -8 -117 -71 -26 -11 -42 -9 15 38 -28 -60 -21 61 -59 -36 -3 22 -31 -36 74 3 -43 -9 72 46 -17 29 83 15
6482A5l2K2P5q0Pk1M9N1j03MO7kn0RQ1j4j06J33l6Nm9L9O0q3L7k7j6M8m1M6l0
$$ 15 -17 5 80 0 7 -14 35 86 -17 -13 54 52 2 11 92 78 -28 105 69 74 25 64 124 41 78 51 35 83 42 88 58
6513E8l6rL8jm3J5OL4n8K2O4o7J0n2P1Kk9QK9k5k6k7P9n3m7P7j6j5J0J5j5p0J0
$$ 58 22 13 51 50 7 22 28 62 4 26 90 23 33 -19 52 54 25 33 62 37 11 -16 63 10 -37 40 24 9 19 34 19 -51 -41
6546d1O6J4rj7L1m6j1k1KO8o4K2M3No0n1R1p0k4L0N9Jo7pN8o1l2J1M3Jj4l8N5
$$ -41 25 39 30 13 44 -2 -13 -34 -32 36 -28 -6 37 42 -18 -69 22 -48 -72 -42 17 18 -49 -56 2 -59 -91 -80 -37 -36 -50 -88 -33
6579c3Lp7O1j0j0j2K5%Nn9P1pL7p7N2k2l5N7P0j4o9%M1l8j6K4J1M0m0J7nK5n9
$$ -33 -30 -107 -46 -56 -66 -78 -53 -53 -48 -107 -36 -43 -6 -83 -31 -53 -88 -31 39 25 -44 -44 -3 -41 -57 -33 -22 18 -22 -5 -10 15 -44
6612d4k8J37k7r8Q1k1K2m7l4P5j5k1Q6k7r1K4O5k7k1J3J0m9M1l4J50j03n4O0o
$$ -44 -72 65 38 -60 21 0 22 -25 -59 16 1 -20 66 39 -52 -28 37 10 -11 2 12 -37 4 -30 120 17 -37 23 17
6641A7ok8M4Rlj8oN8l6J4m6L6ml6L6N2m3n9P9Pp9J7M7J5m2PqP1o3J3O0p8Jl4J05
$$ 17 11 -17 27 36 33 15 9 67 31 45 -1 35 31 -5 31 83 40 -19 60 67 -12 5 52 67 25 32 24 95 32 45 105 27 28 -6 99
6676I9m9m2J7j0K8k1J0nqK7j6nJ0p9O1L4l2q6N6N0n6J8Nj6L0q1J7O6l2m1K2N9
$$ 99 50 8 25 15 43 22 32 27 19 46 30 25 35 -44 17 51 19 -67 -11 39 -17 1 6 -10 20 -61 -44 22 -10 -51 -29 30
6708C0n3o4J17J6j38J45m8k4k7rM1l6RkK9j4l0L9kRj0M8l6Ol2L6J0m3j6K9j2J2
$$ 30 -23 -87 30 46 -92 53 5 -19 -46 -55 -14 -50 -41 -43 -14 -28 -58 -19 -21 -12 -22 26 -10 -4 -36 0 10 -33 -49 -20 -32 -20
6740b0l9R6j3p2PMJ0o2O0L0J1m4j8KM5q1M8K3j%j8K3m0N3j2P8r2p1N7N4m1m5M7
$$ -20 -59 37 24 -48 -41 -37 -27 -89 -29 1 12 -32 -50 -48 -3 -84 -36 -13 -14 -14 -32 -9 -49 4 -8 70 -22 -93 -36 18 -23 -68 -21
6773b1K0n5m1O0Rl7m5O4P0m8j00N2O8o6RO9k7LnN9o5o2N2K5J2q7K4Q9p3k4L6N1
$$ -21 -1 -56 -97 -37 -28 -65 -110 -46 24 -24 -124 -72 -4 -70 -61 8 -19 -16 -21 38 -27 -89 -37 -12 0 -87 -63 26 -47 -71 -35 16
6805A6o5NM9K0k3k7L6o2K8k1J2OL9oo2J11n8k3O5l2K1n0M5L5n1L0n5N6m9L0M6
$$ 16 -49 -44 5 25 2 -25 11 -51 -23 -44 -32 -26 13 7 -55 56 -2 -25 40 8 29 -21 24 59 8 38 -17 39 -10 20 66
6836F6kl9pN7j3o6nN8M0k5kOn4KO0k9j7j2KN3j0n4L6N0n0JN8l5q0NL0j9k0lJ46
$$ 66 64 25 18 75 62 -4 -9 49 89 64 62 68 14 16 76 47 30 18 20 73 63 9 45 95 45 46 104 69 -11 -6 24 5 -15 -18 128
6871A28o7j1%L8L4r5O6K8p9K1N2k9l1l3O8k2n8J9O0p8N0p0J2M3k9l2J8K5l8lN9
$$ 128 61 50 50 88 122 27 93 121 42 63 115 86 55 22 90 68 10 29 89 11 61 -9 3 46 17 -15 3 28 -10 -13 46
6902D6Ln8l0O8k1n1J7P0p1NJM4j5m9N4j4np2O5Jll2j4O7p5l1J8L6r1O3J5l3J1
$$ 46 49 -9 -39 29 8 -43 -26 44 -27 -22 -21 23 8 -41 13 -1 -6 -78 -13 -12 -15 -47 -61 6 -69 -100 -82 -46 -137 -74 -59 -92 -81
6935h1n5Q5J8n8mN6l9l6j2J14k3o4n1J06l5J1L8n9qJ2L8mj4p4K5L2J9lM0Jj9n3
$$ -81 -136 -51 -33 -91 -95 -39 -78 -114 -126 -12 -35 -99 -150 -44 -79 -68 -30 -89 -97 -85 -47 -51 -65 -139 -114 -82 -63 -66 -26 -25 -44 -97
6967i7L9j7p4N7K1N8q6l5M3Q2p7M3J0N8q2J9P2m9k4L6QN6n7j3N8m4l5N1J9m6K2
$$ -97 -58 -75 -149 -92 -71 -13 -99 -134 -91 -9 -86 -43 -33 25 -57 -38 34 -15 -39 -3 5 61 4 -9 49 5 -30 21 40 -6 16
6998A6M5NJ8m8NQ1p6J6rK5j9p8O8K8k4j7N5k2l4L9K7K9n9j5P7n3%mKN8o6j2K0
$$ 16 61 66 84 36 41 122 46 62 53 78 59 -19 49 77 53 36 91 69 35 74 101 130 71 56 133 80 80 76 78 136 70 58 78
7031G8K7p0M9j2jn1K2O7o2K4kNJk3Pj1K6o7J2K8o9P9K1k2m6l7L5P8q3JK6J6n1
$$ 78 105 35 84 72 71 20 42 109 47 71 69 74 75 52 59 48 74 7 19 47 -22 57 78 56 10 -27 8 86 3 4 30 46 -5
7064ek0P1Oo4L7jj4k1KPRm0rJ9Ko2K7K7l7k0j4O2m9l5K4P4l8m9L6M7j46N8oJ2
$$ -5 -25 46 52 -12 25 24 10 -11 -9 -2 7 -33 -42 -23 -21 -83 -56 -29 -66 -86 -100 -38 -87 -122 -98 -24 -62 -111 -75 -28 -174 -116 -122 -110
7098a10k1L1M6m1RK7k1j6k6QN1lo2OO8k7n8O2L6m4j4L7M0r6jR9j2ro5K8L2n2M2
$$ -110 -131 -100 -54 -95 -86 -59 -80 -96 -122 -114 -63 -66 -128 -122 -54 -81 -139 -77 -41 -85 -99 -62 -22 -118 -119 -20 -32 -41 -106 -78 -46 -98 -56
7131e6m9M0J0PN5%p9nM7M2p0M5P4n5j5pO4n4l1L9L5m5k0J0N3K3q9Q1N5oo1OL7
$$ -56 -105 -65 -55 -48 7 7 -72 -77 -30 12 -58 -13 61 6 -9 -16 48 -6 -37 2 37 -8 -28 -18 35 58 -31 50 105 99 38 44 81
7164H1m5L3j5L5kn0P7Np7qN7o2k1O1NM3k9m4P5n2L6o8M5L1p7J09k7J5r9M0nK9
$$ 81 36 69 54 89 87 37 114 119 42 34 91 29 8 69 74 117 88 44 119 67 103 35 80 111 34 143 116 131 32 72 67 96
7196I6m2L1jk6o2N6K5j3K3l6N3n7n5J01J5n8j0J1K5J0j09M8K1qJ3J4j8Nm8K8n
$$ 96 54 85 84 58 -4 52 77 64 87 51 104 47 -8 93 108 50 40 51 76 86 -23 25 46 38 51 65 47 52 4 32 27
7227B7k3n1P4n7l7O6N3k4l8L1J3Ko3M8m1M4k8pO6j01L3OKj8q2O8Jp3k7Q4L7j00
$$ 27 4 -47 27 -30 -67 -1 52 28 -10 21 34 36 -27 21 -20 24 -4 -11 55 -46 -13 -7 -5 -23 -105 -37 -36 -109 -136 -52 -15 -115
7259a15P3QNq5K6P8l6m1J8O9l3o4J7K5m8J7L9Lo4pN3ljk2K5L7r3L7L3ok9r%L9
$$ -115 -42 -34 -29 -114 -88 -10 -46 -87 -69 0 -33 -97 -80 -55 -103 -86 -47 -44 -108 -115 -62 -65 -66 -88 -63 -26 -119 -82 -49 -55 -84 -93 -93 -54
7293e4k2l4M3J3j3OLN7r8M9N7o8m3L6Q7k1l2k2O9o0j4L4O3o3l5j0Q3k3n0M1J8
$$ -54 -76 -110 -67 -54 -67 -61 -58 -1 -99 -50 7 -61 -104 -68 19 -2 -34 -56 13 -47 -61 -27 36 -27 -62 -72 11 -12 -62 -21 -3
7324cj8p5N7O1o7O8M9n6m7qM6J6o9N2J0J3k3n1J24k6m0o3J53p7J0J1M9n5J3jK
$$ -3 -21 -96 -39 22 -45 23 72 16 -31 -39 7 23 -46 6 16 29 6 -45 79 53 13 -50 103 26 36 47 96 41 54 53 55
7355E5Jm0M2L4l8Mj6J3l9j8Q1L3q3l9Q2k0l1KL6N3q8J4L1Jkp0Q2j0n1M7J8l9p8
$$ 55 56 16 58 92 54 58 42 55 16 -2 79 112 29 -10 72 52 21 23 59 112 24 38 69 70 68 -2 80 70 19 66 84 45 -33
7388c3L1P2mo8J2Q0m5l1N5J9l8q6Q8J6kk2L0ro0kL3M1o4l7R2K4r1k6Q8rj25J11
$$ -33 -2 70 66 -2 10 90 45 14 69 88 50 -36 52 68 66 44 74 65 5 3 36 77 13 -24 68 92 1 -25 63 54 -71 40
7420D0M3o9qrj3L1j5M5K3p9K5j6Lk0nO4l1J8r2R5k2l2k8J4M1L7r9O6l6oOOJ7o6
$$ 40 83 14 6 -3 -16 15 0 45 68 -11 14 -2 1 -19 -24 40 9 27 -65 30 8 -24 -52 -38 3 40 -59 7 -29 -35 -29 -23 -6 -72
7454g2JN5J2q4K3L1j1lK3j3l0k1Q6n6O7p4j3Q4q5QK3M3l6k3JP3m9n3M7O0r3j4
$$ -72 -71 -16 -4 -88 -65 -34 -45 -48 -25 -38 -68 -89 -3 -59 8 -66 -79 5 -80 -72 -49 -6 -42 -65 -64 9 -40 -93 -46 14 -79 -93
7486i3M0J3k1rP3ol4k2L3K9q9K6k1J4PLL0Jm3O0j6J0k0j8O0m9J2M0M0p7k4P1j8
$$ -93 -53 -40 -61 -70 3 -3 -37 -59 -26 3 -86 -60 -81 -67 -60 -57 -27 -26 -69 -9 -25 -15 -35 -53 7 -42 -30 10 50 -27 -51 20 2
7519Bn2K1KJ9k4n6R1J2k0j3NR3q3k2J3k9k6O8M3Jp8M6j1K0l5M7M1p9n7Q3P6j01
$$ 2 -50 -29 -27 -8 -32 -88 3 15 -5 -18 -13 80 -3 -25 -12 -41 -67 1 44 45 -33 13 2 22 -13 34 75 -4 -61 22 98 -3
7551cK8m2P5Jj08Q8Ql8k4J03m6l1l6R3lm1j7N0K7n0pJ2J9o0K7K0L1p6M7QQq0O
$$ -3 25 -17 58 59 -49 39 47 9 -15 88 42 11 -25 68 65 24 7 57 84 34 27 39 58 -2 25 45 76 0 47 55 63 -17 -11
7584a1J06j05K0LL0k7q1J06J6k4k9qJ6pkM0m9M9m9M1mm8j4R0l7m1l5J09nq8K4
$$ -11 95 -10 10 13 43 16 -65 41 57 33 4 -4 12 5 3 43 -6 43 -6 35 31 -17 -31 59 22 -19 -54 55 50 -38 -14
7615a4K2J5n6k3R2q9k4O3j3j4j5J0P3l5p7O5m9K8m3R9pn4k3M7jLj7K3k3J4n7O8
$$ -14 8 23 -33 -56 36 -53 -77 -14 -27 -41 -56 -46 27 -8 -85 -20 -69 -41 -84 15 8 -46 -69 -22 -23 -20 -37 -14 -37 -23 -80 -12
7647a2j3j1j0M8k8Rl2K7J0m0K4K9L4m1n3Q3j2m6J0K5j3%K8L7m8l5K8%k9m6J46
$$ -12 -25 -36 -46 2 -26 -17 -49 -22 -12 -52 -28 1 35 -6 -59 24 12 -34 -24 1 -12 -12 16 53 5 -30 -2 -2 -31 -77 69
7678F9j6m4K4K4k8j2j0j1N3m8k6Q6k8k6k6N2Ml6L1O1m7p4P4M4m5p7J4P7J2k7j0
$$ 69 53 9 33 57 29 17 7 -4 49 1 -25 61 33 7 -19 33 37 1 32 93 46 -28 46 90 45 -32 -18 59 71 44 34
7709C4N1j5j02J16l5k7L0K1Nr5L1K2L3r7Q2l2P4r5QL2J9j3l8R3o3n6L1j7K3k9
$$ 34 85 70 -32 84 49 22 52 73 78 -17 14 36 69 -28 54 22 96 1 9 41 60 47 9 102 39 -17 14 -3 20 -9
7739iN0J6j2p6N0M5m9p4P0N6p4l5K5O0r3k1J23l1o2L1K9Rq2QN7K5m6k6J4nOl7
$$ -9 41 57 45 -31 19 64 15 -59 11 67 -7 -42 -17 43 -50 -71 52 21 -41 -10 19 28 -54 -46 11 36 -10 -36 -22 -27 -21 -58
7771e8P8j2n5o0Q4J3l1Lj9L8n5QO2m7JRN8l6n9K6M3k6n1P3%l7k8J0P1k2m1N6L
$$ -58 20 8 -47 -107 -23 -10 -41 -38 -57 -19 -74 -66 -4 -51 -50 -41 17 -19 -78 -52 -9 -35 -86 -13 -13 -50 -78 -68 3 -19 -60 -4 -1
7804am6KL2j2n1J2O9o7L7lK1L3n8j6O9o5k3M1M3n6LL0QNj8L2M1n1o7O8oj7N2k0
$$ -1 -47 -45 -13 -25 -76 -64 5 -62 -25 -28 -7 26 -32 -48 21 -44 -67 -26 17 -39 -36 -6 2 7 -11 21 62 11 -56 12 6 -11 41 21
7838B1M2q6L2NJ2q9R4L3k2j09J6R2j6J9m8L0m4j0N6K0nr3N9P9q5k1K3O2k1j9K2
$$ 21 63 -23 9 14 26 -63 31 64 42 -67 -51 41 25 44 -4 26 -18 -28 28 48 43 -50 9 88 3 -18 5 67 46 27 49
7869D9M0o0k2N2Or3K9K3K3p9N7O1km4m0N5k9%l3Q0o5Mj8L7ol9N0k6K8p1K2P3j4
$$ 49 89 29 7 59 65 -28 1 24 47 -32 25 86 84 40 0 55 26 26 -7 73 8 12 -6 31 25 -14 36 10 38 -33 -11 62 48
7902D8q5M3j0Om9R1N5r3J4K0nK2o0L6mn8K8L5j8o0K5N4r4k3R9j5mn4M3L1J6r8
$$ 48 -37 6 -4 2 -47 44 99 6 20 40 35 57 -3 33 29 -29 -1 34 16 -44 -19 35 -59 -82 17 2 -2 -56 -13 18 34 -64
7934f4O2p3Q3l0j4O5Qp0O2k9m4l3Q4N8k3m3M0l3o8M0J7n3k9N0qJ3L3kK4Jl3L0
$$ -64 -2 -75 8 -22 -36 29 37 -33 29 0 -44 -77 7 65 42 -1 39 6 -62 -22 -5 -58 -87 -37 -45 -32 1 -1 23 24 -9 21
7966B1orq8N1P5o7j1OJ5L1o3K4k8O8k0J0jJ0q8L8J13r9J4kk3RJ8L2M8j11k6Q4
$$ 21 15 6 -82 -31 44 -23 -34 -28 -13 18 -45 -21 -49 19 -1 9 8 18 -70 -32 81 -18 -4 -6 -29 -20 -2 30 78 -33 -59 25
7998B5J4j03N2K2L4l9l0J8kpL2N0q3j7P9l2l7L5n4O2j7o0M1l9pj1K6N1n7J2M6
$$ 25 39 -64 -12 10 44 5 -25 -7 -9 -16 16 66 -17 -34 45 13 -24 11 -43 19 2 -58 -17 -56 -63 -74 -48 3 -54 -42 4
8029DQ5j23m4Q1J6l8NKL6j02P8j9%K0l6NJ2k5J1L7n4KK8Mk9%j4N9m8j7Q4j4k5
$$ 4 89 -34 -78 3 19 -19 -14 -12 24 -78 0 -19 -19 1 -35 -30 -18 -43 -32 5 -49 -47 -19 -15 -44 -44 -58 1 -47 -64 20 6 -19
8062a9k9L0M7n9n6R8j6pn9M9J9n9QJ07o6k3J7P7j19j2N6N2k2l8rLL2n5j2R9n1
$$ -19 -48 -18 29 -30 -86 12 -4 -11 -70 -21 -2 -61 -53 54 -12 -35 -18 59 -60 -72 -16 36 14 -24 -33 -30 2 -53 -65 34 -17
8093a7m5J5Q8m7k9N6pJl1MP8q9J2pN4l0k2O4K0o3k8L6j6K9nK2j8J6ll0J5n3O6
$$ -17 -62 -47 41 -6 -35 21 14 15 -16 -12 66 -23 -11 -18 36 6 -16 48 68 5 -23 13 -3 26 21 43 25 41 38 8 23 -30 36
8126C6j7n6P2m8N2k2KJ2j7K7k8O7m0k1k5J4N0j9K2J1K8r8QM6k0pn9N5MJ3j7L6
$$ 36 19 -37 35 -13 39 17 19 31 14 41 13 80 40 19 -6 8 58 39 61 72 100 2 10 56 36 29 -30 25 29 42 25 61
8158F1k0j4J2K4k7p7N7k3K4m7N5Ko2M0J7nm4M4L5m5k0k7N6L8J7n5Lom1J4J7pk
$$ 61 41 27 39 63 36 -41 16 -7 17 -30 25 27 -35 5 22 17 -27 17 52 7 -13 -40 16 54 71 16 19 13 -28 -14 3 -4 -6
8191f
$$ Imaginary data points
##PAGE= N=2
##DATA TABLE= (X++(I..I)), XYDATA
0@%%%%%%%%%%%%KnJ1j6J6j6K4l2L4m2N1n9P2q3R4j09J25j45J68j91K17k48K80
$$ 0 0 0 0 0 0 0 0 0 0 0 0 0 2 -3 8 -8 8 -8 16 -16 18 -24 27 -32 40 -43 51 -58 67 -78 90 -101 116 -132 148
35A48l14L54l96M42m95N52o13O80p54Q34r22J017j122J237j362J501j654J822
$$ 148 -166 188 -208 234 -261 291 -322 358 -396 438 -484 533 -589 648 -714 787 -867 955
53I55k010K223k459K726l035L392l812M312m923N690o682Q022r950J2973j8437
$$ 955 -1055 1168 -1291 1435 -1600 1792 -2020 2292 -2631 3059 -3623 4399 -5551 7422 -11015
68a1015L1447j21175j37209J09037j3198n9860r498P9918q192o7277O237P8412
$$ -11015 20432 -100743 -237952 -128915 -142113 -201973 -211471 -131553 -139745 -207022 -200785 -122373
80a22373k0362o1575K2264O7044k3828n8081L0179O5586l4750n2258M1693N7244
$$ -122373 -142735 -204310 -182046 -115002 -138830 -196911 -166732 -101146 -135896 -188154 -146461 -89217
92h9217m2196m3639M9423N0986m5538l7769N8734M1336n3738k4981O2981L0977
$$ -89217 -131413 -175052 -125629 -74643 -120181 -157950 -99216 -57880 -111618 -136599 -73618 -42641
104d2641n2070j5837O4823K2611n8256l028O5334Q740n1392L449O4284K925n5505
$$ -42641 -94711 -110548 -45725 -23114 -81370 -84398 -19064 -10324 -61716 -58267 6017 8942 -46563
117d6563J4575O3685j0471m9758K1965N7672j4687n0022L0505N6143k6347m2292
$$ -46563 -31988 31697 21226 -28532 -6567 51105 36418 -13604 16901 73044 46697 4405
129D405L6579M7633l2177l8087M1909M2625l8362l0650M8270L1368m2964k2488
$$ 4405 40984 88617 56440 18353 60262 102887 64525 33875 82145 113513 70549 48061
141D8061M9817K4044m6067j5353N2724J5306n0548o000N1823O014m9079j587N2612
$$ 48061 97878 121922 75855 60502 113226 128532 77984 71984 123807 129821 80742 79155 131767
154A31767k762n1100Q093M9113j1628m7127J2786M5708j7944m7740K2550M1820
$$ 131767 129005 77905 85998 135111 123483 76356 89142 134850 116906 69166 91716 133536
166A33536k7571m0498K6589L6836l3276l7846L3568L0799m0607k9938L7918K2375
$$ 133536 105965 65467 92056 128892 95616 57770 91338 122137 81530 51592 89510 111885
178A11885m2814k5230M0746J6473m6946j7087M2149Q044m8018r888M1839K558
$$ 111885 69071 43841 84587 101060 54114 37027 79176 87220 39202 29314 71153 73711
190G3711m8333m082M3810o883m8068M373M1485j3194m6554J0560M0754k0462m4857
$$ 73711 25378 21296 65106 58223 10155 14528 56013 42819 -3735 6825 47579 27117 -17740
203a7740K0164L5238k7297l8633K3715L2505l2412l4176L0312K5894l6480k6630
$$ -17740 2424 37662 10365 -28268 -4553 27952 -4460 -38636 -8324 17570 -18910 -45540
215d5540L2525K0300l7962k2917L7202J4763m1567j4560L8431Q658m2694q855
$$ -45540 -13015 7285 -30677 -53594 -16392 -1629 -43196 -57756 -19325 -10667 -53361 -62216
227f2216M0598K804m4742p22M2165n280m2065N924M0183j1031m0904J3137L8492
$$ -62216 -21618 -18814 -63556 -64278 -22113 -27393 -69458 -63534 -23351 -34382 -75286 -62149 -23657
240b3657j7361l6597J9998L3399k0984l2938K3460L1442k6983k8112K9159K5994
$$ -23657 -41018 -77615 -57617 -24218 -45202 -78140 -54680 -23238 -50221 -78333 -49174 -23180
252b3180k9947k3119L2238K2636l3763j9157L7267J5428l6192j1342L8161J0806
$$ -23180 -53127 -76246 -44008 -21372 -55135 -74292 -37025 -21597 -57789 -69131 -30970 -20164
264b0164l7563n589L9534L596l8192K025L8653k521l5634O767L8416q510l5429
$$ -20164 -57727 -63316 -23782 -20186 -58378 -56353 -17700 -20221 -55855 -49088 -10672 -19182 -54611
277e4611J3598L5641j4182l1924J8763L2717j8271l0208K3634K9983k4367k4787
$$ -54611 -41013 -5372 -19554 -51478 -32715 2 -18269 -48477 -24843 5140 -19227 -44014
289d4014K7213K4988k7167k1065L1129K1204l0764j5953L4209J3819l2322j0503
$$ -44014 -16801 8187 -18980 -40045 -8916 12288 -18476 -34429 -220 13599 -18723 -29226
301b9226L5472J0010l4930m382L7023K897l5319J508L5752k016l4275O230L6116
$$ -29226 6246 16256 -18674 -23056 13967 16864 -18455 -16947 18805 16789 -17486 -11256 24860
314B4860q691l2970J2234L2778j2505l0347J6172L0592j7444k8355K1734K7191
$$ 24860 16169 -16801 -4567 28211 15706 -14641 1531 32123 14679 -13676 8058 35249
326C5249k2270k3744K4588K3468k6501k0467K9259J8816l0107j4743L1591J2403
$$ 35249 12979 -10765 13823 37291 10790 -9677 19582 38398 8291 -6452 25139 37542
338C7542l1343j0467L3322P935l3178l643L3054J857l2288P52L2201k225l2084
$$ 37542 6199 -4268 29054 36989 3811 168 33222 35079 2791 3543 35744 33519 1435
351A435N670L2019q740l0270J0337K9853j2263k9205J5364K8166j8021k6716K0325
$$ 1435 7105 39124 30384 114 10451 40304 28041 -1164 14200 42366 24345 -2371 17954
364A7954K4158k1437k2426K3196K1146k5711j8298K6513J5548k6925j3128K7330
$$ 17954 42112 20675 -1751 21445 42591 16880 -1418 25095 40643 13718 590 27920
376B7920J0675k8446r407K9400O189k9479l779K8811J636k9954J07K9738k856
$$ 27920 38595 10149 742 30142 36331 6852 3073 31884 33520 3566 3673 33411 30555
389C0555l0312N738K9190q612k8227R324K7323j2513k6695J4800K4282j7283k3335
$$ 30555 243 5981 35171 26559 -1668 7656 34979 22466 -4229 10571 34853 17570 -5765
402e765J7927K0501j9686j9975K0580J7392k3736j5745K3207J3346k4693j2454
$$ -5765 12162 32663 12977 -6998 13582 30974 7238 -8507 14700 28046 3353 -9101
414i101K4895R382k7352q842K7205M900k7813l857K6752R82k8880J83K6950l988
$$ -9101 15794 25176 -2176 -11018 16187 21087 -6726 -10583 16169 17151 -11729 -11546 15404 11416
428A1416k7786N292K5529q336k5858Q564K4439j2416k4209J3506K1285j6162k1505
$$ 11416 -16370 -11078 14451 6115 -19743 -11179 13260 844 -23365 -9859 11426 -4736 -26241
441b6241J6676J9106j8899j9104J9763J5758k2577j5080K1484J2782k3616j1846
$$ -26241 -9565 9541 -9358 -28462 -8699 7059 -15518 -30598 -9114 3668 -19948 -31794
453c1794K3689Q685k5649p801K4926M489k5366l425K5624P60k6673J544K5637
$$ -31794 -8105 580 -25069 -32870 -7944 -3455 -28821 -32246 -6622 -5862 -32535 -30991 -5354
466e354l907k5592N565K4699p737k4276R482K3843j2005k2021J3204K0621j4304
$$ -5354 -9261 -34853 -29288 -4589 -12326 -36602 -27120 -3277 -15282 -37303 -24099 -3478 -17782
479a7782j9893J5878J8663j6720j6853J8802J5526j9404j3578K0449J2999k1331
$$ -17782 -37675 -21797 -3134 -19854 -36707 -17905 -2379 -21783 -35361 -14912 -1913 -23244
491b3244j0035K3264Q630k2988n944K4346M821k3390k152K5054P93k3627K806
$$ -23244 -33279 -10015 -1385 -24373 -30317 -5971 -1150 -24540 -26692 -1638 -845 -24472 -21666
504b1666K4028k839k2300N658K3008n992k1120R223K1734r582j8789J1733J9627
$$ -21666 2362 -477 -22777 -17119 5889 -103 -21223 -12000 9734 152 -18637 -6904 12723
517A2723j1951j7938J5242J7597j5404j4906J8160J4499j7846j2006K0060J1921
$$ 12723 772 -17166 -1924 15673 269 -14637 3523 18022 176 -11830 8230 20151
529B0151k0169q432K1623P772k0553m942K2100M305k0757j845K2176P63k0942
$$ 20151 -18 -8450 13173 20945 392 -4550 17550 21855 1098 -747 21429 22192 1250
542A250J923K1133k255k0535M606K0792n699k0023Q096J9699r381j8383J0610
$$ 1250 3173 24306 22051 1516 6122 26914 21215 1192 9288 28987 19606 1223 11833
555A1833J8255j2176j6932J4198J5358j4990j4070J5880J2712j6675j1536J7566
$$ 11833 30088 17912 980 15178 30536 15546 1476 17356 30068 13393 1857 19423
567A9423R765j8893p942J8552O267j9481n568J9535L049k0374k392K0051k61k0516
$$ 19423 29188 10295 2353 20905 27172 7691 2123 21658 24707 4333 1941 21992 21731 1215
581A215R34J9515l277k0575M069J8976o462j9337P288J7707r677j7957R441J6237
$$ 1215 2149 21664 18387 -2188 1881 20857 14395 -4942 2346 20053 10376 -7581 1860 18097
595A8097j2290j5982J2617J3332j4434j3527J4470J1311j6435j1085J6386Q326
$$ 18097 5807 -10175 2442 15774 1340 -12187 2283 13594 -2841 -13926 2460 10786
607A0786j8055p500J7128N987j8582n459J8335K603j9121k370J8297J19j8829
$$ 10786 -7269 -14769 2359 8346 -10236 -15695 2640 5243 -13878 -16248 2049 2168 -16661
620a6661O17J8215k962j9176L996J7653n894j7602P069J6593q796j6192R697J5290
$$ -16661 -16044 2171 -791 -19967 -15971 1682 -4212 -21814 -14745 1848 -6948 -23140 -13443 1847
634A847j1502j4026J2207J2726j2960j2059J3950J0885j4317r663J5147Q091j5695
$$ 1847 -9655 -23681 -11474 1252 -11708 -23767 -9817 1068 -13249 -22912 -7765 326 -15369
647a5369o949J6062O607j6640m421J7509L130j7185j519J7792O79j7065J484J7966
$$ -15369 -22318 -6256 351 -16289 -20710 -3201 -71 -17256 -18775 -983 -304 -17369 -15885 2081
661B081k527j6721M831J6549m985j5403P036J5559p450j3883R178J4007r202j2036
$$ 2081 -446 -17167 -12336 4213 -772 -16175 -9139 6420 -1030 -14913 -5735 8272 -930 -12966
675a2966J0785J2175j0902j0750J2992J0623j2521q408J4436Q055j4377o219J5699
$$ -12966 -2181 9994 -908 -11658 1334 11957 -564 -8972 5464 13519 -858 -7077 8622
688H622O107j5491l460J6409K774j5561j013J6454K54j5701J576J6166k447j5082
$$ 8622 14729 -762 -4222 12187 14961 -600 -1613 14841 15095 -606 970 17136 14689 -393
702c93M177J4952m330j4458O220J4315p289j3440Q392J3139r193j2054J0136J1519
$$ -393 3784 18736 14406 -52 6168 20483 13194 -246 8146 21285 12092 38 10174 21693
716B1693j1504j0628J2156R258j2711q452J3314O908j4135o176J4040M688j5083
$$ 21693 10189 -439 11717 20975 8264 -188 13126 20034 5899 -277 13763 18451 3368
729C368l465J4481J750j5222j441J4867o73j5298J094J4458l236j4886L330J3714
$$ 3368 -97 14384 16134 912 -529 14338 13665 -1633 -539 13919 10683 -4203 -873 12841
743A2841m939j4376N542J2879p372j3101P306J1710r112j1652R143J0211j1102
$$ 12841 7902 -6474 -932 11947 4575 -8526 -1220 10490 1378 -10274 -1131 9080 -2022
756b022j0032J1043P932j2143q081J2340O001j3615n753J3248M031j4111l218
$$ -2022 -12054 -1011 6921 -5222 -13303 -963 5038 -8577 -14330 -1082 2949 -11162 -14380
769a4380J3416J799j4231j374J3884l05j3924Q50J3431k323j3366K796J2952m140
$$ -14380 -964 835 -13396 -14770 -886 -1191 -15115 -14265 -834 -3157 -16523 -13727 -775 -4915
783d915j3085N358J2160o298j1682P152J1233q242j0345R294R672j0059q486J0788
$$ -4915 -18000 -12642 -482 -6780 -18462 -11310 -77 -8319 -18664 -9370 302 -9757 -18243 -7455
797g455P778j0694o683J1774N887j1719m624J2074M304j1918k656J2431K444j2285
$$ -7455 323 -10371 -17054 -5280 607 -11112 -15736 -3662 642 -11276 -13932 -1501 943 -11342
811a1342p99J2930J42j2123J196J3025j814j2070L494J2586l879j1678N708J1615
$$ -11342 -12141 789 931 -11192 -9996 3029 1215 -10855 -7361 5225 1346 -10332 -4624 6991
825F991n781j0459P224J0548p350q922Q575Q911q675p523R565P410r375o167J0796
$$ 6991 1210 -9249 -2025 8523 1173 -7749 826 9737 1062 -6461 3104 10514 1139 -5028 5768
840E768N737j0587m375J1320M050j1450k630J2186K090j2065n89J2334o6j1956
$$ 5768 11505 918 -3457 7863 11913 463 -2167 10019 12109 44 -545 11789 11723 -233
854b33J097J2181k155j1612L204J1510l897j0958M801J0384n454j0025O248R449
$$ -233 864 13045 10890 -722 2482 13992 10095 -863 3938 14322 8868 -1157 5091 14540
868A4540p164q826P675Q269q593p671Q843O820r761o335J0249N083j0547m702
$$ 14540 7376 -1450 6225 14494 5901 -1770 7073 13893 4132 -2203 8046 13129 2582 -2120
882b120J0661L546j1296k983J1121J711j1645q83J1103j90j1461O61J1074k249
$$ -2120 8541 12087 791 -2192 8929 10640 -1005 -1888 9215 9025 -2436 -1775 9299 7050
896G050j1034K725J0369l863j0500M401R634n279r707N838Q706o824q567P008
$$ 7050 -3984 -1259 9110 5247 -5253 -852 8782 3503 -6204 -366 8340 1516 -7051 -43
910d3P802p886p399Q007O499q994o071R203M817r675m380R848L316j0503k621
$$ -43 7759 -127 -7526 481 6980 -2014 -8085 1118 5935 -3740 -8120 1728 5044 -5459 -8080
925h080J0409J422j0586o64J0268k04j0511P72J0434j969r964K339R715l075r646
$$ -8080 2329 3751 -6835 -7499 2769 2565 -7946 -7174 3260 1291 -8673 -6334 3381 306 -9340
940i340L676R167m388q990N205Q228n702q031O350P642p257o773P731O113q437
$$ -9340 -5664 3503 -885 -9875 -4670 3558 -2144 -10175 -3825 3817 -3440 -10213 -2482 3631 -4806
955d806n426Q954M582r012l854R386K958r431k253R628J643r528p02R447K74r583
$$ -4806 -10232 -1278 3304 -5708 -9562 -176 2782 -6649 -8902 726 2369 -7159 -7861 1586 1860 -7723
971g723N20R624j297r230K124R361k781r138L760Q873m403q373N417Q010n781
$$ -7723 -7203 2421 1124 -8106 -5982 3379 598 -8540 -4780 4093 -310 -8683 -3266 4744 -1037
986a037p442O582P181o988o105P509N607p780m839Q266M464q253l559Q771K966
$$ -1037 -8479 -1897 5284 -1704 -7809 -300 5307 -2473 -7312 954 5418 -2835 -6394 2377 5343
1001E343q859k223R144J779r152p15R413K33r359P19R470j411q914K209R149k975
$$ 5343 -3516 -5739 3405 5184 -3968 -4683 4730 4963 -4396 -3677 5793 4382 -4532 -2323 6826 3851
1017C851q670L798Q504m290p855N032P373n343p087O123O630o529n804O986N382
$$ 3851 -4819 -1021 7483 3193 -4662 370 7743 2400 -4687 1436 8066 1537 -4267 2719 8101
1032H101p401m790P800M232p936l439Q445K811q530k172Q712J585q831p48Q838
$$ 8101 700 -4090 3710 7942 6 -3433 5012 7823 -707 -2879 5833 7418 -1413 -2161 6677
1047F677O2q849O73Q739j378q605J922Q405k818q145L341P815l959p520M581O896
$$ 6677 6739 -2110 -1437 7302 5924 -2681 -759 7646 4828 -3317 24 7839 3880 -3640 941 7837
1063G837n100o791N584O056o056n560O236N031o816m815O977M024p389l601P472
$$ 7837 2737 -4054 1530 7586 1530 -4030 2206 7237 421 -4394 2583 6607 -782 -4383 3089
1078C089K695p892k347Q047J496q456q53Q113M5q370N59Q132j457q151J796P764
$$ 3089 5784 -2108 -4455 3592 5088 -3368 -4221 3892 3937 -4433 -3874 4258 2801 -5350 -3554 4210
1094D210k701p680K994P154l660p086M033O423m608o461M965N884n550n606N809
$$ 4210 1509 -6171 -3177 3977 317 -6769 -2736 3687 -921 -7382 -2417 3467 -2083 -7689 -1880
1109a880N123o617m611O898L853p250l385P493K603p701k081P865J330p902o32
$$ -1880 3243 -3374 -7985 -1087 2766 -4484 -7869 -376 2227 -5474 -7555 310 1640 -6262 -6894
1124f894P742J74p789N20P698r97p484J602P501k152p048K668P184l167o865M075
$$ -6894 848 1022 -6767 -6247 1451 454 -7030 -5428 2073 -79 -7127 -4459 2725 -442 -7307 -3232
1140c232O624m351o129N149N837n275n288O044N108o279m174O753L837o694k960
$$ -3232 3392 -959 -7088 -1939 3898 -1377 -6665 -621 4487 -1792 -5966 787 4624 -2070 -5030
1155e030P227K579p010j837P509J474p191o26P519M44p329N81P559q11p352J716
$$ -5030 2197 4776 -2234 -4071 3438 4912 -2279 -2905 4614 5058 -2271 -1690 5869 5058 -2294 -578
1171e78P466k029p005K867P073l174o527L878O355m085n820M718N505n023m820
$$ -578 6888 4859 -2146 721 7794 4620 -1907 1971 8326 4241 -1579 3139 8644 3621 -1199
1186a199N482M650n874l859O074L532o285l006O649K366o657j978O946J239o959
$$ -1199 4283 8933 3059 -800 5274 8806 2521 -485 6164 8530 1873 -105 6841 8080 1121
1201A121r20O924L02p158K41O906q78p044J134O731j951o725K204O316l147o315
$$ 1121 201 7125 7427 269 510 7416 6538 -506 628 7359 5408 -1317 887 7203 4056 -2259
1217b259L411N641m084n737M213M876m953m903M906M119n609m006N380L226o166
$$ -2259 1152 6793 2709 -3028 1185 6061 1108 -3795 1111 5230 -379 -4385 995 4221 -1945
1232a945l257N895K382o442k322O161J334o694j342O433K73p042o9O394p56o874
$$ -1945 -5202 693 3075 -3367 -5689 472 1806 -4888 -6230 203 476 -6566 -6635 -241 -997 -7871
1248g871J015O358k040o524K251N934l220n910L271N301l736n393L996M662m464
$$ -7871 -6856 -498 -2538 -9062 -6811 -877 -4097 -10007 -6736 -1435 -5171 -10564 -6568 -1906 -6370
1263f370m630M566M215n158l758N168L382n698k944O014K392o081j960O514J363
$$ -6370 -11000 -6434 -2219 -7377 -11135 -5967 -2585 -8283 -11227 -5213 -2821 -8902 -10862 -4348 -2985
1278b985o387q44O792L14o513N12O544n99o214J439O379j520n748K205O136k441
$$ -2985 -9372 -10216 -3424 -3110 -9623 -9111 -2567 -3166 -9380 -7941 -1562 -3082 -8830 -6625 -489 -2930
1294b930n302L139N662l046m920M077N078l956m185M891M440m698l428N545L622
$$ -2930 -8232 -5093 569 -2477 -7397 -3320 1758 -2198 -6383 -1492 2948 -1750 -5178 367 3989
1309C989n348k518O112K577n538j624O358J624n816o45O449O96n771M19O210k26
$$ 3989 -1359 -3877 2235 4812 -726 -2350 4008 5632 -184 -829 5620 6316 545 964 7174 6948
1325F948n703J246O216j256n422K083N873k225n130K944N416k990m845L860M810
$$ 6948 1245 2491 8707 7451 2029 4112 9985 7760 2630 5574 10990 8000 3155 7015 11825
1340A1825l830m313M453M202m503l481M941L339n228k625N388K424n488j888N645
$$ 11825 7995 3682 8135 12337 7834 4353 9294 12633 7405 4780 10168 12592 7104 5216 10861
1355A0861J326n656j026N719L62n816j14N564m34n852P62N461j402n616J403N267
$$ 10861 12187 6531 5505 11224 11586 5770 5656 11220 10786 4934 5696 11157 9755 4139 5542 10809
1371A0809k309n391K221M873l160m945L112M118l956m508L820L508m688l680M330
$$ 10809 8500 3109 5330 10203 7043 2098 5210 9328 5372 864 4684 8192 3504 -176 4154
1386D154K651n147k895M704J873n497k114M911J102n629j423N209K79n837n31
$$ 4154 6805 1658 -1237 3467 5340 -157 -2271 2640 3742 -1887 -3310 1899 2178 -3659 -4190
1401d190N216n14n968M46N146j310n761J233N050k397n407K238M635l181m794
$$ -4190 1026 512 -5456 -5010 136 -1174 -6935 -5702 -652 -3049 -8456 -6218 -1583 -4764 -9558
1416i558L086L979l736m234L666L424m291l502M172K835m672k740M570K277n080
$$ -9558 -6472 -2493 -6229 -10463 -6797 -3373 -7664 -11166 -6994 -4159 -8831 -11571 -7001 -4724 -9804
1431i804j987M984J436n207j140N405N54n485o9N503l51n346Q31N381j078n141
$$ -9804 -11791 -6807 -5371 -10578 -11718 -6313 -5759 -11244 -11313 -5810 -6161 -11507 -10676 -5295 -6373 -11514
1447a1514J772N120j950m596K431M703k493m096L152M171k966l680L805L722l609
$$ -11514 -9742 -4622 -6572 -11168 -8737 -4034 -6527 -10623 -7471 -3300 -6266 -9946 -6141 -2419 -6028
1462f028k887M231L202m078k353M865K583m566j492N126J670m640q16N366Q09
$$ -6028 -8915 -4684 -1482 -5560 -7913 -3048 -465 -5031 -6523 -1397 273 -4367 -5183 183 992
1477I92m692O6N246J45m672Q82N138o87m637J739M933j431m266K320M596k153
$$ 992 -3700 -3634 1612 1757 -2915 -2033 3105 2418 -2219 -480 4453 3022 -1244 1076 5672 3519
1493C519l884K923M109k722l502L583L581l356l003M010L014l889k393M404K336
$$ 3519 -365 2558 6667 3945 443 4026 7607 4251 1248 5258 8272 4383 1990 6394 8730
1508H730m294j618M619J519m567r19M840N79m650j71M754j17m720N89M663r70
$$ 8730 4436 2818 7437 8956 4389 3470 8310 8889 4239 4068 8822 8705 3985 4574 9237 8267
1524H267m666J306M410j652m349J749M199k357m091K355L811k935l798L044L150
$$ 8267 3601 4907 9317 7665 3316 5065 9264 6907 2816 5171 8982 6047 2249 5293 8443
1539H443l520l229L657K537m151k498L929J803m520j719M148J109m733j135M394
$$ 8443 4923 1694 5351 7888 3737 1239 5168 6971 2451 732 4880 5989 1256 121 4515
1554D515L48m703m71M339k69m686K11M289r00m727R60M225j625m420J608M021
$$ 4515 4863 160 -311 4028 3759 -927 -716 3573 2673 -2054 -1094 3131 1506 -2914 -1306 2715
1570B715k490m016K457L540l059l563K973K989l497l036L527K425l839k266L681
$$ 2715 225 -3791 -1334 2206 -853 -4416 -1443 1546 -1951 -4987 -1460 965 -2874 -5140 -1459
1585a459J893m069j766L973J327m200j156M276O22m262l96M305o5m376M11M285
$$ -1459 434 -3635 -5401 -1428 -101 -4301 -5457 -1181 -559 -4821 -5217 -912 -977 -5353 -4942 -657
1601f57p27m359J198M142j458m042J819L944k148l583K381L437k526l133K902
$$ -657 -1384 -5743 -4545 -403 -1861 -5903 -4084 -140 -2288 -5871 -3490 -53 -2579 -5712 -2810
1616b810K965k897k740L307K449l289k096L584K072l752j481L863J373l969q69
$$ -2810 155 -2742 -5482 -2175 274 -3015 -5111 -1527 545 -3207 -4688 -825 548 -3421 -4290
1631d290M110P45m021k97M295K0m113M66M159n86l992J107L873j082l811J660
$$ -4290 -180 565 -3456 -3753 542 562 -3551 -3085 1074 488 -3504 -2397 1476 394 -3417 -1757
1647a757L799j986l324K150L316k314l038K711K890k825k644L179K404l189k228
$$ -1757 2042 56 -3268 -1118 2198 -116 -3154 -443 2447 -378 -3022 157 2561 -628 -2856
1662b856L500K004l659j570L793J342l860j004L953O81m012l11M086j5l992L94
$$ -2856 644 2648 -1011 -2581 1212 2554 -1306 -2310 1643 2324 -1688 -1999 2087 2072 -1920 -1526
1678a526L877o74l968J095L697j216l692J587L619j942l350J962L323k323l089
$$ -1526 2351 1677 -2291 -1196 2501 1285 -2407 -820 2799 857 -2493 -531 2792 469 -2620
1693b620K496K930k766k706K997K433l176k189L351J967l592j568L700J294l778
$$ -2620 -124 2806 40 -2666 331 2764 -412 -2601 750 2717 -875 -2443 1257 2551 -1227
1708a227r01L884N47l816l13L923n4l759L60L719n15l660Q54L569r42l581J396
$$ -1227 -2128 1756 2303 -1513 -1826 2097 2043 -1716 -1356 2363 1848 -1812 -958 2611 1669 -1912 -516
1725e16L471j560l333J928L260k129k958K486K847k689k498K916K294k937j978
$$ -516 2955 1395 -1938 -10 3250 1121 -1837 649 3496 807 -1691 1225 3519 582 -1396
1740a396L258J757l341j357L390J287l492r07L582O77l458m05L600J14l468J61
$$ -1396 1862 3619 278 -1079 2311 3598 106 -801 2781 3458 0 -405 3195 3309 -159 2
1756BL544l06l511P09L423r05l446J243L389j616l101J779K978k108k767K248
$$ 2 3546 3240 -271 438 3861 2956 -490 753 4142 2526 -575 1204 4182 2074 -693 1555
1772A555K587k470k502K635K182k768k035K847J709l116j534L049J198l306j022
$$ 1555 4142 1672 -830 1805 3987 1219 -816 2031 3740 624 -910 2139 3337 31 -991
1787i91L241O98l430n26L322L0l384q8L456m53l563O63L282r71l468J150L116
$$ -991 2250 2948 -482 -1008 2314 2344 -1040 -1128 2328 1875 -1688 -1025 2257 1286 -2182 -1032 2084
1804B084j551l181J669K860k080k749K034K477k470k416K463J954k720k001K773
$$ 2084 533 -2648 -979 1881 -199 -2948 -914 1563 -907 -3323 -860 1094 -1626 -3627 -854
1819h54J596l026j493K943J228l269j008L118O84l303n59L365J30l372M1L278
$$ -854 742 -2284 -3777 -834 394 -2875 -3883 -765 -81 -3384 -3943 -578 -448 -3820 -3779 -501
1835e01m65l246O50L143r38l099J211K968j431k929J700K752j890k445J995K489
$$ -501 -966 -4212 -3562 -419 -1357 -4456 -3245 -277 -1708 -4637 -2937 -185 -2075 -4520 -2525 -36
1851c6k189k244K386K127k352j898K688J733k686j384L055J307l003q43L213P69
$$ -36 -2225 -4469 -2083 44 -2308 -4206 -1518 215 -2471 -3855 -800 507 -2496 -3339 -126 643
1867F43l089k96L391Q5l059J95L350l56k958P34L105o79k865J201K941j116k679
$$ 643 -2446 -2742 649 734 -2325 -2130 1220 864 -2094 -1360 1745 1066 -1799 -598 2343 1227 -1452
1884a452J562K713j438k421J946K497j974k104K297K107k298j710K657J679k644
$$ -1452 110 2823 1385 -1036 910 3407 1433 -671 1626 3733 1435 -275 2382 4061 1417
1899A417j236K873J151k842p48K962O44k913l43K933K54k870K6K951k72k867M95
$$ 1417 181 3054 4205 1363 615 3577 4221 1308 965 3898 4152 1282 1308 4259 3987 1120 1615
1916A615K822p16k845R61K698j168k701J343K527j636k472J772K249k174k087
$$ 1615 4437 3721 876 1837 4535 3367 666 2009 4536 2900 428 2200 4449 2275 188
1931A88K098J845k373j809K378J432k657j489K642R39k797r06K630N27k987n59
$$ 188 2286 4131 1758 -51 2327 3759 1102 -387 2255 3194 397 -509 2121 2648 -339 -898
1947h98K752Q8k963j69K841m25k930L67K738q33k951Q71K575j239k790J236K452
$$ -898 1854 1942 -1021 -1190 1651 1226 -1704 -1337 1401 568 -2383 -1512 1063 -176 -2966 -1730 722
1964G22j652k555J651K205k110k169K061J635k246j784K309J355k540j305K459
$$ 722 -930 -3485 -1834 371 -1739 -3908 -1847 -212 -2458 -4242 -1933 -578 -3118 -4423 -1964
1979a964R81k727q21K628N62k787m98K747J91k816j0K734j74k779L66K813o39
$$ -1964 -983 -3710 -4531 -1903 -1341 -4128 -4626 -1879 -1688 -4504 -4514 -1780 -1954 -4733 -4367 -1554 -2193
1996b193k668R13K579j095k448J448K346j444k151J735K215j882j812K011J750
$$ -2193 -4861 -3948 -1369 -2464 -4912 -3464 -1118 -2562 -4713 -2978 -763 -2645 -4457 -2446 -696
2011f96j888j543K294J466k142j247K480J244k358q81K701R06k579m13K808M27
$$ -696 -2584 -4127 -1833 -367 -2509 -3756 -1276 -32 -2390 -3271 -570 336 -2243 -2656 152 579
2027E79k605J47K758o1k534O25K698n32k461R83K583q28k301J346K348j175k069
$$ 579 -2026 -1879 879 818 -1716 -1091 1607 1075 -1386 -403 2180 1352 -949 397 2745 1570 -499
2044d99J611K223j595j730J792J900j777j608K259J496k112j157K370J159k305
$$ -499 1112 3335 1740 10 1802 3702 1925 317 2576 4072 1960 803 3173 4332 2027
2059B027p89K530P18k491l69K530L00k568L8K607j70k505M10K492n85k329O75
$$ 2027 1238 3768 4486 1995 1626 4156 4456 1888 1926 4533 4363 1858 2268 4760 4175 1846 2521
2076B521K270q37k357J104K136j275k098J361J973j679j895J696J662j985j630
$$ 2521 4791 3954 1597 2701 4837 3562 1464 2825 4798 3119 1224 2920 4582 2597 967
2091I67K057J256k233j350K284R38k443r80K302O77k661n19K435J02k550k06K372
$$ 967 3024 4280 2047 697 2981 3919 1476 496 2798 3475 814 295 2730 2832 282 76 2448
2108B448k97k526J82K351o88k526O63K162r60k373R39K056j350k217J295J893
$$ 2448 2151 -375 -193 2158 1470 -1056 -393 1769 809 -1564 -625 1431 81 -2136 -841 1052
2124A052j694j944J625J659k018j611J922J246k205j282K126Q56k367q45K191
$$ 1052 -642 -2586 -961 698 -1320 -2931 -1009 237 -1968 -3250 -1124 -268 -2635 -3480 -1289
2139a289N89k387n29K260K63k446j34K289q0k363J62K338m83k300N86K259p59
$$ -1289 -700 -3087 -3616 -1356 -1093 -3539 -3673 -1384 -1464 -3827 -3665 -1327 -1810 -4110 -3524 -1265 -2024
2156b024k263J039K096j150k004J366J915j459j737J640J622j770j288J804J371
$$ -2024 -4287 -3248 -1152 -2302 -4306 -2940 -1025 -2484 -4221 -2581 -959 -2729 -4017 -2213 -842
2171h42j895j071K065J019j975p92K195P66k091m77K204M66k185j09K405lk150
$$ -842 -2737 -3808 -1743 -724 -2699 -3491 -1296 -530 -2621 -3098 -894 -428 -2613 -2722 -317 -320 -2470
2188b470K83K357l62k186O86K248o72j998J069K064j013j905J366J929j387j586
$$ -2470 -2187 170 -192 -2378 -1692 556 -116 -2114 -1045 1019 6 -1899 -533 1396 9 -1577
2204a577J606J665j591j384J762J375j770j114J977J059j952q45K222P18k157
$$ -1577 29 1694 103 -1281 481 1856 86 -1028 949 2008 56 -789 1433 2151 -6
2219fm39K220M08k247l2K239l4k205K56K345m70k166N87K138p39j993R48J903
$$ -6 -445 1775 2183 -64 -96 2143 2109 -96 160 2505 2035 -131 456 2594 1855 -138 810 2713
2237B713j051j855J197J782j355j667J461J538j619j424J695J291j805j174J890
$$ 2713 1662 -193 1004 2786 1431 -236 1225 2763 1144 -280 1415 2706 901 -273 1617
2252A617J005k033q89K134O22k115n19K083L33k255j04K147k6k192P6K203m28
$$ 1617 2622 589 -300 1834 2456 341 -178 1905 2238 -17 -121 2026 2000 -192 -116 2087 1659
2269A659k120M98K057o58k012Q18J856r71j874J073J801j223j706J331J542j517
$$ 1659 -461 37 2094 1436 -576 242 2098 1127 -747 326 2127 904 -802 529 2071 554
2285E54j437J630J334j781j231J824R92j885q52J926O43k012n35K003L34k020
$$ 554 -883 747 2081 300 -931 893 1885 0 -852 1074 1717 -295 -830 1173 1507 -513
2301e13j66J978P3k081J30J992k66j979L75J959o21j802O14J944q39j861J053
$$ -513 -679 1299 1372 -709 -579 1413 1147 -832 -457 1502 881 -921 -307 1637 798 -1063 -10
2318a0J684j126j707J252J585j467j361J497J229j604j149J648R68j786q33J863
$$ -10 1674 548 -1159 93 1678 211 -1150 347 1576 -28 -1177 471 1439 -347 -1180 683
2334F83O43j931n39J933M06k033k76J958J02j957MJ910k21j955K69J996n54j907
$$ 683 1326 -605 -1144 789 1195 -838 -1114 844 946 -1011 -1007 903 682 -1273 -1004 992 438 -1469
2352a469N85J804q45j720R46J600j148j614J199J511j440j378J404J308j633j198
$$ -1469 -884 920 75 -1645 -699 901 -247 -1861 -662 849 -591 -1969 -565 743 -890 -2088
2368b088J645R36j699r26J779O50j824o09J833L95j991j98J826J74j974J6J905
$$ -2088 -443 493 -1206 -2132 -353 297 -1527 -2136 -303 92 -1899 -2097 -271 -97 -2071 -2055 -150
2385a50j44j995L61J889n68j798O96J713p40j755R83J572r99j501J138J477j317
$$ -150 -294 -2289 -1928 -39 -607 -2405 -1709 4 -736 -2491 -1508 64 -935 -2436 -1298 179 -1138
2402a138j307J415J244j526j014J537J036j569q67J725P40j708n69J851M54j814
$$ -1138 -2445 -1030 214 -1312 -2326 -789 247 -1322 -2189 -464 276 -1432 -2001 -150 304 -1510
2418a510k26J900J96j885O5J952k14j822M28J851m78j652O31J749o92j587R09
$$ -1510 -1736 164 360 -1525 -1460 492 278 -1544 -1116 735 257 -1395 -764 985 293 -1294 -385
2435c85J576r21j435J210J395j151j256J260J302j328j025J443J074j522q60J692
$$ -385 1191 270 -1165 45 1440 289 -967 293 1595 267 -758 685 1759 237 -623 1069
2451A069P28j637n62J815M17j725k38J816J54j790J34J734j65j733L94J771m56
$$ 1069 1797 160 -402 1413 1830 105 -133 1683 1837 47 181 1915 1750 17 411 2182 1726
2468A726j635M78J717o32j608Q23J539q81j471R79J417j104j401J308J194j392
$$ 1726 91 569 2286 1654 46 869 2408 1527 56 1035 2452 1348 -53 1255 2449 1057
2484A057j083J448R01j540q19J583O06j599n41J672L48j712l07J695R7j802L9
$$ 1057 -26 1422 2323 783 -36 1547 2153 554 13 1685 2033 321 14 1709 1806 4 43
2501D3J685j42j778K34J679m87j679M72J596o87j625P68J468q91j556J087J273
$$ 43 1728 1586 -192 42 1721 1234 -445 27 1623 936 -689 79 1547 656 -900 187 1460
2518A460j167j285J267J118j446r94J382Q61j482q74J526O08j564n89J597M11
$$ 1460 293 -992 275 1393 -53 -1047 335 1196 -286 -1160 366 974 -590 -1179 418 829
2534H29j590l98J581J99j766k0J660r2j700K06J750m93j654N11J578o20j534P62
$$ 829 -761 -1159 422 621 -1145 -1165 495 403 -1297 -1091 659 166 -1488 -977 601 -19 -1553 -791
2552g91J475q90j414R97J283j070j202J110J177j311j005J327R49j397p67J377
$$ -791 684 -206 -1620 -623 660 -410 -1612 -502 675 -636 -1641 -314 635 -762 -1529 -152
2568a52O78j433n94J474N58j610l33J580K21j613p4J598m3j651K73J570l07j568
$$ -152 526 -907 -1501 -27 531 -1079 -1412 168 389 -1224 -1298 300 257 -1394 -1121 449 142 -1426
$$ [...]
8191e2
##END NTUPLES=NMR FID
##END=
