##TITLE=1H_X1412
 CDCl3
 8 sc, 
 15.12.2021
##JCAMPDX= 6.0         $$ Bruker NMR JCAMP-DX V2.0
##DATA TYPE= NMR FID
##DATA CLASS= NTUPLES
##ORIGIN= UXNMR, Bruker Analytische Messtechnik GmbH
##OWNER= root
$$ XWIN-NMR		Version 3.5
$$ Wed Dec 15 10:43:48 2021 Russian Standard Time (UT+4h)  she@DPX200
##.OBSERVE FREQUENCY= 200.131346
##.OBSERVE NUCLEUS= ^1H
##.DELAY= (6, 6)
##.ACQUISITION MODE= SIMULTANEOUS
##.ACQUISITION SCHEME= undefined
##.AVERAGES= 8
##.DIGITISER RES= 18
##SPECTROMETER/DATA SYSTEM= spect
##.PULSE SEQUENCE= zg30
##.SOLVENT NAME= CDCl3
##.SHIFT REFERENCE= (INTERNAL, CDCl3, 0, 15.7039)
##AUDIT TRAIL= $$ (NUMBER, WHEN, WHO, WHERE, WHAT)
$$ ##TITLE= Audit trail, XWIN-NMR		Version 3.5
$$ ##JCAMPDX= 5.01
$$ ##ORIGIN= Bruker BioSpin GmbH
$$ ##OWNER= she
$$ F:/spectra/data/she/nmr/H-F/1/audita.txt
$$ ##AUDIT TRAIL=  $$ (NUMBER, WHEN, WHO, WHERE, WHAT)
(   1,<2021-12-15 10:42:36.93 +0400>,<she>,<DPX200>,
      <created by zg, POWCHK disabled, PULCHK disabled
       configuration hash MD5:
       00 E9 B6 7A A2 85 ED C7 34 08 36 98 17 FE 4E 26
       data hash MD5: 16K
       C5 04 0E D4 61 71 73 B0 A1 CB 01 0F 70 73 F5 50>)
$$ ##END=
$$ 
$$ hash MD5
$$ EA B1 BE 7A BD 6F B8 4A CB 26 07 9E 82 E7 63 D0
##$RELAX= 
##$RELAX= 
##$RELAX= 
##$RELAX= 
##$RELAX= 
##$RELAX= 
$$ Bruker specific parameters
$$ --------------------------
##$DU= <F:/spectra>
##$EXPNO= 1
##$NAME= <H-F>
##$PROCNO= 1
##$TYPE= <nmr>
##$USER= <she>
##$AMP= (0..31)
100 100 100 100 100 100 100 100 100 100 100 100 100 100 100 100 100 100 
100 100 100 100 100 100 100 100 100 100 100 100 100 100 
##$AQSEQ= 0
##$AQ_mod= 1
##$AUNM= <au_zg>
##$AUTOPOS= <>
##$BF1= 200.13
##$BF2= 200.13
##$BF3= 200.13
##$BF4= 200.13
##$BF5= 200.13
##$BF6= 200.13
##$BF7= 200.13
##$BF8= 200.13
##$BYTORDA= 1
##$CFDGTYP= 0
##$CFRGTYP= 5
##$CHEMSTR= <none>
##$CNST= (0..31)
1 1 145 1 1 1 1 1 1 1 1 1 1 1 1 1 1 1 1 1 1 1 1 1 1 1 1 1 1 1 1 1 
##$CPDPRG= <>
##$CPDPRG1= <>
##$CPDPRG2= <>
##$CPDPRG3= <>
##$CPDPRG4= <mlev>
##$CPDPRG5= <mlev>
##$CPDPRG6= <mlev>
##$CPDPRG7= <mlev>
##$CPDPRG8= <mlev>
##$CPDPRGB= <>
##$CPDPRGT= <>
##$D= (0..31)
0 1.2 0 0 0 0 0 0 0 0.06 0 0.03 0 0 0 0 0.0002 0 0 0 0 0 0 0 0 0 0 0 0 
0 0 0 
##$DATE= 1639550556
##$DBL= (0..7)
120 120 120 120 120 120 120 120 
##$DBP= (0..7)
150 150 150 150 150 150 150 150 
##$DBP07= 0
##$DBPNAM0= <>
##$DBPNAM1= <>
##$DBPNAM2= <>
##$DBPNAM3= <>
##$DBPNAM4= <>
##$DBPNAM5= <>
##$DBPNAM6= <>
##$DBPNAM7= <>
##$DBPOAL= (0..7)
0.5 0.5 0.5 0.5 0.5 0.5 0.5 0.5 
##$DBPOFFS= (0..7)
0 0 0 0 0 0 0 0 
##$DE= 6
##$DECBNUC= <off>
##$DECIM= 32
##$DECNUC= <off>
##$DECSTAT= 4
##$DIGMOD= 1
##$DIGTYP= 9
##$DL= (0..7)
0 120 120 120 120 120 120 120 
##$DP= (0..7)
150 150 150 150 150 150 150 150 
##$DP07= 0
##$DPNAME0= <>
##$DPNAME1= <>
##$DPNAME2= <>
##$DPNAME3= <>
##$DPNAME4= <>
##$DPNAME5= <>
##$DPNAME6= <>
##$DPNAME7= <>
##$DPOAL= (0..7)
0.5 0.5 0.5 0.5 0.5 0.5 0.5 0.5 
##$DPOFFS= (0..7)
0 0 0 0 0 0 0 0 
##$DQDMODE= 0
##$DR= 18
##$DS= 0
##$DSLIST= <SSSSSSSSSSSSSSS>
$$ [...]
##$SUBNAM2= <"">
##$SUBNAM3= <"">
##$SUBNAM4= <"">
##$SUBNAM5= <"">
##$SUBNAM6= <"">
##$SUBNAM7= <"">
##$SUBNAM8= <"">
##$SUBNAM9= <"">
##$SW= 18.0517287032376
##$SWIBOX= (0..15)
0 0 2 0 0 0 0 0 0 0 0 0 0 0 0 0 
##$SW_h= 3612.71676300578
##$TD= 16384
##$TD0= 1
##$TE= 0
##$TE2= 300
##$TE3= 300
##$TEG= 300
##$TL= (0..7)
0 120 120 120 120 120 120 120 
##$TP= (0..7)
150 150 150 150 150 150 150 150 
##$TP07= 0
##$TPNAME0= <>
##$TPNAME1= <>
##$TPNAME2= <>
##$TPNAME3= <>
##$TPNAME4= <>
##$TPNAME5= <>
##$TPNAME6= <>
##$TPNAME7= <>
##$TPOAL= (0..7)
0.5 0.5 0.5 0.5 0.5 0.5 0.5 0.5 
##$TPOFFS= (0..7)
0 0 0 0 0 0 0 0 
##$TUNHIN= 0
##$TUNHOUT= 0
##$TUNXOUT= 0
##$USERA1= <user>
##$USERA2= <user>
##$USERA3= <user>
##$USERA4= <user>
##$USERA5= <user>
##$V9= 5
##$VALIST= <valist>
##$VCLIST= <CCCCCCCCCCCCCCC>
##$VD= 0
##$VDLIST= <DDDDDDDDDDDDDDD>
##$VPLIST= <PPPPPPPPPPPPPPP>
##$VTLIST= <TTTTTTTTTTTTTTT>
##$WBST= 1024
##$WBSW= 4
##$XGAIN= (0..3)
0 0 0 0 
##$XL= 0
##$YL= 0
##$YMAX_a= 658190
##$YMIN_a= -601937
##$ZGOPTNS= <>
##$ZL1= 120
##$ZL2= 120
##$ZL3= 120
##$ZL4= 120
##$ABSF1= 10
##$ABSF2= 0
##$ABSG= 5
##$ABSL= 3
##$ALPHA= 0
##$AQORDER= 0
##$ASSFAC= 0
##$ASSFACI= 0
##$ASSFACX= 0
##$ASSWID= 0
##$AUNMP= <proc_1d>
##$AZFE= 0.1
##$AZFW= 0.1
##$BCFW= 1
##$BC_mod= 2
##$BYTORDP= 1
##$COROFFS= 0
##$CY= 11.3945322036743
##$DATMOD= 1
##$DC= 2
##$DFILT= <>
##$DTYPP= 0
##$F1P= 2.36226072786647
##$F2P= -0.459571619588291
##$FCOR= 0.5
##$FTSIZE= 0
##$FT_mod= 4
##$GAMMA= 1
##$GB= 0.15
##$INTBC= 1
##$INTSCL= 1
##$ISEN= 128
##$LB= 0.24
##$LEV0= 0
##$LPBIN= 0
##$MAXI= 10000
##$MC2= 0
##$MEAN= 0
##$ME_mod= 0
##$MI= 1.114404
##$NCOEF= 0
##$NC_proc= 0
##$NLEV= 6
##$NOISF1= 3.799351
##$NOISF2= 2.8
##$NSP= 1
##$NTH_PI= 0
##$NZP= 0
##$OFFSET= 15.70392
##$PC= 1
##$PHC0= -15870.22
##$PHC1= 8.200801
##$PH_mod= 1
##$PKNL= yes
##$PPARMOD= 0
##$PSCAL= 0
##$PSIGN= 0
##$REVERSE= no
##$SF= 200.130013532006
##$SI= 16384
##$SIGF1= 3
##$SIGF2= 2
##$SINO= 400
##$SIOLD= 16384
##$SREGLST= <1H.CDCl3>
##$SSB= 0
##$STSI= 0
##$STSR= 0
##$SW_p= 3612.71676300578
##$SYMM= 0
##$S_DEV= 0
##$TDeff= 0
##$TDoff= 0
##$TI= <>
##$TILT= no
##$TM1= 0
##$TM2= 0
##$TOPLEV= 0
##$USERP1= <user>
##$USERP2= <user>
##$USERP3= <user>
##$USERP4= <user>
##$USERP5= <user>
##$WDW= 1
##$XDIM= 8192
##$YMAX_p= 0
##$YMIN_p= 0
$$ End of Bruker specific parameters
$$ ---------------------------------
##NTUPLES= NMR FID
##VAR_NAME=  TIME,          FID/REAL,        FID/IMAG
##SYMBOL=    X,             R,               I
##VAR_TYPE=  INDEPENDENT,   DEPENDENT,       DEPENDENT
##VAR_FORM=  AFFN,          ASDF,            ASDF
##VAR_DIM=   8192,          8192,            8192
##UNITS=     SECONDS,       ARBITRARY UNITS, ARBITRARY UNITS
##FACTOR=    0.0002768,     1,               1
##FIRST=     0,             0,               0
##LAST=      2.2672688,     0,               0
##MIN=       0,             -601937,         0
##MAX=       2.2672688,     658190,          0
$$ Real data points
##PAGE= N=1
##DATA TABLE= (X++(R..R)), XYDATA
$$ plain form
0 0 0 0 0 0 0 0 0 0 -8 8 -8 8 -16 17 -24 32 -40 48 -56 72 -80 97 -117 136 -160 187 -217 249 -291 334 -381
31 -381 434 -495 559 -631 712 -798 894 -1000 1115 -1240 1380 -1530 1695 -1874 2071 -2285
47 -2285 2521 -2777 3059 -3369 3712 -4092 4516 -4991 5525 -6137 6835 -7648 8605 -9762
61 -9762 11176 -12960 15295 -18491 23159 -30655 44693 -80252 374367 546048 -60270 35440
73 35440 325429 497862 196584 -119628 -273272 -238497 -284343 -321229 -312092 -241644 -258824
84 -258824 -234565 -86877 113799 104967 -53904 -74992 212344 470008 353358 -35089 -205535
95 -205535 9477 277974 220770 -46911 -178219 -62110 65299 39558 -42626 -37238 -6459
106 -6459 -50818 -120935 -99408 -42599 -90172 -204689 -190950 -15937 107040 21041 -102850
$$ packed form
0@%%%%%%%%qJ6j6J6k4L3m1N6p2Q8j04J28j52J77k14K53k96L47m04M66n40O25p15
31c81Q15r29J054j190J343j510J692j894K115k355K620k910L225l569L945m356
47b285M806n298N836o428P081p804Q608r507J0516j1662J2972j4483J6253j8367
61i762K0938k4136K8255l3786M1650n3814P5348j24945M54619J71681o06318R5710
73C5440K89989J72433l01278l16212j53644L4775m5846l6886R137P0448j7180
84b58824K4259J47688K00676q832j58871k1088K87336K57664j16650l88447j70446
95b05535K15012K68497n7204k67681j31308J16109J27409k5741q2184N388L0779
106f459m4359p0117K1527N6809m7573j14517J3739J75013J22977q5999j23891
$$ plain form
117 -102850 -8808 241635 343460 195343 39886 94564 229226 188417 -20813 -158263
127 -158263 -119024 -69566 -156848 -275842 -264922 -158274 -103042 -114729 -70671 53707 133295
138 133295 114755 110687 206649 286972 201755 33374 -3042 107242 141326 -29843 -230004
149 -230004 -223021 -58695 9732 -106511 -220318 -155455 3110 65602 11836 -28695 8161
160 8161 56478 63429 69560 94077 72614 -14706 -58467 33524 155540 118580 -58387 -147898
172 -147898 -25490 141229 114465 -77260 -184976 -91584 47671 42299 -78193 -143507 -91624
183 -91624 -7902 31523 36528 34677 14405 -10325 28063 130238 176697 78676 -67891 -80309
195 -80309 49514 127153 24178 -143304 -170702 -45061 49577 1153 -97563 -106990 -24187
$$ packed form
117a02850R4042K50443J01825j48117j55457N4678J34662m0809k09230j37450
127a58263L9239M9458q7282j18994J0920J06648N5232j1687M4058J24378P9588
138A33295j8540m068R5962Q0323q5217j68381l6416J10284L4084j71169k00161
149b30004O983J64326O8427j16243j13807O4863J58565O2492n3766m0531L6856
160H161M8317O951O131K4517k1463q7320m3761R1991J22016l6960j76967q9511
172a47898J22408J66719k6764j91725j07716R3392J39255n372j20492o5314N1883
183i1624Q3722L9425N005j851k0272k4730L8388J02175M6459r8021j46567j2418
195h0309J29823P7639j02975j67482k7398J25641R4638m8424r8716r427Q2803
$$ plain form
206 -24187 46051 53953 37031 25752 12463 5979 37867 93046 89601 115 -76826 -43788 51288
219 51288 68258 -28322 -112039 -77005 17074 39251 -28938 -78908 -42675 19338 31325 5880
231 5880 888 22196 26791 11781 18963 51359 57377 12241 -29638 -12513 27555 19169 -33323
244 -33323 -59610 -27454 4657 -16435 -52968 -40894 10009 29796 -1591 -21628 11902 53435
256 53435 44470 -450 -13709 20872 45130 20383 -20579 -29803 -11087 -2161 -9591 -10004 -3522
269 -3522 -11376 -30081 -25174 13002 37522 9263 -34813 -29925 23545 54433 19239 -33176 -32398
282 -32398 18718 53399 31125 -13646 -28514 -9438 13739 18971 6912 -14511 -36517 -39501
294 -39501 -13898 15581 12036 -24936 -46809 -15231 38182 51187 13105 -22499 -6522 40982
$$ packed form
206b4187P0238P902j6922j1279j3289o484L1888N5179l445q9486p6941L3038R5076
219E1288J6970r6580q3717L5034R4079K2177o8189m9970L6233O2013J1987k5445
231E880m992K1308M595j5010P182L2396O018m5136m1879J7125M0068q386n2492
244c3323k6287L2156L2111k1092l6533J2074N0903J9787l1387k0037L3530M1533
256E3435q965m4920j3259L4581K4258k4747m0962r224J8716Q926p430m13O482
269c522p854j8705M907L8176K4520k8259m4076M888N3470L0888l5194n2415P78
282c2398N1116L4681k2274m4771j4868J9076K3177N232j2059k1423k2006k984
294c9501K5603K9479l545l6972k1873L1578N3413J3005l8082l5604J5977M7504
$$ plain form
306 40982 60436 31374 -11311 -25526 -8839 8962 9519 -7705 -31747 -45395 -36783 -9839 10572
319 10572 1760 -23805 -27624 3372 39781 40024 9271 -9851 5398 34176 40628 16668 -10751
332 -10751 -19359 -11063 341 2308 -6484 -22245 -33412 -26456 -5203 10319 6332 -9448 -12353
345 -12353 6757 27092 28546 12269 -1432 1546 12725 17219 8100 -9445 -21678 -21472 -11743
358 -11743 -581 367 -9667 -18902 -14733 3123 19730 20188 7626 -3088 285 13421 18303 8085
372 8085 -8130 -15603 -7387 5294 7901 -2209 -14176 -14072 116 14355 16300 2997 -12797
385 -12797 -15318 -5159 5683 4018 -10334 -22040 -18460 -1936 12581 12495 3827 1940 13532 29983
399 29983 33721 19943 2323 -4566 -498 3109 -5410 -22531 -36750 -39240 -28875 -15313 -7079
$$ packed form
306D0982J9454k9062m2685j4215J6687J7801N57j7224k4042j3648Q612K6944K0411
319A0572q812k5565l819L0996L6409K43l0753j9122J5249K8778O452k3960k7419
332a0751q608Q296J1404J967q792j5761j1167O956K1253J5522l987j5780k905
345a2353J9110K0335J454j6277j3701K978J1179M494r119j7545j2233K06R729
358a1743J1162R48j0034r235M169J7856J6607M58j2562j0714L373J3136M882j0218
372H085j6215p473Q216J2681K607j0110j1967J04J4188J4239J945j3303j5794
385a2797k521J0159J0842j665j4352j1706L580J6524J4517q6q668j887J1592J6451
399B9983L738j3778j7620o889M068L607q519j7121j4219k490J0365J3562Q234
$$ plain form
412 -7079 -6280 -7533 673 19151 35268 37668 27183 17765 18492 21414 15322 -1867 -19631 -26575
426 -26575 -24160 -19875 -17671 -18889 -19771 -16043 -5769 10185 21743 20934 12038 6024 10308 16545 12857
441 12857 -285 -12143 -13973 -7443 -3014 -4321 -7511 -7616 -1410 7541 14634 14282 5731 -3642 -4866
456 -4866 480 4370 -2676 -16826 -24047 -17238 -3560 4492 2751 265 5240 16466 26021 25253 16651
471 16651 7643 3060 2462 372 -8728 -22293 -32923 -32344 -21629 -11488 -8796 -10646 -7609 5939
485 5939 22497 30803 28745 22423 19591 20867 19443 11555 -1444 -12744 -17301 -17285 -16214 -18047 -22461
500 -22461 -23139 -17358 -7423 1789 5331 4070 3056 5638 12132 16667 14911 8903 3774 4803 8526
515 8526 8372 4389 -179 -1425 -7 198 -1483 -4634 -9416 -13266 -14087 -10273 -5488 -7259 -13603 -14590
$$ packed form
412g079P99j253Q206J8478J6117K400j0485r418P27K922o092j7189j7764o944
426b6575K415M285K204j218q82L728J0274J5954J1558q09q896o014M284O237l688
441A2857j3142j1858j830O530M429j307l190j05O206Q951P093l52q551r373j224
456d866N346L890p046j4150p221O809J3678Q052j741k486M975J1226R555p68q602
471A6651r008m583n98k090r100j3565j0630N79J0715J0141K692j850L037J3548
485E939J6558Q306k058o322k832J276j424p888j2999j1300m557J6J071j833m414
500b2461o78N781R935R212L542j261j014K582O494M535j756o008n129J029L723
515H526j54l983m568j246J418K05j681l151m782l850q21L814M785j771o344r87
$$ plain form
531 -14590 -5619 7326 12696 8445 4982 9343 17594 20784 15580 8886 4777 2497 1375 -775 -5049
546 -5049 -11895 -18776 -18380 -9888 -2670 -5693 -14837 -15416 -1608 12175 12932 3087 -1463 6880 16907
561 16907 16773 8769 2589 3425 5723 4045 947 -3439 -9327 -14047 -13187 -6094 -2236 -9690 -18013 -13523
577 -13523 3118 14005 8224 -1330 2760 16865 23403 13825 1589 1186 6766 5488 -4043 -12087
591 -12087 -13142 -12596 -13901 -12019 -6645 -3274 -6168 -7404 2675 15877 15917 4711 -467 9000 19274
606 19274 11674 -6529 -12714 -1725 7808 709 -12908 -14236 -3141 4697 2350 -2165 -730 2116
620 2116 408 -1132 1805 3308 -4176 -13020 -8670 5483 9604 -2625 -13802 -3377 18394 23164
634 23164 6814 -7528 -874 14806 14154 -2244 -14589 -12047 -5229 -6309 -11257 -10526 -7320 -7393 -5392
$$ packed form
531a4590Q971J2945N370m251l463M361Q251L190n204o694m109k280j122k150m274
546e049o846o881L96Q492P218l023r144n79J3808J3783P57r845m550Q343J0027
561A6907j34q004o180Q36K298j678l098m386n888m720Q60P093L858p454q323M490
577a3523J6641J0887n781r554M090J4105O538r578j2236m03N580j278r531q044
591a2087j055N46j305J882N374L371k894j236J0079J3202M0j1206n178R467J0274
606A9274p600j8203o185J0989R533p099j3617j328J1095P838k347m515J435K846
620B116j708j540K937J503p484q844M350J4153M121j2229j1177J0425K1771M770
634B3164j6350j4342O654J5680o52j6398j2345K542O818j080m948P31L206p3K001
$$ plain form
649 -5392 4627 16482 14290 755 -2161 12585 24904 13352 -11277 -18341 -2643 9169 -1981
662 -1981 -21274 -21855 -3965 7782 3055 -3897 -214 8786 11200 8861 9951 10224 2179 -8140 -7281
677 -7281 3615 4366 -12010 -24729 -14265 7704 11516 -6033 -16297 -1389 20216 21003 2579
690 2579 -8004 1318 12292 8968 -3148 -7983 -4982 -4423 -5777 -2251 3152 584 -8795 -8229 7537
705 7537 17962 6138 -13937 -13977 7551 19123 2539 -19848 -18160 3787 15552 3939 -10721
718 -10721 -7895 5386 11730 7678 3829 2919 -277 -3889 417 8526 5342 -12148 -22159 -8322
732 -8322 12497 11315 -11255 -23218 -5179 19173 19578 -1360 -13237 -1642 14484 13917 1184
745 1184 -6357 -4430 -1768 -1541 728 3162 -2568 -12080 -10636 5130 16097 5090 -13905 -13541 7388
$$ packed form
649e392J0019J1855k192j3535k916J4746J2319j1552k4629p064J5698J1812j1150
662a981j9293n81J7890J1747m727o952L683R000K414k339J090K73q045j0319Q59
677g281J0896P51j6376j2719J0464K1969L812j7549j0264J4908K1605P87j8424
690B579j0583R322J0974l324j2116m835L001N59j354L526N403k568r379N66J5766
705G537J0425j1824k0075m0K1528J1572j6584k2387J688K1947J1765j1613j4660
718a0721K826J3281O344m052l849r10l196l612M306Q109l184j7490j0011J3837
732h322K0819j182k2570j1963J8039K4352M05k0938j1877J1595J6126n67j2733
745A184p541J927K662K27K269K434n730r512J444J5766J0967j1007j8995L64K0929
$$ plain form
760 7388 20745 7605 -13555 -13776 4358 14578 4369 -9939 -8839 1183 4499 352 -1957
773 -1957 152 -675 -4682 -2699 6235 8274 -1923 -10760 -3155 12169 12134 -3944 -13462 -2644 12640
788 12640 9476 -7085 -12910 -1636 8954 3822 -7728 -8206 486 4608 311 -3217 208 2696
802 2696 -519 -1827 3590 7502 1549 -7560 -4880 7384 10666 -1649 -13450 -6977 9400 11689
816 11689 -2942 -13817 -6375 8144 9972 -1252 -8481 -4729 2513 3806 1212 398 -826 -4063
830 -4063 -3539 3943 10090 4192 -8715 -10103 4224 15411 6845 -11297 -14957 168 12837 7046
844 7046 -7885 -12478 -2784 6831 6456 730 -2898 -2798 -1377 2124 6945 5906 -3349 -10478 -5036
859 -5036 8101 10993 -2276 -14307 -9162 6623 13034 2199 -9425 -7390 3689 9318 4856
$$ packed form
760G388J3357j3140k1160k21J8134J0220j0209j4308J100J0022L316m147k309
773a957K109q27m007J983Q934K039j0197q837P605J5324l5j6078r518J0818J5284
788A2640l164j6561n825J1274J0590n132j1550m78Q692M122m297l528L425K488
802B696l215j308N417L912n953r109K680J2264L282j2315j1801O473J6377K289
816A1689j4631j0875P442J4519J828j1224p229L752P242J293k594q14j224l237
830d063N24P482O147n898j2907j388J4327J1187q566j8142l660J5125J2669n791
844G046j4931m593R694R615l75n726l628J00J421L501M821j039r255p129N442
859e036J3137K892j3269j2031N145J5785O411j0835j1624K035J1079N629m462
$$ plain form
872 4856 -1673 -2691 -786 823 2572 3481 901 -5322 -7707 -1361 6332 4093 -6223 -11205 -3449
887 -3449 7002 6586 -2627 -7351 -1403 5975 5739 1087 -391 2369 3737 1837 983 2606 2164 -1740
903 -1740 -4447 -2365 1392 -475 -5584 -7317 -3021 1286 27 -3246 -1952 2260 3317 643 -127
918 -127 3631 6559 3484 -1661 -1729 3021 5194 925 -3615 -3458 142 1969 -389 -2788 -2811 -2383 -1460
935 -1460 -365 854 -58 -3735 -5152 -1019 4732 4974 -672 -4961 -1177 6092 8183 3013 -2732 -2370
951 -2370 2345 4715 2459 -2256 -5412 -4497 -1781 1037 671 -3281 -6374 -4422 1955 6899 4736 -1176
967 -1176 -3440 1029 7032 7063 855 -4273 -3951 117 2480 47 -3998 -6402 -4563 -72 2954 2065
983 2065 -1273 -3736 -845 4602 7044 4350 -1104 -2908 513 4150 4309 88 -3738 -3936 -999 1580
$$ packed form
872D856o529j018J905J609J749R09k580o223k385O346P693k239j0316m982P756
887c449J0451m16r213m724N948P378k36m652j478K760J368j900q54J623m42l904
903a740k707K082L757j867n109j733M296M307j259l273J294M212J057k674p70
918a27L758K928l075n145o8M750K173m269m540J57L600J827k358k399k3M28R23
935a460J095J219r12l677j417M133N751K42n646m289L784P269K091n170n745L62
951b370M715K370k256m715l156R15K716K818l66l952l093J952O377M944k163n912
967a176k264M469O003L1o208n128L22M068K363k433m045k404J839M491L026q89
983B065l338k463K891N447K442k694n454j804L421L637J59m221l826j98K937K579
$$ plain form
999 1580 1412 -2219 -5014 -4134 -558 2292 1365 -2073 -4212 -2683 1409 4411 3276 -62 -2002 -169
1015 -169 4317 6416 4415 288 -2104 8 3191 3274 -678 -4967 -5667 -2763 -252 -704 -4151 -6751
1031 -6751 -5389 -1162 2719 3608 449 -1937 -409 4523 8570 6547 1497 -1402 658 4464 4847
1046 4847 132 -4619 -5489 -2556 205 -888 -3859 -6180 -5590 -1386 2291 2734 112 -2725 -1433 3492
1062 3492 7113 5540 576 -1993 594 3902 3896 39 -3456 -3247 -1200 404 156 -1635 -3325 -3507
1078 -3507 -1483 1980 2814 285 -2595 -2662 1248 4551 3735 -23 -1848 -350 2354 2930 1297 -417
1094 -417 -1467 -1217 -533 268 -16 -2288 -4622 -3820 -494 2253 1061 -2505 -3366 506 4901 5761 3139
1111 3139 742 764 2309 3869 3476 1096 -2172 -4421 -3703 -1300 -847 -3875 -7475 -6921 -1499 2828
$$ packed form
999A580j68l631k795Q80L576K850r27l438k139J529M092L002j135l338j940J833
1015a69M486K099k001m127k392K112L183Q3l952m289p00K904K511m52l447k600
1031f751J362M227L881Q89l159k386J528M932M047k023n050k899K060L806L83
1046D847m715m751q70K933K761j093k971k321N90M204L677M43k622k837J292M925
1062C492L621j573m964k569K587L308ol857l495K09K047J604k48j791j690j82
1078c507K024L463Q34k529k880o7L910L303q16l758j825J498K704N76j633j714
1094d17j050K50O84Q01k84k272k334Q02L326K747j192l566q61L872M395Q60k622
1111C139k397K2J545J560l93k380l268k249P18K403M53l028l600N54N422M327
$$ plain form
1127 2828 2175 -1767 -2965 1211 6307 7899 5296 1565 480 1872 4001 4402 1433 -3017 -5166
1142 -5166 -3301 379 833 -3504 -7446 -6438 -895 3119 716 -3782 -4811 -1053 3859 5382 3102
1157 3102 174 -516 2047 5164 6193 3529 -317 -2323 -145 2792 2116 -2417 -6494 -5609 -1749 436
1173 436 -1433 -5151 -5708 -2298 1722 3345 2267 375 -167 1697 4507 5694 3937 627 -1277 86
1189 86 2313 2200 -1240 -4202 -4170 -1434 478 -542 -2987 -4214 -2548 341 2042 1873 25 -1379
1205 -1379 -333 2244 4398 4015 895 -1280 -281 2244 3172 876 -2158 -3591 -1897 68 195 -2044
1221 -2044 -4234 -3722 -912 1998 2321 476 -1389 -1008 2088 4848 4408 1173 -1589 -1199 1110 2723
1237 2723 810 -2554 -4143 -2349 510 1301 -779 -3195 -3072 42 2768 2892 461 -1816 -1591 817
$$ packed form
1127B828o53l942j198M176N096J592k603l731j085J392K129M01k969m450k149
1142e166J865L680M54m337l942J008N543M014k403m498j029L758M912J523k280
1157C102k928o90K563L117J029k664l846k006K178K937o76m533m077Q85L860K185
1173D36j869l718n57L410M020J623j078j892n42J864K810J187j757l310j904J363
1189H6K227j13l440k962L2K736J912j020k445j227J666K889J701j69j848j404
1205a379J046K577K154l83l120k175R99K525R28k296l034j433J694J965J27k239
1221b044k190N12K810K910L23j845j865L81L096K760m40l235k762L90K309J613
1237B723j913l364j589J794K859P91k080k416J23L114K726J24k431k277K25K408
$$ plain form
1253 817 3075 2708 -291 -2196 -1829 676 3037 2051 -751 -2018 -481 2091 2509 212 -2155 -2546
1269 -2546 -760 724 224 -1562 -2887 -2909 -944 1070 2174 1406 -469 -532 1261 3623 3551 1352 -902
1286 -902 -654 685 1194 -241 -2195 -2831 -2192 -725 113 -77 -751 -1736 -1300 925 3261 2600 -289 -2398
1304 -2398 -1214 1766 2651 408 -2316 -2609 -182 1460 1649 254 -752 -421 1090 2604 3127 665
1320 665 -2479 -2797 -273 2423 861 -3806 -6251 -3750 691 2494 -31 -2520 -1580 1873 4473 4246
1336 4246 2503 862 577 2031 3453 2580 -891 -4295 -4297 -567 1722 -449 -4932 -5893 -2056 2545
1352 2545 2845 -214 -2141 -746 2435 3262 2208 225 -545 -336 1050 2232 1609 -667 -2651 -1235
1368 -1235 2138 3614 1015 -2630 -2720 136 2007 150 -2722 -3420 -2141 -856 -1115 -1747 -780 35 472
$$ packed form
1253H17K258l67k999j905L67K505K361r86k802j267J537K572M18k297k367l91
1269b546J786J484n00j786j325k2J965K014J104p68j875o3J793K362p2k199k254
1286i02K48J339N09j435j954o36O39J467Q38j90o74r85M36K225K336o61k889k109
1304b398J184K980Q85k243k724k93K427J642J89j395j006L31J511J514N23k462
1320F65l144l18K524K696j562m667k445K501M441J803k525k489R40L453K600k27
1336D246j743j641k85J454J422q73l471l404kL730K289k171m483r61L837M601
1352B545L00l059j927J395L181Q27j054j983p70K09J386J182o23k276j984J416
1368a235L373J476k599l645r0K856J871j857k872o98J279J285k59o32R67Q15M37
$$ plain form
1385 472 1070 2620 3481 2823 1350 1599 3070 2978 640 -2021 -2471 -1592 -1801 -2921 -3437 -2260 -1119 -1820
1403 -1820 -2052 -47 2578 3388 1673 536 2101 3793 2844 271 -1451 -656 -105 -568 -1775 -2364 -2342
1420 -2342 -2006 -1267 524 1824 493 -1456 -1103 1872 4333 2459 -1383 -2512 13 2854 1672 -1363
1436 -1363 -2759 -849 1350 1767 433 -872 -1614 -1125 356 1357 713 -2284 -4525 -2592 1227 2634
1452 2634 -56 -3034 -1724 2809 5292 3381 173 -220 2208 3813 2580 -281 -2338 -2838 -2500 -1275
1468 -1275 -1020 -2345 -4721 -4956 -1983 1740 2210 -416 -1799 978 4495 4909 2143 -245 753 2433
1484 2433 2825 662 -1062 -1769 -1499 -1056 -526 -606 -1390 -2699 -2739 -675 1015 358 -1492 -1724 528 2225
1502 2225 1564 -59 -159 1722 2538 1507 169 106 658 255 -716 -857 -362 -504 -1474 -2189 -1487 -218
$$ packed form
1385D72N98J550Q61o58j473K49J471r2k338k661m50Q79k09j120n16J177J141p01
1403a820k32K005K625Q10j715j137J565J692r49k573j722P95N51m63j207n89K2
1420b342L36P39J791J300j331j949L53K975K461j874l842j129K525K841j182l035
1436a363j396J910K199M17j334j305p42M89J481J001o44k997k241J933L819J407
1452B634k690k978J310M533K483j911l208l93K428J605j233k861k057n00L38J225
1468a275K55j325k376k35K973L723M70k626j383K777L517M14k766k388R98J680
1484B433L92k163j724p07K70M43N30q0p84j309m0K064J690o57j850k32K252J697
1502B225o61j623j00J881Q16j031j338o3N52m03r71j41M95j42r70p15P02J269
$$ plain form
1520 -218 72 -353 -44 696 1125 654 310 1351 1675 911 -723 -843 483 655 -1027 -2284 -1807 73
1538 73 636 -515 -1558 -1146 290 1380 997 462 302 37 292 1341 1749 1296 -212 -833 522 2025
1556 2025 1415 -942 -2444 -1190 573 198 -2030 -3627 -2850 -1067 64 -106 -498 -554 238 1651 3174
1573 3174 3621 2496 1167 1190 2449 2721 538 -1986 -2702 -1596 -566 -1499 -3171 -3845 -2446 -288 672
1590 672 307 69 278 1024 2016 2449 1772 694 -372 -115 743 584 -671 -1631 -1166 344 1097 371 -380
1609 -380 -600 372 859 849 59 -586 -1011 -1008 -981 -526 -629 -962 -979 -378 771 993 937 706 1009 1334 1350 591
1631 591 19 -358 -452 -651 -792 -635 -807 -1028 -820 -408 365 1067 937 557 721 583 774 322 -266 -661
1651 -661 -925 -937 -919 -1059 -1138 -948 -412 404 916 1132 810 728 1148 1384 1473 796 -124 -656 -719 -974 -1038 -1254
$$ packed form
1520b18K90m25L09P40M29m71l44J041L24p64j634j20J326J72j682j257M77J880
1538G3N63j151j043M12J436J090l83n35j60k65K55J049M08m53j508o21J355J503
1556B025o10k357j502J254J763l75k228j597P77J783J131j70l92n6P92J413J523
1573C174M47j125j329K3J259K72k183k524p16J106J030r33j672o74J399K158R60
1590F72l65k38K09P46R92M33o77j078j066K57Q58j59j255r60M65J510P53p26p51
1609c80k20R72M87j0p90o45m25LK7M55j03l33j7O01J149K22n6k31L03L25J6p59
1631E91n72l77r4j99j41J57j72k21K08M12P73P02j30l80J64j38J91m52n88l95
1651f61k64j2J8j40p9J90N36Q16N12K16l22q2M20K36Q9o77r20n32o3k55o4k16
$$ plain form
1673 -1254 -1640 -1304 -895 -306 -160 1 335 807 1384 1584 1195 799 620 383 529 169 -462 -611 -1213 -1322
1693 -1322 -1102 -780 -651 -546 -626 116 310 705 556 820 734 1044 748 609 338 97 -143 -394 -257 -94
1713 -94 -28 -572 -1194 -641 35 159 -298 -502 -285 -208 1 -91 -139 -193 -92 264 440 646 546 371 603 1074
1735 1074 1524 978 -136 -563 -212 -252 -693 -1663 -2150 -1720 -1525 -1158 -1004 -756 41 778 1131 1817 2101 1842
1755 1842 1700 1642 1994 1419 165 -1043 -1624 -1304 -1396 -2176 -2821 -2346 -1484 -837 -823 -456 433 1184 1723 1902
1775 1902 1841 1726 1234 1197 1041 759 304 -726 -1163 -691 -261 -623 -1400 -1378 -624 9 -452 -1110 -1146 -572 155
1796 155 122 -283 -210 292 869 1095 1520 1553 1113 1055 1052 1203 967 -161 -1234 -1090 -533 -997 -2005 -2534 -1996
1817 -1996 -693 -315 -415 -487 67 1192 1590 1563 1623 1323 1286 976 841 629 -60 -1046 -1323 -871 -423 -829
$$ packed form
1673a254l86L36M09N89J46J61L34M72N77K00l89l96j79k37J46l60o31j49o02j09
1693a322K20L22J29J05q0P42J94L95j49K64q6L10k96j39k71k41k40k51J37J63
1713i4O6n44o22N53O76J24m57k04K17P7K09r2m8n4J01L56J76K06j00j75K32M71
1735A074M50n46j114m27L51m0m41r70m87M30J95L67J54K48P97P37L53O86K84k59
1755A842j42n8L52n75j254j208n81L20r2p80o45M75Q62O47J4L67Q89P51N39J79
1775A902o1j15m92l7j56k82m55j030m37M72M30l62p77K2P54O33m61o58l6N74P27
1796A55l3m05P3N02N77K26M25L3m40n8lJ51k36j128j073J44N57m64j008n29N38
1817a996J303L78j00p2N54J125L98k7O0l00l7l10j35k12o89r86k77M52M48m06
$$ plain form
1837 -829 -1808 -1459 -520 469 416 -54 -130 561 1209 1194 746 616 676 794 548 219 54 -227 -979 -1080 -635
1858 -635 -790 -1209 -1648 -1200 -317 124 -39 123 606 1596 1762 1433 1397 1476 1568 991 136 -451 -684 -955 -1441
1879 -1441 -1768 -1854 -1544 -1586 -1209 -573 61 409 327 770 1337 1398 856 463 679 1108 878 111 -486 -310 423
1900 423 545 -91 -438 -344 -249 -257 -642 -818 -1293 -1484 -1320 -1009 -561 -647 -852 -262 1139 2015 2180 1600 1491
1921 1491 1927 2182 1659 317 -1020 -1367 -1460 -1832 -2238 -2584 -2417 -1560 -644 396 1182 1185 1506 2086 2896 2815
1941 2815 1724 462 -318 -465 -938 -1399 -2608 -2865 -2178 -1380 -854 -407 182 767 1446 2002 2079 1843 1210
1960 1210 543 336 277 -66 -912 -1461 -1561 -819 -177 -120 -151 184 377 660 538 394 -249 -752 -846 -1269 -1339
1981 -1339 -1020 -1061 -829 -115 815 1717 1995 2099 2159 2111 2039 1559 669 -601 -1535 -2220 -2649 -2716 -2829 -2878 -2501
$$ packed form
1837h29r79L49R39R89n3m70p6O91O48j5m48j30O0J18k46l29j65k81p52j01M45
1858f35j55m19m39M48Q83M41j63J62M83R90J66l29l6P9R2n77q55n87k33k71m86
1879a441l27q6L10m2L77O36O34L48q2M43N67O1n42l93K16M29k30p67n97J76P33
1900D23J22o36l47R4R5ql85j76m75j91J64L11M48q6k05N90J401Q76J65n80j09
1921A491M36K55n23j342j337l47r3l72m06l46J67Q57R16J040P86LL21N80Q10q1
1941B815j091j262p80j47m73m61j209k57O87P98N26M47N89N85O79N56P7k36o33
1960A210o67k07n9l43q46n49j00P42O42N7l1L35J93K83j22j44o43n03r4m23p0
1981a339L19m1K32P14R30R02K78J04O0m8p2m80q90j270r34o85m29o7j13m9L77
$$ plain form
2002 -2501 -1590 -230 798 1551 1617 2205 2849 3238 2679 1621 618 -101 -205 -575 -1257 -1904 -2019 -1861 -1108
2021 -1108 -378 -22 68 150 552 1390 1344 784 -131 -501 -53 -32 -336 -809 -1049 -675 355 649 847 623 368
2042 368 589 892 827 316 -733 -1102 -1147 -845 -848 -981 -1043 -697 265 1074 1335 1227 1101 1224 1374 1224 579
2063 579 -350 -963 -1575 -1467 -1437 -1478 -1859 -1672 -1017 -14 560 1136 1212 1408 1720 1896 1890 1148 526 -41 -302
2084 -302 -515 -767 -1275 -1506 -1578 -1396 -629 -501 -367 -486 -459 209 812 743 582 322 390 722 949 831 622
2105 622 71 283 460 600 333 -422 -920 -989 -735 -380 -800 -1407 -1403 -900 17 274 -46 42 310 1114 1684
2126 1684 1542 917 482 184 562 595 28 -727 -1352 -1226 -491 -495 -661 -1059 -793 -127 600 745 254 75 328
2147 328 965 1079 738 126 -137 -216 416 469 30 -715 -956 -636 -31 75 -409 -704 -878 -85 364 445 104
$$ packed form
2002b501R11J360J028P53O6N88O44L89n59j058j003p19j04l70o82o47j15J58P53
2021a108P30L56R0Q2M02Q38m6n60r15l70M48K1l04m73k40L74J030K94J98k24k55
2042C68K21L03o5n11j049l69m5L02lj33o2L46R62Q09K61j08j26J23J50j50o45
2063E79r29o13o12J08L0m1l81J87O55J003N74N76P6J96L12J76op42o22n67k61
2084c02k13k52n08k31p2J82P67J28J34j19K7O68O03o9j61k60O8L32K27j18k09
2105F22n51K12J77J40k67p55m98o9K54L55m20o07MN03R17K57l20Q8K68Q04N70
2126A684j42o25m35k98L78L3n67p55o25J26P35mj66l98K66O66P27J45m91j79K53
2147C28O37J14l41o12k63p9O32N3m39p45k41L20O05J06m84k95j74P93M49Q1l41
$$ plain form
2168 104 -85 259 779 921 893 508 181 25 60 99 -248 -928 -1126 -860 -708 -284 -497 -808 -450 24 409
2189 409 869 621 737 587 594 970 838 479 39 -389 -218 -183 -40 -569 -1136 -880 -621 -322 -345 -478 -478 -398
2211 -398 228 424 769 510 179 495 838 1249 902 250 -90 -43 116 161 -466 -1090 -1101 -827 -453 -198 -469
2232 -469 -637 -550 148 893 895 494 47 56 413 788 574 -159 -750 -519 63 347 33 -556 -621 -191 341 419
2254 419 191 -270 -496 -108 372 413 -232 -740 -667 204 594 515 182 -30 128 761 659 612 -77 -486 -494 -187
2276 -187 -270 -549 -1065 -1020 -371 156 676 331 232 425 1134 1472 1047 525 -101 -343 -348 -395 -799 -1369 -1595 -1514
2298 -1514 -465 -194 92 134 132 773 1533 1476 1099 455 309 365 454 39 -655 -1123 -1000 -622 -213 -40 -273
2319 -273 -502 -23 433 778 424 -349 -423 -376 -195 -144 -580 -732 -641 -1 493 716 846 801 922 1074 1314 930
$$ packed form
2168A04j89L44N20J42k8l85l27j56L5L9l47o80j98K66J52M24k13l11L58M74L85
2189D09M60k48J16j50PL76j32l59m40m28J71L5J43n29n67K56K59K99k3j33%Q0
2211c98O26J96L45k59l31L16L43M11l47o52l40M7J59M5o27o24j1K74L74K55k71
2232d69j68Q7O98P45Km01m47RL57L75k14p33n91K31N82K84l14n89o5M30N32P8
2254D19k28m61k26L88M80M1o45n08P3Q71L90p9l33k12J58O33j02m7o89m09qL07
2276a87q3k79n16M5O49N27N20l45r9J93P09L38m25n22o26k42nm7m04n70k26Q1
2298a514J049K71K86M2kO41P60n7l77o44j46N6Q9m15o94m68J23L78M09J73k33
2319b73k29M79M56L45l54p73p4M7J81N1m36j52R1O40M94K23J30m5J21J52K40l84
$$ plain form
2341 930 633 -430 -734 -725 -984 -1102 -1373 -1578 -1158 -360 48 595 712 944 1273 1509 1628 1303 573 -35
2361 -35 -342 -411 -510 -886 -1489 -1512 -1040 -356 233 203 434 562 935 1234 1107 894 259 -316 -194 -105 -365 -711
2383 -711 -1325 -1137 -452 210 214 -43 -4 333 698 819 605 97 -136 -83 -1 238 -20 -332 -309 304 745 1005
2405 1005 486 253 58 205 564 -59 -908 -1613 -1305 -1004 -796 -830 -1191 -997 -306 791 1169 1306 1168 1211
2425 1211 1564 1794 1473 622 -234 -517 -331 -428 -1076 -1746 -1773 -1428 -901 -492 -242 -283 -203 337 679 1066 734
2446 734 472 437 639 871 704 374 -264 -50 390 232 -57 -422 -625 -370 -248 -252 -403 -462 -594 -497 -350 139
2468 139 118 10 62 368 813 779 646 448 388 242 202 -17 -312 -485 -448 -754 -491 -252 -315 -328 -415 -21 405
2491 405 443 513 223 279 618 541 545 174 -127 -383 -117 -230 -179 -331 -629 -698 -338 -137 -324 -564 -503 -172 366
$$ packed form
2341I30k97j063l04Rk59j18k71k05M20P98M08N47J17K32L29K36J19l25p30o08
2361c5l07o9r9l76o03k3M72O84N89l0K31J28L73K99j27k13o35n75J22Q9k60l46
2383g11o14J88O85O62Mk57L9L37L65J21k14n08k33N3Q2K39k58l12K3O13M41K60
2405A005n19k33j95J47L59o23q49p05L08L01K08l4l61J94O91J097L78J37j38M3
2425A211L53K30l21q51q56k83J86r7o48o70k7L45N27M09K50m1Q0N40L42L87l32
2446G34k62l5K02K32j67l30o38K14M40j58k89l65k03K55J22mj51n9j32R7J47M89
2468A39k1j08N2L06M45l4j33j98o0j46m0k19k95j73L7l06K63K39o3j3q7L94M26
2491D05L8P0k90N6L39p7Ml71l01k56K66j13N1j52k98o9L60K01j87k40O1L31N38
$$ plain form
2514 366 536 456 297 393 786 897 840 524 183 94 257 204 -89 -573 -1135 -817 -459 -157 -289 -844 -835 -240
2536 -240 360 427 -43 -129 57 499 629 457 293 38 190 410 604 263 -30 -350 -123 147 261 -335 -722
2557 -722 -748 -501 -267 -369 -690 -719 -321 -169 296 327 241 241 400 825 716 547 313 -75 89 93 50 -374 -535
2580 -535 -494 -139 -206 48 -170 -234 -66 -6 -102 -58 14 -114 -104 -178 -151 -126 -11 1 -87 426 536 555 486 305 390
2605 390 224 176 -42 -322 -292 -447 -630 -338 -414 -363 -302 -394 234 327 277 59 132 352 330 261 28 -234 -387 -328
2629 -328 -11 5 -114 -135 -257 329 623 496 96 85 -23 103 -190 -373 -659 -698 -442 -230 -10 -235 -291 170
2651 170 491 900 911 579 368 215 293 292 -246 -681 -692 -757 -518 -489 -344 -276 -217 427 709 768 632 449 402 385
2675 385 212 -89 -456 -631 -763 -628 -496 -263 -241 -110 298 495 649 476 395 180 219 15 -240 -293 -485
$$ packed form
2514C66J70q0j59R6L93J11n7l16l41q9J63n3k93m84n62L18L58L02j32n55RN95
2536b40O00O7m70q6J86M42J30j72j64k55J52K20J94l41k93l20K27K70J14n96l87
2557g22k6K47K34j02l21k9L98J52M65L1q6%J59M25j09j69k34l88J64Mm3m24j61
2580e35M1L55o7K54k18o4J68O0r6M4P2j28J0p4K7K5J15J2q8N13J10J9o9j81Q5
2605C90j66m8k18k80L0j55j83K92p6N1O1r2O28R3n0k18P3K20k2o9k33k62j53N9
2629c28L17J6j19k1j22N86K94j27m00j1j08J26k93j83k86l9K56K12K20k25n6M61
2651A70L21M09J1l32k11j53P8jn38m35j1o5K39K9J45O8N9O44K82N9j36j83m7j7
2675C85j73l01l67j75j32J35J32K33K2J31M08J97J54j73q1k15L9k04k55n3j92
$$ plain form
2696 -485 -404 -497 -268 -59 -41 177 177 375 446 487 488 39 -227 -192 -350 -562 -545 -737 -562 -395 -231 151 262 467
2720 467 605 847 866 794 451 106 -90 -219 -486 -770 -878 -916 -756 -445 -199 -151 64 402 678 646 660 572
2742 572 429 209 289 26 -192 -430 -581 -522 -364 -96 -28 -78 102 307 571 397 139 129 -23 76 -61 -238
2764 -238 -429 -549 -329 -158 63 17 156 196 271 353 362 312 233 -4 10 -168 -338 -244 -302 -277 77 3 -14 142 185
2789 185 310 356 84 110 -103 -381 -419 -433 -371 -361 -304 -361 -206 -49 108 214 615 664 602 547 352 290 307 15
2813 15 -6 -181 -250 -312 -334 -528 -333 -313 -285 -178 -194 -201 -150 40 168 44 116 47 81 218 286 347 157 134 402 411
2839 411 194 30 -52 -163 -6 -197 -444 -314 -575 -563 -159 -381 -131 -6 -152 98 128 385 262 -61 171
2860 171 211 175 225 51 -1 204 128 167 -8 -110 60 157 46 -110 137 -133 -280 -261 -343 -410 -338 -279 -119 -198
$$ packed form
2696d85Q1r3K29K09J8K18%J98P1M1Jm49k66L5j58k12J7j92J75J67J64L82J11K05
2720D67J38K42J9p2l43l45j96j29k67k84j08l8J60L11K46M8K15L38K76l2J4q8
2742E72j43k20Q0k63k18k38j51N9J58K68O8n0J80K05K64j74k58j0j52R9j37j77
2764b38j91j20K20J71K21m6J39M0P5Q2Rn0p9k37J4j78j70R4n8K5L54p4j7J56M3
2789A85J25M6k72K6k13k78l8j4O2J0N7n7J55J57J57J06M01M9o2n5j95o2J7k92
2813A5k1j75o9o2k2j94J95K0K8J07j6pN1J90J28j24P2o9L4J37O8O1j90k3K68R
2839D11k17j64q2j11J57j91k47J30k61J2M04k22K50J25j46K50L0K57j23l23K32
2860A71M0l6N0j74n2K05p6L9j75j02J70R7j11j56K47k70j47J9q2o7P2N9J60p9
$$ plain form
2884 -198 -3 18 133 267 323 401 173 11 97 155 182 -76 -44 45 -100 41 0 -51 -96 92 315 45 -105 -256
2908 -256 -368 -282 -191 -423 -259 -329 -224 -102 119 95 232 355 420 386 469 196 114 -24 -21 -51 -221 -271 -288 -263 62
2933 62 -70 49 120 153 267 113 195 54 2 -145 -119 -166 -181 -234 -202 -296 -99 46 203 -16 310 203 370 340
2957 340 300 240 199 -18 -45 70 -249 -132 -273 -251 -57 -78 -171 -114 -196 122 -117 -84 -200 -84 -130 -9 0 167
2981 167 9 111 137 132 351 138 363 489 291 169 176 -152 -141 -215 -383 -500 -360 -394 -274 -310 -76 -36 212
3004 212 193 115 172 245 188 149 90 -53 -56 -93 0 19 3 40 -125 73 139 174 110 -66 -122 115 -65 -114 -109 -223 -345
3031 -345 -85 -163 -92 -100 63 -46 131 149 159 6 -12 86 20 69 -157 -109 -36 -129 83 189 142 205 41 173 135
3056 135 96 53 -103 -263 -229 -277 -253 -221 -389 -167 -164 91 209 34 267 363 387 415 262 195 58 84 -143 -98 -312
$$ packed form
2884a98J95K1J15J34N6P8k28j62Q6N8K7k58L2Q9j45J41m1n1m5J88K23k70j50j51
2908b56j12Q6R1k32J64p0J05J22K21k4J37J23O5l4Q3k73q2j38Ll0j70n0j7K5L25
2933F2j32J19P1L3J14j54Q2j41n2j47K6m7j5n3L2r4J97J45J57k19L26j07J67l0
2957C40m0o0m1k17k7J15l19J17j41K2J94k1r3N7q2L18k39L3j16J16m6J21RJ67
2981A67j58J02K6nK19k13K25J26j98j22Pl28J1p4j68j17J40l4J20l6K34M0K48
3004B12j9p8N7P3n7l9n9j43ll7R3J9j6L7j65J98O6L5o4j76n6K37j80m9Nj14j22
3031c45K60p8P1qJ63j09J77J8J0j53j8R8o6M9k26M8P3r3K12J06m7O3j64J32l8
3056A35l9m3j56j60L4m8K4L2j68K22LK55J18j75K33R6K4K8j53o7j37K6k27M5k14
$$ plain form
3081 -312 -321 -176 -247 -250 -165 -195 17 -218 -60 39 -21 196 -98 39 141 219 51 -121 37 -8 181 81 136 -80
3105 -80 -74 207 -1 -23 -117 -191 -255 -251 -117 -209 -164 -122 -225 -96 17 86 47 126 223 203 272 30 129 -29 -162 110
3131 110 -209 -12 -188 -257 -40 -239 -148 -77 -104 -33 123 17 45 -66 -144 53 -19 -22 -156 -106 17 -228 -33 -62
3155 -62 23 -154 -56 25 87 21 168 60 191 132 171 45 134 6 -129 -153 61 -33 -171 -439 -283 -137 -125 107
3179 107 -34 -136 -32 121 255 32 84 117 111 183 65 143 -9 -52 -104 79 -161 -173 -300 -209 -77 60 -24 -65
3203 -65 -116 -72 35 109 -101 -166 -158 94 92 -72 176 -4 -20 215 416 104 -97 -45 -32 48 -30 -120 -301 -394 -204
3228 -204 -45 -129 -277 -238 -80 105 51 208 134 24 109 289 119 -16 -44 -165 -234 -244 -47 -59 -18 -82 -102 155
3252 155 346 416 274 226 131 48 68 -69 -197 -166 -233 -281 -162 -327 -118 -152 -246 273 194 104 359 104 327 362
$$ packed form
3081c12rJ45p1lQ5l0K12k35J58R9o0K17k94J37J02P8j68j72J58m5J89j00N5k16
3105h0OK81k08k2r4p4o4MJ34r2M5M2j03J29J13O9l9P9R7k0O9k42R9j58j33K72
3131A10l19J97j76o9K17j99R1P1k7P1J56j06K8j11p8J97p2lj34N0J23k45J95k9
3155f2Q5j77R8Q1O2o6J47j08J31n9L9j26Q9j28j35k4K14r4j38k68J56J46J2K32
3179A07j41j02J04J53J34k23N2L3oP2j18P8j52m3n2J83k40j2j27R1J32J37q4m1
3203f5n1M4J07P4k10o5QK52kj64K48j80j6K35K01l12k01N2J3Q0p8r0j81r3J90
3228b04J59q4j48L9J58J85n4J57p4j10Q5J80j70j35k8j21o9j0J97j2M1o4k0K57
3252A55J91P0j42m8r5q3K0j37j28L1o7m8J19j65K09l4r4N19p9r0K55k55K23L5
$$ plain form
3276 362 305 115 -156 60 104 88 29 -82 -167 -76 109 33 -4 -113 -203 -71 -85 -111 -141 -206 -191 -194 -101 54 -10 38
3302 38 72 272 500 387 284 188 234 308 330 -129 -102 -505 -268 -348 -254 -377 -363 -318 -324 -127 157 218 94 -119 292
3327 292 186 20 48 40 -63 4 -35 71 8 -41 -21 19 73 -97 111 -13 -117 133 152 -195 -176 -399 -116 -237
3351 -237 -230 -180 -277 83 156 103 16 225 10 181 237 151 204 -56 39 63 -134 8 -33 23 -122 13 147 112 63
3376 63 -92 -73 -80 -106 -91 -50 -235 -119 -115 -5 -157 -86 -100 113 142 212 260 93 96 403 330 387 285 29 123 33 198
3403 198 50 -134 -209 -182 -99 -84 50 -128 -119 -204 -84 -30 88 -198 -36 -26 102 -103 53 163 95 59 306 448
3427 448 23 177 5 193 94 24 -54 -240 -201 -47 -166 -69 -219 -85 -330 -125 -52 -73 -45 -141 71 69 270 209
3451 209 80 82 271 211 189 63 38 109 145 73 189 171 7 -97 -19 -130 -211 -188 -388 -226 -271 -187 -16 -103 -77
$$ packed form
3276C62n7j90k71K16M4j6n9j11q5R1J85p6l7j09r0J32j4k6l0o5J5lR3J55o4M8
3302C8L4K00K28j13j03r6M6P4K2m59K7m03K37q0R4j23J4M5oJ97K84O1j24k13M11
3327B92j06j66K8qj03O7l9J06o3m9K0M0N4j70K08j24j04K50J9l47J9k23K83j21
3351b37PN0r7L60P3n3q7K09k15J71N6q6N3k60R5K4j97J42m1N6j45J35J34l5m9
3376F3j55J9pk6J5M1j85J16MJ10j52P1j4K13K9P0M8j67LL07p3N7j02k56R4r0J65
3403A98j48j84p5K7Q3J5J34j78Rq5J20N4J18k86J62J0J28k05J56J10o8l6K47J42
3427D48m25J54j72J88r9p0p8j86L9J54j19R7j50J34k45K05P3k1K8r6K12kK01o1
3451B09j29KJ89o0k2j26k5P1L6p2J16j8j64j04P8j11q1K3k00J62m5Q4J71q7K6
$$ plain form
3476 -77 210 174 88 251 172 172 96 282 242 292 66 -69 -117 -215 -64 -64 -210 -165 -131 -117 38 -222 -133 -102 14 -112
3502 -112 76 69 -14 123 215 174 127 -46 62 83 287 259 155 -73 -52 -175 -9 -37 -225 -226 -168 -59 72 82 -110
3527 -110 -95 24 207 298 176 139 67 124 21 -110 35 -267 -202 -31 -102 -218 -1 -48 -178 23 243 256 331
3550 331 311 273 108 185 136 -213 -46 -71 -301 -141 -352 -246 -241 -365 -51 47 -43 17 -61 27 206 148 194 226 168
3575 168 271 415 110 167 48 -24 78 90 -88 -252 -228 -219 -167 -118 -148 -374 -286 -218 -43 -104 -120 49 136 202 324
3600 324 278 313 362 282 403 151 164 65 -248 -338 -590 -208 -205 -390 -420 -333 -20 89 59 205 107 364 313 471 340
3625 340 235 183 -13 56 66 -121 -350 -231 -325 -132 -132 -75 -59 72 -78 177 140 115 195 178 225 7 114 -93
3649 -93 -253 0 64 -64 -60 -75 42 63 90 -13 156 -205 -38 -122 -91 -103 104 -158 -16 60 53 120 82 116 102 111
$$ packed form
3476g7K87l6q6J63p9%p6J86m0N0k26j35m8r8J51%j46M5L4J4J55k60Q9L1J16j26
3502a12J88pq3J37R2m1m7j73J08K1K04k8j04k28K1j23J66k8j88jN8J09J31J0j92
3527a10J5J19J83R1j22l7p2N7j03j31J45l02O5J71p1j16K17m7j30K01K20J3P5
3550C31k0l8j65P7m9l49J67k5k30J60k11J06Nj24L14R8r0O0p8Q8J79n8M6L2n8
3575A68J03J44l05N7j19p2J02J2j78j64K4RN2M9l0k26Q8O8J75o1j6J69Q7O6J22
3600C24m6L5M9q0J21k52J3r9l13r0k52L82Lj85l0Q7L13J09l0J46r8K57n1J58j31
3625C40j05n2j96O9J0j87k29J19r4J93%N7J6J31j50K55l7k5Q0j7M7k18J07k07
3649i3j60K53O4j28Mj5J17K1K7j03J69l61J67q4L1j2K07k62J42P6pO7l8L4j4R
$$ plain form
3675 111 59 120 -114 -142 -303 -146 -102 -70 -306 -291 -280 88 114 -43 210 178 259 554 369 298 234 48 -114 -76
3699 -76 -306 -188 -412 -362 -544 -258 -154 -60 -209 117 142 166 343 337 286 298 170 224 124 -63 -19 -44 -56 -153 -161
3724 -161 -266 -116 36 -21 -44 -56 -171 -149 -40 -87 0 53 -176 -88 -14 2 3 142 134 207 134 246 270 -19 217 104
3750 104 -79 -176 -61 -146 -197 -192 22 -127 -9 4 109 -24 139 -30 -52 72 197 -11 80 -87 39 -167 -64
3773 -64 -110 4 48 -87 122 163 211 303 205 14 129 254 29 7 -151 -271 -255 -208 -174 -75 -69 -243 -141 -27 23
3798 23 -52 194 49 109 98 268 152 135 120 267 154 185 -11 97 -15 -68 -208 -171 -115 -194 -82 24 -12 -128
3822 -128 -97 -102 138 -36 52 8 221 -32 147 73 114 36 -22 -21 -26 251 186 -60 76 -22 -60 87 170 -38 -8 133
3848 133 -95 -20 -256 -227 -249 172 -116 -159 -191 -116 23 88 17 63 -15 121 187 141 32 175 -62 33 -18 116 219
$$ packed form
3675A11n2O1k34k8j61J57M4L2k36J5J1L68K6j57K53l2Q1K95j85p1o4j86j62L8
3699g6k30J18k24N0j82K86J04R4j49L26K5K4J77on1J2j28N4j00j87M4k5j2r7q
3724a61j05J50J52n7k3j2j15K2J09m7Q7N3k29Q8P4J6JJ39qP3p3J12K4k89K36j13
3750A04j83r7J15q5n1NK14j49J18J3J05j33J63j69k2J24J25k08R1j67J26k06J03
3773f4m6J14M4j35K09M1M8R2r8j91J15J25k25k2j58j20J6M7L4R9Oj74J02J14N0
3798B3p5K46j45O0j1J70j16j7j5J47j13L1j96J08j12n3j40L7N6p9J12J06l6j16
3822a28L1nK40j74Q8m4K13k53J79p4M1p8n8JnK77o5k46J36r8l8J47Q3k08L0J41
3848A33k28P5k36K9k2M21k88m3l2P5J39O5p1M6p8J36O6m6j09J43k37R5n1J34J03
$$ plain form
3873 219 124 -129 15 -53 -126 -73 -109 -106 -272 -102 -335 -97 -361 -218 -24 13 49 184 191 230 143 278 147 304
3897 304 189 63 27 202 -176 -94 -320 -155 -236 -303 -234 -197 -148 101 -27 -22 -83 134 90 106 194 115 160 238 136
3922 136 85 116 67 239 112 77 44 172 109 6 -105 53 -75 -113 -156 -23 -201 -294 -154 -159 71 52 -41 135
3946 135 95 92 143 73 108 61 -19 163 27 -103 -69 -92 -2 18 2 -14 0 17 -146 9 -30 160 -10 86 -31 9
3972 9 -107 -50 -16 -131 -146 -113 -58 -70 -50 -11 88 -167 43 55 31 199 80 7 86 77 -6 38 -155 -238 -30 -184 -102
3999 -102 -195 -132 -11 -200 -187 -200 200 -73 -67 47 17 123 -75 165 108 7 -47 86 88 49 -59 69 96 86 34
4024 34 -203 18 -222 -108 -136 -221 -257 -173 -202 48 -47 -118 -11 70 -37 209 301 105 231 104 319 160 51
4047 51 -49 -100 -58 10 -78 -74 -166 -241 -176 -259 -88 27 22 -69 -158 -52 22 54 53 14 33 1 -176 -32 37 32 193 28
$$ packed form
3873B19r5k53J44o8p3N3l6Lj66J70k33K38k64J43J94L7L6J35PL9q7J35j31J57
3897C04j15j26l6J75l78Q2k26J65q1o7O9L7M9K49j28No1K17m4J6Q8p9M5P8j02
3922A36n1L1m9J72j27l5l3J28o3j03j11J58j28l8m3J33j78r3J40nK30j9r3J76
3946A35m0lN1p0L5m7q0J82j36j30L4k3R0K0j6j6J4J7j63J55l9J90j70R6j17M0
3972Ij16N7L4j15j5L3N5j2K0L9R9k55K10J2k4J68j19p3P9rq3M4j93q3K08j54Q2
3999a02r3O3J21j89J3j3M00k73OJ14l0J06j98K40n7j01n4J33Kl9j08J28K7j0n2
4024C4k37K21k40J14k8q5l6Q4k9K50r5p1J07Q1j07K46R2j96J26j27K15j59j09
4047E1j00n1M2O8q8Mr2p5O5q3J71J15nr1q9J06P4L2jl9J9l2j77J44O9nJ61j65
$$ plain form
4075 28 -10 111 29 165 210 102 -96 8 -151 14 13 -136 -78 -182 -212 -96 14 84 64 19 -98 -72 24 112 -2
4100 -2 -21 -112 -57 13 -141 72 29 26 90 -71 14 -129 16 -2 -96 31 -205 -241 -207 77 -136 -105 201 -50 -34 96
4126 96 150 160 157 137 150 231 252 112 213 188 28 -101 4 -206 -74 -228 -233 -262 -287 39 -216 -70 115 -45 -109
4151 -109 116 246 138 315 146 128 32 192 -16 80 -42 -96 -165 -86 -128 -241 -84 -173 -101 -225 -268 8 132
4174 132 63 154 121 -48 128 -33 -90 -22 -128 -23 92 -2 67 -93 120 84 -45 -139 -88 -164 -105 10 -124 -29
4198 -29 -94 -71 25 6 106 -16 33 202 5 68 75 -84 -190 -68 -169 -30 -134 -39 -69 53 8 255 172 296
4222 296 130 336 284 209 138 94 -60 -165 -241 -211 -336 -322 -239 -247 -97 -196 66 -92 197 302 178 363 156 243
4246 243 265 183 219 -221 118 -107 51 -106 -263 -1 90 -14 1 -57 -172 -88 -44 -75 -43 -81 63 -3 -115 254
$$ packed form
4075B8l8J21q2J36M5j08j98J04j59J65jj49N8j04l0J16J10P0k0m5j17K6R6Q8j14
4100bj9r1N5P0j54K13m3lO4j61Q5j43J45j8r4J27k36l6L4K84k13L1L06k51J6J30
4126I6N4J0lk0J3Q1K1j40J01k5j60j29J05k10J32j54nk9k5L26k55J46J85j60o4
4151a09K25J30j08J77j69j8r6J60k08R6j22n4o9P9m2j13J57q9P2j24m3K76J24
4174A32o9R1l3j69J76j61n7O8j06J05J15r4O9j60K13l6j29r4N1p6N9J15j34R5
4198b9o5K3R6j9J00j22M9J69j97O3Pj59j06J22j01J39j04R5l0J22m5K47q3J24
4222B96j66K06n2p5p1m4j54j05p6L0j25J4Q3qJ50r9K62j58K89J05j24J85k07Q7
4246B43K2q2L6m40L39k25J58j57j57K62R1j04J5n8j15Q4M4l1L2l8J44o6j12L69
$$ plain form
4270 254 24 228 61 91 69 31 109 27 -161 105 30 -200 -201 -137 -173 10 -79 53 -128 -184 232 174 161 97 141
4295 141 110 -49 -138 -223 -39 -76 -32 -4 84 -129 22 44 98 45 95 164 124 220 -54 -18 53 -80 -75 -172 24 -123
4321 -123 -252 -315 -181 -43 -152 -253 -53 -37 -152 -45 268 201 158 316 177 271 312 57 184 159 -42 38 26
4344 26 -77 -172 -100 -155 -391 -141 -100 -371 -231 -62 40 65 145 85 -11 179 86 149 178 111 56 -105 -27 89 -16
4369 -16 -13 13 12 34 175 189 4 -84 -71 37 -7 -219 -227 -42 -123 -15 59 167 189 72 103 -44 81 73 40 68 69 -65
4397 -65 -5 -64 56 194 -54 -20 -73 -166 31 -118 38 -100 20 -102 -95 46 -198 -102 -160 -36 99 -41 2 34
4421 34 -26 153 184 186 84 156 232 171 192 -57 66 -87 -149 -202 -96 -309 -35 -67 -87 -38 -121 122 36 34 -1 -12 -47
4448 -47 6 -28 6 25 -130 182 -14 -34 -17 -5 16 -75 -95 1 27 48 -32 -66 -45 43 65 32 16 -38 -104 59 105 65
$$ packed form
4270B54k30K04j67L0k2l8P8q2j88K66p5k30jO4l6J83q9J32j81n6M16n8j3o4M4
4295A41l1j59q9q5J84l7M4K8Q8k13J51K2N4n3N0O9m0R6k74L6P1j33Nr7J96j47
4321a23j29o3J34J38j09j01K00J6j15J07L13o7m3J58j39R4M1k55J27k5k01Q0j2
4344B6j03r5P2n5k36K50M1k71J40J69J02K5Q0o0r6J90r3O3K9o7n5j61P8J16j05
4369a6LK6jK2J41J4j85q8J3J08m4k12qJ85q1J08P4J08K2j17L1j47J25ql3K8Jj34
4397f5O0n9J20J38k48L4n3r3J97j49J56j38J20j22PJ41k44R6n8J24J35j40M3L2
4421C4o0J79L1Kj02P2P6o1K1k49J23j53o2n3J06k13K74l2k0M9q3K43q6kl5j1l5
4448d7N3l4L4J9j55L12j96k0J7J2K1r1k0R6K6K1q0l4K1Q8K2l3j6n4o6J63M6m0
$$ plain form
4476 65 34 -104 134 3 -8 -101 -104 -187 24 28 -7 -92 97 233 57 101 116 -186 -35 92 -31 -19 -93 35 -28
4501 -28 -122 -53 -37 -189 -78 -134 198 -30 -155 -216 9 91 96 -62 135 54 127 149 86 -49 -2 86 -39 106 -286
4526 -286 -216 -215 -202 -299 -307 -179 -84 -177 28 19 240 121 104 177 170 132 37 15 -80 134 -130 -1 -117 -83 -167 -92 -76 -113
4554 -113 -25 91 51 -68 -91 -125 -153 -40 -98 -76 192 103 -112 -100 -11 17 57 41 81 -2 76 86 -17 -118 -140 -84
4580 -84 -146 -201 -168 -75 -48 65 -60 83 149 149 5 57 139 70 -48 -47 -185 -244 1 -47 -125 98 182 11 90 203
4606 203 116 100 5 199 -250 21 -107 -231 -153 -242 -130 -83 -112 -206 -35 130 215 269 248 219 294 189 2 158
4630 158 -100 -179 -22 -182 -103 -231 35 74 -46 59 129 -40 -73 -32 -61 -55 -99 -150 -104 -40 -16 -185 55 109 -35
4655 -35 37 128 102 200 138 21 -112 36 -105 -125 -235 -102 -279 -101 -21 -83 -72 -77 4 126 27 115 117 -4 -22 -7
$$ packed form
4476F5l1j38K38j31j1r3lq3K11Ml5q5J89J36j76M4J5l02J51J27j23J2p4J28o3
4501b8r4O9J6j52J11n6L32k28j25o1K25Q2Nj58J97q1P3K2o3j35M7Q8j25J45l92
4526b86P0JJ3r7qJ28R5r3K05rK21j19j7P3pl8r5k2r5K14k64J29j16L4q4P5J6l7
4554a13Q8J16m0j19k3l4k8J13n8K2K68q9k15J2Q9K8M0j6M0q3P8J0j03j01k2N6
4580h4o2n5L3R3K7J13j25J43O6%j44N2Q2o9j18Jj38n9K45m8p8K23Q4j71P9J13
4606B03q7j6r5J94m49K71j28j24P8q9J12M7k9r4J71J65Q5N4k1k9P5j05j87J56
4630A58k58p9J57j60P9j28K66L9j20J05P0j69l3M1k9Om4n1M6O4K4j69K40N4j44
4655c5P2R1k6R8o2j17j33J48j41k0j10J33j77J78Q0o2J1nQ1J22r9Q8Kj21j8J5
$$ plain form
4681 -7 -31 -70 -35 30 -3 93 -102 64 42 32 64 -9 -59 -40 121 -123 -225 -33 -215 -82 -122 -73 -75 -96 21 -52 12
4708 12 92 113 -179 7 -106 -4 61 -16 30 -41 1 126 169 164 31 50 33 84 17 28 194 -143 -95 -174 -270 -143
4734 -143 -154 -93 -38 12 -24 90 86 38 33 68 97 14 315 68 -14 23 30 -39 50 135 -65 86 -22 -136 -52 16 99 -170
4762 -170 -148 -175 -80 -104 -238 -133 -168 39 113 52 189 198 199 134 66 67 121 23 8 54 -205 -110 -8 -76 -16 3 -47 9
4790 9 91 -112 86 -133 57 92 -162 23 23 18 52 208 166 18 -7 101 37 19 46 -83 3 -65 3 -101 -29 -11
4816 -11 48 -20 11 -55 -49 85 74 38 34 -58 -64 14 77 -78 13 -58 -22 -67 62 232 172 242 158 173 32 178 -24 68
4844 68 100 -142 -8 -45 -105 -16 -119 -160 -19 -15 88 -150 62 -237 -28 61 -135 -36 -49 67 -32 56 88 120 66
4869 66 197 177 72 -20 -9 -60 205 -56 -107 -124 -125 -127 -186 -38 -165 -40 30 -120 162 220 300 259 146 99 9 -39
$$ packed form
4681gk4l9L5O5l3R6j95J66k2j0L2p3n0J9J61k44j02J92j82J33m0M9kk1J17p3O4
4708A2Q0K1k92J86j13J02O5p7M6p1M2J25M3nj33J9j7N1o7J1J66l37M8p9r6J27
4734a43j1O1N5N0l6J14mm8nL5K9q3L01k47q2L7Po9Q9Q5k00J51j08j14Q4O8Q3k69
4762a70K2k7R5k4j34J05l5K07P4o1J37RJo5o8JN4r8j5M6k59R5J02o8O0J9n0N6
4790IQ2k03J98k19J90L5k54J85%nL4J56m2j48k5J08o4j8K7j29Q6o8O8j04P2J8
4816a1N9o8L1o6OJ34j1l6mr2oP8O3j55R1p1L6m5J29J70o0P0q4J5j41J46k02R2
4844F8L2k42J34l7o0Q9j03m1J41MJ03k38K12k99K09Q9j96R9j3J16r9Q8L2L2n4
4869F6J31k0j05r2J1n1K65k61n1j7jkn9J48j27J25P0j50K82N8Q0m1j13m7r0m8
$$ plain form
4895 -39 85 71 78 -28 -70 -7 -196 38 18 73 -103 158 4 -51 125 -96 25 -106 -59 -258 -114 -4 -36 9
4919 9 185 118 245 218 217 154 241 44 121 35 74 -151 33 -105 -110 -44 -8 -116 177 90 11 30 -26 15 48 -8 36 -95
4947 -95 -67 -42 -174 124 37 -39 60 89 308 261 42 252 60 5 -19 -9 72 -227 -201 -6 -140 -90 -115 -7 192
4972 192 130 92 121 -6 177 77 140 -17 90 -24 13 -183 -37 24 -50 2 -217 27 -7 72 55 -17 80 -97
4996 -97 -156 -28 -151 -180 -85 -145 -173 -10 105 -52 -46 136 135 147 136 122 6 4 37 -122 -251 -240 -38 -254 -46 -24
5022 -24 70 -33 -42 91 94 131 107 67 -100 -76 -96 -46 -96 -168 -121 -70 -81 -32 64 -73 106 168 91 101 93 9 92 96 61 -74
5052 -74 -134 -97 -125 -99 151 -228 -86 16 34 -67 130 71 -66 -168 -213 -12 -74 -96 4 -5 -34 257 166 46 121
5077 121 24 11 -115 -97 112 -65 -48 -269 -168 -166 -209 -88 -126 -116 -60 161 49 118 0 201 103 -13 120 114 176
$$ packed form
4895c9J24j4Pj06m2O3j89K34k0N5j76K61j54n5J76k21J21j31M7j99J44J10l2M5
4919IJ76o7J27k7jo3Q7j97P7q6L9k25J84j38nO6L6j08K93q7p9J9n6M1L3n6M4j31
4947i5K8K5j32K98q7p6R9K9K19m7k19K10j92n5k4J0Q1k99K6J95j34N0k5J08J99
4972A92o2l8K9j27J83j00O3j57J07j14L7j96J46O1p4N2k19K44l4P9j7p2R7j77
4996i7n9J28j23k9R5o0k8J63J15j57OJ82jJ2j1j4j16kL3j59j29J1K02k16K08K2
5022b4R4j03rJ33LL7k4m0j67K4k0N0n0p2M7N1j1M9R6j37J79O2p7J0qq4Q3Ml5j35
5052g4o0L7k8K6K50l79J42J02J8j01J97n9j37j02m5K01o2k2J00rk9K91r1j20P5
5077A21r7j3j26J8K09j77J7k21J01Km3J21l8J0N6K21j12O9j18K01r8j16J33oO2
$$ plain form
5102 176 48 72 -80 105 137 -136 -111 -54 80 -14 -210 -98 -53 52 64 37 27 135 -7 104 102 -48 127 -62
5126 -62 125 17 62 1 9 -117 9 -133 -132 74 10 -27 11 -48 -160 96 -37 5 -50 -75 58 -70 -58 159 106
5151 106 -133 -72 56 21 -66 -79 -223 -33 30 -147 65 81 58 11 50 160 -4 7 17 -5 -3 -63 -26 -220 94
5176 94 -66 -76 -80 -6 -46 27 3 162 19 -6 88 74 200 90 53 -57 77 142 -114 -120 -129 -19 48 -85 -48 -154
5202 -154 -33 -227 -125 -14 -60 81 168 40 -104 -64 116 69 -45 107 62 108 32 32 270 -5 -39 47 -31 -166
5226 -166 -197 -71 -149 -82 -48 79 -114 -90 -113 100 87 -131 -169 -30 3 -60 -3 10 -20 31 198 5 -121 -20 101
5251 101 74 85 123 162 93 -40 -21 12 95 -19 -192 -24 -165 -170 -196 -158 -170 121 29 65 16 1 190 104 161 63 -84
5278 -84 -74 23 89 3 -21 95 58 -164 -197 -51 -5 27 78 -71 -60 -150 -163 -108 -156 -236 -58 -109 -162 85 178 114 -17
$$ packed form
5102A76j28K4j52J85L2k73K5N7J34r4j96J12M5J05J2k7j0J08j42J11kj50J75j89
5126f2J87j08M5o1Qj26J26j42JK06o4l7L8n9j12K56j33M2n5k5J33j28J2K17n3
5151A06k39O1J28l5q7j3j44J90O3j77K12J6k3m7L9J10j64J1J0k2Ko0L7j94L14
5176I4j60j0mP4m0P3k4J59j43k5R4j4J26j10l7j10J34O5k56orJ10O7j33L7j06
5202a54J21j94J02J11m6J41Q7j28j44M0J80m7j14J52m5M6p6%K38k75l4Q6p8j35
5226a66l1J26p8O7L4J27j93K4k3K13j3k18l8J39L3o3N7J3l0N1J67j93j26J01J21
5251A01k7J1L8L9o9j33J9L3Q3j14j73J68j41nk6L8j2K91r2L6m9j5J89q6N7r8j47
5278h4J0R7O6q6k4J16l7k22l3J46M6L2N1j49J1r0j3N5m8q0J78n1n3K47R3o4j31
$$ plain form
5305 -17 158 50 147 183 170 -3 108 -9 59 -64 30 140 -53 45 -56 -62 -50 -103 -49 -57 19 150 -86 -163 -3
5330 -3 41 -75 -131 -109 4 -30 56 116 110 100 -85 24 98 53 105 -6 79 -233 -128 -158 -28 -142 -185 -188 -8 93
5356 93 -8 58 151 -25 -25 21 -84 105 107 -95 -20 15 -18 36 -53 -20 1 103 -61 117 122 -199 -137 182 -77 -112
5382 -112 -197 -87 -46 -28 -100 -149 -10 -63 11 49 124 84 50 185 61 143 16 -4 -109 61 -74 -32 -62 -122 -31 -165
5408 -165 -147 -205 -99 -102 -95 -139 -24 66 -145 -21 128 -34 20 -31 -5 -79 -41 40 15 79 8 139 27 -102 82 -87
5434 -87 -32 146 -39 -72 -33 48 -110 -29 -115 -16 112 -30 113 -93 -128 129 33 161 -16 -58 112 137 17 -130
5458 -130 -83 77 42 -61 -68 -64 172 -57 -20 -35 -43 -72 -8 -24 99 68 66 111 60 -184 -55 -38 -48 74 -12 -3 -49 -69
5486 -69 3 109 -84 29 112 45 14 87 -105 -58 -120 -18 -58 -124 -177 38 -41 -139 -34 141 -3 0 -44 9 145 0
$$ packed form
5305a7J75j08R7L6j3j73J11j17O8j23R4J10j93R8j01oJ2n3N4qP6J31k36p7J60
5330cM4j16n6K2J13l4Q6O0oj0j85J09P4m5N2j11Q5l12J05l0J30j14m3lJ80J01
5356I3j01O6R3j76%M6j05J89Kk02P5L5l3N4q9L3K1J02j64J78Nl21O2L19k59l5
5382a12q5J10M1J8p2m9J39n3P4L8P5m0l4J35j24Q2j27k0j05J70j35M2l0o0R1j34
5408a65J8n8J06lPm4J15R0k11J24J49j62N4n1K6p4L8Q1k5O4p1J31j12j29J84j69
5434h7N5J78j85l3L9Q1j58Q1q6R9J28j42J43k06l5K57r6J28j77m2J70K5j20j47
5458a30M7J60l5j03pMK36k29L7j5qk9O4j6J23l1kM5n1k44J29J7j0J22q6Rm6k0
5486f9P2J06j93J13Q3o7l1P3j92M7o2J02m0o6n3K15p9r8J05J75j44Lm4N3J36j45
$$ plain form
5512 0 87 -171 105 215 59 -99 52 33 -58 -64 -141 105 54 -50 -56 -12 -31 -61 30 -176 -64 42 49 107 82 47 81
5539 81 35 118 187 46 31 64 -97 49 46 -7 -225 -81 -36 -191 27 32 -26 17 -11 -34 -34 52 153 -1 54 184 -54
5566 -54 41 62 -87 6 -2 40 -27 58 -57 -154 46 70 5 12 11 38 -65 -94 -192 -195 -122 -120 -71 -171 -128 -39 -112 82 -120
5595 -120 41 118 56 155 -99 244 -63 156 150 31 125 15 -11 -59 -130 47 123 -95 -43 -106 -112 -182 -7 -177 -96
5620 -96 -119 -116 58 -151 7 156 -70 59 84 125 -73 178 158 162 38 89 -85 -38 21 -22 -15 -197 32 68 -151
5645 -151 43 -19 -66 -47 -8 62 72 40 60 217 141 48 -1 -21 134 15 111 90 5 49 38 36 -125 -55 155 -155 13
5672 13 27 -3 -65 -21 -23 -68 -35 51 107 -3 71 80 92 -30 11 14 7 214 118 -68 159 -158 -120 -10 -43 -5 81 40 40
5701 40 -80 -47 -88 -133 -6 88 -109 -91 -26 -63 -147 -68 -16 -79 28 212 -3 31 132 89 99 170 -8 147 100 84
$$ packed form
5512@Q7k58K76J10j56j58J51j9r1op7K46n1j04oM4j9l0R1k06J12J06PN8k5l5L4
5539H1m6Q3O9j41j5L3j61J46ln3k18J44M5j55K18Nn8M3k8k3%Q6J01j54N5J30k38
5566e4R5K1j49R3qM2o7Q5j15r7K00K4o5PjK7j03k9r8lP3KM9j00M3Q9p3J94k02
5595a20J61P7o2R9k54L43l07K19oj19R4j10k6m8p1J77P6k18N2o3op0J75j70Q1
5620i6k3LJ74k09J58J49k26J29K5M1j98K51k0Mj24N1j74M7N9m3Pj82K29L6k19
5645a51J94o2m7J9L9P0J0l2K0J57p6r3m9k0J55j19R6k1q5M4j1kj61P0K10l10J68
5672A3J4l0o2M4km5L3Q6N6j10P4RJ2j22M1LpK07r6j86K27l17L8J10l3L8Q6m1%
5701D0j20L3m1m5J27R4j97J8O5l7q4P9N2o3J07J84k15L4J01m3J0P1j78J55m7j6
$$ plain form
5727 84 -57 60 -121 -371 -238 33 95 -6 -29 -137 65 -39 62 -306 129 52 64 17 151 -34 118 91
5749 91 159 22 30 88 12 -14 -77 -146 -140 -99 -11 39 -170 79 -150 -74 -22 -179 45 -72 48 -23 47 139 -8 -54 17
5776 17 105 134 156 38 69 -4 160 123 89 -122 -149 -76 -175 -128 62 -92 -12 54 -41 -75 53 3 144 169 68 10
5802 10 -19 -162 36 -36 127 49 -73 -47 44 30 -116 27 -36 52 3 46 -109 -163 -115 -46 9 8 -118 -227 -60 -1
5828 -1 51 -130 59 62 14 71 -106 -11 13 43 209 57 -31 -43 -157 39 -30 -215 -78 -236 -137 -122 21 72 -36
5853 -36 -68 -87 4 63 45 21 46 137 -26 68 -151 -201 74 -44 -39 76 198 102 19 -43 30 64 66 -84 153 -10 59
5880 59 0 40 -103 -49 -144 12 20 -14 -116 104 10 -91 -10 23 22 34 -154 -11 66 -70 48 90 95 142 241 63 20
5907 20 95 27 -38 -36 58 18 43 -20 -136 -13 -247 -11 2 49 76 30 108 215 59 92 106 -184 66 -97 -3 -51
$$ packed form
5727H4j41J17j81k50J33K71O2j01k3j08K02j04J01l68M35p7J2m7J34j85J52k7
5749I1O8j37QN8p6k6o3o9OM1Q8N0k09K49k29P6N2j57K24j17J20p1P0R2j47m6P1
5776A7Q8K9K2j18L1p3J64l7l4k11k7P3r9M7J90j54Q0O6r5l4J28n0J41K5j01n8
5802A0k9j43J98p2J63p8j22K6R1j4j46J43o3Q8m9M3j55n4M8O9N5jj26j09J67N9
5828aN2j81J89Lm8N7j77R5K4L0J66j52q8j2j14J96o9j85J37j58R9J5J43N1j08
5853c6l2j9R1N9j8k4K5R1j63R4k19n0K75j18NJ15J22r6q3o2P3L4Kj50K37j63O9
5880E9n9M0j43N4r5J56Ql4j02K20r4j01Q1L3jJ2j88J43P7j36J18M2NM7R9j78m3
5907B0P5o8o5KR4m0K5o3j16J23k34K36J3M7K7m6P8J07j56L3J4k90K50j63R4m8
$$ plain form
5933 -51 -115 -110 -30 -68 -27 -30 32 -87 -54 255 136 10 118 -41 144 98 22 66 -87 -51 42 54 125 82 6 -87 -33
5960 -33 -154 -114 -21 -98 15 -11 -19 -60 -45 -23 -125 74 -50 40 18 -102 69 -104 -90 65 -4 105 23 -8 117
5985 117 -172 -33 26 36 16 70 3 -29 -85 7 -31 43 -83 -40 -12 -64 -140 77 141 -26 -56 -66 -52 65 15 149
6011 149 -16 -16 18 117 114 24 254 125 25 41 10 114 -96 -160 1 -95 -153 -220 -46 31 -20 -120 -56 -105 -88 -22
6037 -22 60 96 110 63 60 78 48 136 28 151 -37 153 -85 -126 -36 26 -97 11 8 -56 -63 27 -43 -67 -32 5 -5 74
6065 74 -146 -40 -14 80 -17 -54 169 69 67 30 -63 63 -45 -173 27 -83 -83 -265 -69 -23 29 4 -60 146 100
6090 100 49 63 45 -37 -15 19 56 -58 -42 27 -42 -65 -26 -188 91 -50 -53 56 -29 37 -74 103 42 142 66 17
6116 17 -78 -87 -14 24 57 -50 -39 97 120 33 47 58 39 17 -23 21 -102 37 -201 -104 11 165 151 -27 -138 -44
$$ packed form
5933e1o4NQ0l8M1lO2j19L3L09j19j26J08j59J85m6p6M4j53L6R3J2P1m3p6r3N4
5960c3j21M0R3p7J13k6qm1J5K2j02J99j24R0k2j20J71j73J4J55o9J09q2l1J25
5985A17k89J39N9J0k0N4o7l2n6R2l8P4j26M3K8n2p6K17O4j67l0j0J4J17n0J34
6011A49j65%L4R9lr0K30j29j00J6l1J04k10o4J61r6n8o7J74P7n1j00O4m9J7O6
6037b2Q2L6J4m7lJ8l0Q8j08J23j88J90k38m1R0O2j23J08lo4pR0p0k4L5L7j0P9
6065G4k20J06K6R4r7l7K23j00kl7r3J26j08j28K00j10%j82J96M6N2k5o4K06m6
6090A00n1J4j8q2K2L4L7j14J6O9o9k3L9j62K79j41lJ09q5O6j11J77o1J00p6m9
6116A7r5rP3L8L3j07J1J36K3q7J4J1j9k2m0M4j23J39k38R7J15J54j4j78j11R4
$$ plain form
6142 -44 -8 -28 -148 81 -58 125 -70 -144 96 -104 26 -73 -3 25 51 -47 22 171 154 130 105 -71 224 59
6166 59 143 -55 -63 -94 -80 -122 -57 -101 8 -36 -279 -1 147 -175 153 137 -86 23 224 218 -13 207 223 78 92
6191 92 -11 121 91 -108 -133 -80 -1 -148 -117 -121 -69 -74 -162 37 52 9 -73 69 84 96 -41 -41 67 78 70 -102 115
6218 115 168 97 -51 -11 -17 -29 -29 -46 118 -25 2 -59 -22 90 -78 -166 -87 6 -27 -65 -124 -11 -41 -97 -57 -20 -21 81
6246 81 24 9 -21 -6 -19 89 113 25 110 -27 103 96 -15 22 40 -46 -107 -154 -129 -155 -102 -74 -115 -66 40 28 128 26
6274 26 186 -23 -15 57 75 47 18 -91 -90 46 -12 -187 -14 -55 -133 34 -39 -35 -26 -71 -38 -58 -2 76 -18 5 -5 -109
6302 -109 107 185 -97 2 -75 5 87 23 30 -7 -62 -8 66 -40 -17 65 -111 143 -82 118 118 -72 -57 8 -101 -61
6328 -61 -60 164 21 -33 56 106 37 37 2 114 -18 56 75 198 -1 104 -24 -157 -6 -138 34 -66 -140 -133 -108
$$ packed form
6142d4L6k0j20K29j39J83j95p4K40k00J30r9P0K8K6r8O9J49j7k4k5j76K95j65
6166E9Q4j98ql1J4m2O5m4J09m4k43K78J48l22L28j6k23J09K01ok31K20J6j45J4
6191I2j03J32l0j99k5N3P9j47L1mN2nq8J99J5m3q2J42J5J2j37%J08J1qj72K17
6218A15N3p1j48M0oj2%j7J64j43K7o1L7J12j68q8P9R3l3l8n9J13l0n6M0L7jJ02
6246H1n7j5l0J5j3J08K4q8Q5j37J30pj11L7J8q6o1m7K5k6N3K8m1M9J06j2J00j02
6274B6J60k09QP2J8k8k9j09JJ36n8j75J73m1p8J67p3MRm5L3k0N6P8r4K3j0j04
6302a09K16P8k82R9p7Q0Q2o4Pl7n5N4P4j06K3Q2j76K54k25K00%j90J5O5j09M0
6328f1JK24j43n4Q9N0o9%l5J12j32P4J9J23j99J05j28j33J51j32J72j00p4PK5
$$ plain form
6353 -108 28 -24 -93 -303 -143 -48 9 0 82 23 182 101 78 56 93 -68 82 28 -73 14 6 -192 -101 -32 101 -123
6379 -123 -15 -63 77 -11 14 -27 -111 170 1 37 -77 -21 -18 -49 96 18 -19 41 -22 148 -67 -95 79 -65 86
6404 86 65 -40 -31 -56 181 -22 -10 -85 1 98 107 -147 92 45 -37 90 67 123 25 -27 -186 -46 -54 122 1 -103
6430 -103 -99 24 79 -53 170 24 -136 -22 89 35 -6 -125 6 -223 -38 -22 -119 -122 -121 -50 21 -1 -57 162 -60
6455 -60 -34 -80 27 -148 -51 55 -84 -132 18 43 -12 -80 -65 80 -6 -12 -42 54 1 -64 -159 11 69 213 45 163
6481 163 74 32 100 -34 109 41 94 56 -66 13 -60 59 -79 133 18 1 101 -125 -57 -65 -31 -7 29 80 50 -57
6507 -57 -139 194 104 35 65 82 139 -35 -121 -5 63 26 -139 -51 -108 -40 -133 -77 7 -119 66 -93 3 -64 -55 129 -98
6534 -98 23 52 -112 112 -13 33 -50 -8 49 65 148 63 -18 -125 47 -134 -129 2 -33 10 -97 10 190 54 76
$$ packed form
6353a08J36n2o9k10J60R5N7rQ2n9J59q1k3k2L7j61J50n4j01Q7qj98R1O9J33k24
6379a23J08m8J40q8K5m1q4K81j69L6j14N6Ll1J45p8l7O0o3J70k15k8J74j44J51
6404H6k1j05Rk5K37k03J2p5Q6R7Rk54K39m7q2J27k3N6r8n2j59J40qJ76j21j04
6430a03MJ23N5j32K23j46j60J14J11n4m1j19J31k29J85J6r7lJP1P1k2n6K19k22
6455f0K6m6J07j75R7J06j39m8J50K5n5o8J5J45q6ol0R6n3o5r5J70N8J44j68J18
6481A63q9m2O8j34J43o8N3l8j22P9p3J19j38K12j15j7J00k26O8qL4K4L6N1l0j07
6507e7q2L33r0o9L0J7N7j74q6J16O8l7j65Q8n7O8r3N6Q4j26J85j59R6o7RJ84k27
6534i8J21K9j64K24j25M6q3M2N7J6Q3q5q1j07J72j81NJ31l5M3j07J07J80j36K2
$$ plain form
6559 76 139 55 67 -45 -74 39 82 98 -144 79 89 38 164 1 79 86 47 -125 -109 90 98 -135 -46 -57 -91 59
6585 59 -97 44 -57 17 -23 -18 9 -45 -67 97 94 -49 -176 -5 41 107 -17 64 142 -12 111 7 -33 -11 13 42
6611 42 -74 38 78 36 -98 -57 -66 -39 -20 -13 115 178 238 -42 247 110 39 107 103 4 3 130 53 37 -54 45 -94 -121
6639 -121 -21 1 -42 -87 -175 -85 -23 87 -178 188 4 -7 85 -54 89 -64 -22 149 23 -107 29 54 88 -50
6663 -50 -129 4 -22 -36 6 -1 -116 -91 8 -268 -130 116 -150 -36 59 27 -150 -134 8 -60 -51 -52 -38 -184 -4 5 -178
6690 -178 -1 19 -108 40 37 75 154 -2 -46 -14 20 -2 -74 107 -196 -41 -29 -19 24 -54 73 144 70 98 34 50
6716 50 56 175 184 48 -6 -29 120 43 -77 104 24 -85 121 -103 -3 133 19 5 45 -26 64 92 -76 115 -54
6741 -54 -69 21 107 8 97 142 5 -5 -21 -13 46 -31 36 18 105 107 -59 -27 -241 -5 58 -136 -60 78 -17 8 110 27
$$ packed form
6559G6O3q4J2j12k9J13M3J6k42K23J0n1J26j63P8Pl9j72J6J99Qk33Q9j1l4J50
6585E9j56J41j01P4m0NK7n4k2J64lj43j27J71M6O6j24Q1P8j54J23j04m0K2K4K9
6611D2j16J12M0m2j34M1rK7J9PJ28O3O0k80K89j37p1O8mr9jJ27p7j6r1R9j39k7
6639a21J00K2m3m5q8R0O2J10k65L66j84j1R2j39J43j53M2J71j26j30J36K5L4j38
6663e0p9J33k6j4M2pj15K5R9k76J38K46k66J14R5l2j77J6J42o8RjJ4j46J80Rj83
6690a78J77K0j27J48lL8P9j56m4L2L4k2p2J81l03J55J2J0M3p8J27P1p4K8o4J6
6716E0OJ19Rj36n4k3J49p7j20J81q0j09K06k24J00J36j14j4M0p1R0K8j68J91j69
6741e4j5R0Q6r9Q9M5j37j0j6QN9p7O7j8Q7Kj66L2k14K36O3j94P6J38r5K5J02q3
$$ plain form
6769 27 66 67 -163 -25 -19 -112 18 11 -12 59 -147 79 48 -38 -56 -61 24 -137 -34 84 26 61 -62 -38 -60 -14 -83 37
6797 37 67 26 -62 -62 -117 37 -52 45 4 59 96 24 74 145 55 101 -163 164 -98 -97 50 47 97 -30 -73 97 -14 -68
6825 -68 -135 -9 -83 -49 139 -20 147 115 44 83 -92 -14 -33 -111 11 23 28 44 89 29 50 -101 1 59 192 -87
6851 -87 -15 -112 -2 -130 -15 -90 -26 6 57 96 223 -58 86 29 -2 11 128 -77 37 -12 -74 -4 -76 13 24 2
6877 2 80 11 -27 -18 -160 -89 97 -27 -148 -134 -37 28 90 13 60 92 -184 45 -39 -39 -116 33 -28 -52 101 -80 -32
6904 -32 -82 -75 2 25 -32 -79 132 76 2 -113 9 -40 80 -82 63 48 35 -113 -2 -12 152 66 1 107 -99
6929 -99 0 107 169 66 -268 -192 -130 -68 -101 -24 -64 80 -64 -103 -16 -59 -65 107 -13 151 8 53 -14 50 34 -55
6955 -55 6 -118 -129 79 110 -92 -1 -154 95 -31 -115 138 0 -127 -44 -165 -96 -38 -14 -38 -7 94 30 90 -17
$$ packed form
6769B7L9Jk30J38Or3J30pk3P1k06K26l1q6j8nQ5j61J03J18n8L5j23K4k2M6o9J20
6797C7L0m1q8%n5J54q9R7m1N5L7p2N0P1r0M6k64L27k62JJ47lN0j27m3J70j11n4
6825f8o7J26p4L4J88j59J67l2p1L9j75P8j9p8J22J2NJ6M5o0K1j51J02N8J33k79
6851h7P2r7J10j28J15p5O4L2N1L9J27k81J44n7l1J3J17k05J14m9o2P0p2Q9J1k2
6877BP8o9l8Rj42P1J86j24j21J4R7O5O2p7M7L2k76K29q4%p7J49o1k4J53j81M8
6904c2n0PP7K3n7m7K11n6p4j15J22m9J20j62J45j5j3j48J11j0J64q6o5J06k06
6929i9R9J07O2j03l34P6O2O2l3P7m0J44j44l9Q7m3oJ72j20J64j43M5o7O4j6q9
6955e5O1j24j1K08L1k02R1j53K49j26q4K53j38j27Q3j21O9N8K4k4L1J01o4O0j07
$$ plain form
6980 -17 -83 -34 47 90 98 -4 -157 -95 -35 -88 -70 -128 91 24 -21 20 37 72 -42 -33 47 21 56 -44 82 25 27 -25 63
7009 63 12 19 140 40 51 5 -27 -64 -4 -22 61 -54 -85 -60 20 50 21 -24 27 -148 -143 -135 84 -71 80 4 -6 -34
7037 -34 106 26 95 35 120 -89 -8 -52 38 179 40 -64 114 42 -43 -113 131 -241 48 -38 -17 -11 -107 37 -15 -3
7063 -3 -20 10 -36 131 -25 -24 -46 148 59 92 -79 -24 -43 -7 100 -51 48 51 -87 -41 -65 -172 -169 38 -20 104 -4
7090 -4 63 0 80 69 54 63 -70 -66 -14 -62 0 64 76 -100 -64 -20 139 -56 -104 -127 -25 -66 -28 72 -65 -39 -78 -165
7118 -165 -144 79 -18 89 68 95 43 -76 42 99 -36 94 -19 52 35 -77 45 156 91 73 70 -148 -48 -35
7142 -35 -42 22 -43 -14 -170 59 -181 -39 -92 -4 113 45 -19 80 154 -41 -64 97 100 32 -59 -96 -82 -132 -47 -97 -15 191
7170 191 -2 45 -66 -150 129 23 16 -84 17 -28 -96 -51 1 49 -99 24 123 -18 66 16 -27 -37 3 89 150 55
$$ packed form
6980a7o6M9Q1M3Qj02j53O2O0n3J8n8K19o7m5M1J7L5j14RQ0k6L5j00J26n7Kn2Q8
7009F3n1PJ21j00J1m6l2l7O0j8Q3j15l1K5Q0L0k9m5N1j75NQK19j55J51p6j0k8
7037c4J40q0O9o0Q5k09Q1m4R0J41j39j04J78p2q5p0K44l72K89q6K1Or6J44n2J2
7063cj7L0m6J67j56Jk2J94q9L3j71N5j9L6J07j51R9Lj38M6k4j07LK07n8J24j08
7090dO7o3Q0j1j5Rj33MN2m8O2O4J2j76L6M4J59j95m8k3J02m1L8J00j37K6l9q7
7118a65K1K23r7J07k1K7n2j19J18N7j35J30j13P1j7j12J22J11o5j8lk18J00J3
7142c5pO4o5K9j56K29k40J42n3Q8J17o8o4R9P4j95k3J61Lo8r1l7J4n0Q5n0Q2K06
7170A91j93M7j11q4K79j06pj00J01m5o8M5N2M8j48J23R9j41Q4n0m3j0M0Q6O1r5
$$ plain form
7196 55 -5 -40 -94 -52 -56 -92 31 -114 52 97 12 116 -63 192 -51 18 98 -121 -172 -102 -108 -36 -19 -88 -24 10 -57
7223 -57 24 218 72 39 59 125 12 -69 -47 -216 -173 -153 -154 -81 69 -9 13 -51 77 52 10 -62 62 29 27 13 -1 -46
7251 -46 84 -169 -38 132 -159 127 -18 42 -54 180 -25 -21 -2 14 14 -192 74 -37 -54 -181 22 -102 -14 230
7275 230 40 252 68 -66 50 66 2 72 -75 155 81 -29 117 -56 -12 -87 52 7 -43 25 7 160 38
7298 38 117 43 63 -50 -59 37 100 -18 -71 -75 74 103 46 -10 113 -21 71 38 -43 -195 -24 -30 -71 -2 -95 -10 53 -19
7326 -19 -97 -28 -61 -64 -129 3 -13 161 125 13 129 -82 71 18 94 96 73 -110 -57 5 -26 -18 45 122 -27 -74 4 45
7354 45 -91 142 -86 -68 -34 -71 19 -113 62 35 7 -36 -63 -15 5 23 -10 78 -37 -137 4 -57 -73 -53 -64 64
7380 64 -80 34 121 29 -45 -12 -138 -49 77 80 9 40 19 34 45 -52 55 105 -5 21 191 -33 -25 -115 73 11 -93
$$ packed form
7196E5o0l5n4M2ml6J23j45J66M5q5J04j79K55k43O9Q0k19n1P0oP2J7o9O4L4o7
7223e7Q1J94j46l3K0O6j13q1K2j69M3K0jP3J50p8K2o4J28k5m2p2J24l3kj4j4m5
7251d6J30k53J31J70k91K86j45O0r6K34k05MJ9J6%k06K66j11j7j27K03j24Q8K44
7275B30j90K12j84j34J16J6o4P0j47K30p4j10J46j73M4p5J39m5n0O8j8J53j22
7298C8P9p4K0j13rR6O3j18n3mJ49K9n7n6J23j34R2l3q1j52J71om1O9r3Q5O3p2
7326a9p8O9l3lo5J32j6J74l6j12J16k11J53n3P6Kk3j83N3O2l1QO3P7j49m7P8M1
7354D5j36K33k28J8L4l7R0j32J75k7k8m3k7M8K0J8l3Q8j15j00J41o1j6K0j1J28
7380F4j44J14Q7r2p4L3j26Q9J26Lp1L1k1J5J1r7J07N0j10K6J70k24Qr0J88o2j04
$$ plain form
7407 -93 9 -62 -161 -77 47 -8 -60 139 85 139 -21 -112 -23 145 -110 0 57 160 -29 13 58 -1 -1 178 2
7432 2 -67 0 -99 105 -75 -62 -54 16 -204 -217 -55 -21 32 12 -159 50 141 -4 82 42 123 -45 20 253 -14 34
7458 34 -154 -26 4 -22 -114 -93 147 -105 -3 -61 -90 52 -16 23 -23 29 45 -95 -49 -134 79 62 40 145 164 105
7484 105 -40 -21 59 15 -133 -87 49 54 61 34 -258 -113 46 -27 104 108 22 71 -18 -19 11 -49 69 165 -37 130 -113
7511 -113 -7 -5 -15 -98 -12 -55 -173 -26 92 15 -37 -52 -32 152 -22 -86 73 -81 22 -56 10 -17 8 52 -125
7536 -125 70 35 102 -210 44 -45 40 6 124 -253 -34 134 -84 -144 -196 -89 -109 90 5 27 -108 70 -75
7559 -75 88 52 -135 157 -48 138 -45 -57 41 165 -27 -12 -16 -114 46 83 -34 69 -11 18 73 22 -16 18 -132
7584 -132 -150 -55 -36 -31 -43 187 81 -69 -91 77 138 19 44 28 43 5 217 -70 -68 198 4 61 -83 -16 -136
$$ packed form
7407i3J02p1r9Q4J24n5n2J99n4N4j60r1Q9J68k55J10N7J03j89M2M5n9%J79j76
7432Bo9O7r9K04j80J3QP0k20j3J62L4N3k0j71K09R1j45Q6m0Q1j68O5K33k67M8
7458C4j88J28L0k6r2K1K40k52J02n8k9J42o8L9m6N2J6j40M6q5K13j7k2J05J9n9
7484A05j45J9Q0m4j48M6J36NPk7k92J45J59p3J31Mq6M9q9jL0o0J18R6k02J67k43
7511a13J06Kj0q3Q6m3j18J47J18p7n2j5K0J84j74o4J59j54J03p8O6k7K5M4j77
7536a25J95l5O7l12K54q9Q5l4J18l77K19J68k18o0n2J07k0J99q5K2j35J78j45
7559g5J63l6j87K92k05J86j83j2R8J24j92J5mr8J60L7j17J03q0K9N5n1l8L4j50
7584a32j8R5J9Nj2K30j06j50k2J68O1j19K5j6J5l8K12k87KK66j94N7j44O7j20
$$ plain form
7609 -136 -31 -104 -122 -24 -128 123 -57 -62 -98 15 38 26 -93 -69 34 64 83 74 74 116 -131 -19 72 56 20 -35 80
7636 80 -11 79 -63 -89 -115 -35 26 -103 36 -246 -150 55 47 -8 -50 105 -47 80 36 34 131 89 -176 62 69 -74
7662 -74 -106 -3 -80 56 37 25 30 49 -28 5 -21 35 -14 -4 5 -106 -107 -62 -108 -14 8 -165 207 69 -23 105 -32 11
7690 11 -38 -14 -90 -28 79 -39 -83 -38 79 -120 -70 -97 -127 -102 -123 -207 76 -63 -77 -59 -32 91 3 9 111 29 53
7717 53 35 -27 27 -34 118 -75 -101 -25 118 -52 -61 -136 -54 -77 15 -28 22 -123 50 -159 -59 54 128 5 -23 -228
7743 -228 -39 98 78 -9 -39 -19 69 181 -103 50 -23 82 23 -76 107 -93 -39 50 130 -70 97 86 -55 -18
7767 -18 -5 -19 147 9 26 93 182 -12 -168 -64 101 5 40 144 -118 -33 -165 99 -76 66 -5 -35 -156 -2
7791 -2 121 -56 -62 -20 26 -54 -79 -41 62 -14 -53 32 122 -139 -105 -38 -66 31 -51 -49 59 -85 79 54 61 121 5 5 -104
$$ packed form
7609a36J05p3j8R8j04K51j80nl6J13K3j2j19K4J03L0J9r%M2k47J12R1j6l6n5J15
7636H0r1R0j42k6k6Q0O1j29J39k82R6K05qn5m2J55j52J27m4kR7m2k65K38Pj43
7662g4l2J03p7J36j9j2NJ9p7L3k6N6m9J0Rj11jM5m6R4K2j73L72j38r2J28j37M3
7690A1m9K4p6O2J07j18m4M5J17j99N0k7l0K5k1q4K83j39j4J8K7J23q8OJ02q2K4
7717E3j8o2N4o1J52j93k6P6J43j70rp5Q2k3R2m3N0j45J73k09J00J13P4j23k8k05
7743b28J89J37k0q7l0K0Q8J12k84J53p3J05n9r9J83k00N4Q9Q0k00J67j1j41L7
7767a8J3j4J66j38J7O7Q9j94j56J04J65r6L5J04k62Q5j32K64j75J42p1l0j21J54
7791bJ23j77oM2M6q0k5L8J03p6l9Q5R0k61L4O7k8R7q2KJ08j44J64k5PO0j16%j09
$$ plain form
7820 -104 21 -99 -77 -114 -19 -9 77 -89 -63 46 -44 107 122 -39 128 3 80 88 30 135 18 -74 -129 -19 -9
7845 -9 -3 -120 84 55 -85 -130 -43 93 8 -136 14 -60 75 70 -83 50 27 -138 32 63 -14 125 -80 37 16
7870 16 -10 -14 -212 76 -54 94 21 -183 49 -55 -28 -43 -84 95 95 -76 -118 82 204 118 46 -72 -75 58 -118
7895 -118 34 -2 -64 8 43 92 67 40 -96 26 -23 -102 28 40 103 -22 31 -68 59 -158 -79 41 -33 -74 46
7920 46 0 -46 104 -72 77 18 -65 -146 -29 22 -269 208 88 11 -130 -114 -122 18 93 -1 85 132 -19 23 164
7945 164 -217 3 -45 52 8 -9 31 -64 -109 42 -107 69 80 -21 -108 41 -56 10 -115 -58 86 77 -141 -92 -44
7970 -44 19 162 52 -46 -72 -153 105 4 -17 4 12 -17 100 -21 10 -93 -39 -153 -37 170 -25 -77 115 -8
7994 -8 -41 -87 100 -95 -28 -15 117 -7 40 50 105 -99 122 214 -55 52 -116 6 -15 117 -35 -38 -32 159 -45
$$ packed form
7820a04J25j20K2l7R5J0Q6j66K6J09r0J51J5j61J67j25P7Qn8J05j17r2n5J10J0
7845iOj17K04k9j40m5Q7J36q5j44J50p4J35nj53J33k3j65J70L1p7J39k05J17k1
7870A6k6mj98K88j30J48p3k04K32j04K7j5m1J79%j71m2K00J22q6p2j18lJ33j76
7895a18J52l6o2P2L5M9k5k7j36J22m9p9J30J2O3j25N3r9J27k17P9J20p4m1J20
7920D6m6m6J50j76J49n9q3q1J17N1k91M77j20p7j41J6qJ40P5r4Q6M7j51M2J41
7945A64l81K20m8R7m4j7M0r5m5J51j49J76J1j01q7J49r7O6j25N7J44rk18M9M8
7970d4O3J43j10r8k6q1K58j01k1K1Qk9J17j21L1j03N4j14J16K07j95n2J92j23
7994hl3m6J87j95O7J3J32j24M7J0N5k04K21R2k69J07j68J22k1J32j52lOJ91k04
$$ plain form
8019 -45 17 41 -10 10 -125 112 -56 -106 -85 -14 50 -132 224 -105 52 -173 -145 -81 24 27 -29 136 0 90 -19
8044 -19 43 146 41 -6 -52 10 -29 -126 -32 -54 4 74 -76 42 110 31 91 49 -87 194 5 10 100 -8 138 16
8070 16 275 -86 51 174 -96 1 -8 38 -70 -65 -138 17 -39 -151 -4 -20 24 103 75 137 -104 -47 -65 -18 39 -125
8096 -125 -51 34 11 -7 143 -6 70 -49 61 -11 -49 -24 -60 74 -70 -123 -22 -30 -64 -48 -5 -108 -41 -108 69 -72
8122 -72 -55 -7 183 -24 64 -251 -20 13 143 166 19 89 100 -5 -86 14 -84 -166 14 61 -25 -164 -20 82
8146 82 -129 0 4 221 -14 -143 -30 55 166 -113 29 76 46 87 -72 -91 -55 -51 -40 -87 -105 9 -100 62 -33
8171 -33 -162 -24 -83 86 -152 18 -1 177 -77 -67 30 -84 -33 -138 60 5 -3 -53 -216 -56
$$ packed form
8019d5O2K4n1K0j35K37j68n0K1P1O4j82L56l29J57k25K8O4J05Ln6J65j36R0j09
8044a9O2J03j05m7m6O2l9r7R4k2N8P0j50J18O8p9O0m2j36K81j89NR0j08J46j22
8070A6K59l61J37J23k70R7rM6j08Np3J55n6j12J47j6M4P9k8O2k41N7j8M7N7j64
8096a25P4Q5k3j8J50j49P6j19J10p2l8K5l6J34j44n3J01ql4J6M3j03O7o7J77j41
8122g2J7M8J90k07Q8l15K31L3J30K3j47P0J1j05q1J00r8q2J80M7q6j39J44J02
8146H2k11J29MK17k35j29J13Q5J11k79J42M7l0M1j59j9L6MJ1m7j8J14j09J62r5
8171c3j29J38n9J69k38J70j9J78k54J0R7j14N1j05J98n5qn0j63J60
8191e6
$$ Imaginary data points
##PAGE= N=2
##DATA TABLE= (X++(I..I)), XYDATA
$$ plain form
0 0 0 0 0 0 0 0 0 0 0 -8 0 -8 8 -8 8 -16 16 -24 24 -32 38 -41 52 -58 72 -81 94 -110 126 -143 165 -189 214
33 214 -242 274 -307 344 -386 432 -480 534 -593 656 -727 806 -890 981 -1081 1192 -1311
50 -1311 1446 -1593 1757 -1939 2144 -2376 2641 -2946 3303 -3728 4237 -4872 5680 -6749 8236
65 8236 -10464 14147 -21356 40844 -209507 -601937 -156523 423413 658190 415626 199737
76 199737 227049 365427 335149 205589 94817 20637 -119110 -227943 -213628 -157496 -246046
87 -246046 -388019 -326337 -12731 196467 42464 -248772 -229376 122839 379373 238784
97 238784 -59182 -129683 50116 181844 116466 9875 24236 82548 65894 19600 47333
108 47333 90779 24628 -99112 -108126 -8416 -2848 -177673 -324527 -228089 -10852 35441 -112287
$$ packed form
0@%%%%%%%%%qQqJ6j6J6k4L2m0M8n6P0p9R3j10J30j53J75k04K36k69L08l54M03
33B14m56N16n81O51p30Q18r12J014j127J249j383J533j696J871k062K273k503
50a311K757l039L350l696M083m520N017n587O249p031P965r109J0552j2429J4985
65H236j8700K4611l5503O2200k50351l92430M45414N79936K34777k42564k15889
76A99737K7312J38378l0278j29560j10772p4180j39747j08833J4315N6132q8550
87b46046j41973O1682L13606K09198j54003k91236J9396L52215K56534j40589
97B38784k97966p0501J79799J31728o5378j06591J4361N8312j6654m6294K7733
108D7333M3446o6151j23740r014R9710N568j74825j46854R6438K17237M6293j47728
$$ plain form
120 -112287 -175169 7323 236350 256409 127726 99382 221958 289714 172687 12684 -24230
131 -24230 2632 -54135 -179600 -233457 -189557 -168541 -209280 -197031 -72086 42435 23271
142 23271 -31904 55219 240154 292693 141648 -1610 56344 201062 181300 -18249 -163934
153 -163934 -109793 7843 -3421 -115412 -165327 -106144 -35617 -21800 -20837 926 -5163 -50817
165 -50817 -46847 56474 143010 71383 -84060 -103622 62848 204669 130002 -58932 -105079
176 -105079 39716 163188 99788 -57840 -116449 -49268 14103 -2940 -57338 -91101 -104519
187 -104519 -99723 -41736 50590 75631 -8046 -84219 -14654 147949 200989 73680 -68043
198 -68043 -46581 87860 131337 16787 -109926 -111148 -27073 14386 -21566 -64857 -70433 -55339
$$ packed form
120a12287o2882J82492K29027K0059j28683k8344J22576O7756j17027j60003l6914
131b4230K6862n6767j25465n3857M3900K1016m0739J2249J24945J14521j9164
142B3271n5175Q7123J84935N2539j51045j43258N7954J44718j9762j99549j45685
153a63934N4141J17636j1264j11991m9915N9183P0527J3817R63K1763o089m5654
165e0817L970J03321Q6536p1627j55443j9562J66470J41821p4667j88934m6147
176a05079J44795J23472o3400j57628n8609O7181O3371j7043n4398l3763j3418
187a04519M796N7987R2326K5041q3677p6173O9565J62603N3040j27309j41723
198f8043K1462J34441M3477j14550j26713j222Q4075M1459l5952m3291n576J5094
$$ plain form
210 -55339 -30664 14957 62237 51725 -17040 -46921 24094 115504 103450 -4730 -67015 -7938
222 -7938 76477 61272 -33715 -82564 -36791 17480 4605 -41394 -52176 -27062 -15413 -23114
234 -23114 -9935 23807 30647 -1126 -17117 21749 68372 55514 4441 -11485 22647 42611
246 42611 5003 -40639 -33223 3968 2954 -40832 -59762 -22000 16031 2668 -32021 -24755 24691
259 24691 51074 23775 -9621 -3579 24723 32188 14493 2779 1479 -8428 -23278 -16717 12215
272 12215 21008 -14422 -48940 -29156 23985 38448 -7906 -50933 -30130 26668 47428 10691
284 10691 -30814 -24962 12768 38122 34075 13922 -4197 -12327 -4473 17791 28771 4824 -37504
297 -37504 -52425 -18598 20026 9689 -36907 -58002 -22142 31075 41818 8497 -19397 -6910
$$ packed form
210e5339K4675M5621M7280j0512o8765k9881P1015R1410j2054j08180o2285N9077
222g938Q4415j5205r4987m8849M5773N4271j2875m5999j0782K5114J1649p701
234b3114J3179L3742O840l1773j5991L8866M6623j2858n1073j5926L4132J9964
246D2611l7608m5642P416L7191j014m3786j8930L7762L8031j3363l4689P266M9446
259B4691K6383k7299l3396O042K8302P465j7695j1714j300r907j4850O561K8932
272A2215Q793l5430l4518J9784N3141J4463m6354m3027K0803N6798K0760l6737
284A0691m1505N852L7730K5354m047k0153j8119q130P854K2264J0980k3947m2328
297c7504j4921L3827L8624j0337m6596k1095L5860N3217J0743l3321k7894J2487
$$ plain form
309 -6910 29758 50328 40692 15791 -5421 -11031 121 14559 12602 -14267 -44167 -43980 -13374
322 -13374 10008 -2724 -33559 -37101 -4853 28622 31219 7736 -7624 2438 23201 34190
334 34190 27932 10887 -5704 -13290 -6297 6330 5777 -12138 -31372 -31043 -10445 5754 1225 -12840
348 -12840 -15240 1013 20447 25403 16350 3803 110 7148 15332 16091 4740 -13663 -23653 -18356
362 -18356 -4082 3641 -3910 -16563 -18361 -4706 13010 17630 7270 -3380 -2406 9329 17790
375 17790 11109 -4812 -15568 -10789 3945 12912 7908 -5470 -12764 -4106 12084 19703 11425 -6264
389 -6264 -16648 -11905 -1350 271 -11979 -25899 -25179 -9991 6401 10031 2298 -319 11652 29730
403 29730 38925 31193 15060 3758 1792 4441 1394 -11380 -28312 -39820 -37615 -24129 -13481
$$ packed form
309f910L6668K0570r636k4901k1212n610J1152J4438j957k6869k9900J87L0606
322a3374K3382j2732l0835l542L2248L3475K597k3483j5360J0062K0763J0989
334C4190o258j7045j6591p586O993J2627n53j7915j9234L29K0598J6199m529j4065
348a2840k400J6253J9434M956r053j2547l693P038Q184P59j1351j8403r990N297
362a8356J4274P723p551j2653j798J3655J7716M620j0360j0650R74J1735Q461
375A7790o681j5921j0756M779J4734Q967n004j3378p294Q658J6190P619q278j7689
389f264j0384M743J0555J621j2250j3920P20J5188J6392L630p733k617J1971J8078
403B9730R195p732j6133j1302j966K649l047j2774j6932j1508K205J3486J0648
$$ plain form
416 -13481 -12423 -14483 -7885 10881 28540 32849 25922 19057 20537 24054 19915 8277 -6897 -19111
430 -19111 -23755 -21057 -14433 -11159 -14974 -18670 -12821 3227 17211 17691 9164 4474 7160 12530 10235
445 10235 -29 -9634 -12774 -8837 -2766 290 -1064 -4762 -4061 5004 16593 20317 11829 -2006
459 -2006 -7499 -2510 1919 -3092 -16429 -25117 -21066 -10068 -1486 289 -584 4184 14981 25752
473 25752 30414 24879 14101 6503 5025 5819 -235 -15252 -30299 -35316 -27869 -17832 -14703 -15919
487 -15919 -13713 -2979 12128 22485 24441 21771 20178 22358 23427 19108 9307 -2773 -9955 -10879
501 -10879 -9883 -10820 -15270 -20373 -20258 -14414 -5754 -107 -828 -3456 -2853 2863 9161 9399 5617 3938
517 3938 5804 9490 11297 9942 7759 5417 3959 4703 6142 4923 -2721 -13104 -16362 -11124 -5814
$$ packed form
416a3481J058k060O598J8766J7659M309o927o865J480L517m139j1638j5174j2214
430a9111m644K698O624L274l815l696N849J6048J3984M80q527m690K686N370k295
445A0235j0264r605l140L937O071L056j354l698P01R065J1589L724q488j3835
459b006n493M989M429n011j3337q688M051J0998Q582J775q73M768J0797J0771
473B5752M662n535j0778p598j478P94o054j5017j5047n017P447J0037L129j216
487a5919K206J0734J5107J0357J956k670j593K180J069m319r801j2080p182r24
501a0879R96r37m450n103J15N844Q660N647p21k628O03N716O298K38l782j679
517C938J866L686J807j355k183k342j458P44J439j219p644j0383l258N238N310
$$ plain form
532 -5814 -8693 -17588 -20323 -12130 -1165 4135 2602 2523 7471 13482 17233 18151 14686 9379 4356 4053
548 4053 7940 6205 -4892 -17255 -18314 -7299 -127 -6544 -17668 -18806 -6470 4960 4133 -2146
562 -2146 -2500 4862 11939 13084 11133 9228 6905 5013 6691 9509 6473 -5853 -16401 -13187 -2692
577 -2692 -1180 -13192 -23177 -15266 1175 7393 354 -4610 4580 17656 19492 12215 7038 8412
591 8412 8976 4430 -187 -2330 -6593 -14253 -17835 -11095 -2357 -4964 -13577 -11868 3591 15753 9446
606 9446 -3230 -1759 13066 19843 7857 -7612 -7594 2900 6268 -1074 -7932 -5456 -121 269 397
621 397 3730 5374 -264 -6582 -1785 7510 4747 -11586 -20702 -8964 8833 7732 -9477 -16331
635 -16331 -263 19751 19452 4593 -1350 7146 15124 10427 -416 -4866 -5876 -10165 -12646 -8410
$$ packed form
532e814k879q895k735Q193J0965N300j533p9M948O011L751R18l465n307n023l03
548D053L887j735j1097j2363j059J1015P172o417j1124j138J2336J1430q27o279
562b146l54P362P077J145j951j905k323j892J678K818l036j2326j0548L214J0495
577b692J512j2012r985P911J6441O218p039m964R190J3076J836p277n177J374
591H412N64m546m617k143m263p660l582O740Q738k607q613J709J5459J2162o307
606I446j2676J471J4825O777j1986j5469J8J0494L368p342o858K476N335L90J28
621C97L333J644n638o318M797R295k763j6333r116J1738J7797j101j7209o854
635a6331J6068K0014k99j4859n943Q496P978m697j0843m450j010m289k481M236
$$ plain form
649 -8410 -3192 -8224 -17470 -12515 7566 20166 10343 -6345 -2536 18132 26417 8868 -12008 -11503
663 -11503 3451 6453 -7515 -18755 -14548 -4155 -758 -2166 1177 5960 4417 1909 7945 18371
677 18371 15568 -2177 -12473 -2356 11844 5166 -17802 -25944 -8222 10334 5904 -12227 -14809
690 -14809 2651 16834 12507 668 -1329 4749 6263 2300 1216 1913 -3234 -11275 -8829 5172
704 5172 11119 -2043 -16268 -7991 14809 20915 464 -18310 -10205 11190 15533 -3381 -18844
717 -18844 -12093 3053 6650 -392 -4681 -1479 863 2112 7846 13886 8653 -6106 -10307 4672
731 4672 18520 7624 -17303 -24224 -3462 15743 7124 -15726 -21011 -2034 15303 11358 -2614
744 -2614 -6285 1222 7104 6452 5101 3847 -2335 -9398 -5955 7021 11232 -3351 -18690 -11692 10379
$$ packed form
649h410N218n032r246M955K0081J2600r823j6688L809K0668Q285j7549k0876N05
663a1503J4954L002j3968j1240M207J0393L397j408L343M783j543k508O036J0426
677A8371k803j7745j0296J0117J4200o678k2968q142J7722J8556m430j8131k582
690a4809J7460J4183m327j1839j997O078J514l963j084O97n147q041K446J4001
704E172N947j3162j4225Q277K2800O106k0451j8774Q105K1395M343j8914j5463
717a8844O751J5146L597p042m289L202K342J249N734O040n233j4759m201J4979
731D672J3848j0896k4927o921K0762J9205q619k2850n285J8977J7337l945j3972
744b614l671P507N882o52j351j254o182p063L443J2976M211j4583j5339O998K2071
$$ plain form
759 10379 17880 514 -17212 -10107 10628 16809 1991 -11555 -6534 5897 7471 90 -3369
772 -3369 -1145 -602 -3505 -1734 4804 4313 -5821 -11024 -1084 11889 7714 -8238 -12727 1847 15132
787 15132 8149 -8556 -10080 4171 12732 3976 -8297 -6946 3158 5432 -1469 -5665 -2325 752
801 752 -1962 -3253 1695 4284 -934 -7041 -1836 9267 9458 -3687 -11328 -1673 12701 10236 -6433
816 -6433 -13469 -2140 11447 8619 -4936 -10233 -2622 5234 4520 -743 -2755 -2560 -3547 -2081 3828
831 3828 6452 -822 -10298 -6932 8039 14639 2877 -12689 -9960 7731 16170 4554 -11208 -11361
845 -11361 1217 9094 3770 -4417 -6668 -3330 125 3206 5399 2622 -4787 -7458 947 11561
859 11561 9200 -5323 -13757 -4321 10391 10641 -3768 -13669 -7071 5324 8229 589 -5625 -3797
$$ packed form
759A0379P501j7366j7726P105K0735O181j4818j3546N021J2431J574p381l459
772c369K224N43k903J771O538m91j0134n203R940J2973m175j5952m489J4574J3285
787A5132o983j6705j524J4251Q561q756j2273J351J0104K274o901m196L340L077
801G52k714j291M948K589n218o107N205J1103J91j3145p641R655J4374k465j6669
816f433p036J1329J3587k828j3555n297P611P856p14n263k012J95r87J466N909
831C828K624p274r476L366J4971O600j1762j5566K729J7691Q439j1616j5762j53
845a1361J2578P877n324q187k251L338L455L081K193k777p409k671Q405J0614
859A1561k361j4523q434R436J4712K50j4409r901O598J2395K905p640o214J828
$$ plain form
873 -3797 1055 3506 4013 3658 942 -3112 -2933 3859 8467 3210 -6730 -9022 292 8033 3276 -7433
889 -7433 -10003 -2330 4528 2000 -3987 -4513 -198 2317 1217 812 3066 3694 1332 463 3636 6253
905 6253 3459 -2302 -3259 624 2633 -1091 -5776 -4915 -1423 -1487 -4295 -4070 -86 2520 -204 -3320
921 -3320 -925 4497 6127 1384 -2126 -17 4010 4509 1193 -1640 -825 439 1157 1194 940 -942 -3876
938 -3876 -4091 -268 3209 611 -5665 -7736 -2364 4261 4212 -1738 -5098 -1402 5037 6911 3484 -341
954 -341 -1322 1455 4026 4074 1260 -3577 -6266 -3535 1321 2781 -1736 -7455 -6317 559 6035 4944
970 4944 -800 -3113 790 5982 6692 2511 -2127 -3225 -1010 1812 1840 -1907 -5844 -6604 -2434 2356
986 2356 3097 -961 -4271 -2913 2353 5895 4556 413 -1991 -243 3389 4593 2557 -1360 -3229
$$ packed form
873c797M852K451N07l55k716m054J79O792M608n257r940k292R314P741m757j0709
889g433k570P673O858k528n987n26M315K515j100m05K254O28k362q69L173K617
905F253k794n761r57L883K009l724m685Q61L492o4k808K25L984K606k724l116
921c320K395N422J630m743l510K109M027M99l316k833Q15J264P18L7k54j882k934
938c876k15L823L477k598o276k071N372O625m9n950l360L696O439J874l427l825
954c41r81K777K571M8k814m837k689K731M856J460m517n719J138O876N476j091
970D944n744k313L903N192P10m181m638j098K215K822K8l747l937p60M170M790
986B356P41m058l310J358N266L542j339m143k404J748L632J204k036l917j869
$$ plain form
1001 -3229 -992 1898 2764 -169 -4101 -4990 -2325 1061 1613 -1670 -5065 -4888 -1739 2390 3264 425
1017 425 -2380 -1498 2569 6280 5693 2161 -539 704 4165 5235 2325 -2217 -4927 -3426 -446 410
1033 410 -2215 -6481 -7875 -4711 435 2810 295 -3531 -2736 2255 7045 6809 2237 -566 1341 4733
1049 4733 5857 2731 -1688 -3954 -2834 73 1180 -1384 -5350 -7213 -4447 496 2522 -85 -3789
1064 -3789 -3375 1644 5587 4677 948 -1078 578 3267 3768 1781 -963 -2658 -1802 -80 1483 756
1080 756 -2637 -4832 -3210 950 3136 636 -2919 -3166 -98 2822 2709 578 -327 143 1241 2536
1096 2536 2656 1951 -365 -2088 -1042 1623 1625 -1650 -5809 -5485 -1553 1330 544 -2951 -3980 -1299 2178
1113 2178 4178 4377 2758 1658 1882 3660 5624 4210 -222 -3917 -3154 441 1233 -3170 -8042 -8214
$$ packed form
1001c229K237K890Q66k933l932q89K665L386N52l283l395J77L149M129Q74k839
1017D25k805Q82M067L711n87l532k700J243L461J070k910m542k710J501K980Q56
1033D10k625m266j394L164N146K375k515l826P95M991M790k36m572k803J907L392
1049D733J124l126m419k266J120K907J107k564l966j863K766M943K026k607l704
1064c789M14N019L943r10l729k026J656K689N01j987k744j695Q56J722J563p27
1080G56l393k195J622M160K186k500l555k47L068K920j13k131r05M70J098J295
1096B536J20p05k316j723J046K665Kl275m159L24L932K883p86l495j029K681L477
1113B178K000J99j619j100K24J778J964j414m432l695P63L595P92m403m872j72
$$ plain form
1129 -8214 -3613 844 935 -2171 -3831 -1814 2563 5639 5754 3351 636 930 3901 6285 4644 -713
1145 -713 -4114 -2009 2293 2861 -1851 -6947 -6695 -2220 1491 201 -3669 -5653 -4264 -231 2898 3018
1161 3018 686 -1134 -120 4108 6927 5303 1105 -1287 997 4642 4087 -272 -4806 -4832 -1770 132
1177 132 -1072 -4179 -5754 -4717 -1698 1152 2090 523 -1198 -361 2676 5399 4798 1348 -640 589
1193 589 3189 3418 479 -2682 -3284 -1663 397 168 -1801 -3772 -4053 -2237 665 1872 374 -1854
1209 -1854 -2368 611 3642 4171 1459 -740 14 2398 3696 2167 -844 -2888 -2033 12 932 -798
1225 -798 -3694 -4860 -2977 378 2436 1068 -1415 -2089 439 3985 4581 2209 -749 -1268 1294 3147
1241 3147 1754 -1428 -3599 -2605 432 1652 266 -2349 -3548 -1540 1595 2732 1271 -1555 -2483
$$ packed form
1129h214M601M457R1l106j660K017M377L076J15k403k715K94K971K384j641n357
1145g13l401K105M302N68m712n096K52M475L711j290l870j984J389M033L129J20
1161C018k332j820J014M228K819j624m198k392K284L645n55m359m534k6L062J902
1177A32j204l107j575J037L019K850R38j567j721Q37L037K723o01l450j988J229
1193E89K600K29k939l161o02J621K060k29j969j971k81J816K902J207j498k228
1209a854n14K979L031N29k712k199P54K384J298j529l011k044Q55K045R20j730
1225g98k896j166J883L355K058j368k483o74K528L546N96k372k958n19K562J853
1241C147j393l182k171R94L037J220j386k615j199K008L135J137j461k826r28
$$ plain form
1256 -2483 -673 1718 2466 440 -2100 -2123 196 2558 2481 25 -1305 -351 2149 2975 1512 -1003 -2095
1273 -2095 -1761 -269 414 -272 -2156 -3598 -2928 -183 1809 1283 -507 -1065 799 3093 3418 1854 -80
1290 -80 24 797 1228 729 -638 -2020 -2682 -1926 339 1645 -53 -2213 -2606 93 3176 2931 72
1307 72 -2408 -1815 743 1787 262 -1775 -2459 -1275 634 1872 1877 -94 -1437 213 3523 4997 2430
1324 2430 -1998 -3209 -339 2548 1315 -3138 -5725 -4315 -1055 622 -635 -2259 -2207 -146 2727
1339 2727 4396 3603 1092 -513 1392 4437 4932 795 -3876 -4057 -364 2410 168 -3664 -5226 -2399
1355 -2399 700 1268 -376 -1664 -1103 391 1569 2082 1060 -1141 -1874 -17 2664 3022 -112 -2660
1371 -2660 -1093 2614 4158 1714 -1151 -1037 878 1277 -318 -1915 -2196 -2058 -2444 -2444 -1517 -1142 -1358 -1691
$$ packed form
1256b483J810K391P48k026k540k3K319K362p7k456j330R54K500Q26j463k515j092
1273b095L34J492O83o86j884j442O70K745J992n26j790n58J864K294L25j564j934
1290h0J04P73M31m99j367j382o62P56K265J306j698k160l93K699L083k45k859
1307G2k480N93K558J044j525k037o84J184J909J238Nj971j343J650L310J474k567
1324B430m428j211K870K887j233m453k587J410L260J677j257j624N2K061K873
1339B727J669p93k511j605J905L045M95m137m671j81L693K774k242l832j562K827
1355b399L099N68j644j288N61J494J178N13j022k201p33J857K681L58l134k548
1371b660J567L707J544k444k865J14J915L99j595j597k81J38l86%R27L75k16l33
$$ plain form
1389 -1691 108 2714 3542 2308 1256 2139 3684 3169 1112 -103 -141 -451 -2453 -3612 -2703 -1183 -1400
1406 -1400 -2991 -3036 -286 2322 2014 539 452 2332 3697 2534 765 42 -187 -509 -674 -224 -486 -2254
1424 -2254 -3410 -2163 1061 2608 284 -2538 -1745 1907 3851 1480 -1616 -2001 543 2262 1675 -468
1440 -468 -1433 -914 501 2149 2449 1025 -1691 -2702 -389 2370 1527 -2713 -5467 -3468 545 1531
1456 1531 -1327 -3573 -1794 2134 4299 3036 1115 857 2180 3356 3739 2513 -112 -2534 -2960 -767
1472 -767 544 -1384 -5072 -5640 -2377 984 827 -2040 -2559 265 3290 3528 1602 237 1241 2120
1488 2120 2395 2066 1218 -219 -1550 -1095 478 892 -655 -2763 -2804 -585 592 -915 -2433 -1968 214
1505 214 1371 300 -604 228 1456 1638 959 1066 1642 1081 -13 -567 -237 396 -337 -1527 -1645 -979
$$ packed form
1389a691J799K606Q28j234j052Q83J545n15k057j215l8l10k002j159R09J520k17
1406a400j591m5K750K608l08j475q7J880J365j163j769p23k29l22j65M50k62j768
1424b254j156J247L224J547k324k822P93L652J944k371l096l85K544J719n87k143
1440d68r65N19J415J648L00j424k716j011K313K759q43m240k754J999M013R86
1456A531k858k246J779L928K165j263j921k58J323J176L83j226k625k422m26K193
1472g67J311j928l688n68L263L361j57k867n19K824L025K38j926j365J004Q79
1488B120K75l29q48j437j331M55J573M14j547k108m1K219J177j507j518M65K182
1505B14J157j071r04Q32J228J82o79J07N76n61j094n54L30O33p33j190j18O66
$$ plain form
1523 -979 -814 -810 -718 344 1123 545 -233 536 1895 2170 355 -830 64 1049 957 -1191 -2189 -1369 -20
1542 -20 403 -605 -1276 -1418 -866 -66 629 928 182 -891 -626 1203 2376 1725 -308 -477 1710 2998
1560 2998 2123 -538 -1655 -631 715 236 -1473 -3081 -3495 -2525 -1653 -808 -766 -1344 -1367 357 2615 3579
1578 3579 2235 974 1698 3326 3589 1594 -804 -1519 -841 39 -796 -2239 -3227 -2564 -1490 -367 210
1595 210 23 -89 -36 767 2053 1637 330 -687 -223 802 785 -408 -1458 -987 317 1049 694 325
1613 325 63 355 541 838 516 -100 -984 -1203 -1055 -904 -543 -1410 -1398 -591 492 793 438 461 731 1071
1633 1071 1148 1000 396 -20 -471 -1023 -653 -474 -388 -628 -709 -371 403 785 937 816 824 916 717 568 -143 -570
1655 -570 -1003 -1212 -955 -869 -1229 -1301 -980 -197 824 1041 957 931 1028 1625 1562 1001 574 -167 -332 -592 -827 -1336
$$ packed form
1523i79J65MR2J062P79n78p78P69J359K75j815j185Q94R85r2k148r98Q20J349
1542b0M23j008o71j42N52Q00O95K99p46j073K65J829J173o51k033j69K187J288
1560B998q75k661j117J024J346m79j709j608m14R70Q72Q45M2n78k3J724K258R64
1578C579j344j261P24J628K63j995k398p15O78Q80q35j443r88O63J074J123N77
1595B10j87j12N3Q03J286m16j307j017M64J025j7j193j050M71J304P32l55l69
1613C25k62K92J86K97l22o16q84k19J48J51L61q67J2Q07J083L01l55K3K70L40
1633A071P7j48o04m16m51n52L70J79Q6k40q1L38P74L82J52j21QR2j99j49p11m27
1655e70m33k09K57Q6l60p2L21P83J021K17q4k6R7N97o3n61m27p41j65k60k35n09
$$ plain form
1677 -1336 -1504 -1571 -1126 -647 -367 -300 20 316 1120 1226 1455 1177 799 671 448 320 186 -285 -819 -1121
1697 -1121 -1083 -859 -931 -741 -540 -354 66 128 205 497 579 594 708 644 717 534 -129 -498 24 297 37 -406
1719 -406 -586 -344 -166 -104 -431 -289 -249 -287 -353 -282 -518 -563 -601 -141 445 858 592 166 583 1432 1912 1325
1741 1325 580 205 395 371 -691 -1263 -1848 -1863 -1860 -1986 -1536 -1277 -1200 -282 684 1738 1995 1664 1566 1922 2823
1762 2823 2223 845 -68 -387 -540 -1166 -1911 -2487 -1922 -1872 -1307 -1262 -887 -477 -2 706 1284 1716 1352 920
1782 920 734 1335 1717 712 -177 -329 278 648 -124 -1007 -724 -177 -107 -484 -1266 -1366 -1146 -890 -695 -596
1802 -596 -317 -472 -58 602 1446 1646 1067 1076 1850 2147 1461 273 -630 -334 117 -447 -1666 -2382 -2106 -1217
1822 -1217 -912 -879 -865 -408 278 925 1209 1546 1321 899 992 1324 1165 147 -898 -841 -267 57 -768 -1628
$$ packed form
1677a336j68o7M45M79K80O7L20K96Q04J06K29k78l78j28k23j28j34m71n34l02
1697a121L8K24p2J90K01J86M20O2P7K92Q2J5J14o4P3j83o63l69N22K73k60m43
1719d06j80K42J78O2l27J42M0l8o6P1k36m5l8M60N86M13k66m26M17Q49M80n87
1741A325p45l75J90k4j062n72n85j5Lj26M50K59P7R18R66J054K57l31r8L56R01
1762B823o00j378r13l19j53o26p45n76N65N0N65M5L75M10M75P08N78M32l64m32
1782I20j86O01L82j005q89j52O07L70p72q83K83N47P0l77p82j00K20K56J95R9
1802e96K79j55M14O60Q44K00n79RP74K97o86j188r03K96M51n64j219p16K76Q89
1822a217L05L3J4M57O86O47K84L37k25m22R3L32j59j018j045N7N74L24q25q60
$$ plain form
1842 -1628 -1522 -655 -162 -166 -563 -341 348 556 849 921 1161 980 849 833 1078 524 -156 -649 -738 -454 -690
1863 -690 -1450 -1945 -1430 -972 -747 -766 -498 472 1174 1365 1251 1630 2027 1909 1496 795 535 64 -590 -1093
1883 -1093 -1185 -1491 -1516 -1488 -1396 -739 -466 -669 -416 292 1055 925 370 -27 378 926 1027 413 55 279 696
1904 696 945 565 482 289 43 257 0 -505 -1289 -1953 -2118 -1323 -984 -1414 -1619 -1060 518 1552 1962 1601
1924 1601 1668 2208 2614 1927 1003 -145 -906 -1258 -1590 -1863 -2280 -2557 -2428 -1275 71 737 828 1130 1892
1943 1892 2775 2854 2119 821 132 -89 -448 -1052 -1912 -2386 -2210 -1896 -1119 -455 -162 96 674 1402 1946 1831
1963 1831 1030 543 224 301 -14 -539 -861 -875 -537 72 132 397 581 840 629 626 481 -31 -1002 -1405 -1690
1984 -1690 -1631 -1473 -1609 -1385 -850 300 1224 1778 2259 2726 2653 2527 2241 1802 558 -789 -1744 -2203 -2429
$$ packed form
1842a628J06Q67M93ml97K22O89K08K93P2K40j81j31j6K45n54o80m93q9K84k36
1863f90p60m95N15M58K25j9K68R70P02J91j14L79L97j18m13p01k60m71o54n03
1883a093r2l06k5K8R2O57K73k03K53P08P63j30n55l97M05N48J01o14l58K24M17
1904F96K49l80q3j93k46K14k57n05p84o64j65P95L39m30k05N59J578J034M10l61
1924A601O7N40M06o87r24j148p61l52l32k73m17k77J29J153J346O66R1L02P62
1943A892Q83P9p35j298o89k21l59o04q60m74J76L14P77O64K93K58N78P28N44j15
1963A831q01m87l19P7l15n25l22j4L38O09O0K65J84K59k11lj45n12r71m03k85
1984a690N9J58j36K24N35J150R24N54M81M67p3j26k86m39j244j347r55m59k26
$$ plain form
2003 -2429 -2663 -3081 -3155 -2432 -1079 14 630 1073 1417 2113 2493 2706 1864 924 237 57 -296 -606 -1291
2022 -1291 -1640 -1572 -1047 -308 53 -83 -125 306 1008 1079 472 -260 -574 -497 -146 -213 -810 -1046 -778 8 685
2043 685 1158 1058 559 703 830 925 619 -491 -1144 -1277 -950 -856 -1174 -1435 -1019 -119 750 1347 1294 1370 1318
2064 1318 1441 1418 923 476 -618 -1107 -1436 -1429 -1488 -1729 -1852 -1533 -491 304 536 854 967 1437 1740 1745 1524
2085 1524 1027 531 142 -65 105 -320 -968 -1152 -1276 -915 -314 -459 -711 -962 -503 335 307 107 -39 -39 392
2106 392 734 1219 785 560 589 642 1125 1017 366 -576 -714 -453 -402 -643 -1560 -1593 -1362 -523 -110 -120 -173 -32
2128 -32 668 1381 1756 1222 639 453 788 917 455 -393 -1025 -923 -384 -165 -618 -1053 -1252 -539 160 422
2148 422 268 -208 -51 391 862 1103 614 85 -115 412 652 335 -557 -762 -516 -113 47 -447 -779 -865
$$ packed form
2003b429k34m18p4P23J353J093O16M43L44O96L80K13q42r40o87j80l53l10o85
2022a291l49O8N25P39L61j36m2M31P02P1o07p32l14P7L51o7n97k36K68P86O77
2043F85M73j00m99J44J27R5l06j110o53j33L27R4l18k61M16R00Q69N97n3P6n2
2064A318J23k3m95m47j094m89l29Pn9k41j23L19J042P95K32L18J13M70L03Nk21
2085A524m97m96l89k07J70m25o48j84j24L61O01j45k52k51M59Q38k8k00j46%M31
2106C92L42M85m34k25K9N3M83j08o51r42j38K61N1k41r17l3K31Q39M13j0n3J41
2128c2P00P13L75n34n83j86L35J29m62q48o32J02N39K19m53m35j99P13O99K62
2148D22j54m76J57M42M71K41m89n29k00N27K40l17q92k05K46M03J60m94l32q6
$$ plain form
2168 -865 -604 -108 190 -11 58 207 493 1030 1094 868 405 205 422 421 48 -528 -764 -927 -769 -549 -421
2189 -421 -913 -886 -491 63 369 685 578 259 563 804 1057 841 331 -12 146 370 325 -87 -600 -848 -710
2210 -710 -443 -470 -565 -681 -836 -478 137 313 326 146 208 828 1048 1158 606 193 224 400 261 -17 -520 -1111
2232 -1111 -745 -513 -189 -389 -646 -772 -138 561 849 440 -66 19 385 723 546 201 -501 -391 81 271
2252 271 221 -252 -346 -206 265 466 385 -195 -509 -285 155 196 -278 -683 -584 -184 473 674 324 155 249 693
2274 693 1032 792 39 -394 -495 -400 -232 -611 -1098 -1256 -736 24 503 431 353 505 1048 1389 1459 981 283
2295 283 -168 -206 -266 -314 -1220 -1664 -1335 -966 -308 -105 -390 -109 327 981 1554 1144 562 420 351 227 232 -139
2317 -139 -619 -760 -362 70 299 48 -66 -11 299 608 422 -116 -416 -704 -510 -407 -586 -794 -843 -385 170
$$ packed form
2168h65K61M96K98k01O9J49K86N37O4k26m63k00K17jl73n76k36j63J58K20J28
2189d21m92K7L95N54L06L16j07l19L04K41K53k16n10l43J58K24m5m12n13k48J38
2210g10K67k7r5j16j55L58O15J76J3j80O2O20K20J10n52m13L1J76j39k78n03n91
2232a111L66K32L24k00k57j26O34O99K88m09n06Q5L66L38j77l45p02J10M72J90
2252B71n0m73r4J40M71K01q1n80l14K24M40M1m74m05R9M00O57K01l50j69R4M44
2274F93L39k40p53m33j01R5J68l79m87j58N20P60M79p2p8J52N43L41P0m78o98
2295B83m51l8o0m8r06m44L29L69O58K03k85K81M36O54N73m10n82j42o9j24Nl71
2317a39m80j41L98M32K29k51j14N5L10L09j86n38l00k88J94J03j79k08m9M58N55
$$ plain form
2338 170 652 935 876 914 1165 1331 1365 761 87 -534 -710 -811 -1076 -1530 -1578 -1306 -938 -86 138 386 830
2359 830 720 1320 1435 1468 981 229 -254 -277 -515 -644 -1146 -1388 -1081 -544 -38 235 308 509 654 1009 1255
2380 1255 832 365 -156 -60 46 -135 -608 -1111 -1113 -361 -81 63 123 -327 52 261 437 408 20 -539 -503 -125
2402 -125 161 104 -282 -284 131 854 1251 962 358 372 714 889 481 -509 -1314 -1497 -1220 -911 -1154 -1441 -1389 -729
2424 -729 50 765 941 870 889 1545 2154 1796 1111 347 39 103 -22 -478 -935 -1429 -1513 -911 -611 -550 -652 -536
2446 -536 -329 90 599 548 225 230 489 785 852 373 242 414 440 651 242 62 -50 -222 -331 -350 -504 -402
2468 -402 -873 -756 -563 -150 -228 -265 84 334 622 663 697 585 468 376 315 221 145 -179 -606 -701 -551 -312 -76
2491 -76 -423 -479 -258 48 328 238 181 286 506 432 539 486 162 -52 20 43 252 -76 -708 -684 -508 -155 -230
$$ packed form
2338A70M82K83n9L8K51J66L4o04o74o21j76j01k65m54m8K72L68Q52K24K48M44
2359H30j10O00J15L3m87p52m83k3k38j29n02k42L07N37N06K73P3K01J45L55K46
2380A255m23m67n21R6J06j81m73n03kP52K80J44O0m50L79K09J76k9l88n59L6L78
2402a25K86n7l86kM15P23L97k89o04J4L42J75m08r90q05j83K77L09k43k87N2O60
2424g29P79P15J76p1J9O56O09l58o85p64l08O4j25m56m57m94q4O02L00O1j02J16
2446e36K07M19N09n1l23NK59K96O7m79j31J72K6K11m09j80j12j72j09j9j54J02
2468d02m71J17J93M13p8l7L49K50K88M1L4j12j17r2o1r4p6l24m27r5J50K39K36
2491g6l47n6K21L06K80r0n7J05K20p4J07n3l24k14P2K3K09l28o32K4J76L53p5
$$ plain form
2514 -230 -777 -848 -531 37 198 36 128 89 523 843 1053 637 232 89 526 507 345 -376 -753 -672 -295 -77
2536 -77 -204 -828 -1058 -552 -105 72 -38 -331 -248 158 410 359 173 16 -16 472 800 753 272 -2 213 395
2558 395 388 85 -273 -497 -356 -300 -418 -687 -626 -534 -339 -113 172 150 206 214 509 776 614 172 69 44 326
2581 326 348 46 -111 -162 -71 -66 -31 -72 93 80 146 48 30 -192 -291 -445 -416 -186 -154 -231 -183 -29 233 342 480
2606 480 633 613 259 327 143 251 95 -396 -402 -469 -407 -197 -394 -440 -215 58 329 372 -6 72 1 157 291
2629 291 23 -286 -417 -539 -141 101 -29 50 104 174 571 680 490 91 19 94 109 -325 -580 -841 -667 -548
2651 -548 -193 -94 -270 -22 254 640 956 920 503 244 281 305 -76 -482 -884 -688 -570 -355 -416 -203 -72 174
2673 174 454 676 709 384 387 405 309 69 -285 -418 -694 -597 -387 -232 -216 -165 149 443 494 630 492 127 149
$$ packed form
2514b30n47p1L17N68J61j62R2l9M34L20K10m16m05j43M37j9j62p21l77Q1L77K18
2536g7j27o24k30N06M47J77j10k93Q3M06K52n1j86j57l2M88L28m7m81k74K15J82
2558C95pl03l58k24J41N6j18k69O1R2J95K26K85k2N6QK95K67j62m42j03k5K82
2581C26K2l02j57n1R1NL5m1J65j3O6r8j8k22r9j54K9K30L2p7M8J54K62J09J38
2606D80J53k0l54O8j84J08j56m91oo7O2K10j97m6K25K73K71M3l78P8p1J56J34
2629B91k68l09j31j22L98K42j30P9N4P0L97J09j90l99p2P5J5m34k55k61J74J19
2651e48L55R9j76K48K76L86L16l6m17k59L7K4l81m06m02J96J18K15o1K13J31K46
2673A74K80K22L3l25LJ8r6k40l54j33k76R7K10J55J6N1L14K94N1J36j38l65K2
$$ plain form
2696 149 185 -172 -266 -359 -599 -585 -267 -124 9 177 392 492 624 585 525 144 -17 -246 -404 -454 -719 -808 -720
2719 -720 -401 -106 66 364 406 570 881 1036 834 693 433 98 -74 -431 -431 -600 -878 -706 -632 -322 -224 -108
2741 -108 24 586 748 691 592 405 217 48 59 -198 -346 -505 -492 -361 -127 148 -16 216 285 314 493 405
2763 405 217 66 76 -16 -183 -493 -410 -413 -484 -177 30 -80 193 294 325 373 208 87 27 -214 -219 -261 -331 -346 -324
2788 -324 -18 -21 118 274 297 317 456 513 139 136 -180 -129 -442 -565 -521 -534 -279 -308 -330 -188 196 250 336 338 485
2813 485 575 598 296 243 126 -36 -64 -216 -179 -431 -314 -272 -265 -280 -278 -139 -270 -276 -74 -22 -131 -79 60 296 307
2838 307 274 344 271 367 376 482 199 76 -45 -18 -69 -81 -319 -296 -406 -321 -134 -252 -276 -152 -65 126 179 -29 -33
2863 -33 -70 126 39 56 30 -124 232 65 244 277 222 299 245 228 115 9 -23 -245 -204 -327 -323 -268 -391 -173 -269
$$ packed form
2696A49L6l57r4r3k40J4L18J43J33J68K15J00J32l9o0l81j61k29j58n0k65q9Q8
2719g20L19K95J72K98M2J64L11J55k02j41k60l35j72l57%j69k78J72P4L10R8J16
2741a08J32N62J62n7r9j87j88j69J1k57j48j59J3J31K34K75j64K32O9K9J79q8
2763D05j88j51J0r2j67l10Q3lp1L07K07j10K73J01L1M8j65j21o0k41nm2p0j5K2
2788c24L06lJ39J56K3K0J39N7l74ll16N1l13j23M4j3K55k9k2J42L84N4Q6KJ47
2813D85R0K3l02n3j17j62k8j52L7k52J17M2Pj5KJ39j31oK02N2j09N2J39K36J1
2838C07l3P0p3R6RJ06k83j23j21K7n1j2k38K3j10Q5J87j18k4J24Q7J91N3k08m
2863c3l7J96q7J7k6j54L56j67J79L3n5P7n4j7j13j06l2k22M1j23MN5j23K18r6
$$ plain form
2888 -269 -146 -63 167 74 192 192 109 91 181 123 209 9 -48 12 68 174 272 1 80 147 126 147 102 -104 -216 -231
2914 -231 -277 -409 -590 -271 -66 -197 -245 -77 -114 127 218 395 246 262 192 169 49 -107 -8 -177 -185 -122 88 14
2938 14 190 78 48 193 208 204 -38 -158 43 95 -222 -198 -380 -248 -396 -279 -12 -47 104 255 117 402 395
2961 395 370 350 223 280 35 110 -235 -93 -211 4 -127 -41 82 -81 -27 -152 -24 -193 -128 -222 -440 -483 -260
2984 -260 -224 -41 -36 96 173 337 304 692 398 377 377 326 101 -88 -87 -294 -273 -262 -256 -276 -277 -211 -160 -108 61 148 104 24
3012 24 124 -56 60 76 8 -15 44 -50 -11 22 120 106 251 158 89 -55 92 59 28 -144 -149 -345 -227 -246 -102 -248
3038 -248 8 79 -135 -25 180 5 -181 -185 68 183 9 123 -18 -98 -76 119 134 123 187 149 116 120 114 6 -7
3063 -7 -116 -163 -61 -297 -454 -355 -207 -339 -221 -81 59 37 211 324 528 504 344 161 125 46 153 -44 -244
$$ packed form
2888b69J23Q3K30r3J18%q3j8R0n8Q6k00n7O0N6J06R8k71P9O7k1K1m5k06j12j5
2914b31m6j32j81L19K05j31m8J68l7K41R1J77j49J6p0k3j20j56R9j69qO3K10p4
2938A4J76j12l0J45J5mk42j20K01N2l17K4j82J32j48J17K67l5J51J51j38K85p
2961C95k5k0j27N7k45P5l45J42j18K15j31Q6J23j63N4j25J28j69O5r4k18m3K23
2984b60L6J83NJ32P7J64l3L88k94k1%n1k25j89Jk07K1J1Ok0jO6N1N2J69Q7m4q0
3012B4J00j80J16J6o8k3N9r4L9L3R8j4J45r3o9j44J47l3l1j72nj96J18j9J44j46
3038b48K56P1k14J10K05j75j86mK53J15j74J14j41q0K2J95J5j1O4l8l3Moj08j3
3063gj09m7J02k36j57R9J48j32J18J40J40k2J74J13K04k4j60j83l6p9J07j97k00
$$ plain form
3086 -244 -55 -62 -63 -121 -234 -235 -185 -40 4 87 -133 -48 -20 52 144 35 126 57 90 264 129 158 123 -40 81 117 87
3113 87 51 -19 -322 -87 -83 -190 -276 -313 38 139 76 120 30 62 237 133 267 49 -54 -115 -63 124 -99 -151 -66
3138 -66 -38 -79 -22 111 122 -22 69 32 114 23 -34 232 -3 -8 76 -145 -82 -88 -188 -362 -201 -48 -195 -219 -79 84
$$ packed form
3086b44J89pjn8j13jN0J45M4Q3k20Q5K8P2R2j09R1o9L3J74j35K9l5j63J21L6l0
3113H7l6p0l03K35Mj07q6l7L51J01o3M4r0L2J75j04J34k18j03o1N2J87k23n2Q5
3138f6K8m1N7J33J1j44R1l7Q2r1n7K66k35nQ4k21O3oj00j74J61J53j47k4J40J63
$$ [...]
8191A01
##END NTUPLES=NMR FID
##END=
