##TITLE=1H_X1312
 CDCl3
 8 sc, 
 14.12.2021
##JCAMPDX= 6.0         $$ Bruker NMR JCAMP-DX V2.0
##DATA TYPE= NMR FID
##DATA CLASS= NTUPLES
##ORIGIN= UXNMR, Bruker Analytische Messtechnik GmbH
##OWNER= root
$$ XWIN-NMR		Version 3.5
$$ Tue Dec 14 12:15:34 2021 Russian Standard Time (UT+4h)  she@DPX200
##.OBSERVE FREQUENCY= 200.131346
##.OBSERVE NUCLEUS= ^1H
##.DELAY= (6, 6)
##.ACQUISITION MODE= SIMULTANEOUS
##.ACQUISITION SCHEME= undefined
##.AVERAGES= 8
##.DIGITISER RES= 18
##SPECTROMETER/DATA SYSTEM= spect
##.PULSE SEQUENCE= zg30
##.SOLVENT NAME= CDCl3
##.SHIFT REFERENCE= (INTERNAL, CDCl3, 0, 15.7039)
##AUDIT TRAIL= $$ (NUMBER, WHEN, WHO, WHERE, WHAT)
$$ ##TITLE= Audit trail, XWIN-NMR		Version 3.5
$$ ##JCAMPDX= 5.01
$$ ##ORIGIN= Bruker BioSpin GmbH
$$ ##OWNER= she
$$ F:/spectra/data/she/nmr/H-F/1/audita.txt
$$ ##AUDIT TRAIL=  $$ (NUMBER, WHEN, WHO, WHERE, WHAT)
(   1,<2021-12-14 12:14:04.53 +0400>,<she>,<DPX200>,
      <created by zg, POWCHK disabled, PULCHK disabled
       configuration hash MD5:
       00 E9 B6 7A A2 85 ED C7 34 08 36 98 17 FE 4E 26
       data hash MD5: 16K
       3F 6C CA 6F A9 DB 1E AE 7C 38 6A 67 39 B4 9E 9F>)
$$ ##END=
$$ 
$$ hash MD5
$$ 7C 24 88 7B D2 00 C5 21 8D 92 E5 6B 2F 5C A9 41
##$RELAX= 
##$RELAX= 
##$RELAX= 
##$RELAX= 
##$RELAX= 
##$RELAX= 
$$ Bruker specific parameters
$$ --------------------------
##$DU= <F:/spectra>
##$EXPNO= 1
##$NAME= <H-F>
##$PROCNO= 1
##$TYPE= <nmr>
##$USER= <she>
##$AMP= (0..31)
100 100 100 100 100 100 100 100 100 100 100 100 100 100 100 100 100 100 
100 100 100 100 100 100 100 100 100 100 100 100 100 100 
##$AQSEQ= 0
##$AQ_mod= 1
##$AUNM= <au_zg>
##$AUTOPOS= <>
##$BF1= 200.13
##$BF2= 200.13
##$BF3= 200.13
##$BF4= 200.13
##$BF5= 200.13
##$BF6= 200.13
##$BF7= 200.13
##$BF8= 200.13
##$BYTORDA= 1
##$CFDGTYP= 0
##$CFRGTYP= 5
##$CHEMSTR= <none>
##$CNST= (0..31)
1 1 145 1 1 1 1 1 1 1 1 1 1 1 1 1 1 1 1 1 1 1 1 1 1 1 1 1 1 1 1 1 
##$CPDPRG= <>
##$CPDPRG1= <>
##$CPDPRG2= <>
##$CPDPRG3= <>
##$CPDPRG4= <mlev>
##$CPDPRG5= <mlev>
##$CPDPRG6= <mlev>
##$CPDPRG7= <mlev>
##$CPDPRG8= <mlev>
##$CPDPRGB= <>
##$CPDPRGT= <>
##$D= (0..31)
0 1.2 0 0 0 0 0 0 0 0.06 0 0.03 0 0 0 0 0.0002 0 0 0 0 0 0 0 0 0 0 0 0 
0 0 0 
##$DATE= 1639469643
##$DBL= (0..7)
120 120 120 120 120 120 120 120 
##$DBP= (0..7)
150 150 150 150 150 150 150 150 
##$DBP07= 0
##$DBPNAM0= <>
##$DBPNAM1= <>
##$DBPNAM2= <>
##$DBPNAM3= <>
##$DBPNAM4= <>
##$DBPNAM5= <>
##$DBPNAM6= <>
##$DBPNAM7= <>
##$DBPOAL= (0..7)
0.5 0.5 0.5 0.5 0.5 0.5 0.5 0.5 
##$DBPOFFS= (0..7)
0 0 0 0 0 0 0 0 
##$DE= 6
##$DECBNUC= <off>
##$DECIM= 32
##$DECNUC= <off>
##$DECSTAT= 4
##$DIGMOD= 1
##$DIGTYP= 9
##$DL= (0..7)
0 120 120 120 120 120 120 120 
##$DP= (0..7)
150 150 150 150 150 150 150 150 
##$DP07= 0
##$DPNAME0= <>
##$DPNAME1= <>
##$DPNAME2= <>
##$DPNAME3= <>
##$DPNAME4= <>
##$DPNAME5= <>
##$DPNAME6= <>
##$DPNAME7= <>
##$DPOAL= (0..7)
0.5 0.5 0.5 0.5 0.5 0.5 0.5 0.5 
##$DPOFFS= (0..7)
0 0 0 0 0 0 0 0 
##$DQDMODE= 0
##$DR= 18
##$DS= 0
##$DSLIST= <SSSSSSSSSSSSSSS>
$$ [...]
##$SUBNAM2= <"">
##$SUBNAM3= <"">
##$SUBNAM4= <"">
##$SUBNAM5= <"">
##$SUBNAM6= <"">
##$SUBNAM7= <"">
##$SUBNAM8= <"">
##$SUBNAM9= <"">
##$SW= 18.0517287032376
##$SWIBOX= (0..15)
0 0 2 0 0 0 0 0 0 0 0 0 0 0 0 0 
##$SW_h= 3612.71676300578
##$TD= 16384
##$TD0= 1
##$TE= 0
##$TE2= 300
##$TE3= 300
##$TEG= 300
##$TL= (0..7)
0 120 120 120 120 120 120 120 
##$TP= (0..7)
150 150 150 150 150 150 150 150 
##$TP07= 0
##$TPNAME0= <>
##$TPNAME1= <>
##$TPNAME2= <>
##$TPNAME3= <>
##$TPNAME4= <>
##$TPNAME5= <>
##$TPNAME6= <>
##$TPNAME7= <>
##$TPOAL= (0..7)
0.5 0.5 0.5 0.5 0.5 0.5 0.5 0.5 
##$TPOFFS= (0..7)
0 0 0 0 0 0 0 0 
##$TUNHIN= 0
##$TUNHOUT= 0
##$TUNXOUT= 0
##$USERA1= <user>
##$USERA2= <user>
##$USERA3= <user>
##$USERA4= <user>
##$USERA5= <user>
##$V9= 5
##$VALIST= <valist>
##$VCLIST= <CCCCCCCCCCCCCCC>
##$VD= 0
##$VDLIST= <DDDDDDDDDDDDDDD>
##$VPLIST= <PPPPPPPPPPPPPPP>
##$VTLIST= <TTTTTTTTTTTTTTT>
##$WBST= 1024
##$WBSW= 4
##$XGAIN= (0..3)
0 0 0 0 
##$XL= 0
##$YL= 0
##$YMAX_a= 42871
##$YMIN_a= -64787
##$ZGOPTNS= <>
##$ZL1= 120
##$ZL2= 120
##$ZL3= 120
##$ZL4= 120
##$ABSF1= 10
##$ABSF2= 0
##$ABSG= 5
##$ABSL= 3
##$ALPHA= 0
##$AQORDER= 0
##$ASSFAC= 0
##$ASSFACI= 0
##$ASSFACX= 0
##$ASSWID= 0
##$AUNMP= <proc_1d>
##$AZFE= 0.1
##$AZFW= 0.1
##$BCFW= 1
##$BC_mod= 2
##$BYTORDP= 1
##$COROFFS= 0
##$CY= 11.3945322036743
##$DATMOD= 1
##$DC= 2
##$DFILT= <>
##$DTYPP= 0
##$F1P= 2.36226072786647
##$F2P= -0.459571619588291
##$FCOR= 0.5
##$FTSIZE= 0
##$FT_mod= 4
##$GAMMA= 1
##$GB= 0.15
##$INTBC= 1
##$INTSCL= 1
##$ISEN= 128
##$LB= 0.24
##$LEV0= 0
##$LPBIN= 0
##$MAXI= 10000
##$MC2= 0
##$MEAN= 0
##$ME_mod= 0
##$MI= 1.114404
##$NCOEF= 0
##$NC_proc= 0
##$NLEV= 6
##$NOISF1= 3.799351
##$NOISF2= 2.8
##$NSP= 1
##$NTH_PI= 0
##$NZP= 0
##$OFFSET= 15.70392
##$PC= 1
##$PHC0= -16031.55
##$PHC1= 14.6008
##$PH_mod= 1
##$PKNL= yes
##$PPARMOD= 0
##$PSCAL= 0
##$PSIGN= 0
##$REVERSE= no
##$SF= 200.130013532006
##$SI= 16384
##$SIGF1= 3
##$SIGF2= 2
##$SINO= 400
##$SIOLD= 16384
##$SREGLST= <1H.CDCl3>
##$SSB= 0
##$STSI= 0
##$STSR= 0
##$SW_p= 3612.71676300578
##$SYMM= 0
##$S_DEV= 0
##$TDeff= 0
##$TDoff= 0
##$TI= <>
##$TILT= no
##$TM1= 0
##$TM2= 0
##$TOPLEV= 0
##$USERP1= <user>
##$USERP2= <user>
##$USERP3= <user>
##$USERP4= <user>
##$USERP5= <user>
##$WDW= 1
##$XDIM= 8192
##$YMAX_p= 0
##$YMIN_p= 0
$$ End of Bruker specific parameters
$$ ---------------------------------
##NTUPLES= NMR FID
##VAR_NAME=  TIME,          FID/REAL,        FID/IMAG
##SYMBOL=    X,             R,               I
##VAR_TYPE=  INDEPENDENT,   DEPENDENT,       DEPENDENT
##VAR_FORM=  AFFN,          ASDF,            ASDF
##VAR_DIM=   8192,          8192,            8192
##UNITS=     SECONDS,       ARBITRARY UNITS, ARBITRARY UNITS
##FACTOR=    0.0002768,     1,               1
##FIRST=     0,             0,               0
##LAST=      2.2672688,     0,               0
##MIN=       0,             -64787,          0
##MAX=       2.2672688,     42871,           0
$$ Real data points
##PAGE= N=1
##DATA TABLE= (X++(R..R)), XYDATA
0@%%%%%%%%%%%%%%%%%qJ6j6J6j6J6k4L2l2L9m7M8n6O4p2Q8j00J08j20J36j53J75
39I4j98K18k42K71l01L33l67M05m47M92n43N98o57P25q01Q83r75J081j203J344
59G10j509J707j947K244k629L147l887N033p076J1830m4555k3228O0667J0209
73A0716j5206k2840J7445L0871K1885n004r480q615l140n877R78k55j0609k2738
87b1869j1944J1163K2198J264j9205j1722J7260K6931N830j8461j1408J0008J6477
100A6522m52j4858p655P400P947j394n658j07K290l171m372L082N299m047j4507
115a3681p876J0263J3475k312j3437k366J7299J7130j872j2089j573J2631Q236
128B3828r297j4685m403K768k172r742n873L911M404j251r75P235J1282L689l089
$$ plain form
0 0 0 0 0 0 0 0 0 0 0 0 0 0 0 0 0 0 0 -8 8 -8 8 -8 8 -16 16 -16 23 -24 24 -32 32 -40 48 -52 56 -64 72 -81 94
39 94 -104 114 -128 143 -158 175 -192 213 -234 258 -285 313 -344 381 -420 463 -512 569 -634 710
59 710 -799 908 -1039 1205 -1424 1723 -2164 2869 -4207 7623 -36932 -60160 507 10716
73 10716 -4490 -27330 -9885 20986 42871 37867 28387 19772 16632 10755 11733 11478 869 -21869
87 -21869 -33813 -22650 -452 812 -18393 -30115 -12855 14076 19906 1445 -9963 45 16522
100 16522 16070 1212 -6443 957 8904 7510 1852 1745 4035 864 -3508 -426 4873 826 -13681
115 -13681 -21557 -11294 2181 -131 -13568 -15934 1365 18495 16623 4534 2961 15592 23828
128 23828 14531 -154 -4557 -1789 -3961 -13703 -19576 -15665 -11261 -12512 -13487 -6252 5030 8719 5630
143E630K684J0168N189r204j3516p99R286P44j4796j5376J634J3209M522q741
157i366p752N659J3394O054l489l253J504K754M62P20K629j938q729o336M606
172c081J1010J354j2930j0822N491J4418M024j2073j1692L505J2561O103n803
185B065p779M25N735M680K032j37k229m717k615M680O242k125j0908q047N158
200g540J1208J361j0277q405N110J2714N040o012o760J024O430L378j633k460
214C178k140k406j257J635L517r06o375l881M371Q069J521p479n547M329Q675
229E304K605n832n544J735M637J005k781k082Q85J28j962p85J601J558j659k847
245d034J178M276J842k618k695J912M482P13l134k299J188J840j932l577l07K589
$$ plain form
143 5630 8314 18482 23671 14467 951 152 9438 10182 -4614 -19990 -18356 -5147 -625 -9366
157 -9366 -17118 -11459 1935 7989 4500 1247 2751 5505 5967 6687 9316 7378 -1351 -7687 -3081
172 -3081 7929 9283 -3647 -14469 -8978 5440 9464 -2609 -14301 -10796 1765 7868 2065
185 2065 -5714 -5289 446 5126 7158 7021 4792 75 -2540 2140 8382 6257 -4651 -12698 -7540
200 -7540 3668 5029 -5248 -13653 -8543 4171 9211 3199 -3561 -2537 3893 7271 5638 3178
214 3178 1038 -1368 -2625 -990 2527 1621 -4754 -8635 -4264 3805 5326 -2153 -7700 -3371 5304
229 5304 7909 2077 -3467 -1732 2905 3910 1129 -953 -68 60 -1902 -2687 -1086 472 -1187 -4034
245 -4034 -2856 1420 3262 644 -2051 -139 4343 5056 1922 -377 811 2651 719 -2858 -3165 -576
261e76R45k921l117J470M096J681j466j507J554K705M27j011m61J52k51j072k14
278D34J103p66k871k210J535M104Q88l719l263J208M649K454k515l153K7K642
294E47K120p11j756r30QJ229J468M04j341k881j137K290L213K28l580l381J136
311c074L932K227j718l290l78K635K086p6k068j700K16J105J356J62j755k095
327b435o48J732K905M71k112k037M74K802J937p17k015r50J045J523q2j471j578
344a156q68P29Q80K76p18j556n64J155K009J453m90j210o2J127J531M66j151j364
362D87o04K60N21o77j381j130k11J108J263K07m84o61M91J853J507K72j103j545
380A73k66P30O45n06j745j271K63J227Q83m46j133L3J304J627M90j079j194l98
$$ plain form
261 -576 369 -2552 -5669 -4199 -103 1578 112 -1395 159 2864 3291 2280 1819 1971 1720 648 434
278 434 1537 771 -2100 -4310 -2775 1329 2217 -1502 -4765 -3557 1092 3546 1031 -2122 -2095 547
294 547 2667 1956 200 -730 -722 507 1975 2379 1038 -1843 -2980 -690 2523 2751 -829 -4210 -3074
311 -3074 858 3085 1367 -1923 -2301 334 2420 2344 276 -1424 -1208 -103 1253 1415 -340 -2435
327 -2435 -3083 -1351 1554 2025 -87 -2124 -1650 1152 3089 2372 357 -593 452 1975 1893 422 -1156
344 -1156 -2024 -1295 -415 -139 -857 -2413 -2977 -1822 187 1640 1150 -60 -122 1005 2536 3002 1851 487
362 487 -117 143 664 -13 -1394 -2524 -2735 -1627 -364 -157 -641 -1302 -811 1042 2549 2821 1718 173
380 173 -93 637 1282 776 -969 -2240 -1977 -750 133 -313 -1446 -1413 -109 1518 2008 929 -265 -663
398f63O19J087J42r05j303o31R78J544M58p74j165J09J312O29p07j551r49O89
416a081Q78R0n96p89O3Q70J212J011K78p07n28m1O35L00j126j524q23K73O18j65
436a152o95J05Q11J405R20J86K16j80k46N5M2k01r57j710j015R5O31L93n27k59
456b083P50J198J118L57q6J86K90K63R7n87p92j002o70M11N63j97q30r61L46J274
476c55O32k11q73l14O56N87P8l69m81K89P87P13M59l16n59j5M38N66j23j334j199
497i44n91L41M22n17o68j90N22J214O32J15J24K81P57N75j08n36q56o13n5r7j32
518c24n06p79j60L29O27O65J64j8L10M67N59K9l98k31j08m0j19n34m76l08l04
539a155P3K21K76J06n28j97O07Q81O84k48n24L15O94L81k42q30k00J89j03j86
$$ plain form
398 -663 -44 1043 1185 280 -1023 -1654 -676 868 1326 552 -613 -504 808 1437 730 -821 -1770 -1081
416 -1081 -203 -113 -709 -1498 -1435 -565 647 1658 1936 1229 701 660 1295 1595 469 -1055 -1878 -1605 -987 -1152
436 -1152 -1847 -1742 -931 474 1394 1580 1796 1616 1370 1425 1467 1266 309 -1401 -2416 -2321 -1690 -1297 -1824 -2083
456 -2083 -1333 -135 983 1340 1254 1440 1730 1993 2090 1503 711 -291 -961 -550 13 -184 -1014 -1975 -1629 -355
476 -355 277 66 -807 -1121 -465 122 200 -169 -650 -361 426 1139 1598 1282 723 708 1146 1712 1589 255 -944
497 -944 -1535 -1194 -772 -1289 -1957 -2147 -1625 -411 221 336 460 741 1498 2073 1965 1429 573 -40 -95 -192 -324
518 -324 -830 -1609 -1769 -1440 -813 -148 16 -2 308 775 1334 1363 965 734 626 586 467 -67 -543 -851 -1155
539 -1155 -1082 -861 -585 -479 -1007 -1204 -597 284 968 720 196 511 1205 1586 1344 514 314 503 400 214
559B14o29n85k50j82L60O48R1m40m72M94J510P16n47q74o5J198N02q06j085l10
579e12N89N36n16o36m04P9K63K02L29J22n44m61M17J045N72p52r46N58J261O50
599A852j071j417K44J207L64j082j333j29P08J13l18j33K25L80O7L82Q13K78m09
618G41m28L96J055j95j754j266N32J469J17j725j081Q10J737N60j049n98P81R47
636A049J27o57n73k5j89k92J57M36k22j056m39J374J753pj545q46J485J751m28
655A853j939j268R45J552n16j530p98N59R42J64j67K10L7m26n0P44R20n10j644
674i22m49J389J489o27k037m74J953J851n08k075o40J362J164n64j327o44N55
691e04K11m95j8K71J12m28m3J389R22p10j375n9J841J209j528k196r7J843J197
$$ plain form
559 214 -415 -1000 -1250 -1432 -1072 -424 -333 -773 -1245 -751 759 1475 928 54 -11 1187 1689 883 -202 -512
579 -512 77 613 97 -539 -943 -864 -601 -399 -70 52 -492 -953 -536 509 1081 329 -617 -59 1202 1852
599 1852 781 -636 -392 815 1179 97 -1236 -1365 -657 -544 -862 -995 -770 -390 -323 59 872 1150 741
618 741 313 709 1764 1569 -185 -1451 -919 550 667 -1058 -2139 -1329 408 968 -81 -679 102 1049
636 1049 1176 519 -54 -79 -268 -560 -403 33 -189 -1245 -1684 -310 1443 1436 -109 -955 530 2281 1853
655 1853 -86 -1354 -409 1143 627 -903 -1701 -1142 -200 -36 -203 7 44 -382 -432 312 1232 722 -922
674 -922 -1371 18 1507 880 -1157 -1631 322 2173 1665 -410 -1050 312 1476 912 -415 -1059 -504
691 -504 -293 -788 -806 -535 -423 -851 -894 495 1417 707 -668 -727 1114 2323 795 -1401 -1498 345 1542
710A542j296j871K39J693J033p66j097K38O93K09j96j90l3o32r10M17J269M70
728H12j435j548R03K443Q19j702j858O56K600Q38j764j844P4J602P07q83j011
745e91k38K67J70K37O07n8j226o62R91J805K03k070j562J270K465O46k143k022
763a911P72K318P33j344j587J50J067L90k92l37k30l92k13P74J239l92j537r28
781a720J296K144k4k178j444J053K352J94j856j296P46J494L00j096n71K82L63
798C9L8o7K95Mq20m26P86J232j24j523p64J147J491k14j658q49J300J354m51j361
818e71n54J106R39n29p62p6N34K03m24j26L32Ln11j62N43O96m85j111J91J332
838E68P92q47j442J90J587P93r21j571k5J217N63o13j016k76N44M21L0l2j26l39
$$ plain form
710 1542 246 -1625 -1386 307 1340 574 -523 -285 408 617 421 231 198 -434 -1344 -927 342 812
728 812 -623 -2171 -1268 1175 1994 292 -1566 -910 1690 2528 764 -1080 -1006 596 1303 420 -591
745 -591 -829 -562 -392 -155 452 394 -832 -1494 -503 1302 1505 -565 -2127 -857 1608 2254 111 -1911
763 -1911 -1139 1179 1912 568 -1019 -869 198 588 296 -41 -271 -663 -876 -102 1137 745 -792 -1720
781 -1720 -424 1720 1696 -482 -1926 -873 1479 1673 -183 -1479 -733 761 1061 -35 -606 -324 39
798 39 77 10 305 309 -511 -937 -151 1081 957 -566 -1330 -183 1308 1094 -564 -1413 -113 1241 790 -571
818 -571 -1125 -19 920 391 -371 -447 87 290 -134 -260 72 75 -436 -598 -55 641 156 -955 -764 568
838 568 1360 513 -929 -739 848 1641 720 -851 -876 341 904 291 -725 -1001 -457 -36 -6 -38 -164 -503
858e03k63N39J156J58j170j017N69J610O90j394j544J24J676Q54r52j379k00Q25
876b21Q23o9o40l65k62K65N61N32j66r86o69P57J329L15j280j245M50J536O73
895A338q75j283o3J127O74j69o24m71K16J97J99K60k97o33m31L85Q16R1q66p04
915a113J56J170N39o61o98kP82N56k97m09M6J73J02o5Q8P9k34l95%K92K53l13
937D9o22j33L94K62j85l27J2L67J70m3J37K40J38k09j68J96M24j9m95n05N7L57
959I7J19l19m77o4K76K93P9l4j34%M8M32L23k44m60k98K27N32J02m72n64o3N98
982cM35j68l91l35J82M46K18j02m13l10K01M07K46r0n06k28K67M27K41l54n68
1003c98oK49M02P4m17l91o5M12M63L3l63k29K0M67L02p0l66l72M9L03J42r3l47
$$ plain form
858 -503 -766 -227 929 1087 -83 -1100 -531 1079 1769 375 -1169 -1045 631 1485 533 -846 -1046 -221
876 -221 602 533 -107 -472 -734 -469 92 624 458 -528 -1197 -440 889 1204 -76 -1321 -871 665 1338
895 1338 463 -820 -883 244 918 749 125 -346 -130 67 266 526 229 -404 -835 -450 366 457 -409 -1113
915 -1113 -957 213 752 91 -607 -609 173 729 432 23 69 242 344 279 367 446 212 -183 -183 109 362 49
937 49 -573 -706 -312 -50 -235 -562 -550 -183 -13 -56 81 321 459 250 82 278 702 683 188 -317 -260 97
959 97 216 -103 -580 -644 -368 -75 4 -30 -164 -164 -116 316 639 395 -65 -363 -136 396 498 26 -538 -601 -3
982 -3 432 264 -127 -462 -280 166 384 282 -131 -441 -240 167 413 323 -183 -411 -144 283 524 170 -398
1003 -398 -404 -155 247 321 -96 -487 -552 -140 323 356 -7 -236 -216 251 553 483 117 -255 -206 97 239 146 -201
1026b01l59N7M07K99N7m52k27K31N55L48k64m96j38K54L38P1m29l61j98R2L82
1047c4Q4j97m24k03M15P02J91l88m39j2P16M99q2n99m18J64M11J44k98m72l90
1068f30Q3K91L87j83n53k46K68P07M70m00n90n6N98P12j26n84l68J14M67K72l20
1089C13l31l05q0L51K72o9m36m70K01N45M12k21n85j75N69N37P0m17l49Q6L11
1110B29N9n7k57j51j28K1L11J28j49k90q3L88M70k6l25k82J66L50o0k71j92j00
1132b49k6l9QR3N1k29r4K44M75K65l02k08M5M10L07k54l58j29rJ47K8j73j09l82
1156d88j23J79M15J19m35l89J56O42M19j39n48m0M34N37n8l54l25n9K05K63j4
1177C97l85m20k06K09M76P5m36m72O4O94N65j22o07k37L78O82O0l91m77j17L21
$$ plain form
1026 -201 -560 -503 -96 203 260 -192 -419 -188 367 715 451 -45 -183 71 409 480 51 -310 -508 -416 -34
1047 -34 50 -147 -571 -774 -359 343 534 146 -293 -305 411 910 828 229 -189 -25 386 530 232 -240 -630
1068 -630 -547 -256 131 -52 -605 -851 -583 124 594 194 -396 -452 146 858 732 148 -220 -106 361 633 313
1089 313 -18 -323 -403 -52 220 151 -285 -755 -554 -9 403 182 -403 -578 -9 528 598 181 -168 -82 229
1110 229 288 231 -26 -177 -305 -284 27 155 6 -284 -367 21 491 465 140 -142 24 374 314 43 -149 -249
1132 -249 -275 -314 -306 -213 -162 -391 -485 -241 234 499 197 -11 34 444 751 497 139 10 1 148 176 3 -106 -488
1156 -488 -611 -432 -17 102 -333 -722 -566 76 495 356 -192 -232 202 739 681 327 2 -57 148 411 397
1177 397 12 -408 -614 -405 71 146 -290 -762 -698 -4 561 439 -168 -405 -27 655 715 324 -153 -270 51
1198E1K26l7k01m75j50K44M34J77l55m34P0M84M77j16m56k51K47L66K23k60l49
1219h5j22J07K74J25k45k44k51O5L52J39q5l11j36K72L93N0j43k52RL07J11k7
1241C03k41j86MRK62K4j57k35l4J16L84O8k12l23N6K26K17q8k63k44N3K98J36
1264A73q3l38p1R3K75K88p2l24j66J69K22K64k07m12j21J92L62O1k96k57n1L26
1286B7L17q8l37j70p3K97J40q8k35k45R5K71K30L3k09j69K10L22J76j54l07r2
1308d9K11J74ll41k81J9J39J23k4j77n0k0J22K00K1k0j70j32J36K77M0j30j74
1331a09K8K92Q1k6r4j14R2Kj6N2r0k60j84n7K78J12k45k33p2M09L19lj90oJ52
1356A18K86R6j48j43k18n6J38P0K3l59l00O2M21L22j55m88r3L88M79j2m54k77
$$ plain form
1198 51 277 240 39 -436 -586 -342 92 269 -86 -520 -450 34 511 395 -61 -312 -65 301 524 264 -85
1219 -85 -207 -100 174 299 54 -190 -441 -376 -24 115 30 -281 -417 -145 248 298 155 -97 -88 219 330 303
1241 303 62 -124 -120 -111 151 175 18 -217 -251 -135 249 317 105 -218 -162 64 281 193 -70 -314 -261 37 173
1264 173 90 -248 -319 -226 49 337 265 -59 -225 -56 166 430 223 -189 -310 -118 244 305 9 -248 -299 27
1286 27 344 256 -81 -251 -324 -27 113 25 -210 -455 -360 -89 141 174 -35 -204 6 328 504 350 43 -49
1308 -49 162 336 333 -8 -289 -270 -131 -8 -32 -209 -259 -279 -157 43 64 44 -126 -258 -122 155 195 65 -109
1331 -109 -81 211 292 266 172 58 150 152 136 188 98 -162 -346 -403 -125 -13 -258 -491 -563 -154 165 162 -28 -34 118
1356 118 404 500 352 209 -9 -65 73 143 166 -193 -493 -431 -10 312 157 -331 -424 -36 443 431 -23 -300
1378c00J30L20J49j55k96r6K7K52K94rk94l53P5M78L03l19m97k45M33M48n8m56
1400a69k62J93M76J17j46j92j28P0J82O2q9k50k55j0L19L10k13l68J4L80M50j05
1422C86l04j59K41K21K3l56j84j7N3n2n9oN3j18k8K95J86K8j33m6J74J72j47j97
1446B6j76K06J09k72j54NJ89M8j85o8K11K64j06j80q9K39J50lq6o6K5L9k7mJ39
1471B34j25k38m4J39K32j81l54j58K54L90k6l51k15K08M33J70j72k02M3J12J71
1492C20K0p8k65j97N5K33Q5j75m11j07L72M39K9m14l37K54M59N1k63k80O0J83
1514C3N8P7j39j97p7J64K71R9k19k95o9L97L17j01l77k33J98M03N4l76j50m6K05
1537cP4j15j27q6k7J05J46P2Rj55M6K67J75j9k31j07J49O2O9l04j49K5J20q7j40
$$ plain form
1378 -300 -170 150 299 144 -152 -248 -221 31 325 316 22 -331 -256 222 525 206 -291 -536 -103 345 287 -169
1400 -169 -431 -238 238 355 209 17 -111 -41 141 203 114 -136 -391 -401 -82 228 15 -353 -339 41 491 386
1422 386 82 -77 164 385 408 52 -132 -149 -96 -148 -207 -213 -160 -278 -306 -11 175 203 70 24 198 370 223 26
1446 26 -150 56 165 -107 -261 -256 -67 -19 -204 -272 -61 203 97 -83 -172 67 217 214 128 62 87 126 99 95 234
1471 234 109 -129 -173 -34 198 17 -337 -495 -241 149 123 -228 -443 -235 198 368 196 -6 37 149 320
1492 320 340 262 -3 -200 -145 88 173 -2 -413 -520 -148 291 320 -94 -431 -177 282 333 70 -210 -150 33
1514 33 91 168 29 -168 -245 -81 190 289 70 -225 -294 103 420 319 -58 -291 -93 310 364 -12 -162 -208 -3
1537 -3 71 -44 -171 -257 -284 -179 -33 39 48 -107 -61 206 381 362 131 24 173 235 304 0 -149 -124 -4 -91 -231
1562b31pN3O7M8J5N5J8l5L1k1J11nl4n2L5J39j08j08R6Q0Rj36j33J18Q6n5j66
1589a30j57J02J45m8K6j02P0J67%O7n0j6l9L3OJ20j59k41o2J36J68k2j60l9J22
1614f3K09R7j66j32N7L7J08j08j21o8j0O1P3L9j1j04KK46P0rj84m5Q2K8j1j52
1640g5j72nJ42K2M0k8l2M2J39N8Q6j36Ll8K5M5k7j61m0m8J03n1j0OM3P2J5P2J0
1669A00m6m4L7j3M3l9o2n2P4J8j6Np0M5R4O2l4Mo2l5N9K9l9q8j17JR1L6n0Rk1
1700h1N7J6M7p9pjMR0j6k9k6L1O7M3PRq5PP2L9j13p7K5jj07L0j23n9L0K4O3mO3
1733h4P5O9R4J25M0o7j4o2J12j08j62n4n9L0p6j44m9J38J07PL0N3MN6M5J9m3L1
1761A13q3j5M4j9n7o8Q1N0J00j16q8%P0J26l6j40m6N5l3M7q1L7J4oP7K9J2o2n2
$$ plain form
1562 -231 -238 -185 -118 -70 -55 0 18 -17 14 -7 104 99 65 13 48 187 79 -29 67 147 156 20 -113 5 91 36 -130
1589 -130 -287 -185 -40 -88 -62 -164 -94 73 73 140 90 74 35 68 74 194 35 -206 -268 -132 36 14 -146 -185 -63
1614 -63 146 243 77 -55 2 39 147 39 -82 -150 -160 -99 -26 13 2 -102 -100 146 216 207 23 -22 60 88 77 -75
1640 -75 -247 -252 -110 -88 -48 -76 -108 -66 73 131 217 81 84 46 71 116 89 -72 -112 -160 -57 -108 -118 -112 -69 3 18 90 100
1669 100 54 10 47 34 77 38 -24 -76 -2 16 0 5 -65 -20 74 136 102 106 44 9 68 97 58 -30 -147 -146 -55 -19 -69 -60 -81
1700 -81 -24 -8 39 -40 -47 -48 -44 46 30 1 -25 6 73 116 123 132 47 54 126 165 52 -25 0 -1 -108 -78 -201 -260 -230 -206 -143 -147 -84
1733 -84 -9 60 154 279 319 252 238 176 288 180 18 -36 -95 -65 -141 -285 -334 -196 -89 -82 -52 1 5 61 106 125 82 113
1761 113 30 15 59 40 -17 -85 -4 46 146 30 -58 -58 12 138 102 -38 -84 -29 -62 -15 -96 -59 -45 -51 26 55 67 5 -47
1790d7M6R2j2j39q6J3J09P8j5j02m6K18L0J2k3j20R6L9o7l3j19m4o0M4K2P0j05
1817a49K4L5J56M2o8KP5P9L8j34j43L5J00o6j17r4OJ35k2K0k2J6J7k4J08P6n6
1844F9rp1J22O8l4j43r7L0J88q7j89r0Q5J12l8o0m8J00P9J34j7L9q6qO9O4k8q1
1872G3k30M1Q5P6o2j95M2Q5J55J0r1o5K8J32Mp8p2l6N1L5M5K9o2l3n7J68R7p1
1900A04j18n0J8J44j12o1p4M1J89Rn6r6Q6O9k2ll1j06r2M2l4M2n4Ol1J52J33J9
1928A14mM9J65J5j14k8j12j5o2j28j13p1M4j4M5L5N8P0J02P3K9P2%q4K6o9m5o6
1956b8p4oP4j1l3l0R4J60j7k6j41Q3k3J0r3j04m0M0Q5J8j3O4k2J40M6%nq7o3N
1986CK7n6j30j18N9P9J29N2k4lJ39O9K2j07j01j43K5N2n5j02p3n0J64J27J8Q0
$$ plain form
1790 -47 -1 91 79 -60 -146 -133 -24 54 39 -63 -109 109 139 151 128 8 104 143 76 43 -76 -120 -180 -136 -114 -44 -149
1817 -149 -125 -90 66 108 40 42 117 196 234 100 -43 -8 92 26 -91 -185 -179 -44 -66 -46 -68 -52 -35 -59 49 125 69
1844 69 60 -11 111 179 145 2 -95 -65 123 36 -153 -243 -158 -46 -84 -144 -192 -92 -13 121 104 143 57 49 118 182 154 73
1872 73 -157 -116 -31 45 -17 -212 -170 -85 70 80 -11 -76 -48 84 88 10 -62 -98 -47 -12 33 62 0 -33 -90 78 175 104
1900 104 -14 -64 -46 98 -14 -75 -149 -108 81 90 34 -62 24 93 71 68 37 -69 -161 -119 -153 -111 -165 -159 -190 -38 95 114
1928 114 110 159 324 339 225 197 85 70 8 -120 -233 -304 -260 -274 -229 -194 -136 -66 36 109 138 210 210 126 152 83 38 -28
1956 -28 -102 -108 -34 -45 -78 -108 -14 146 129 103 -38 45 22 32 -61 -165 -205 -165 -80 -62 -75 -11 -33 107 153 153 148 61 -2 3
1986 3 30 -26 -156 -274 -215 -136 -7 45 21 18 157 226 248 141 40 -103 -78 -26 -81 -183 -256 -306 -142 -15 3 83
2012H3l6P8J31L0p8Qj29j8m4q3n7j55N1N8M0N1k6O2pQ7M9J6k1q6L3l2M5r4k0p
2042g1N8J2K3N4r2O0k1j3K6n9J0j20RP0J9P7l5k0N9N3Q6J7j26l7J3J3o8p1n0m6
2072a70l6P7J01m1mm4J55N3K4O4j01p9J40l9J7j27q7k4P6KN9k6l6L4R0N4m4m9
2100C9l2n9J30rq8j3o5J8Q2pj07l9M5N6O5O8o5o6L4N2P5k9l0j3rP6j8J3j23o3
2130h2LO4k7p6m8L3J06KJ5j2JO1K7K8K8J8p2l1O8l3l9kj43RN1k4K1J4m8QL7pJ31
2163H1m9m0PkQ7J7J5j06p5P8M6n3L6o3o0J06qO2m4p2l1O1L0M6n6p8K2N7K2Kj55
2194a17k3L8R6Rro5K0L8J13L2r4J4j12Q8N8M1m3j60l2J00Q0r3l2q8J3J11M3lj38
2223a15j6J15OM0J2m3Q0m2N4K7q5n4%J5Pqn0n5J5L6Q7m0m4RM6O0P3n8j2o6J9L7
$$ plain form
2012 83 47 125 256 286 208 216 87 69 25 -58 -115 -270 -219 -161 -121 -70 -96 -34 -41 46 95 111 90 4 37 5 50 -44 -64 -71
2042 -71 -13 -1 22 76 -16 44 23 10 36 -23 -13 -133 -124 -54 -35 42 7 -13 46 99 185 202 76 39 52 65 -3 -74 -124 -170
2072 -170 -206 -129 -28 -69 -73 -117 38 91 115 179 78 -1 139 100 117 -10 -97 -121 -45 -43 16 -10 -46 -12 78 132 88 39
2100 39 7 -52 78 69 -19 -32 -97 -79 3 -4 -111 -150 -105 -49 16 84 19 -47 -13 39 114 85 55 42 33 109 91 104 -19 -82
2130 -82 -79 -15 -42 -118 -166 -133 -27 -25 -10 -22 -21 40 67 95 123 141 69 38 106 73 34 32 -111 -102 -51 -75 -54 -40 -88 -80 -43 -50 81
2163 81 32 -8 -1 -3 84 101 116 10 -65 13 59 6 42 -21 -81 25 17 79 35 -37 -68 -7 23 69 13 -65 -43 14 36 38 -117
2194 -117 -140 -102 -6 3 -6 -71 -51 -13 100 132 38 52 -60 28 86 127 84 -76 -108 -8 72 -21 -53 -141 -128 -17 26 23 -115
2223 -115 -131 -16 -10 30 42 -1 79 37 91 118 33 -21 -21 -6 1 -7 -57 -112 -97 -61 26 -14 -58 -49 -3 57 130 72 60 -6 13 50
2255E0m0M3j23kQO8L5q0p9K2J05jN3n7jL3n1OQj7j7QK4K4R1p5j4j3K2k9L7m5l3
2288d0n2M1j2l4J08k4n1O0R3k6l3l4K9k8Q9l5q5q0O5J8O8om3l6Q0J20m9K7n0j15
2318c5N9Nk0q0q5k7M8K2N3J7n1P2J04L6K2K1j43M9K7M7j15np6jO0J5Om2l7jJ24
2349F9q4j8k4o5J30l4oJ8k5kM2Q7J07j07r7P6Qk0Ln4o1OKk1j2K3k6OR2L3L8j3
2381G1j41P5Q4k3p0n7l5j3M2L8l2j6K2R7M4MN8o6k6NK0o6m0o8l8L5J3j5l5k2Q8
2412f7P5Q7m2j8n6Q8J4J3p6K6q0O6J5OK1m5n0J8N1j1m7r0K0K7P3n1m4K0L7L4J2
2443B6L3QJ5l7N4k3jk8p5j8l2K0J1m9N7%M6LO5j6o2M7o1J30K5o5p3J2K2J4j5r1
2475e8QML3K9j2m4M4k3N1K7q2nm1O9jN4l5l8j9J03j8k4j6n1L2K4l8rpN0j4K5N3
$$ plain form
2255 50 10 53 -70 -72 -64 4 39 -41 -120 -98 7 6 59 2 1 34 -17 -11 -3 -20 -37 -29 -5 19 110 35 21 8 30 1 38 -7 -40
2288 -40 -92 -51 -63 -97 11 -13 -64 -4 89 63 30 -4 25 -3 86 51 -34 -114 -49 -31 37 31 -12 -48 32 152 103 130 80 -35
2318 -35 24 29 9 -71 -156 -183 -135 -113 -60 -43 -94 -22 82 118 140 161 18 67 94 141 26 21 -55 -56 4 19 25 -17 -54 -55 69
2349 69 -15 -33 -57 -122 8 -26 -32 -14 -39 -41 1 88 195 88 -9 67 75 55 58 4 -57 -51 -49 -70 -82 -59 -85 -79 13 46 84 71
2381 71 -70 5 89 66 -4 -61 -96 -109 -67 -29 -61 -77 -55 42 86 90 148 82 56 61 81 15 -25 -93 -131 -96 -83 -98 -133 -155 -67
2412 -67 8 95 53 35 -21 67 81 94 18 44 -36 30 45 51 72 27 -23 -5 46 35 -12 -102 -82 -55 18 -33 -77 -57 -20 14 26
2443 26 59 67 82 45 99 76 75 47 -28 -46 -78 -58 -47 -96 -39 -39 7 10 75 59 -3 44 -17 113 138 73 0 12 34 48 33 -58
2475 -58 -50 -46 -13 16 4 -40 4 -19 32 59 -23 -28 -69 0 -1 53 18 -20 -39 64 46 22 6 -45 -13 11 -27 -36 -43 7 -7 18 71
2508G1j23k4J2K0Q4J0j03L2j1P7L6j05k8K4J3M8L3p3l5k3KQ8P2n2j6j13J16OM3
2537H1q4m8NJ9OM8p0LoJ5L6k9P5p4M4LK6O0o0K5m4J2N9q8nj0J6j4k9n0M6j3k2
2570f7jk7Q4k6J3m3jJ13l2nK9j7R2l0l9M4l2o4J3Lm5j1mp8Q2j3j4l9M9K2RP5j9
2603B1k4k5J8Q6l6J1l6n5L2P9k5l9p3L2K3M6J2j03J4j6K7K0ol7rJ1J28n0L7k6
2633C7k1ON2o3l1m9KJ6L7rnJ4K7MN4n0K9Om7L2k5nm8L6q6L0mN0j3k9O7oL7L1o8
2668HK0Qk3Rk9j0n4J03n7K4o4J9J4M1j3R8q9l1j9nK2j6L6k5j4R4k9J8l6NLK1j5
2701A4J1p0Ml8M4J1l7k1N6k8L3J06Qo1k3Q0j8k9K3q8l4MK9o1k3J6K5L7L8j7L6
2732B7K0J6j9n7M6l7l3J4j1J2L8l6L2j8Q8j9rm6M3n4Kjq7Q8o0JMk7O7rk1P8qk5
$$ plain form
2508 71 -52 -76 -64 -44 40 50 -53 -21 -32 45 81 -24 -52 -28 -15 33 66 -7 -42 -65 -63 25 97 45 29 -84 32 38 81
2537 81 -3 -51 -46 -27 -21 27 -43 -40 -46 -31 5 -24 51 -23 21 24 50 110 50 75 31 43 102 14 9 -1 15 1 -28 -78 -32 -45 -67
2570 -67 -68 -95 -11 -37 -24 -67 -68 45 13 8 37 20 112 82 43 87 55 -9 4 7 -38 -49 -53 -131 -49 -62 -76 -115 -66 -44 -35 40 21
2603 21 -3 -28 -10 76 40 51 15 -40 -8 71 46 7 -66 -34 -11 35 47 -56 -42 -58 -31 -11 -17 -54 -63 -52 76 26 63 37
2633 37 16 22 74 11 -20 -69 -67 -51 -14 -23 -28 -14 13 17 71 21 50 56 9 41 16 11 -37 -1 -87 -57 -61 -11 -24 -53 14 8 45 76 8
2668 8 28 36 13 22 -7 -17 -71 32 -25 -1 -65 -46 -32 9 -4 94 5 -26 -45 -50 -28 -44 -8 -33 -47 47 18 36 0 5 8 29 14
2701 14 25 -45 -41 -79 -35 -24 -61 -82 -26 -54 -21 85 93 32 9 89 71 42 65 -23 -57 -53 -24 -85 -108 -92 -67 -30 8 -9 27
2732 27 47 63 44 -13 33 -4 -37 -23 -34 -22 16 -20 12 -6 82 63 54 8 51 -3 -1 -2 -89 -1 -61 -60 -56 -83 -16 -25 -46 32 24 -1
2766al6O3j8Ok4K4n8N2k1L9J3K3o0M4qm6JJ8n5J0l9KP3l1mqK5JL7l0O9K9j8m0
2800C2nK8j9jj7jJ0L0j06J1M0m8M2k6L2J6J3Lp7M0L0q1L0RP3no3K4O3j4n2J1l6
2833a4m4O8OPm1k8P0o1L4M9m1k6LNppRK9J1N0j02KJ2qM6l0k7QK6jk6n5N2Mk4J2
2869c9J1K2k9J20j1j0j12P0j6mJ2J3n8M0%%J3o4LO4J2pj1J5p2k3R4j3ok0l3mR9
2902E6jJ6o0l8O3Rl6J9p0K3k8J7K0k2k6M5K6m8oO4j3K8l7L2o0l8N1L0L5n0l1K5
2934eJ5N5m6L6n0k7P5m2j5l8K0l5N6o8j5J0JN6K9k3K0l8P3LL6m5k8L9o6L3k2n6
2966f2P4L1mj4m6L4J5k5Jo1Pl0M8M0j6M2pm6L1Q1j01N8k6k0M3ok7Pk7LM4m9J2
2999Dn5MO7%Mm9k9J6L6N1p0K%L7K8jl3kQ2n6P6p8j3K3J6m1j7m9l0L4rK6N2r9J9
$$ plain form
2766 -1 -37 26 8 14 -10 14 -44 8 -13 26 39 62 2 46 38 -8 -7 11 -44 -34 -73 -71 2 -29 -33 -41 -16 -15 22 -8 61 90 72 32
2800 32 27 55 36 35 18 17 27 57 -49 -38 2 -46 -4 -30 2 18 31 34 -43 -3 27 -54 -24 -15 58 53 -10 14 77 63 11 22 -14
2833 -14 -58 10 16 23 -18 -46 24 -37 -3 46 5 -21 -18 -13 -20 -27 -18 11 22 72 -30 -28 -16 -24 22 -8 -35 -27 -1 -2 -28 -83 -31 -27 -51 -39
2869 -39 -28 -6 -35 85 74 64 -48 22 6 2 14 27 -31 9 9 9 22 -42 -39 25 37 30 19 34 -38 -61 33 20 14 -6 -39 -43 56
2902 56 55 71 11 -27 36 45 9 28 -42 -19 -47 -30 -10 -32 -58 -13 13 -35 -41 23 10 38 1 33 -27 -65 -14 16 51 1 -30 -5
2934 -5 10 65 19 55 5 -22 53 11 -4 -42 -22 -57 -1 -69 -84 -74 -73 -17 12 -11 9 -29 44 47 83 38 10 49 -17 16 -6 -62
2966 -62 12 43 39 25 -21 13 28 3 4 -57 -50 -80 -32 8 -8 34 27 -19 12 93 -8 50 24 4 47 41 14 21 -6 -3 41 -8 4
2999 4 -51 -47 20 20 24 -25 -54 -38 -2 49 -21 -19 -19 18 46 45 12 10 92 36 112 34 21 44 60 19 2 -47 -77 -43 -52 -26 26 -73 -54
3034e4JK5R6j48K9R7m1Lj3O9m2j5N0m5J5J0k5J7k6PLl7k7N6j0k3K2m1J2j1J8L7
3066IJ8J6k6k6PL8q9R5m8j1LoK4L6k2J1l7L4Ok0kJ4n9k7P0l5K0k5J5K2J1J9l7
3099bk1J3K1K6m2K2j4l6Qj1N8o4J1K8M8qo0M9l1j4L7J4m0J0J0Jk9OOM6lk7k3m6
3133e7P7om4pM0m7L6K5o8N7k6L1m7J05k6M1l4qk0qn0L8LLJ8j03O4j6l3M5m8K7
3165c8L2m8L9qL0n4J05l8K4l1k6J0j5M7J6n0JlP8r8N2o8lM1nJ3qo3M0K9L5k8j19
3198a11P5J6QO1k5k0k9J25k6jJn8L0PL4m9m6l5K0L4l4n5K5J2j4M7Nqk1J3j3L3
3230AkN9n9%nP2qm9K2M0Pm7j6l4nm3L8M1m6Kl4K4jK7N4m6QJ9L8J0n6Rn5M3n0L6
3266fL3j3j9jO7r9M0n4M0JK4p7O7l9k2M1K6n5N7o1L7OK0K5n9L5%jN7n1J9rl2l1
$$ plain form
3034 -54 -53 -28 68 -80 -51 46 5 8 -5 64 22 7 57 12 27 37 12 29 3 10 13 -24 -51 5 -5 -28 -6 -47 -35 -46 -28 9
3066 9 27 43 17 -9 -2 36 -53 42 -6 -17 -14 -20 4 40 18 29 -8 26 32 12 10 24 -35 -62 8 -27 -7 -32 -17 5 16 35 -2
3099 -2 -23 -10 11 37 -5 17 3 -33 -25 -36 22 -42 -31 -3 45 37 -23 26 -5 -19 18 32 -8 2 12 13 -16 -10 -4 42 39 12 -11 -57
3133 -57 20 14 -30 -37 3 -44 -8 17 -51 6 -20 11 -36 69 43 84 50 42 22 14 -36 2 5 8 26 -77 -13 -29 -62 -17 -65 -38
3165 -38 -6 -54 -15 -23 7 -47 58 20 44 13 -13 -3 -18 29 45 -5 -4 -7 71 -27 25 -43 -46 -5 -10 3 -5 -68 -28 1 36 8 -111
3198 -111 -36 -20 -12 49 24 4 -25 100 74 73 74 16 46 53 87 38 -8 -43 -23 11 -23 -78 -53 -41 -55 -8 -3 -11 -32 -19 -32 1
3230 1 -1 58 -1 -1 -6 66 58 9 31 71 78 31 15 -19 -24 -67 -29 12 -34 -32 -66 -42 -43 -16 38 -8 0 19 57 67 11 20 -35 8 -42 -6
3266 -6 27 14 -5 -6 61 -38 2 -52 -12 -11 13 -64 3 -36 -58 -17 9 -46 11 -50 -13 -7 13 38 -21 14 14 13 70 19 38 29 -3 -34
3300c4R1m7K0o8RO7K5n0n6J6M2OJ4k6k0l1P0p0R4o4m9lP5k4kk5j1N8J3Qm8K7l7
3333c0N2l9K1o3M0j2N6J7MOo5J4M7ojM1j12n4N6N2k7J8o2j6J9L5j4j7J0k1L7P8
3365F4n7Mjl4N0j3O2m9o5Q0n4mO5m8j02L8M2j0k1K3j4N1l5Q6r9M8j2L3MNj0J7
3397D4o8L7L5n9O4j12M3j3Q2m7n0njQL4Ol0j6K7k6K5L1j0K9K7L8m0%l2l2JPN5
3430E2n0j7J8J1M5j44P8L5j01R4J1l6j1j4j0P5m7QlNpk2L9k5J4rJ7N6oo7K3l3
3462b1N6r7R3l7n1K1N3l8k3J6J5J6o0R7p8M8k2JL1l1RJ5k0J9NK5o4R2r9O0m5K3
3494Ij1k7J7L7n3N4l4n3M4oP0J6k5mn7kN9n7L3o7N0k2J5J2p0M6J3k8K6l3O4n0
3526c4P3o5K8k9k3O0JmJ4l1Qk2j7J01o8K7j8l0N4l0N4m1K9p8M0O1m1K2j4oL0l8
$$ plain form
3300 -34 57 10 30 -38 -29 38 63 13 -43 -27 15 21 35 9 -11 -42 28 -42 52 -12 -61 -64 11 -13 -15 -40 -51 7 20 28 -20 7 -30
3333 -30 22 -17 4 -59 -19 -31 25 42 46 52 -13 1 48 42 41 82 -30 -84 -28 24 -3 15 -47 -63 -44 -9 -23 -40 -30 -51 -14 64
3365 64 7 11 10 -24 26 13 75 26 -39 41 -13 -17 48 0 -102 -64 -22 -32 -53 -30 -44 7 -28 58 -41 7 -5 28 32 37 27 44
3397 44 -24 13 48 -11 53 -59 -16 -29 53 6 -44 -49 -50 -42 -8 -2 -32 -48 -21 -47 -22 9 -1 28 55 93 53 53 21 -11 -10 -3 52
3430 52 2 -15 3 14 59 -85 -7 28 -73 21 32 -4 -15 -29 -39 36 -11 -3 -6 -1 -8 -30 9 -16 -2 -11 6 62 56 -11 12 -21
3462 -21 35 -62 31 -6 -57 -36 17 -21 -44 -28 -13 3 -57 40 -38 10 -12 -11 20 -11 -2 13 -7 12 17 42 -22 70 -29 31 -14 9
3494 9 -2 -29 -12 25 -28 26 -8 -61 -17 -23 47 63 38 34 -23 -25 34 -23 10 -57 -7 -29 -14 -2 -72 -26 -13 -41 -15 -48 16 -34
3526 -34 39 -26 2 -27 -50 10 11 7 21 -10 -2 -24 -41 60 -8 19 1 -29 25 -5 49 8 37 -41 -1 60 19 41 27 21 51 13
3558A3N0n2K1k2rjk7N5q4O6p1N7L1j4l1k3P6k2l8L1k9k0P2k3k1L8J7n4K1M1JK2
3590G1l4j2k2M4l7j4L6p3k%k8k1L1K9L0oL0J7n3J3J1L6j3L8l8J7J4p8mo6O0K1
3622cK3k8k5Om0K2M2k3L2j4J5k7K1j7J4l9N8k9N5l9J0j4J5N2p9L6n1L6l2J2mm
3654a9j4jM8o5L7j2KJ2J3M6j7k5Rj6lK0k3K4M5l8K6M2k6k2Mlq6N4K4o4n4M4J3
3687b5J1l8J7L9o0PN6K7k8%mRL4m9Kl2MlL9oj4%O7p8K1R3q7K9k1K7n4j9N9l0n5
3722f2M7l7O7l4pK9J7j3l4J0L3%l7J2J7o2N8m6K0NM5mNj9j7pJ1j3L2K4n3%L9l7
3756a1K8M6km6n5M1L5pj6m0K1j2O0l0j2K1j6MO5m8J1k3L8K9m5rj8k8lop6P4l4
3789f4Q5n4kL7pK4n7P7n5Q5K1q3L2Nl1L7Mm4J8m2kJ2Qj7k7k0N1k7OL0l5lK1l2
$$ plain form
3558 13 63 11 32 10 1 0 -27 28 -56 10 -61 -4 27 13 -18 -41 35 13 -25 6 -23 -43 29 6 -15 23 40 -14 7 48 49 71
3590 71 37 25 3 47 10 -4 32 -41 -43 -43 -71 -92 -61 -32 -2 -8 22 39 -14 -1 10 46 33 71 33 50 64 -14 -18 -84 -24 -3
3622 -3 20 -8 -33 -27 -67 -45 -3 -26 6 -8 7 -20 1 -16 -2 -41 17 -12 43 4 14 0 15 67 -12 24 -27 9 -23 -11 -15 -19
3654 -19 -33 -34 14 -51 -14 -26 -24 -12 1 47 30 5 14 -2 -5 15 -8 16 61 23 49 91 65 43 47 44 -42 12 36 -28 -82 -38 -25
3687 -25 -14 -52 -35 4 -56 -49 7 34 6 6 2 11 45 -4 -2 -34 -30 -33 6 0 -14 -14 53 -25 -4 89 2 31 10 37 -17 -36 23 -7 -62
3722 -62 -15 -52 15 -19 -26 3 20 7 -27 -17 16 16 -21 -9 8 -54 4 -42 -22 -17 28 24 29 10 -7 -14 -3 -16 16 40 -13 -13 26 -11
3756 -11 17 63 61 15 -40 1 36 29 13 -27 -6 -18 42 12 0 21 5 9 74 26 37 14 52 81 36 27 9 -19 -22 -28 -104 -30 -64
3789 -64 21 -33 -35 2 -5 19 -38 39 -16 69 90 7 39 44 13 50 54 10 28 -14 -16 -4 4 -13 -40 -60 -9 -36 -30 0 -35 -38 -17 -49
3823d9R0n0OL5k6N4l4J3n3J9k1N0j4K1m8M5jm4K6o0J4J1k2nK1l5L3L7J1l4L6n5
3855b9K4M9k3l3L9Ok6N6k8j0jK4m5Oj2Pj7N0n8m1M0L8o1Nl0QR3p7N1J3K1K1n7
3888CL2K2ql1Ln7P7m5N6o4lnJ8ll2J8J2%Pk8P2L3n2j2p5M3j9L0Kn2M4L0L2l3P
3923B2L8o6M0n1L9lq2O6j5K2K2l7K6rL1p1Q3p3J1J2j8K4k6J7n6M9L8n7mK4k3N1
3955B4K2r0J7K0O0j9j1p3Q1m6J4N0j1on7L7Ln9M2J5lL3q2k0K3K4j7J0Jk9l2K7
3987e2L2Ql1O2j2N7pj7kj5K9l3l7M6k2ml4p0R4K2jm1ML5k1M8k1k9JN2m9j1L6M
4021B1M2J1l8qK0o0J0k2l5M6k2K7kk3K5j3M1J0k4RL5q8O5nm7M6m0qM3m2OQ8n5
4054A3N4p5L7m7j1M5n8J05q0k7K8n5N9m1M5J2NLk6QL5n1L9k5R3nr5k8O3J0k7j9
$$ plain form
3823 -49 41 -9 -3 32 6 60 26 39 -14 5 -16 34 20 41 -7 38 37 -7 19 -41 -27 -16 -38 -43 -22 -57 -24 13 24 -10 26 -29
3855 -29 -5 44 21 -12 27 33 7 63 35 25 24 48 3 9 -3 4 -13 37 -21 -62 -22 16 -45 -40 -70 -62 31 -46 5 18 39 60 3
3888 3 35 57 49 18 21 -36 41 -4 52 -12 -15 -20 -2 -5 -37 -19 -7 -7 0 -28 44 77 25 13 -62 -19 -38 -8 -6 -58 -14 16 48 15 22
3923 22 60 -6 34 -17 22 19 -63 3 -12 10 32 -5 21 12 43 -28 55 -18 -7 5 -13 11 -15 2 -54 -5 33 -24 -28 -4 -27 24
3955 24 46 -44 -27 -7 53 34 23 -50 31 -15 -1 49 38 32 -25 12 15 -44 -2 13 10 43 -39 -59 -36 -12 -29 -19 -18 -47 -79 -52
3987 -52 -20 -12 -43 19 7 64 57 40 38 23 52 19 -18 28 6 2 -32 -102 -8 14 13 -28 -24 11 -10 38 17 -12 -11 41 -8 -19 17 21
4021 21 63 74 36 28 48 -12 -2 -24 -59 -13 -35 -8 -10 -33 -8 -21 20 30 6 15 50 -38 27 22 -25 21 -19 -27 16 -26 -20 68 13
4054 13 67 -8 29 -18 -29 16 -42 63 -17 -44 -16 -71 -12 -53 -8 4 9 12 -14 -6 29 -22 17 -8 85 80 -15 -43 20 30 3 -16
4086a6j2L0mM2p2Q7q3PL5n0L6Rk7J3QM1k8K9m6OpLK7o3KM0M3q9M4k3j1L1j6N5
4120D1n9m7J62n8l5J8j3j9kj6K2llMNNm6Oj6L5Om7P2K3Nn1K9Qn1oK9J9j9l3N7
4155B2m0qL0n8M4K3k7j6m8Q3n1Q6k0k9jkM7n4J0nJRk2k8N5N5m2J6k0k4J4J0m3
4188c3P5k6l4LRJ0k3m7M6j4j9L3Nk9O5L4l3J2n2M5m4Q5qLk3Qr9Q1L1l4l4l9J1
4221c5M4m6NK5m3K5P1p4j7L2K9K3m4J3oj8P5l5j9k4l2K8L1qm0L8m0N1k4L0q0O9
4253DPJ8m8J2NL7n4J5o0N1oL0K6k8L2L5p4Q9q4lOjJ6kj22N4JJK0K0j2l6K1L0p
4288gl9K6lM6J2m5L5J9q2O8l7L5mm1M4q0P0Jj3M4rk1n4K8RRm5M7K3o5L6m1L9J0
4322A5L0p5O9n8k8R3n2M3rk3JN0q2N2j7P8r2J7k2oj1K2jJnk9O5J4jm8K3j8pL2
$$ plain form
4086 -16 -28 2 -2 40 -32 55 -28 -21 14 -36 0 9 -18 -5 3 44 16 45 -1 5 -2 1 28 -35 -33 7 50 -39 5 -18 -29 2 -14 41
4120 41 -18 -65 97 39 4 22 9 -10 -12 -28 -6 -9 -12 -8 -3 2 -44 -38 -54 -19 -13 -60 12 35 40 -11 18 26 -25 -31 -2 17 -2 -35 22
4155 22 -18 -26 4 -54 -10 13 -14 -30 -78 5 -46 40 20 -9 -10 -12 35 -19 -9 -14 -13 -4 -26 -54 1 56 14 30 10 -14 0 10 -33
4188 -33 42 16 -18 -15 -6 4 -19 -66 -20 -34 -53 -20 -15 -44 21 55 22 34 -18 27 -17 68 60 63 40 48 -51 30 61 27 -7 -46 -35
4221 -35 9 -37 -32 -7 -50 -25 46 -28 -45 -13 16 39 -5 8 2 -16 59 24 5 -19 -51 -23 8 0 -40 -2 -42 9 -15 15 -65 4
4253 4 11 29 -19 -7 -2 35 -19 -4 -64 -13 -19 11 37 9 41 76 2 91 7 4 10 9 25 23 -99 -45 -44 -43 -23 -3 -15 -51 -30 0 -7
4288 -7 -46 -20 -23 23 35 -10 25 44 -38 30 -7 28 24 -17 27 -53 17 18 5 49 40 19 -35 -7 2 11 -34 13 36 -29 7 -34 5 15
4322 15 45 -30 39 -19 -47 46 -6 37 28 5 6 56 -26 26 9 87 -5 12 -10 -16 -27 -5 -6 -5 -10 -39 26 40 39 -9 14 -4 -11 21
4356B1J2pk6Ol2J5ol5K7L7k5k2J6J7J0j8k9P0k7N1p6n4J01l0lK3l3L1k6mK4j4
4388fl3K4L5m1nP7l4Ol0L5l2J6L2j4n2L2o4J01m4NJ5k4L5l0n9L2j5j9M9J7K9m7
4420in8R3J0l2o6Q0N9j10L5L7m0K3jk1J3l7O3l5J9Ln0k5K3Q1r9MK9J0j9J4Ljk5
4453b9MP2J2o3P2k9K5m0%j4L5n8jL1N2l9m2J6n1M5p0L9K2ll9J5J3L6m2J4Q8q1
4485a0L0l8K1PJ7l3M5m0j9J8J8j5J1l0l2Q5m3K4j4N0l3l6O7o1N9m4l1K8l3M7J0
4516B5m8O7j8l9M0l9M2K9p3L0j1k1J9j6M0j6l3jJ1J9k0J0K7j4J1J8n2L7J6Kk4
4547A8nol7O%K6M6m0K8o9jO5m5j3j1M9om4J7kK8K3l0L9m6JM9q5J7Kj4kN1K3m7
4582a5kj0J1P9l4l8j8mQ3n4j0LJ4%K3M7n9K5j3l7O4q4O0j8pnJ7j7QJ2m3P0p9M2
$$ plain form
4356 21 33 26 0 6 -26 -11 -17 -52 -25 12 -13 -35 -19 -2 8 -10 -39 31 4 55 -21 -75 26 -4 -7 16 -17 14 -12 -16 8 -6
4388 -6 -39 -15 20 -21 -26 51 17 23 -7 28 -4 12 44 30 -22 10 -54 47 3 8 23 -1 34 4 -55 -23 -38 -57 -8 9 38 -9
4420 -9 -67 26 36 4 -62 18 77 -33 2 39 -1 22 21 0 13 -24 39 4 23 26 -24 -49 -26 55 -44 -40 -11 -1 -20 -6 -3 -4 -29
4453 -29 -25 47 59 -4 68 39 64 24 24 10 45 -13 -14 17 69 30 -12 4 -47 -2 -72 -33 -11 -14 -53 -38 -25 11 -31 -17 71 -10
4485 -10 20 -18 3 10 27 -6 39 -1 -20 -2 16 1 12 -18 -50 35 -8 16 2 52 19 -17 50 -11 48 4 -27 1 -32 15 25
4516 25 -23 44 26 -13 27 -12 30 59 -14 16 5 -16 3 -13 27 11 -22 -23 -12 7 -13 -3 24 10 21 39 -13 24 40 42 18
4547 18 13 7 -30 -24 -24 2 48 8 36 -33 -34 31 -14 -27 -38 11 5 -39 -22 -24 4 27 -3 36 -10 -9 40 -45 -28 -26 -40 -42 9 32 -15
4582 -15 -17 -27 -16 63 29 -9 -27 -31 52 -2 -12 -9 5 5 28 75 16 41 28 -9 55 -29 31 13 6 1 18 1 9 21 -22 48 -31 11
4616A1j2KP2r6M5M0m0j2N9o3oj4LM6m8j5LJ8rL6m1nN4K4l6%J5j0%j4M1L3r3QN2
4651D8l6%J4n5nM0k2j1rM7rk3j2nL8jj8L8J9l2J0Nlm8O3m4M6o2qP5k6l6J4J5o
4686Al2k4M3%k8K9j8JJ4l0N3o5j8M4N3n8j1N6L0m8L6n4J2k6k1M2L8q0N8j3j9K9
4718fN8p2L4l3kK2MJ0q7J35l9k0J8K2o1j4MJ9Pj0k9J5J2%J3J2L8r3L9O1m3J5k6
4751Ck1JL0m7L2J4L6m2J2N%l0L2m1L3J1m3lO9n5K1j7K1j7oK7o8M7j5L3N7n7l4
4784a2K8oj9m6P5j8QJ0o6K8K8%lpm0K2J3K7lLj2K8J0o0N9k4k8L8j5nk6L3n3qk3
4819f4M4K3n0N2Ok4J5j2J3l6K7N7n6j1N5n8l1L8lK3J6l3Oj5N1no4M6n2M5m3N1
4851A1l2k2P6l8Nl6j7M5J3rL3n0kJ4jlj2L4k5L2L8k2l9omM5k4J6n7J6J0O0j7k1
$$ plain form
4616 11 -1 1 73 -23 22 62 22 10 69 6 0 -14 -11 35 -13 -28 -25 -7 -16 20 -21 -26 28 52 16 16 31 21 21 7 48 81 -12 -4 48
4651 48 12 12 26 -29 -34 6 -16 -27 -36 11 2 -21 -33 -38 0 -1 -19 19 38 6 16 21 18 -30 33 -11 35 -27 -35 40 14 -22 -8 7 1
4686 1 -31 -55 -12 -12 -40 -11 -29 -28 -14 -44 9 -56 -74 -30 23 -35 -46 10 40 -8 28 -26 -14 -40 -61 -19 19 -61 -3 -16 -35 -6
4718 -6 52 -20 14 -19 -21 1 5 15 -72 63 24 4 22 44 -17 -31 -27 -8 -1 -11 -40 -25 -13 -13 0 12 50 -43 -4 57 14 29 3
4751 3 -18 -17 13 -34 -2 12 48 6 18 23 23 -7 25 -16 17 28 -15 -18 51 -4 17 0 21 4 -2 25 -43 4 -11 22 79 22 -12
4784 -12 16 10 -9 -55 20 2 10 20 -46 -18 10 10 7 0 -40 -18 -5 22 19 22 10 38 48 -12 47 23 -5 33 18 13 -13 20 -33 -41 -64
4819 -64 -20 3 -47 5 11 -13 2 -10 3 -33 -6 51 -5 -16 39 -19 -50 -12 -15 8 24 -9 -3 -18 33 28 -36 10 -42 3 -40 11
4851 11 -21 -43 33 -5 0 -36 -53 -8 5 -4 29 -21 -23 -9 -10 -13 -25 9 -16 16 54 32 -7 -13 -17 28 4 20 -37 -21 -11 49 32 11
4885A1Rj9jj1L2K1j7o1O0j1J4l8j7j9M0J4nml6mK5lnM2m0O0j03O9J8l1J3n5P4
4918B2o4O1J3m2L6k6L1K4n8O8n2o7Q9o7M6K3m2p1R8K2k5q1M2P2p2J6m9M3Qj8K4
4949Dl8QPj0P1m3K4Nq0Q9j3n0Nj4L4j8M1n1K5kL7m7K5PMm9j2M1Pk9J7Ll8K3J9
4984BMrk0j1N4l2Pj1j2L6K1l9k6O9n6N3Pm3Rk3J2Q3k7l5qok6KnK7j5J2k9NM1m9
5020c8K2N5o2lJ4j6M4lk8O8m5o2N0J9jL3n9k6J9j0O8l6L8m9K6k8K8n3L0l5M0j
5052arL6p5M9l9N3m7K7K2Nk7K0pm1J9Pn6J03n4k5K0j6M0l2L6RLJ7k5Mk7PJ1k5
5086a8Q4j06N6j1K2k1n6K3J5kK3k2K4K1l4qN1j4J6r6QJ00k5M7n8j8Pn9N6j8k6
5117c9J4M7n1K2J3JJ6l8k6L8m7M4j6M3l6j8J8L6K5Jo4J1L9m6L5j8k%J3m6j5N7
$$ plain form
4885 11 20 1 0 -11 21 42 25 -36 24 13 27 -11 -28 -47 -7 7 2 -2 -38 -42 -17 -20 -25 17 -23 37 -66 3 21 -10 3 -52 22
4918 22 -42 19 32 -10 26 0 31 55 -3 65 13 -54 35 -32 14 37 -5 -76 22 44 19 -62 -20 52 -20 -4 -53 -10 -2 -20 4
4949 4 -34 -26 -19 -29 42 -1 23 28 -52 37 24 -26 -21 -35 -1 -19 22 -29 -4 -6 31 -16 9 16 20 -29 -41 0 7 -22 -5 -2 -40 -17 2
4984 2 6 -3 -23 -34 20 -12 -5 -16 -28 8 29 -10 -36 33 -23 30 37 -6 3 -20 -8 75 48 13 5 -1 -27 -25 -30 -3 -18 -6 -35 -30 11 -38
5020 -38 -16 39 -23 -26 -12 -28 16 13 -15 53 8 -54 -4 15 14 47 -12 -38 -19 -29 39 3 41 -8 18 -10 18 -35 -5 -40 0 -1
5052 -1 -10 26 -49 0 -39 14 -33 -6 16 21 -6 14 7 -34 -15 -8 -64 39 -15 -40 -20 -36 4 -28 8 17 20 37 12 16 -11 -4 7 -18
5086 -18 66 -40 16 5 27 6 -50 -27 -12 -14 9 -13 11 32 -2 -10 41 27 43 -53 -45 55 30 77 19 1 8 -51 5 -13 -39
5117 -39 -25 22 -29 -7 6 7 23 -15 -41 -3 -50 -6 -22 21 -15 -33 -15 21 46 47 -17 -6 33 -13 22 4 2 2 15 -31 -46 11
5149A1l7%L8p5O3pQm0J4K5j0l7K4M5k0k7O3K0n5k4N6j1J0n0jM0m4O2o0L2m5P0
5181C8k6Or1J08q0L5J6o6OJ2L7kj3J8l3K4M3o8j3J7J5n2K2L8Nm3O8n7K5N5o3J2
5213gM8k5j8MK1m7N6Nm6j8P7o5l8O2j1L1l2pJ1MMl2J7L6l8OK6Kjj9m0qJ2P4j6
5248B8k3j2L2k9l8L2K6l0Qj4M4Kn5N3m4J6Pnl7L5RnM0n1N8j1L7m1p3N7m7MQm9
5282f8L4mL1K4n7%nk4K6M5mm4K4K8K7o3olO4J1n7O9k7K6m5N5p5QRp3Q1p4M7Q8
5316F8l5o5J3K8k6L4l6NN4q2K0K3P6n5q5R3j8J8k4onjL7n5J8J5n6j2K8O0n6L4
5348Gm4J3jK3m2L1L0oJn9O1L4k4l3M4l3j0l9O3m2QM5k3jk1L8j1m6O6nm0J2o1R1
5382B6l1J7J1o6L8J8k1O4m6N5o1mj6m3M3L5j0j1l1m1R9pk7k4M1On9N8lj7pJ0j2
$$ plain form
5149 11 -26 -26 12 -63 0 -7 1 -39 -25 0 -10 -47 -23 22 2 -25 38 58 3 -21 35 24 34 -16 -17 23 -21 41 -19 13 -32 38
5181 38 12 18 -73 35 -45 -10 6 -60 -54 -42 -5 -7 -20 -2 -35 -11 32 -36 -49 -32 -17 -69 -47 -9 -4 -47 21 -36 -11 44 -19 -7
5213 -7 41 16 -2 2 23 -24 32 37 -9 -27 50 -15 -53 9 -2 29 -3 -10 1 5 9 -23 -6 30 -8 -2 24 26 25 6 -34 -42 -30 44 28
5248 28 5 -7 25 -4 -42 -10 16 -14 -6 -20 24 26 -29 24 -20 -4 3 -2 -39 -4 5 0 40 -11 47 36 73 32 -41 16 -31 -27 -19 -68
5282 -68 -34 -38 -7 17 -40 -40 -45 -69 -43 2 -2 -46 -22 6 33 -30 -36 -39 25 36 -21 48 21 47 2 57 -18 -10 -1 -74 7 -67 -20 68
5316 68 33 -32 -19 9 -17 17 -19 -14 40 -42 -22 1 77 22 -63 30 12 30 6 0 -5 -6 31 -24 -6 9 -47 -59 -31 29 -27 7
5348 7 -37 -24 -25 -2 -44 -13 17 11 12 -47 14 48 24 -9 35 2 -8 -47 16 -26 -18 27 4 3 -18 20 9 -37 29 24 -16 -4 -65 26
5382 26 -5 12 23 -43 -5 13 -8 56 10 65 4 0 -16 -59 -16 19 9 -2 -33 -74 25 18 -9 -33 8 14 -45 13 10 -7 -14 -4 -16
5415a6l8O4J4l9O5k3n3llJ8rNJ0lj0J7J3k4L1m4M1k0l8M2l7M3L4k5p6M3j7J3L2
5448GM4k7l2j2O8l7p3O6l9K3K2l7M0J0%m6K8pJ1Qk5KJ0j6M9n8k7P3o1N8j8j6k
5481a4mM4j2m2L7nJ2%n7N2M3o1L6Qk2K3n1K4L8l3L5m0j8J0L4j5Jk0J0j9mM1mL7
5515F4n8j1R0q8K6jk6J8k5Oj6OK4p2J21p4L1o7M1J8K1m7L3lMqj8nM5l1K1JK4q
5549C6mjj3K6rJj0j4m8L9j3oj7M6k0n4Q9k4o0K8JP8m5k3k4K9N6k0l9K7J2l6J9
5582Go1Q3p0J7L0mp7O1N6l5k6M1mJ7p1J4P3o3M5l2%k7J7j8N7l8Pk8J5N0p8M5N0
5615E3n2J1Ql2L8q3Q3m4Rq4R7K3n5Q6k9Jj7j3oK4n0O7pj3k7k2L4k1L0QOj1m8M8
5649A2k8QJ5l2N8j08Q4J0r4O9mm3K1L0K3k1MLM2j5m9j7N9J6q3M3K2m9K2jl1L9
$$ plain form
5415 -16 -54 10 24 -15 50 27 -26 -29 -32 -14 -23 -18 -8 -11 -21 -4 9 -15 16 -28 13 -7 -45 -3 -40 3 37 12 -64 -21 -38 -25 7
5448 7 51 24 -8 -20 48 11 -62 4 -35 -12 10 -27 13 23 23 -23 5 -2 9 17 -8 -6 4 -12 37 -21 -48 25 -36 22 4 -12 -14
5481 -14 -18 26 14 -28 9 4 16 16 -41 11 54 -7 29 37 15 38 -13 11 49 16 51 11 -7 3 37 22 23 3 13 -6 -10 31 27 64
5515 64 6 -5 85 -3 23 22 -4 14 -11 -5 -21 -15 9 -63 58 -16 15 -52 -11 7 28 -19 14 11 15 7 -11 -16 29 -2 19 20 44 36
5549 36 32 31 18 44 35 36 26 12 -36 3 -10 -16 -33 13 -7 -61 28 4 -56 -28 -27 51 6 -17 -41 -12 44 24 -15 12 24 -12 7
5582 7 -54 29 -41 -24 6 2 -75 -14 42 7 -19 22 18 35 -36 -22 51 -12 33 1 1 -26 -9 -27 30 -8 -1 -29 -14 36 -42 3 53
5615 53 1 12 20 -12 26 -57 26 -18 -9 -93 4 27 -28 58 29 30 13 0 -6 18 -32 35 28 15 -12 -34 0 -21 9 17 23 12 -36 12
5649 12 -16 -8 7 -25 33 -75 9 19 -75 -6 -10 -53 -32 -2 21 0 4 7 49 34 -15 -32 27 43 -40 3 25 -24 -2 -3 -34 5
5681EL9pqNk6l0K0%K4M4o0K0nj8m0rK1JklM5m7RK7M3m1M2l9k8J7L9n3KK2K4ol4
5718gM5m4K1l2K5p6N2L5%l9J7l7N5m0K9L3l4j1M8Jk6PJ9k0j0j8k6N5k4L7p5J6
5750b4M0l5M8Oo1J7OrMM1o2M1K3m8J4J7nm0J4j7N4k5k2K6pJ8Jll3K2m3k5R6o1
5784c2J0L7l5L1j7m5K3K0M2k6k2K8N2o5on0KM6P5r0O6m4L8L7l1r8MQ2ql8Kk7K0
5817a9Lm7O6m2M0L4o4L3Jj9k3O6m1J5k9J9j8Pn2N4MM9m5j2J1jLL2m6N9K3n3oj2
5851a0QjpRJ8l8J2n2N6l4LK2lK0j0k4K1RJ1K4J4o7l5M5kK4j7Jk2QM7Km8L4k1J
5887bj9L0jm1M7rj4KJ1Rpk2O6kj1mn4J1qK9j2joJk2Km3P0J5j3kK4J3p6J6J1J0
5924bJ1k0j7L0pl3J0P2p0L5l6O7q6M9L7m3jJ0k9oL3j6J0K9n4K4M5o0m2P6nn5K8
$$ plain form
5681 5 44 37 29 34 8 -22 -2 -2 22 66 6 26 21 3 -37 -46 -25 -24 -26 -29 16 -31 -22 5 48 7 49 10 -18 -1 38 -15 -13 9 33 27 -7
5718 -7 38 -6 15 -17 8 -68 -16 19 19 -20 -3 -40 15 -25 4 37 3 -8 40 41 15 22 41 21 11 -7 -33 22 -2 35 -40 -24
5750 -24 16 -19 29 35 -26 -9 -3 -12 -8 33 -29 12 35 -13 1 18 13 -27 -13 -30 24 -1 -23 3 -4 14 15 12 -21 1 -42 -67 29 -32
5784 -32 -22 15 -20 11 -6 -51 -28 -8 34 8 -14 14 66 1 -5 -55 -53 -7 68 -22 44 0 38 75 44 -54 -50 32 24 -14 -12 -39 -19
5817 -19 -16 -63 3 -39 1 35 -29 4 5 -14 -37 29 -12 3 -26 -7 -25 -18 -70 -16 -12 37 -8 -20 -9 -10 -7 25 -21 38 61 8 2 -10
5851 -10 -2 -3 -10 -1 17 -21 -9 -61 -5 -39 -36 -14 -17 3 -7 -31 -10 -1 10 34 48 -19 -54 -9 -11 13 -4 -3 -25 -17 30 32 -16 18 -3 -2
5887 -2 -21 9 8 -33 14 5 -9 -7 4 13 6 -16 50 48 37 33 -21 -10 -18 11 -1 -2 -8 -7 -29 -27 -70 0 15 2 0 24 37 -39 -23 -12 -2
5924 -2 9 -11 -28 2 -5 -38 -28 44 -26 9 -27 40 -46 3 40 -3 -4 6 -23 -29 4 -12 -2 27 -27 -3 42 -18 -60 16 11 -44 -16
5957a6pJ6L8rl4J0J7K9l5Rql6LQ8q8J5K6l6k5L4j9L6RJ8m1L7j6j5l8j9K3l1Q1
5990A6k4jRJ0Rk8N6n5j2J4kkK8Ln4L7joj2MJ2M3o4j5K3KK8m2K1k6J0Ol7Q1m9K4
6026FkQk7NnNJK6j8o3O6rKL6o4N9r0P8%j6j6K6Ll0M6k8L8o6O1m3RM1k6J0lMn2
6063b8LJ9k4L7JL7n1j1M4o3lN6Ll1j4J5l7P7l8m4O6J7k2j1j6L8j5M9o5J2J3l5
6095b1K3M3k7m1L3j2kk4m5N9k9J0N1j3pPJ0m5O0Lmo3L7ln1k0K7Q0k7l1K6n6L8
6128a4k2Jl1N8k7J7J8k3K4J5m0m0L0M9n7P3n5rK7j0Qk4nM7m1J5K5J1m7QPJ0j8
6161b0K0Pl4M7lo6K6N7Oo8K5k5N7n0J3N7k3J1r1K3j2L6j4N3l5l8M7m2L7k2l2O5
6193A2l4Pn3O3K0rk7K1J1k5K3M1j2m1j1k5P5m1j0k7N7m0MJ6J1o1MM3M8m3jl6M3
$$ plain form
5957 -16 -23 -7 31 22 -12 -2 15 44 9 18 10 -26 -23 65 -23 -8 18 -18 -43 -9 -28 8 17 35 -6 31 15 0 -38 -57 -34 -65 16
5990 16 -8 -9 0 10 19 -9 47 -8 -20 -6 -8 -10 18 21 -33 4 3 -3 -15 -11 1 44 -20 -35 -12 -10 18 -24 -3 -29 -19 -13 -50 31 -18 6
6026 6 4 12 -15 -10 -15 -10 -9 17 -1 -64 2 -7 -5 31 -33 26 -64 14 14 -2 -18 8 11 -19 27 -1 37 -29 32 -11 -2 39 13 23 20 24 -28
6063 -28 -25 -6 -30 7 8 45 -6 -17 27 -36 -39 17 20 -11 -25 -10 -47 30 -8 -52 14 31 9 -2 -18 20 5 54 -11 1 14 -21
6095 -21 2 45 18 -23 10 -2 -4 -28 -73 -14 -43 -33 18 5 -2 5 15 -30 30 33 29 -34 3 0 -51 -71 -44 36 9 -22 4 -52 -14
6128 -14 -36 -35 -66 -8 -35 -18 0 -23 1 16 -24 -64 -34 15 -42 31 -24 -33 -6 -16 -8 -32 -37 10 -31 -16 9 20 -27 -19 -12 -2 -20
6161 -20 0 7 -27 20 17 -49 -23 34 40 -28 -3 -28 29 -21 -8 49 26 37 -54 -31 -43 -7 -21 32 -3 -41 6 -36 1 -21 -53 12
6193 12 -22 -15 -68 -5 15 6 -21 0 11 -14 9 50 38 -3 -14 -39 36 -5 -15 -42 15 -25 -21 -5 6 -55 -51 -8 40 -3 -4 -40 3
6226Cj0K2M8o1p9N8M5n2j1PPM3mn7M1j9M7oj5oM7n8j8K7J0J7k4L1jj5O7r4Kj4
6260b2L5j2jm4m2J00K7j4o2M5n0O3m6K2l3Q5o9mJ5K4MJ8m0j8NKk0K0j8JJ8K8M
6293B1o1L0J1l1K5j4L8Jn3P5j6k2k7L1PmLLLPk9j7jQN1J5n7m6L3k8mM7k6kQ4k7
6329B8m8M4n4l1K3P4rn1L3j8k1K7mm1N7OK1pm3QJ7k9Q9l4kl6j9QL6n3qJ05l4K
6363C6k9K8n1j2L7k7N5o0O2pl5kM8j4k0j4k0J8M4l8M5j6%p0L0MJ6k7K6k7j5J6
6395a9L5m0L1oL9o0QJ1j8J6M5p6N0k1l7L2J4Mj7l7Q3q8oN8L5k7rol1O1l8Q5p5
6428dJ9J3n9M0K4n3N6jm6K3lj7k8N1k7N0o2k6Q6p7N7ll5K4j8lk2J0O7l9J4J7k6
6461Bj1J6mnL9q3N3j2oJ8k9N1jj6j3m7O8k9J4k3j5M7j6n8QK2J2j2N8p6M5kk0M3
$$ plain form
6226 3 -7 15 63 2 -77 -19 26 -26 -37 -30 -23 20 16 -41 0 -19 28 22 7 1 48 -10 -28 -1 9 26 2 33 32 17 84 -10 -8 -22
6260 -22 13 1 0 -44 -86 14 41 27 -35 10 -40 23 -23 -1 -34 51 -18 -22 -7 17 21 39 -1 -19 -14 -12 -32 -12 -30 -29 -11 17 21
6293 21 -40 -10 1 -30 -5 -19 19 20 -33 42 26 4 -23 8 15 11 14 17 20 27 -2 -19 -20 -12 39 54 -3 -49 -16 -44 -48 -1 -27 -29 55 28
6329 28 -20 24 -30 -61 -38 36 27 -24 9 -9 -30 -3 -7 -48 9 15 36 29 -14 -6 11 -18 71 37 35 -1 -20 -12 24 -29 -37 68 34 36
6363 36 7 35 -16 -28 9 -18 37 -23 39 32 -3 -5 43 29 9 -5 -25 -7 37 -1 44 28 28 -42 -12 -8 8 -19 7 -20 -35 -19
6395 -19 16 -24 7 1 40 -20 -12 -1 -19 -3 42 -34 16 -5 -42 -10 4 8 -9 -46 37 -51 -57 1 36 9 0 -6 -37 24 -14 71 -4
6428 -4 15 28 -31 9 33 -20 36 35 -11 12 9 -8 -36 15 -12 38 -24 -50 36 -41 16 13 -22 2 -16 -19 -41 -31 36 -3 11 28 2
6461 2 -9 7 3 -2 37 -46 7 -5 -11 7 -22 29 28 12 -1 -48 20 -9 5 -18 -33 14 -2 -60 -52 -30 -18 -30 28 -48 -3 -5 -25 18
6495A8k3kK3n5Q0k2o4N2j4MJ4j6km9N2Rj0J7Oo4N1l3Kj5M3l%k0kl7N4k1MN2n1
6530b2J9mm6NL0K0k1RK8Lj9j8J7J4J5l7J6k8k3M3mj8kJ1O2J9n6oJrJ5n2J2J2M6
6565C2Mp6K0j2k1L9pM6j6jqK1q4P3l8rNL7l7L2O3p5l1P1m9K4k0ML1l2rK5J7k4
6599eK8m8K6Rl7K5K9n8L2k7L8m5O0k7l9R2m2k2L2k7P1q0K2k2P0l7Ll7K9j4Pm8
6631d2L3j6P9n1J0j8J7J4l7J7Om6Q3m3J5rm3M1m9Q1p5J4j0K5L7k9k4MM8m2N0q4
6663d4N1K8l6K5n7J9K5mrK4l5K0rM2l1j7J1j2j9k3O7J6m7j4N0k5pl6%P5qJ5l0
6696En0mN4n9k5J09k5L5n4K3L0m6j7N5l3kJ7OJ4j6j4M5m0qL7mJ1r3QK5pk9M1o7
6730g8P1L0m7K2K1j5l7N0rMl2L4k5N4L7p8j0JLJ7n1J7L7L%m5N2m2M5n0L3Om1J8
$$ plain form
6495 18 -5 -7 16 -39 41 19 -45 7 -7 -3 11 -5 -7 -56 -4 5 -5 12 18 -46 5 -28 -26 -41 2 -1 -1 -21 -23 -60 -6 -27 -23 29 -22
6530 -22 -3 -7 -53 -48 -18 2 -19 -10 18 21 2 -16 1 15 30 -7 9 -19 -42 1 -3 -21 -23 -12 50 69 13 7 8 -1 14 -38 -26 -14 32
6565 32 36 -40 -20 -32 -53 -14 -21 25 9 8 0 21 -63 10 -28 -37 -32 5 -32 0 63 -12 -43 28 -21 3 -17 -13 18 -14 -23 2 19 -5
6599 -5 23 -25 1 10 -27 -2 27 -31 1 -26 12 -33 27 0 -39 53 11 -11 21 -6 65 -15 7 -15 55 18 21 -16 13 -1 6 -42
6631 -42 -9 -25 54 3 13 -5 12 26 -11 6 12 -34 49 6 21 12 -31 10 -39 42 -33 -19 -29 -4 33 4 -20 -16 32 -10 40 -44
6663 -44 7 35 -1 24 -33 -14 11 7 -2 22 -13 7 -2 40 9 -8 3 -9 -28 -51 16 32 -15 -29 21 -4 -11 -47 -47 28 20 35 5
6696 5 -45 -49 5 -54 -79 30 5 40 -14 9 39 -7 -24 31 -2 -4 13 19 33 17 3 48 8 0 37 33 44 -49 -41 -16 -23 -52 -11 -78
6730 -78 -7 23 -24 -2 19 4 -33 17 8 12 -20 14 -11 43 80 2 -8 -7 -4 13 -38 -21 16 19 19 -26 26 -16 29 -21 12 18 -23 -5
6764eK6L0l2kk5K6J1j4ll4lKM0n9M8k2J9j4k7J6Nl1N8Jko3K6J2O0m3K1p5P5mK9
6799D7n8K6K4n0L9k4K2j5K6m5j2QJ3J9o5R3p5lPj7L5k6N9m9Qk1J4j5K8pmK2oK1
6833A9l4nPL1lRl5L9k5L3m6k1L1K3qj9L8qQm7KMJ7j5J8n9M4m4O5j0l1oj8J7J5
6868a4k1K3M0K0m0k4J3mrK1K6Mj6K1Mk2p0K6K1k3j6J0L0kL5p3J6qJ1j8KO0n7L9
6902EnL2o9M8j0lJ6j9jK3K4p9LM6l0O0o7j2K5k7P0l6J4J9k6k2Q3rk1Mk3lj8J3
6936Ek6OKk3J6L0qK3J8p6OM2l0j4L8k3o0L9P2l8lj1J7LMJ9Om7K0N2o9OL7m9KL
6972a1PJk1M1k0Mk9PmJ0L4j5j2M1k6l6K6L7j9rk8jRN1q7Q2lqm3N4k7n0N7o0O2
7007A4j5j8LP0n6J2j7l8JN4K2n1O8L0j35O3%k9P1p9j0K1m3N1O5j18K3N6q6N8M0
$$ plain form
6764 -5 21 51 19 17 -8 18 29 15 12 -22 -25 -23 17 -42 6 -16 3 -11 -38 -22 -17 -48 10 11 9 -54 -28 -16 44 1 22 -53 22 18 47
6799 47 -11 15 39 -11 28 4 26 11 37 -8 -20 -12 1 20 -45 48 -27 -30 -23 -40 -5 -31 28 -21 -13 -34 -20 -35 -7 -14 -18 4 -2 19
6833 19 -15 -20 -13 18 15 24 -11 28 3 36 -10 -31 0 23 15 -4 34 26 34 -13 -11 -7 10 -5 13 -46 -2 -46 19 9 -22 -28 -46 -29 -14
6868 -14 -35 -12 28 48 8 -16 -3 -7 -16 5 31 35 19 40 44 22 -48 -22 -1 -24 -40 -30 0 -2 33 -40 -24 -32 -21 -39 -37 23 -34 5
6902 5 0 32 -37 11 1 -2 14 -5 -6 17 41 -38 -35 11 -19 41 -26 -38 -13 -40 30 -6 8 27 1 -21 62 53 32 36 13 10 -8 5
6936 5 -21 -15 -13 -36 -20 10 2 25 43 -33 -27 15 -15 -29 9 -14 -74 -35 37 -1 -4 -15 2 5 9 28 34 -13 7 59 -10 -4 33 -16 -14 -11
6972 -11 -4 -3 -24 17 -3 1 -28 -21 -25 -15 19 4 -8 33 7 -29 -3 34 15 6 -22 -23 -14 37 -50 32 29 21 -22 32 5 -45 12 -48 14
7007 14 -1 -19 -16 54 -2 10 -7 -45 -44 10 32 -19 49 79 -56 7 7 -22 49 -30 -40 -19 -62 -11 54 -64 -41 15 -71 -13 27
7038B7pok5L5l3O6k7Jk5K0m4OmLL7k9L4N5j05MQJ3q8Q1n8K5K2K4Oj6l3K8O5k5
7072C5j2p1O7m0L9j8j1PJ4l7j0N7j8l9j6J2N9m8L3L6j3K6k0K2m9QoLL2m8j2rL6
7105In1K1j6j9O7p6M0l3R6k5m2K9j2N6p5L9l0L6l7L6NK8m1n0N4mjJ5n3PN8n3O
7138a6j5j2N3m3J3K4QK0l5jok9O9l6K2Jm0L0n1M0m7R4j08J20j21P6kl7J7K5m1
7169b8j5J5L7j3j7k2K3L0k3N6j1m2k5K7m7M5J7n5M8K3m5J3j4J1Rk8Lk4O0k1pM1
7201B1k8QJ4l8K6l7K7J5P0q1J8K0m3o5R6K6p3kJ9o1L9P8q1O8j5mJ8l1%oOJ4m8
7234c0O3l8rJ2O5p4L3j4k7J4J6k8N8m3K5J4n8RK0L7r2N8k9K5j8N7m3N6l1p6Q8
7265D0l4k3L8pj9M7j1rj3m4j1pM3oJ7l8O4o1L8Qm2M3j8qkm6P9k7j9P3l7k8N0m4
$$ plain form
7038 27 20 14 -11 24 -9 57 30 31 6 26 -18 -12 -16 -13 24 -5 29 84 -21 -17 -9 4 -84 -3 -61 -36 -14 10 16 0 -33 -5 60 35
7072 35 23 -48 19 -21 18 0 -11 -4 10 -27 -37 20 2 -37 -53 -41 18 -30 3 39 26 52 32 54 5 13 7 10 42 -6 -18 -27 9
7105 9 -42 -21 -37 -56 11 -65 -25 -58 38 13 -29 0 -12 44 -31 8 -22 14 -23 13 18 46 5 -45 9 5 4 19 -34 -27 31 -22 -16
7138 -16 -31 -43 10 -33 -20 4 12 32 -3 -4 -10 -39 30 -6 16 17 -23 7 -44 -4 -51 43 -65 55 -66 10 8 -29 -12 13 -28
7169 -28 -43 -28 9 -4 -21 -43 -20 10 -13 43 32 -10 -35 -8 -55 -10 7 -48 0 23 -22 -9 -23 -12 -3 -31 -28 -52 8 -13 -20 21
7201 21 -7 1 15 -23 3 -34 -7 8 78 -3 15 35 -8 -73 23 49 -24 -26 -7 -68 -29 49 -32 36 21 17 35 4 4 -2 4 18 -30
7234 -30 33 -5 -14 -2 63 -11 22 8 -19 -5 11 -17 41 -2 23 37 -21 -12 8 45 -47 11 -18 7 -11 46 3 59 28 -48 40
7265 40 6 -17 21 14 -5 42 31 22 9 -35 -46 -53 -10 -16 1 -37 27 -34 4 12 -30 13 -5 -13 -15 -61 18 -9 -28 45 8 -20 30 -14
7299a4j1N7Kj00P6j2k1J9l9P6k8J2Kj2K7j6k2p%M3L5p0k4l6L6pj6N1J6l5L4m4
7331b8L1l7P1q1MK0O8j2k9ML4n9K8J3n0PKoj3K9j6%M3j09P8l8P7J5k2m5rlQ4o2
7365a1oO0j3k3l0Q6n7K2k3j1oK7m0J4M3k2jj2K5l6J7k8o8J21j6pN4m2J8k9J5j3
7397HK4j2l6J9j4ON9p6K6K2l8n0Q4m7J4J0l6M9n0L3J6J9k0qqO7q4J3rK4m1L5Q
7430Gl8L3K3j0l7j6K3l6N2rm4K9J1j0pL3K7o3N8ql1RN6r7%KJ6jL4j8L0O2n2j6
7464A2n6O6l6J6O1n8Rj7l7M5j7J9L2j01J8L9KLK3M3l7m8NM1n1M4kl8K9j3m9O4
7496A1RQm5L9k8m6N7K3mn9O9nk4J1l0nJ7J1m2J3%j0K2LL9n1K9k1k6M8m3L7O0q2
7530a5RO6o1On0N4J9k9Lk1L0N7q3P1l6j0J8p3O2J0j9k9M6qM3mo8K1PLnj2rK0j2
$$ plain form
7299 -14 -25 32 34 -66 10 -2 -23 -4 -43 33 5 17 19 7 34 18 -4 -11 -11 32 67 -3 -27 -63 -27 -34 -50 1 17 -18 16 -28
7331 -28 3 -34 37 -44 -40 -20 48 36 7 11 45 -14 14 27 -23 -16 -14 -20 -33 -4 -20 -20 23 -86 -8 -46 31 46 24 -21 -30 -33 51 -11
7365 -11 -17 43 30 7 -23 63 6 28 5 -6 -12 15 -25 -11 32 10 9 -3 22 -14 3 -25 -93 28 12 5 59 17 35 6 21 8
7397 8 32 20 -16 3 -11 -5 54 -22 4 26 -12 -62 22 -25 -11 -1 -37 12 -38 -5 11 30 10 2 -6 61 -23 -10 -19 5 -36 -1 7
7430 7 -31 2 25 15 -22 -38 -15 -51 1 -8 -52 -23 -12 -22 -29 4 31 -32 26 18 -13 -4 52 -45 -45 -43 -27 -28 6 -12 18 80 28 12
7464 12 -44 22 -14 2 63 5 14 -3 -40 5 -12 7 39 -62 -44 -5 -3 0 23 66 29 -19 -14 27 -24 20 18 -20 9 -4 -53 11
7496 11 20 28 -17 22 -6 -52 5 28 24 -35 34 29 5 16 -14 -19 -2 9 -33 -20 -20 -30 -8 -5 34 -17 12 -9 -35 13 -30 7 67 -15
7530 -15 -6 60 -1 5 -45 9 28 -1 2 -19 11 68 -15 56 20 10 28 -45 17 27 8 -21 25 17 60 56 -12 9 16 19 14 2 -7 13 1
7565AN9m3Mj3O3q4J6l5j7L9j2O0p8M6j6qN7mn0O6j5k8Nj6N1p0M7J7ml5MK2l6L5
7599B8l8kJ5njn7MQ0n0MJ5n7J23l6l7L1j02J24m8k6N2l7N9n1kj5j6M1J8j5k8j2
7631d1J5J0L1k0j4lJ9L3k5m6O5qnj4n7M2k8M6RljK4j0q9R3m5L5n2J9L2pk2Qj5
7665b4k7M6j4M7l3j8K8oL5o4L4K6j5MJ7o4J5K6k0K0L0k2o1J9K4p7K3Q5p4M1k9
7696b8M4l2L2j0j1J0j0K9k7L3l7M2j0k9J1n1J4K3j3QRm2M9K1k5k5k6P0m0P7J7
7727G3l7l7n6O7p7j7P3M2r2M8nK1k8M2n1m7Q6L0m0qK4k1L1m2P6l7j5K1kl0J5J2
7759A9n2J1J8M5o5K3k6P1j01k1J07j2mk3OK0j4qpL2oN2q3L2j5j7JK6KKk2j9M8
7792B0m2j7K9J0j3L7J2m5%R2m8l7J1j3L7k8JK1j6J1o0mL8j8J4L6m9k8Jk0Q4l2
$$ plain form
7565 1 60 17 21 8 71 -13 3 -32 -49 -10 -22 38 -40 6 -10 -18 39 35 -15 51 36 8 13 -3 48 -22 25 42 38 3 7 29 -7 28
7599 28 -10 -12 3 -2 -3 -60 -56 24 -26 -22 -7 -64 59 23 -14 17 -85 39 -9 -35 17 -20 39 -12 -14 -29 -45 -4 14 -1 -29 -41
7631 -41 -26 -16 15 -5 -19 -22 -3 30 5 -41 24 16 11 -3 -60 -18 -46 0 9 6 5 29 19 -70 23 -22 13 -39 -20 12 5 -17 -9 -24
7665 -24 -51 -5 -19 28 -5 -23 5 -1 34 -30 4 30 15 19 36 -28 -13 13 -7 13 43 21 -40 -21 3 -74 -51 34 -40 1 -28
7696 -28 16 -16 16 6 -5 5 -5 24 -3 30 -7 35 25 -4 7 -44 -30 -7 -20 -12 -3 -45 4 25 0 -25 -51 19 -21 56 73
7727 73 36 -1 -57 10 -67 -84 -11 31 -61 -13 -18 3 -25 17 -34 -81 5 35 -5 -13 11 -10 21 -21 55 18 3 24 22 -8 7 19
7759 19 -33 -22 -4 41 -24 -1 -27 44 -57 -78 29 17 13 -10 -4 16 2 -6 -13 19 13 65 -18 14 -1 -18 -17 9 11 13 -9 -28 20
7792 20 -22 -39 -10 0 -13 24 36 -9 -9 83 35 -2 9 -4 33 5 6 27 11 22 -38 -42 -4 -22 -8 28 -21 -49 -48 -68 16 -16
7824a6K1j1L0l9J0l9J9QJ7Nk3Kk3O9J9k8m7K9k9K3L3km0K4L9k5n8K6j5L1J8j7
7856A1M8n3PM7m7jj8MK5m6k0K8K2m6K0l7QK7J1MjM0k4j9J7J2n0L1L7l3j5K3J7
7889B9k5J2j8j9M5n3M0j3k3NK0Mj7J1J2OOnj8j2O0o4Jj3NL1lnk5K7L1o7K3m0Q0
7924B8l3j3N4J2n6j9PMJ2J0l6k9M8%K5k0k2KL7kl8J8K3k4k3M5m7N2j9j1Lk7J5
7957b4j5M3o4P1k1l9Q9n2M0j7l5K6K4L1p7qj2O9No9J0M7n2k7R5m5MN8o5k0K4L0
7989B4m3k7J5M2pJ6mk6O0n8RPp2O9K7p4K8K3rk0K1j1j6n1O0jP7l7j6K7j5o7O7
8022A8J4mm0K5k9N6m3m8P3l1j9M5k5J4Nn6R6p4J6Nk1qj7L7lJ0Pj3N5J9j00K5M6
8055C5m0L4j1j9l7L0M0k2l8K0k7QL5Ol5j9L9J9k0j6N0k9L6r9J06p4O0o8N9kk2
$$ plain form
7824 -16 5 -6 24 -15 -5 -44 -25 -17 0 5 -18 -16 -39 30 49 21 -26 3 -26 -3 30 28 -12 12 51 26 -32 -6 -21 10 28 11
7856 11 59 6 13 60 13 12 -6 -2 23 -23 -43 -15 7 -39 -19 -56 -48 -21 -10 -6 -7 33 9 -10 7 19 -31 0 37 4 -11 12 29
7889 29 4 16 -2 -21 24 -29 11 -2 -25 -20 0 4 -13 -2 10 16 22 17 -1 -13 47 -17 -16 -29 -24 7 4 -1 -26 1 32 -35 -12 -52 28
7924 28 -5 -18 36 48 -8 -27 -20 -16 -4 6 -30 -59 -11 -11 14 -6 -28 -26 11 9 -29 -11 12 -12 -35 10 -37 15 -4 -15 -12 -39 -24
7957 -24 -39 4 -60 11 -10 -49 40 -12 28 11 -24 2 26 57 -20 -28 -40 29 34 -35 -25 22 -30 -57 38 -7 -3 55 -10 -30 -6 24
7989 24 -19 -46 -31 11 4 20 16 -10 50 -8 1 8 -64 5 32 -42 -14 9 0 -20 1 -10 -26 -77 -17 -18 59 22 6 33 18 -49 18
8022 18 32 28 -12 13 -16 40 -3 -51 22 -9 -28 17 -8 6 11 -45 51 -23 -7 -2 -23 -31 -48 -11 -14 -4 3 -10 45 64 -36 -11 35
8055 35 -5 29 18 -1 -38 -8 32 10 -28 -8 -35 -27 8 14 -21 -40 -1 18 -2 -18 32 3 39 -60 46 -28 32 -36 23 21 -1
8086ak3M3M1r2O5l1K5Kk3Ok6j5O4l4rK6j3mjj2J7l6K1NMkN5k2Om3j1k7L3J0Rn9
8122e2K3K8J0K9m4K0j3K8J9j5k5L1m7JjjK1l5J0k7N2l8m1J02k5l8MRqJ3J3j6K
8155a1Lj5M9Mp4P3m8K9k0L4l4K1m5JP9o0o0O8j4m5O5k0k4R5k5j8L4n2L5L4j5k1
8187B3j4j5N5o6
$$ plain form
8086 -1 -24 19 60 -32 33 2 27 29 6 12 -14 -29 35 1 -8 18 5 1 0 -12 5 -31 -10 -5 -1 -3 52 30 36 -7 -18 -45 -12 -2 7 -52
8122 -52 -29 -1 9 38 -6 14 1 29 48 33 8 39 -8 -7 -8 -9 12 -23 -13 -40 12 -26 -67 35 10 -28 -24 -15 -23 -10 3 -13 -11
8155 -11 -8 -23 26 30 -44 29 -19 10 -10 24 -10 11 -34 -33 46 -14 -74 -6 -20 -65 0 -20 -44 51 26 8 42 -10 25 59 44 23
8187 23 9 -6 49 -17
8191a7
$$ Imaginary data points
##PAGE= N=2
##DATA TABLE= (X++(I..I)), XYDATA
0@%%%%%%%%%%%%%%%%%%%%%%%%%%%%%%%%%%%%%%jKkKlMnOpQrJ1j2J2j2J2j3J6j8
57iK0k4K8l2L9n0O4q5J24j94L46q18M179K3523j7113m7779k7006J5522L1856J1871
77e538q356n396R043J5508J2525J0069N599p553j5821n810J0845R796j3695k9077
91a7861j1695J6489J9850m607k1612o332J7955J8001k484j4542l443J1566Q236
104I521m289p235M91M857L26q77N329N664l866j1045l605J0170O978j1502j8677
119a7760l968J3355R140r168j2555M649J8732J1820m879o595O053J0792J241q732
133A2125o643O72j900r587q804n75L297k288n668L418J1991P089l613l318R651
148E847J5519K156j3127j0478N031J0650l396j6335j0835M199R242j07q348l747
$$ plain form
0 0 0 0 0 0 0 0 0 0 0 0 0 0 0 0 0 0 0 0 0 0 0 0 0 0 0 0 0 0 0 0 0 0 0 0 0 0 0 0 -1 1 -1 1 -2 2 -3 3 -4 4 -5 6 -6 6 -6 6 -7 9 -9
57 -9 11 -13 15 -17 22 -28 36 -49 75 -119 227 -591 3588 27111 9998 -37781 -64787 -49265 -17409 -5538
77 -5538 -13894 -19290 -10247 5261 17786 27855 33454 25901 10080 4270 15115 24911 11216 -17861
91 -17861 -29556 -13067 6783 2176 -19436 -25768 -7813 10188 7704 -6838 -10281 1285 9521
104 9521 5232 -2003 -1512 3345 3671 2794 8123 13787 9921 -1124 -4729 5441 12419 917 -17760
119 -17760 -21728 -8373 767 -8401 -20956 -16307 2425 14245 9366 2771 8824 19616 20857 12125
133 12125 5482 6154 4254 -5333 -14137 -14712 -11415 -13703 -19371 -15953 -3962 3127 -486 -3804 5847
148 5847 21366 23522 10395 -83 4948 15598 12202 -4133 -14968 -10769 -1527 -1634 -9982 -13729
162a3729M498O079K942J753K689n46n247j327P549Q667k675j3520o860R444J2892
177A2609j268j4742r125P427J2078P53j0665q723K334P335L266r41j922j431q99
192c914K075P075N821l262q988l435P833Q971l943j3357p004O719J0373n51j0114
207e701o240M384Q552L285k570k070K40Q79J375K395J903k395o200k431M898N375
223E679k408q895l966O387P888l86p240l998M369O076N28l198j518J889J111j487
239H31n25J456L98k308k922P75L223k62l780k222K625M446K12l098o57L014K829
256D035r05k528R00K600l19l776l199J242K906o36l323j939J555K647J31j067
272a676N02J390J069J03M71J208n08k322r82J943K775j098m863k565K371M191
$$ plain form
162 -13729 -9231 -3152 -210 1543 4232 3686 -1561 -2888 4661 13328 10653 -2867 -9727 -283 12609
177 12609 11341 -3401 -12526 -5099 6979 7732 -2933 -11656 -9322 -1987 1279 338 -1584 -3015 -3914
192 -3914 -1839 5236 11057 7795 -1193 -4628 3205 12176 8233 -5124 -12128 -5409 4964 4413 -5701
207 -5701 -11941 -7557 995 4280 1710 -360 -120 759 2134 4529 6432 4037 -2163 -4594 304 5679
223 5679 3271 -5624 -9590 -3203 4685 4299 -2941 -6939 -2570 3506 4034 836 -682 1207 2318 831
239 831 306 1762 2160 -148 -3070 -2295 928 666 -3114 -5336 -2711 1735 1947 -1151 -1808 1206 4035
256 4035 3130 602 1502 4102 3783 7 -3192 -1950 956 320 -3003 -4942 -3387 -740 -609 -1676
272 -1676 -1174 216 1285 1388 1859 3067 2559 237 -745 1198 3973 2875 -1988 -4553 -2182 2009
288B009O19l754l003J357L255J521j671k060p8J119J543J021m24j542j620L12
304a396L073K223j304l984k298K380L808L75l178l131O34L361J592j201k025o99
320a770J525J802P72n80k066j439M27J871J658j095l075j562J271K732J153j743
336a19j855K76K114J912k13j372o06L31J264P62p06j455j696n77J051J028k55
353a16j545j561L81J748J547M19q65l64Q93J360R06m81j290p61O0N01J36j369
371d01j664q05M35J564R84l46p95l11J161J945Q77m65j525p69O26P57k03j496
389d31j658J69J290R71j58j231n23P52J443J048j67j415j033jR72J035m21j299
407f57p48O66J669O64q58r40nJ126Q49p59j361j051j88N70M12O1l84n82K58J111
$$ plain form
288 2009 2628 -1126 -4129 -2772 483 2004 333 -1727 -1805 -686 857 1878 1454 -88 -1708 -1396
304 -1396 1677 3900 2596 -1388 -3686 -1306 2502 2877 -301 -3432 -2798 563 2155 954 -1071 -1770
320 -1770 -245 1557 2329 1749 -317 -1756 -1329 542 2200 1105 -1970 -3532 -2261 471 1624 -119
336 -119 -1974 -1698 416 2328 2115 743 137 468 1732 2494 1788 333 -1363 -1940 -889 139 -116
353 -116 -1661 -3222 -2841 -1093 454 873 8 -356 537 1897 2803 2322 1032 271 331 832 968 -401
371 -401 -2065 -2870 -2435 -871 113 -233 -1028 -1339 -178 1767 2644 2179 654 -115 511 1268 1065 -431
389 -431 -2089 -1920 -630 341 183 -1048 -1571 -819 624 1672 1505 90 -943 -944 28 1063 642 -657
407 -657 -1405 -739 930 1594 736 -204 -209 917 1766 1007 -354 -1405 -1593 -1023 -611 -550 -934 -1516 -1258 -147
427a47J386Q90n55q02J99N75J36j001j608p41J65K93o0n01NN73O78J178J116N01
447B280j14p80k38M40K39p85j657j306l0L11j2l07k98N49R95Q50P13J92p9k6K49
468A186O73L27q50j222q75L99R75N2q54q41p7Q32N08l81o26n29K32N20P0q1m72
489a034j73O62J197Q85J94o86l15N02O86J45j012j288o42k0R1l05p85k84M04Q53
509i25P99K00K1K06M59Q18M25l27n92p83m44O9j65j86o27n80J56M78M87J93q1
530c99L34O14M81K07j95k26n1j22n5P2k67n33p90m24N09M23n7n46n46M94Q98M16
552B37n4l11L64Q69L49m1l97l89J3r4k0K5o33r88n70L92R93J49q93n22M95J445
574D19O06p79o09L99J018N08o70q10j07J04K73ok00j83o86l82N54O54M0r05p51
$$ plain form
427 -147 1239 2129 1574 772 971 1546 1682 681 -927 -1668 -1503 -1210 -1270 -1771 -1766 -1193 -515 663 1779 2280
447 2280 2166 1386 1148 1588 1827 1042 -615 -1921 -1951 -1640 -1652 -1959 -2257 -1708 -713 137 850 1042 963 937 1186
468 1186 1859 2186 1336 114 -761 -362 613 665 -189 -1030 -1107 -275 233 -148 -774 -1303 -1071 -551 -481 -562 -1034
489 -1034 -1207 -545 652 1537 1731 1045 730 1232 1918 2063 1051 -237 -879 -899 -808 -1113 -1898 -2182 -1778 -925
509 -925 -126 74 95 301 760 1578 2003 1676 1084 301 -143 -74 -239 -425 -1052 -1632 -1476 -998 -511 -318 -399
530 -399 -65 549 1030 1237 1042 816 765 643 588 660 393 -140 -930 -1354 -845 -422 -479 -1025 -1571 -1077 -179 237
552 237 183 -128 236 1105 1454 1413 1016 627 640 546 526 551 -82 -1070 -1640 -1248 -255 -106 -999 -1521 -1026 419
574 419 1025 246 -363 36 1054 1562 892 82 -25 79 352 346 146 -37 -723 -1105 -551 103 143 -762 -1513
595a513P93J242K75j059p79J006J567K18j036q79L36R52q9q57o93j53ll42j11
614a125L73Q1l01M8Q69J254K8j223l77J178J422m69k091j057J010J049k77j586
632a194o39J143J056J18n73j57N92L30r7J73L5o16j102l70J060R94r42j580k33
651b002J820J804o59j658j44J646J578q80j790l92P66O41l37q60j38N5k26K07
669e69P56O07o00j282J42J619Q62j285k001m0K194J143j184j884R0K044J283p71
687A124j219p8R21L43o82l65k0k81n64j61P52M47j012r64O53K005Q87j589j624
706a427P44K126O65j861j813N74J722L87j324j128N47J209J66j75o3J58k81m16
724a90N07R78l71j675j200J019J985j26k202j293J419K536K79k061j317J172J931
$$ plain form
595 -1513 -720 522 797 -262 -1041 -35 1532 1750 714 -165 171 1123 1034 177 -516 -669 -672 -1014 -1125
614 -1125 -752 -671 -972 -924 -55 1199 1227 4 -373 805 2227 1758 -333 -1390 -380 669 392 -1194
632 -1194 -1833 -690 366 484 -89 -246 346 676 579 752 787 171 -931 -1301 -241 753 -189 -1769 -2002
651 -2002 -182 1622 963 -695 -839 807 2385 1505 -285 -677 89 730 393 -467 -605 -550 -776 -569
669 -569 187 794 194 -1088 -946 673 1535 250 -1751 -1791 403 1546 362 -1522 -1432 612 1895 1124
687 1124 -95 -173 748 1091 409 44 24 -257 -821 -982 -230 217 -795 -1759 -1106 899 1786 197 -1427
706 -1427 -683 1443 2108 247 -1566 -992 730 1117 -207 -1335 -788 421 587 412 349 507 226 -190
724 -190 317 1295 924 -751 -1951 -932 1053 927 -1275 -2568 -1149 1387 1666 -395 -1712 -540 1391
741A391N04j324j038J86N56K07jJ4l88r83k62J224J252n26k125q87J837K213l80
760A470k448j403J652K315Q6j848j298Q13J476J64o26m47j27o3N4N85O78p43j422
779a132l63J571J625o77k271p34J791K024m34k236q05J316J481j29j326n71O75
796a95N39p0k00N4J4o60j72R20P64n08j388l89J491J183p22j613k23J417J171
815A413q95j453n6J320P56p53r09J72O43K06m09k47M42Qm79k1M26L68o83r58M38
836f71J172L40j184j189P02J675M47j206j189O40J507M54j040r23Q7Q11K12m01
854B44k88l32k55JM83O59k79j132n52J051J472J28j641j112R47J730M75j422j197
873a020L24J222N77m90q60k48J58L48M53J19n17q16l25J013J137l43j381q76R46
$$ plain form
741 1391 1895 571 -467 -281 275 482 481 495 107 -876 -1138 86 1338 812 -1313 -2200 -363 1850 1470
760 1470 -978 -2381 -729 1586 1672 -176 -1474 -661 815 979 353 -94 -221 -284 -230 355 1033 290 -1132
779 -1132 -1495 76 1701 1024 -1247 -1981 -190 1834 1400 -836 -1641 -325 1156 1027 -299 -870 -195
796 -195 344 274 74 128 142 -518 -690 230 994 486 -902 -1291 200 1383 661 -952 -1175 242 1413
815 1413 518 -935 -991 329 1085 332 -577 -405 238 444 35 -212 230 238 -241 -262 164 532 -151 -1109 -671
836 -671 501 841 -343 -1532 -830 845 1292 86 -1103 -463 1044 1498 458 -465 -378 433 645 244
854 244 -44 -376 -631 -630 -147 512 233 -899 -1451 -400 1072 1200 -441 -1553 -606 1124 1599 177 -1020
873 -1020 -696 526 1103 613 -247 -495 -337 11 464 583 66 -750 -1075 -62 1075 732 -649 -1525 -579
892e79J540R9j340r82L83J311M21o07p65o9N44M42J16J7l16l94p1N58N47j33j088
913c66n35N54Q37J35j006p54L98Q05K85m59n07J82L42J65R0p7J62q3k55K41M09
934E63R4k06n68R1M65P7l87n01m7K76n8k38lR1J01k00p5M67M25M8l18k57M58M05
958G03Rm59l86J0K88L5j22l16k33j5K30L04K19k96l38jM94N33j43o07l95K31N89
981C34K09m16m61j47L31M39K9k96l23j26L07N06l6k72m99m7N32L78j1m39l77J54
1003b31M61K95j89m73l26K27L34K25k22m88j28J93M73K09k68k63j02K43M85J33
1023E88l54k70k38K00L44k4k68m98j57L83M47R7l66m01K49M08L96kl55k72O7L07
1045B81K65l4n28l82j23L79M15k44n81l57K85P37L31l78m38m2N69N76M3l34l68
$$ plain form
892 -579 961 1060 -280 -1262 -879 432 853 246 -519 -588 -44 398 514 531 215 -179 -250 308 855 722 -366
913 -366 -901 -347 490 625 -381 -1135 -737 68 353 -106 -613 -431 -89 76 166 89 251 168 -87 154 563
934 563 657 451 -117 -26 439 516 129 -372 -419 -143 -201 -439 -442 -351 -250 -450 -525 -58 367 415 97 -160 298 703
958 703 712 253 -133 -123 165 200 78 -238 -471 -486 -256 48 267 -29 -367 -368 126 659 516 -91 -486 -255 334
981 334 543 127 -334 -481 -150 289 318 22 -301 -427 -120 386 350 78 -421 -468 64 442 431 -8 -385 -231
1003 -231 230 525 336 -137 -463 -236 98 323 101 -387 -515 -322 151 360 92 -171 -273 -30 455 588
1023 588 234 -36 -274 -74 270 246 -22 -520 -677 -294 153 250 -116 -517 -268 140 536 534 179 -93 -26 281
1045 281 546 512 -16 -398 -521 -142 273 29 -552 -909 -624 113 444 66 -372 -414 155 731 774 440 72
1066G2j14L21K82L7l85o56j67L83M53j3o52n56K73P32L90k18o51j01M60N42J65
1087E97l17k06j59K27L70R4k57m51k49J67N34j8m16o51Q0O22M14k78m64j96L60
1108a97N30L1j49k10k5O7P8J36q6l23k62J07K41K85j78m05J2K87M54P3k89k2N
1131A60J07Kj24j0o4m08j54J37K36K2m57j38K13M73L14k16k98J76L01K73L8j98
1153C85j08k02l4K38J64j86m97l80K17M57R8m04n74M9O77L55q1m20j70L77M37
1174C98K52o7m07j91Q5K59L21k14o14m23J47N46K17m78n99k2O20N50j07m06k38
1195c71K27N00K11q7l64k90M1L63J95j12n07m52K95M31K40l23m58j30M93L86N1
1216C39l52k78Q9L15L14k7k52j88m3J25K83r4k46l12j41L64K20j03k23k60J80
$$ plain form
1066 72 -42 279 561 598 213 -443 -610 -227 226 213 -439 -995 -722 10 400 182 -469 -570 -110 432 597
1087 597 280 74 -85 142 512 606 349 -102 -351 -184 350 332 -84 -735 -655 -33 381 103 -361 -557 -197
1108 -197 333 364 215 5 -20 47 125 261 175 -148 -410 -303 -62 223 45 -360 -348 -61 393 466 177 155 160
1131 160 267 269 145 135 71 -337 -491 -354 -118 -96 -553 -691 -478 -5 309 93 -205 -29 272 545 583 385
1153 385 277 75 41 279 443 257 -240 -620 -403 54 152 -252 -826 -777 -100 255 174 -246 -416 -39 398
1174 398 650 583 176 -15 70 329 650 436 -178 -601 -454 92 309 -169 -768 -790 -170 380 273 -133 -371
1195 -371 -144 356 567 480 116 -174 -133 230 425 313 -194 -646 -351 80 320 -3 -461 -591 -98 288 339
1216 339 -13 -291 -202 113 427 400 148 -40 -83 42 325 231 -15 -327 -468 -104 116 13 -210 -470 -290
1237b90M81O3j34j47p5P7K45P1q1k20j99L9J35K72n9l82j26J75K83K04j70k21
1259e9j64J92K76N3k91k71j14K50K48J7j81k67l1K66K90J07k26l69L0L29K38k8
1281B95m12k17J70L87J72j93l67j00K54L59O4k56l16q9J06K41nk32j92j58J86
1302c03L82j2j21k33R8M02K29n0l02j85K09J89K2j87k29j9O2L3L3k1j31j00n9
1325b93K24J76p3j82j36O4K53m5n7o0l8J82J33J08O6l9j34l1J03J92m6l44l63
1348c40MK65Q7k67k85l5K71L06J05j53p6J18J50K24J12j39l35k34K02L49J6m08
1370f3m75Q7M75L14j51m80j19M03L13Q5k94l43N2J23K27J21j86l89q7J96N35J52
1392D96m28l83k6M79L88l28m60k09L46L54k9k67j80M3K52J84Nk9j92j86J54K73
$$ plain form
1237 -290 191 254 120 -27 -102 -25 220 291 210 -10 -209 -170 -35 237 178 -204 -330 -155 128 332 162 -59
1259 -59 -223 -31 245 298 7 -264 -378 -128 120 137 -44 -311 -342 -76 214 321 95 -274 -244 85 323 295
1281 295 -117 -334 -164 223 395 202 -165 -265 -11 348 412 156 -160 -249 -143 98 93 -139 -331 -489 -303
1302 -303 79 67 -54 -287 -189 213 442 392 90 -95 114 303 325 138 -91 -110 -48 -15 18 -3 -134 -234 -293
1325 -293 -69 107 34 -148 -284 -220 33 -12 -69 -129 -167 15 148 256 322 283 149 118 221 413 367 23 -340
1348 -340 -336 -71 16 -251 -536 -571 -300 6 111 -42 -118 0 150 374 486 347 12 -222 -20 329 345 -63
1370 -63 -538 -451 24 338 187 -293 -412 -9 304 389 95 -248 -196 -73 154 275 89 -300 -387 -191 344 496
1392 496 68 -315 -341 138 526 198 -262 -471 -125 229 200 -67 -247 -204 48 232 237 208 16 -170 -16 257
1414B57P7l99m41L2M07K19j47m44k1M86L19k5k25j43K12K00j02r6j15n5j60j03
1436b67J30P8j56j17O6K40K18j01q3J0K05J21j75j80M2J96j34k57q8K07Q5j19
1458g9j26j10K11K42j24r1ML8O9q5J62P5o9j70N9K68J33k02l62pK79K92k59n77
1482d29n0K56K21N6k86j99J89K21J86K7j22q3oJ44K59O7l48m07N9M41J95l03m49
1505c61j67M24L92o6l66j54J54K65R4j22j27j37N0R8K38ll28j61J3L75K48k92
1527F7m08J4L50L77m7m29m3J57K41M2j34k08m7kK5N6j18j25j68L1K89J76j36k15
1551b55O3L26J82q8j47m4J30J98j41j84q3M7J6p9p1Pjj0PMJ54j6q7QLQ6m0p9N9
1580c5J27J3j22n3J21K20j06q8p3L6J44j08j92q5P8P3k0k1k8l8Q7P5Q0J22p7j40
$$ plain form
1414 257 334 -65 -506 -474 -67 152 5 -439 -460 26 345 320 95 -48 164 364 262 166 51 -4 -164 -267
1436 -267 -137 -59 -215 -332 -266 -26 192 91 8 18 223 344 169 -11 31 227 93 -164 -252 -45 40 -79
1458 -79 -205 -315 -104 138 14 -77 -73 -35 34 -51 111 186 117 -53 6 274 407 205 -157 -164 115 407 148 -429
1482 -429 -479 -223 -2 54 -232 -431 -242 -21 165 192 70 -13 -19 125 384 451 103 -304 -245 196 391 88 -361
1505 -361 -528 -104 288 222 -144 -298 -144 121 215 93 -34 -171 -121 -23 215 212 -116 -277 -264 111 359 67
1527 67 -341 -327 23 400 353 -76 -119 38 279 321 187 -21 -68 -70 -45 11 -107 -232 -400 -369 -80 96 -40 -255
1551 -255 -192 134 316 228 81 37 167 365 224 40 -43 4 20 -59 -130 -123 -124 -134 -127 -123 31 15 -72 -64 -61 25 -15 -94 -35
1580 -35 92 105 -17 -70 51 271 165 77 4 40 184 76 -116 -201 -123 -50 -70 -91 -119 -157 -70 5 85 207 130 -10
1606a0K2J20P5j25k71q5K00J23m1j75j8J07J95O1p5q1JRN6M3j77j00o0K6J48R1
1632E9q4j06J7J94J84j01p2j08j4J78l4j69q0m7J1R8jj9N5mL4J22J33j20q4n0
1658hJ14j0%r3j39M7p5J60l6j3j1l1J13N4k2Jj6n3P4j6m4k6n6L7K4k6M9j03R3
1687a2O0rL8m7J6l0L7k0M9p1n6L8j0J4m9k4J9NL1L7l4q7K7l6J16Pm3p2L4P7O4
1718F9J09q2qO4J12p4m2m2r9R6j27k0r0q3r3L3N0K0O5j9J03J19J27J0j4KQ8J2
1746B86q0j03p0n2Q6j61j08j6L0OJ8Q8M0J4P2o9Q0K4o3k4k4R0J2q8q8J1J43M9
1774A03J6j42K0Q0j5lj04J8l2K0m2M4J9l7L8Q6M1L3j07j42J02J33j35m8j45O8
1800a31R5K3k7m2J2J65Q7Oo9J1l4M3n0m9l5j52j0J1O5j7m1j06J47J34JJ1m9R0
$$ plain form
1606 -10 12 132 207 82 -189 -274 -74 49 8 -167 -185 -78 117 178 103 22 23 32 88 131 -46 -146 -206 -180 -32 59
1632 59 -25 -131 -114 80 264 163 91 -17 -31 147 113 -56 -136 -183 -172 -74 -75 -94 -39 -43 -9 113 246 126 42 -8
1658 -8 106 96 96 3 -136 -89 -164 -4 -40 -53 -64 -95 18 72 50 51 35 -18 56 40 -4 -30 -86 -49 -25 -51 -2 -105 -12
1687 -12 48 39 77 30 46 16 53 33 82 11 -45 -7 -17 -3 -52 -76 -57 -52 -21 16 -18 -105 -78 -114 2 9 -34 -106 -72 5 69
1718 69 178 96 88 152 264 190 148 106 7 103 -24 -44 -134 -217 -310 -277 -227 -207 -142 -161 -58 61 188 198 184 186 274 286
1746 286 206 103 33 -19 67 -94 -202 -218 -188 -182 -164 -76 -36 -22 50 -19 61 85 22 -2 -26 64 76 -12 -100 -89 54 103
1774 103 119 -23 -3 77 62 59 -45 -27 -59 -39 -81 -37 -18 -55 -17 69 110 143 36 -106 -4 129 -6 -54 -199 -131
1800 -131 -36 -13 -40 -82 -70 95 182 188 119 130 96 139 89 40 5 -147 -157 -146 -81 -98 -139 -245 -98 36 37 48 -1 89
1828H9J10m0l8q0o2P9j6j0j30m1J04p3O3o8K1l0P8nJ63k3j44J08P8J48o1j87o0
1855b7O8M6pj90j37J09L8K9m5l5OK0J07J43j8oj12j5J73L8r8j41o9J58P5n6j33
1882g9r6J56R5Jl7p4l9J09K2J4n9j21KR3N3J9o7r3K1J76J00j53q5m9J11N2o7j29
1910a24KJ21%J00m3K8J8m8J01l7pr1r9j16R4k5j66J6n4K32J35rO5N1J51Q5n3m7
1938B80n9n7o6j82r0oo2kqM8O9K9N0R1N0O2k4m5J9m6p3o4r7J60O0q4kk4J14J42
1968A83J3j36pl4m6O2j27l5p0JPQ6L8K4%O0J33O5n1j77j03J41J7j05l5j30L6J36
1996e4j0Q5K2J0J20K6O9m8j16j28m6L7k7j31o4o3J72O4M1M6K2P9J18L3k2n9r9
2023G7K2o3o0m4r0n6MN8J40pm8K4K7J53pj09K8k9k4l4O3n1l2M5j4M5J7M7k3o8
$$ plain form
1828 89 199 159 121 41 -21 58 42 32 -98 -139 -35 -108 -45 -113 -92 -122 -44 -49 114 91 -53 55 133 281 220 33 -27
1855 -27 41 87 80 -110 -247 -138 -100 -71 -116 -151 -145 -125 -18 125 107 101 -11 -26 147 185 87 -54 -123 35 110 54 -79
1882 -79 -175 -19 76 77 40 -34 -73 36 58 72 13 -108 -106 -13 40 59 -8 -101 -80 96 196 43 -42 -91 20 72 5 -124
1910 -124 -122 -1 -1 99 56 84 102 54 155 118 111 20 -79 -195 -101 -126 -292 -276 -330 -98 37 28 93 144 295 380 327 280
1938 280 221 164 98 -84 -174 -180 -242 -244 -252 -204 -135 -106 -56 35 85 147 123 78 97 51 -22 -86 -183 -23 37 -47 -49 -73 41 183
1968 183 196 60 53 19 -27 35 -92 -127 -197 -196 -189 -103 -65 -41 -41 19 152 217 166 -11 -114 27 44 -61 -96 -226 -190 -54
1996 -54 -64 21 43 53 173 199 268 220 104 -24 -70 -33 -60 -191 -255 -318 -146 -82 -41 5 27 106 224 257 235 176 77
2023 77 99 36 -24 -68 -158 -214 -210 -152 -12 -19 -67 -43 -16 137 130 21 49 20 -4 -38 25 -26 -58 -13 -27 18 35 82 59 -9
2053ij2N5l1l1o3q8L5K2J26lpk2J24O8Rj5o9p9Rkj9n8j03n1O8J13M3j05J9RJ30
2084F3J00n2l2n4J3N3l9m1l7r5O7N2M4q1j9k1J31O8K9j47m7LR6Q2j19l1r1J3J14
2113B2l6k1m4p6O0M8J13p1m4KK7Q0N7n5mk6K0R6o9Qj38N4l1l2j9m5j5k9K8O0L5
2144d5Pj9L1P6M1K8k7jlL7l5Lq2m3k8NJ2K8j4q1k0K9O2J8K3o6k1M5Q2%oo7j5J25
2178G9J3n7on4k9J00Jj4n8j19J42M5Rl0o5k1N6Q2J9j63n9J3J7R2M1j37K1J7R3
2207B8J8j1n3n2R0P8L5m9r1m4P1Q7k1j19l7m8J13k5Kl5n2L7R4oL2o5K6k5J03O9
2237A50o7o8q4R2N5j7j13k5nJ7k5R9p2M2j9Q5L1K2n1N8j38O6K6ro5j12J08j7M9
2266A3j1k5l2OP1k3M4o9j5M6m7P5M1j25K6KP8P4r5J4Qm3K7Oo1k3r5N5K2M0oJ9
$$ plain form
2053 -9 -21 34 3 -28 -91 -179 -144 -122 4 1 -6 -28 96 164 173 158 89 10 19 17 -2 -60 -163 -214 -146 -33 10 -95 -76 -67 63
2084 63 163 111 79 25 38 91 52 11 -26 -121 -54 -2 42 -39 -58 -79 52 120 149 2 -45 -42 54 136 17 -14 -105 -92 22
2113 22 -14 -35 -79 -155 -95 -47 66 -5 -49 -47 -20 60 117 62 58 32 52 148 79 87 -51 3 -28 -60 -79 -124 -139 -168 -140 -80 -45
2144 -45 -38 -57 -26 50 91 119 92 91 88 125 90 93 11 -32 -60 -55 -43 -15 -29 -110 -130 -101 -39 -21 2 -64 -85 -40 42 42 36 -31 -46 79
2178 79 92 35 29 -25 -54 46 47 33 -25 -144 -2 43 52 22 -43 -64 -8 74 93 -70 -129 -116 -99 -7 34 -103 -82 -65 28
2207 28 46 35 -18 -70 20 98 133 84 -7 -51 20 107 86 -33 -70 -118 -5 -30 -28 -63 -115 -78 16 10 42 -23 3 -22 81 150
2237 150 83 15 -69 23 78 61 -52 -77 -82 -65 -90 9 -63 -21 -40 45 76 98 47 105 -33 33 59 50 -15 -127 -19 -36 13
2266 13 2 -23 -55 -49 22 -1 43 -26 -41 5 -42 33 74 -51 -25 -23 55 129 34 48 56 13 40 46 -15 -38 -133 -78 -56 -16 -22 -3
2298cmm9J05R8p6q5ON8l9jn5j08M8M3Q3o9O2m2J1N4J30Ol5j26R1m6l8n3n8q1K0
2329a53M4K3J4n1J8O7Q8O1nq1j7M1J7M1o1p2k2M5J9M6q3Jj6O9J1n7j1p6k8O6J3
2360d9J9l7J3m1J21O5k7LmO0K8m3n0j21pk0N5mk5o7L3M9R6J12j23J1l1L2N2q8
2390A2p6oqj1J9%j7L2mJ31Q0o1m9N4L6k1j1o1m5n8pM6m6mo2O9K4oK8qpk0J32k1
2424E4n5K5rN5l4L5k9J6m2J9M3r4j4k5o1O0l1M2j9m9J1K7O4R1K0p8QL5J5K6p6
2455C0l5K2p8j9P8n7k1L0k5M3J6P3p0j9M9M3L7p2ol3L3L4J1l7m3L2n3QL8l6n7
2486h4JM4J43j21n9k8L2Q4O2n7n3M9PP4p3nq2O6m5R9J1j02Km7P1R1n4n2j7k3R
2517e7J36p3q1J0m3J81n4o0%mO0M8l0k7%l7K9N3l3m1m0R1jjnj2K0l8L4j5m1l8
$$ plain form
2298 -3 -7 -56 49 147 71 -14 -8 50 11 10 -45 -153 -105 -62 21 -48 14 -28 -17 37 167 173 138 12 103 57 19 -34 -92 -173 -153
2329 -153 -109 -86 -72 -123 -105 -38 50 111 106 25 8 49 66 107 46 -26 -48 -3 16 62 -21 -20 -36 33 44 -13 -24 -100 -128 -62 -49
2360 -49 -30 -67 -54 -95 26 91 64 67 63 123 151 108 58 -63 -70 -90 -35 -39 -64 -131 -98 -49 47 159 36 47 16 48 100 12
2390 12 -64 -70 -78 -89 -70 -70 -87 -55 -59 72 152 91 42 96 132 111 100 39 -6 -64 -71 -25 -71 -75 -137 -68 -44 -50 -22 -30 -37 -57 75 54
2424 54 -1 24 15 70 36 71 42 58 16 35 78 -16 -30 -55 -116 -56 -87 -45 -64 -113 -102 -75 -11 80 100 22 30 65 80 106 30
2455 30 -5 17 -61 -80 -2 -59 -80 -50 -75 -32 -16 57 -13 -32 17 60 97 25 19 -14 19 53 64 27 -16 16 -37 -29 9 -27 -84
2486 -84 -83 -39 104 -17 -76 -104 -72 12 74 17 -36 13 20 94 21 16 -66 0 -45 54 65 -37 -35 -82 -11 80 26 -26 -43 -66 -57
2517 -57 79 6 -75 -65 -108 73 19 -41 -41 -45 15 63 33 6 6 -31 -2 51 18 -23 -63 28 27 26 21 9 29 -9 25 10 -31 -69
2549f9Qm9N7L1lRL3J1j5R7m6j9j7L3l6k6j9%%KK2j5Nj4pQl3l1K3pm6N1N5k0J9
2584hk7N1N8l4O7k5Lq0M1l1oNl3p7oN1O0j24O4j0O3K5Lj7j12J2J27k5k3K9j9j0
2616hN5ljm6rm1P2Qp0j3k4rR6p0M3p5L3J12pQj6l1K4J0kL5r9pl5M9M2k8j8L5l3
2651b3Q2j1l5Kml7P2o2%j5k2P8Pq3pK0OQ8M8j8l7l1k1L6j3l1o1j2O9M4j0j4j5
2684a0N9Jjj2jp3PK0m8L0%m7L4Q1n2K9PJ9l0j4KL8o8j2p2K8k0K5j7l1O7N2J8Q1
2718I0l8jOLM5k9j08J7l3oL3ol2K6l8J06J1k5l1LJ4l3NMk6KN3Pl2J6NK9j4J5L1
2753F9p7pJ8m1J5K9n5k8J0M9k7m4L6M0j5L4ll6L4j9%N8r9L2L3ML4L5oj2l4L2k8
2786C1qK9n1j7n7j7M5k3l3mN4J6PM9J4m5J9J3O4j7ol3j6J7l7mM3n2k0M8l0j4%
$$ plain form
2549 -69 -61 -110 -53 -22 -25 -16 17 28 13 110 64 45 28 61 25 -1 -20 -20 -20 -18 4 -11 -6 -20 -27 -19 -52 -83 -60 -67 -113 -62 -7 -27 -8
2584 -8 -35 16 74 40 107 82 85 5 46 15 9 14 -19 -96 -102 -51 9 -115 -51 -61 2 27 30 13 -99 -87 40 15 -8 21 2 -8
2616 -8 47 44 43 -3 -12 -53 19 27 -43 -56 -80 -89 7 -63 -20 -95 -62 50 43 51 35 4 28 38 36 71 -28 -35 -70 -21 21 -7 -25 10 -23
2651 -23 59 48 13 15 11 -26 46 -16 -16 -31 -53 25 32 -51 -58 -38 -32 56 104 86 49 18 -3 33 20 -11 -72 -84 -15 29 19 5 -10
2684 -10 49 50 49 37 36 -37 -30 -10 -58 -28 -28 -75 -41 40 -12 17 24 43 13 -1 1 39 -29 -41 -113 -85 -105 -80 -97 -128 -61 -9 9 90
2718 90 52 51 57 60 105 76 -32 -15 -48 -54 -21 -27 -59 -33 -71 35 46 21 -10 -7 7 -26 -21 -17 -43 -41 12 19 -13 3 8 37 23 38 69
2753 69 -8 -15 3 -38 -23 6 -49 -77 -67 -18 -45 -89 -53 -13 -28 6 3 -33 1 -18 -18 40 -59 -27 6 10 44 79 73 61 27 59 31
2786 31 23 52 1 -16 -73 -90 -45 -68 -101 -105 -51 -35 -28 21 35 -10 9 22 86 69 63 30 14 31 -6 -10 33 -19 -39 9 -21 -35 -35
2819c5m7N9M7pp0MJ2J5L1%m4K8PR4o5k5oJ0pK2k8N2n9j8O9K0j08R2o6M1qj4J7
2852A3m4j5K0M4l6J2Nm2Q2J7m9j2%K2l2K2j2l5O5l0ROK0k5jN0m4K3k2k9L9k4M1
2885C8r0K0M4Pn1L1j1J5J3O3k5j16N8qNK7l4Rn2M6OOk5QM6p3M0RJ6Qpp6J4Ok3
2920e6J3M4j6j5K1j8J3o0R8l2M4n1KJ6K4kk5k7J9L2j4kJJ5k4LK4n4JL0k7K6l7
2953c4k8J5J9K9M6n9O3n4O7l7jJPL2k1l1J4k7k3M6J1k7ro0M2P1j05K5o1O0o3P8
2985a4K0k8J0L6J1m5Q7p0M6j4L0o8J2m5J5N5nl6L8k0l4M0k2j1n0K1N0k4k8KkM9
3017Fn0M9kk9N4l2J3P0l1l1J9n4%j4J0j5M6k1Mk9O6l0m8M0mo0P2j5k3J6R0l7l3
3050clK7L5Oj6r6O7k9K3n2j6j1PJ8L6L0m6J4PK9j0qL5q0N0Nk4J3ok9L2l7J6J4
$$ plain form
2819 -35 -82 -23 24 17 -53 -49 -37 -22 9 9 -35 -7 0 94 29 4 -2 8 1 23 -5 47 -12 -30 39 59 -49 43 -23 18 10 -4 13
2852 13 -31 -46 -26 18 -18 -6 -1 -43 39 56 7 -5 -5 17 -15 7 -5 -40 25 -5 4 10 30 5 4 54 10 33 11 -18 21 -3 38
2885 38 -52 -32 12 19 -32 -1 -12 3 16 79 54 -62 -4 -12 -7 20 -14 -5 -57 -11 -5 1 -24 -16 30 -43 -3 6 22 30 23 -53 -39 -33 -56
2920 -56 -43 1 -15 -30 -9 -27 -14 -74 24 -8 36 -15 -13 3 27 25 0 -27 -8 24 10 8 9 24 0 3 27 -27 -26 4 -23 3 -34
2953 -34 -62 -47 -28 1 47 -12 51 -3 64 27 26 27 34 66 45 14 28 1 -22 24 35 8 -1 -61 -19 52 -53 -28 -89 -29 -92 -14
2985 -14 6 -22 -12 24 35 -10 77 7 53 39 69 1 13 -32 -17 38 33 -3 35 15 -19 21 -1 -12 -62 -41 9 -15 -43 -41 -43 6
3017 6 -44 5 3 -26 28 -4 9 79 48 17 36 -18 -18 -32 -22 -37 9 -12 -8 -37 29 -1 -49 -9 -13 -73 -1 -16 -39 -23 67 30 -3
3050 -3 -6 21 56 62 46 -50 17 -12 11 -41 -57 -68 -61 -43 -7 23 -23 -9 -2 27 17 9 44 -36 14 19 -5 8 2 -27 5 -32 -16 -2
3084bj9K9mJ6l1K7m6J1L7k5L9l1n4J3L1k7M5J8j6k4j5P0l5K9q2l2N2K5p6J0K6
3115d1lN3j4oJ9k6J2K2j2j7mK7m4P6nj4rNM6p9K0K0Jn5k1O2n7l5rL0M0q8Q7Km7
3150f4P6l2Q0m1k1J5L3j6m4J8l1pM5kpl5J1J3oMj1Pl2L6O2p8M6Mk7N9m2oj1L6
3184C2m7N2n2O0Ok9nj8j0O8l4pq1Q3m4k7L0m8L8k6Q4l5J0l5R6j8Oj1pnj2jM2m
3218E1o3rK1QrK4m7l7PP0n1J6m6M7K5l5O0k6%J9j6J6m2J8mK7j5J09m2k2l9m1L3
3251Gk3o3Q3Ok1o1O3Nl0J8K7m8J00l0n1M0j3M0m3qJkl2m2J24l8k2pL9L2q4N2m8
3284b9L1n9P3j2j2rK9LpM1k4l5K7J1Pjl0Pn2M7mK9p7L2l7O5M0j0J2j32P8lk9M4
3318A4j7J5j3nK2k0l2J0K3lqM8l2m1P9k7j8j9k3O5k8K1l0K0j0L9RRL7q1M0%K2
$$ plain form
3084 -2 -21 8 4 20 -11 16 -30 -19 18 -7 32 1 -53 -40 -9 -36 9 27 11 -13 -28 42 7 36 -46 -78 -26 -1 -77 -67 -41
3115 -41 -44 9 -5 -11 8 -18 -6 16 4 -13 -17 10 -34 42 37 23 14 19 65 -14 6 26 27 -28 -49 13 -44 -79 -88 -58 -18 -106 -19 -17 -64
3150 -64 12 -20 60 19 -2 13 46 30 -14 4 -27 -34 11 9 2 -33 -22 -9 -15 -11 -22 -15 -47 -11 51 -27 19 23 -4 55 13 7 -4 32
3184 32 -15 37 -15 45 51 22 17 -1 -11 57 23 16 -65 18 -26 -53 -23 -71 -33 -59 25 -10 0 -35 61 43 49 38 31 26 14 13 55 51
3218 51 -12 -21 0 8 -1 23 -24 -61 -54 16 -35 -19 -65 -18 7 -28 32 6 6 25 9 25 -17 1 -3 24 9 118 76 54 15 -26 7
3251 7 -16 -79 4 10 -11 -72 -9 -4 -34 -16 11 -37 63 33 -18 22 9 49 6 -2 -1 -3 -35 -77 47 9 -13 -20 19 51 -33 19 -29
3284 -29 2 -57 16 4 -8 -17 12 15 8 49 25 -10 17 28 35 34 4 11 -41 6 2 31 -46 -14 -51 14 54 44 56 -76 2 -1 -30 14
3318 14 -3 12 -1 -6 16 -4 -36 -26 -3 -6 -14 34 2 -39 40 13 -5 -24 -47 18 -10 11 -19 1 -9 30 39 48 85 4 44 44 66
3351F6n0JQq7K1J0L1K6o5K3o9L7M8j4J1k7OM3J4rjL9l4oK6j2jQm2L6Jj8m4LLm3
3387f1l3M8j1J8RJ9K3m7M3m1O2k3Q1p9m6N0l6O4k4jK4m0k0Q6p6J4JJ5l7J2o0M2
3419b4rK4O3j45Q0M2j5J1j0mm9j3P6M2m2QJl5L8l5j0L9q9N6Rk1j4Nj2L4m3J6Q
3452a8l7P9l9NML5M0p7K7N9m6k0Q0o9j4j0nj1m0O3r9O3L1j0J5m3J8J2L6m1Pm1
3484d6J1PN8k7N4o6L9j2J1Nm4Oj0K4l2kk9N9q%j4k2N6M7j7pj7K5n0L9o1O7n3J4
3518Em7K3o0L8L8Rk3j0M6j6L8k0k5J9M0l1r0J00j8j4M5k5L0l8rj1l6PK7%j7lP
3551b1L2o0J4Q6m0j1Jk5L4L3k8L1J5l9o2L3%L3p1L3Jj02J42m8J8o1L3L6rnj0P
3583a0j3j1oRM5j01J00M4p1j5%Q4j3J2j4Kj5j1o5M3m0K4l2o3KJ06rm8L6jlL0M3
$$ plain form
3351 66 16 17 25 -62 -41 -31 0 26 -39 -16 -85 -48 0 -14 -3 -30 -24 19 33 24 23 62 28 22 48 36 35 43 1 37 38 20 -24 -21 -18 -61
3387 -61 -94 -46 -57 -39 -30 -11 12 -35 8 -33 29 6 87 8 -38 12 -24 40 16 15 39 -1 -21 65 -11 3 4 19 -18 -6 -66 -24
3419 -24 -33 -9 54 -91 -11 31 16 27 17 13 -36 -49 27 69 27 35 36 1 39 4 -6 33 -56 0 9 -12 -26 -21 -33 1 -42 -26 -18
3452 -18 -55 24 -15 -10 -6 29 69 -8 19 78 32 12 92 23 9 -1 -6 -17 -57 6 -93 -30 1 -9 6 -37 -19 -7 29 -12 -5 -46
3484 -46 -35 -28 30 3 57 -9 30 18 29 34 -10 -4 -14 10 -22 -24 -53 6 -2 -2 -16 -38 18 65 48 41 24 49 -1 38 -23 44 -9 5
3518 5 -42 -19 -79 -41 -3 6 -17 -27 19 3 41 21 -4 15 55 24 -66 34 16 2 47 22 52 14 5 -6 -42 -35 -8 -8 -25 -28 -21
3551 -21 11 -49 -35 51 11 0 1 -24 10 43 15 46 61 22 -40 -7 -7 26 -45 -12 -11 -113 29 -19 -1 -62 -29 7 -2 -7 -17 -10
3583 -10 -23 -34 -40 -31 14 -87 13 57 -14 -29 -29 55 42 54 40 42 27 16 -49 -6 -46 -22 -54 -117 -115 -9 -18 -66 -30 -31 -34 -4 39
3616C9l7L9m1M4Rj4l7rLj2J0L0LMk5m1Q3n1l1j4K3K8j2j9j8NN9LnK1k9j5Q1o8
3650Fk3M5k9j6N9J5j32O8J8m5j8P3l7J1l2K7qpK6Ro5L3O2m1K3k4oM7o6J54j30
3681cK1K9k8l8K8l4j9M8l8K2j3m2J4l8Q9n6L2N1k9j1K9j4J8l3J8k2kJ7j0K0k4
3712a8PLJ8J0k5K6j0LpK5m7Mp1J02J2o8M4pN1m6RjK1o9k4K4P2m2l3J8LM1l5rJ8
3747aK8k1O4n5r3Q1j5L3j3J3Kl3K9m1J5N2o5NqoPKL4j7Pm9P4j07P2J4k9K7OpL6
3782D1j1lL1J4o3j2J4J4km6j2K6r1J21m1NJ4Jm9P4mk8N2l4L6m0L8j0j7NNk8j0
3815a0L7J9j7n9N4J9j09N1K0l3L2qm4O6l8l8M7pJ5J0j8L0mO9n7J7Lm5O7mn0K9
3847D4m1l4%K1m1MNK2K1j9J3K4k8J0k2M4m7M9jmkl2L4qK1jl2j8K4j8lL3n8M3l1
$$ plain form
3616 39 2 41 0 44 53 39 2 -7 -4 -16 -6 24 27 31 6 -35 48 -3 -34 -48 -25 3 -9 -28 -46 -41 18 21 16 37 8 -7 74 6
3650 6 -17 28 -1 -17 42 57 -75 -7 11 -34 -52 21 -16 -5 -37 -10 -18 -25 1 10 -55 -22 40 -1 22 -2 -8 39 -27 127 -3
3681 -3 18 47 19 -19 9 -25 -44 4 -34 -12 -25 -67 -53 -91 -2 -58 -26 25 -4 -15 14 0 18 -15 3 -19 -21 -4 -14 6 -18
3712 -18 -11 -8 10 20 -5 21 11 14 7 32 -15 -11 -82 20 32 -36 8 1 52 6 15 14 35 -34 -58 -34 38 -4 -37 -19 -16 25 -10 -19 -1
3747 -1 27 6 70 15 -78 3 -12 21 8 21 23 -10 19 -22 -7 45 -20 -15 -23 -29 -22 -20 14 -3 4 -45 29 -78 -6 8 -21 6 12 5 41
3782 41 30 27 58 72 9 -3 11 25 23 -23 -35 -9 -100 21 -20 -15 -1 0 -49 25 21 -7 45 11 47 7 45 35 18 23 28 0 -10
3815 -10 27 46 29 -30 24 43 -66 -15 5 -28 4 -4 -48 18 -20 -58 -11 -18 -3 7 -11 19 15 84 27 44 47 2 69 65 15 44
3847 44 3 -31 -31 -10 -51 -47 -42 -20 1 -18 -5 19 -9 1 -21 23 -24 25 24 20 18 -14 20 12 33 32 0 -18 6 -12 -15 18 -40 3 -28
3882b8k9O4j1lol3K4NK3M4Oj2k4N3o0M5l5k8Orj5l3N9o2N5Pj8JL9j5j5K1K0j3
3916B3K9J5o6j5kJ5L1m0RN1r8J7P1m4On1P3l5M3k4jk2J6nK8jl3jL2k9k7L0kK8
3950B1q3L3L4n0N6KPo7K9l5Q6m4m0PP6j6rk2K8k9J2pJL5p9N0M0n6L7j6m7J7j3
3983d2N9k6m0k7P3k5J3rlj8K1LN2p2P0om1P9n4P8j04L3K4k5l0P0p0k7P0n5JK1
4015gJ9l5NqL2j4K3j3L1J2l1m6N7K8m3k2j6L7qj3K4J4j8l7L0j1n2M2K8m7j8K3
4047c4L6L4l1N2ml4k7L7j4Nl8K3J8Qk6J0Pm1N0p0K6L5n5N9m3k7J8k1K0oO8%q0
4080d5L4N4J4n6M2l5L6m4L4l0L7k5n8P5m3j8l2K5j7Q1k8Qm9j2O6l4L4l3j6L5J
4111AqPl2K2L9r2P3o8P5q6P5n7N7%pLk4K9J9n4K5L0j2J6PL3j42Q5l9N4p6R9n3
$$ plain form
3882 -28 -57 7 -4 -7 -13 -46 -22 -17 6 50 56 44 20 73 13 58 23 -5 1 -8 -23 -56 3 -59 -4 3 -15 -14 25 10 -5 16 36 23
3916 23 52 67 1 -14 -16 -1 30 -10 -1 50 -48 -31 40 -4 2 -49 24 -11 32 8 7 -15 1 -4 24 23 -10 -11 21 -8 -35 -5 -7 21
3950 21 -62 -29 5 -45 11 13 20 -47 -18 -53 33 -11 -51 -44 32 16 7 -15 13 -16 -4 -11 -10 25 -54 -4 36 -20 17 1 -46 -29 -42
3983 -42 17 -9 -49 -76 -3 -28 -15 -24 -27 -45 -24 -21 31 -41 29 23 -18 61 7 85 -19 14 38 13 -17 53 -17 -44 26 -29 -28 -7
4015 -7 12 -23 -18 -26 6 -8 15 2 33 45 14 -32 25 53 10 -12 -28 9 1 -12 12 26 8 -29 1 -10 -62 -20 8 -39 -57 -34
4047 -34 2 36 5 57 53 19 -8 29 15 20 -18 5 23 31 5 15 22 -19 31 -39 -13 22 -33 26 -17 -44 -26 -47 -27 -33 35 35 -45
4080 -45 -11 43 57 1 43 8 44 0 34 4 41 16 -42 33 -10 -28 -60 -35 -52 29 1 9 -40 -52 14 -20 14 -19 -35 0 1
4111 1 -7 0 -32 -10 29 -63 10 -58 17 -69 6 -51 6 6 -1 2 -22 7 26 -28 -3 27 15 31 38 71 -71 14 -25 29 -47 52 -1
4144aj5N4p0L1l2L4ol5K2k0PK8mj3QJ7m2P7m9LMk1j5M4j7J9n3N8nj3M1m9L9rj2
4179EQQnN8r7K5qnJ5j8NN7o4N1j0M1o8l2Q0l7nn9N2k4J3l6J7KO2J8k7j3p3J06
4213D2k5Pn9L4O6o7kK1J1l6j4MK4m0L9l6N6p3lK7QJ2Pj6J3k8qL3K2J3k6N3l0n4
4247b5J00Nr5J2Pk5L9J6qq3O2k1K1l5L2Jj8k0J2Orl4M5rL7j4J5L1qJ7l2j3lJ8
4281B4Ln0j0Ok3N0m8L5j3L4m7J5L4O4r3M0MK1n7K2k0L0k6L7K0k8J0l9qQNk8L9
4314A1j3Pp0L5J9L4l4L4m4J9qM8J7l8J6l1oM6o1Kj9O8l1J4L7o9k7P0l7J4K2Nk1
4347In9L9M9n0L8m4K2j8k0L8n9L8P9j01N0K4l6J3o0O5o4L2M1k3j3k2P9m8jQJ2
4378A8M5m1j7K2m1P8k8K3k4q2Q5j01P5K6p0K4r2J16rm3L1Mk3L6j3NOJ5p2N9J6
$$ plain form
4144 -1 -16 38 -32 -1 -33 1 -5 -40 -18 -38 -31 -3 -7 -20 -12 5 -37 40 -9 -6 -2 -23 -38 6 -11 8 -45 13 8 -5 36 -13 26 17 5
4179 5 13 21 16 74 -23 2 -6 -11 4 -14 -9 48 -16 35 25 66 -2 -34 46 9 4 -55 -3 -27 -14 -50 -33 -31 31 49 22 9 -64 42
4213 42 17 24 -35 -1 65 -2 -4 17 28 -8 -22 -18 6 -34 5 -31 25 -48 -51 -24 -16 -4 3 -13 0 -28 -36 -3 19 32 6 59 29 -25
4247 -25 75 80 -15 -3 4 -21 18 34 26 -57 5 -16 5 -30 2 3 -15 -35 -23 -17 -26 -60 -15 -24 13 -1 14 45 37 54 22 9 6 24
4281 24 27 -23 -33 -27 -50 0 -48 -13 -26 8 -39 -24 10 74 -19 21 25 46 -11 11 -9 21 -5 32 52 24 34 -5 -13 -5 0 -28 11
4314 11 -2 5 -65 -30 -11 23 -11 23 -21 -2 -10 38 55 17 33 2 -4 42 -19 -17 -36 32 1 15 52 -17 -44 26 -11 3 25 30 9
4347 9 -50 -11 38 -12 26 -18 4 -14 -34 4 -55 -17 62 -39 11 35 -1 12 -48 17 -47 -15 26 3 -10 -32 47 -1 -2 6 18
4378 18 63 22 5 27 -14 64 36 59 35 -47 38 -63 12 38 -32 -8 -100 16 7 -36 -5 -1 -24 12 -1 4 10 25 -47 12 28
4409B8m6O7j12O2J4k3K5Lk1J2Ok8j4J9J6l9K0J8k8M8m5NM5o5nPO1k0J0J7o8J3
4441a8qN8l4j6k3kL1n3J3O1j1M7n1L7n5J%L0j2J1n1P3m%M8lq8P8jk4l0K8Mo3L0
4476Cm3J7K0Ml4L4rJ9j7Kk6N3p0K8L4L8l5J7lp0N4mqn0k6N3L1j9j3mQ1p4l9J01
4510D5k5m3nO8l7J6l3J2j7O3k5j0k9O7k8l6L5j4J7pm5J0mL0j2j3j4J9J9M8q6m
4542c8P2k7j1K1j7K5l2k1L0k2K4o6J29o2k3L7rJ6p3N4l1M3m8oK5j6k3NNM4N5l1
4574B9jn3N4L9o2k6nK6j8j1M1m7L0j0N1j3Mnl7R4r9K8Rmj9Mm2J0L3Rl5N9k2m8
4608c7M0oM4p8L0n2j9M2J1k5OK3J4MN1o8L4N0Kp5Q5l9n7K4j4J8j4J6k7MK2j0J4
4641A3n2O6k1J8j09P5K0J1n2n7J32j07O9J9k7k1L5k0Nl3O8Lm7k7L2q1Q7q2O2j7
$$ plain form
4409 28 -18 49 -63 -1 13 -10 15 18 -3 9 15 -13 -27 -8 8 -31 -11 7 -21 27 -18 -13 32 -33 -38 -31 30 10 20 37 -31 -18
4441 -18 -26 32 -2 -18 -41 -43 -12 -65 -52 9 -2 45 -6 31 -24 -23 -23 7 -5 6 -45 28 24 24 72 69 -19 59 58 34 4 32 36 -27 3
4476 3 -40 -23 -3 1 -33 1 -8 11 -6 -4 -30 23 -47 -19 15 53 18 35 32 -38 16 12 4 -46 -72 -19 12 -7 -20 -24 57 -17 -56 45
4510 45 20 -23 -28 40 3 19 -14 -2 -19 44 19 9 -20 47 19 -17 18 4 21 14 -31 -21 -25 5 -7 -20 -34 -15 4 52 -34 -38
4542 -38 34 7 -4 17 0 25 -7 -28 2 -20 4 -62 67 5 -18 19 10 26 -47 7 -24 19 -29 -35 -10 -26 -49 -44 -39 5 60 29
4574 29 28 -25 29 68 6 -20 -25 1 -17 -28 13 -34 -4 -14 37 24 28 23 -14 80 -19 9 18 14 -5 -1 -43 -33 0 9 -26 33 11 -37
4608 -37 3 -3 41 -37 -7 -59 -78 -36 -25 -50 -44 -21 -7 -3 48 -20 14 64 66 -9 76 37 -20 4 -10 8 -6 10 -17 -13 9 -1 13
4641 13 -39 27 6 24 -85 -10 10 21 -31 -88 44 -63 6 25 -2 -23 12 -8 -3 -36 32 35 -12 -39 -7 -88 -1 -83 -21 -38
4671c8N1PJnll5M0j1jK1loonOk5rmM0Mj04Q6l3LJ8K6l5PJ4k0PK8Ok6M8l7lkj0
4710hL0j2Pl2kJ3l6O9j6l7OM4%pm1L7K3j0k9ml2jK4JKK2o7O6qM7m7J5m7K3K9o0
4746c8K1k3J9qO1K0o9K5K4Pl6qj7K5j4j5N5l0J3j1m0N3J9p4O7o2L3k7L9J0oj7
4778dJJ9l3j5k9N8J9jLl1M4m1l4M9KK2%j4l2J4K5p0N8j4m3N6pk9L1N4r3M2LK4
4812C4nl4L1m5N3l4l4K4On9P0j9l9K5M%N7j3q5M3K9j4jK6J3p0Ql%O4k6J5l7J5
4846aj0OM9k8o8Q3l0m2k0L4k6J4%K5nk8P2n6j1QK0J5jK9Ml1l0j3Q6qMo4L0nOl3
4882b5J0j9M2kLj6KK6k9j3N8nl3K3pk1j5P6p0P3q2j5K1k2L4L3m0pL6m1L8m9N3
4915A7k1n8R7k8k4M3Nr9R4m7LN7Qo0L5m3K5N7m3k5o5P1L3m6L1n0K1J1k7K1l6L7
$$ plain form
4671 -38 13 20 21 16 13 -22 18 7 6 27 24 18 12 7 13 -12 -21 -25 15 19 -85 1 -32 -29 -11 15 -20 -13 1 -19 -12 16 22 -4 44 7 4 2 -8
4710 -8 22 10 17 -15 -17 -4 -40 29 13 -24 -18 26 26 19 -22 15 38 28 -1 -5 -37 -38 -14 -13 -11 11 -56 10 2 49 2 17 -30 -7 22 -38
4746 -38 -17 -40 -21 -29 32 52 -17 8 32 39 3 -5 -22 3 -11 -26 29 -1 12 1 -39 14 33 -41 26 -36 -3 -30 9 19 13 -4
4778 -4 -3 16 -17 -32 -61 -3 16 15 18 -13 31 -10 -44 5 7 29 29 15 -17 -3 22 -48 10 -4 -47 9 2 -27 4 58 -35 7 10 34
4812 34 29 -5 26 -19 34 0 -34 -10 -4 -63 7 -12 -51 -26 -22 -22 35 22 -63 -20 9 -5 -6 20 33 -37 -29 -32 -32 32 6 21 -16 -1
4846 -1 -11 -5 44 16 -52 31 1 -41 -61 -27 -53 -39 -39 -14 -19 -47 25 -31 -42 -34 -14 1 0 29 33 2 -28 -41 45 37 41 -23 7 2 8 -25
4882 -25 -15 -34 8 6 9 -7 -5 21 -8 -21 37 32 -1 22 15 -6 -21 55 -15 58 -24 -39 -18 -40 -6 27 -13 -20 16 -25 13 -36 17
4915 17 -4 -62 35 7 -17 26 31 -68 26 -21 -18 39 47 -13 22 -21 4 61 18 -7 -72 -1 32 -14 17 -33 -12 -1 -28 -7 -43 -6
4947fjlM7o3j1mK3ll4O0K4K6l1n3Q3q4K1N3q3LJ3kO2m6qk3L0J3%pJ6K6j3m7J4
4982hQPk5l%L8l6Kj8OJ3P6r0M5Kk2O7p6L4j0j9j3J6j3L1%j4j7RM0Lk7K2m4P9n7
5018Fm8k5L5K7kk8P0Qok2m5L5L7m3%l9K6L6Mn5m2M2P6p3Q7k8o4L3K0m6J7J9qo
5052bL5j6Lm6K5L4j8M5p7L1Pl3L3m4l6P9k3J8J9l4Lm8O3m5l9Q2j9pj1m4M4L1K7
5085C7L5q0kL8m6K4j0k0pL0K6j9L0o1J6j1K2l1NL4Ol8j5j3L9L4l4K6qJ4k0k7N5
5118B9LRn1PJ9n8Q3rj9mK5kk0l2P2o6L0j3k2O0K5l9m2qP5qn4L6n5%N3nk6k4L9
5153Hj5M6l0M3o5OoL1m5K4Kj7nN2m7M4m8L6j4QL1m1L0k9Lm0L9J1J2m0OON9m7j1
5188cK0MOq7M2J1JKkK2K4o6N6J5l1j6j0j8M0k3L7J2oj5p7P7k9mL1K0l2jnk7K1
$$ plain form
4947 -6 -7 -10 37 -26 -37 -41 -18 -21 -55 5 29 55 24 -29 54 -30 -9 44 -39 -36 -23 -25 37 -9 -17 -40 -10 3 3 -4 12 38 25 -22 -8
4982 -8 0 7 -18 -21 -21 17 -19 -17 -35 -29 -16 60 -30 15 17 -5 62 -14 20 10 -9 -22 -6 -19 12 12 -2 -19 -10 30 33 6 28 -16 63 6
5018 6 -42 -67 -32 -5 -7 -35 35 43 37 15 -30 5 42 -1 -1 -40 -14 22 26 -29 -71 -29 47 -26 61 33 -31 2 22 -24 -7 12 4 -2
5052 -2 33 17 20 -26 -1 33 15 60 -17 14 21 -12 21 -23 -59 20 -3 15 34 0 3 -45 18 -27 -66 16 -3 -10 -21 -65 -21 10 37
5085 37 72 -8 -10 28 -18 6 -4 -24 -31 -1 25 6 36 -25 -9 -20 2 -29 -24 10 16 -22 -37 -50 -11 23 -11 15 7 21 1 -26 29
5118 29 32 41 -10 -3 16 -42 41 32 13 9 34 32 12 -20 52 -14 16 3 -19 41 66 27 -15 -23 52 44 -10 26 -29 -29 24 19 -7 -31 8
5153 8 -7 39 9 52 -13 -7 -13 18 -27 -3 -1 -18 -23 29 -18 26 -22 14 0 8 39 -2 28 -1 2 -38 1 12 24 -16 -10 -4 55 8 -3
5188 -3 17 21 27 -60 -18 -7 -6 -4 -6 16 40 -26 30 45 14 -2 -12 -30 10 -13 24 36 30 15 -62 15 -14 -18 13 33 1 0 -5 -32 -11
5223a1LP2l7k3k7K6N5m7j1NrJ2j7Om8l6M6j5K4L0lk0oO3n3L6Ok5J3n7oQ0m4Jm
5258b1NmP6r5N1j5ORj6j4jLK8k5k9K6j0oP0l6K0L0n4j7N2o1lJ4mK6l8JN0k1j7
5293b0jn6Q7o2M2k9O7j3l9l0P1nj9j9NJ8M0l3MRk9OkK4m0K9k8k4LN3m7n3P1J7
5327cJ8l1M8mmn6N7K9o3P0j5r1L2N2n9noN2%j6k4K2pqJ7LJ3j0Nk8l3J2L1K8o1
5362c5P0j5l4N8p4J4Nj6J4jj7L4l3J6jO2j4k1J0m2L4l1L7n0J5R2n6j7Oj5Q4l5
5394D4Jr3J02l9m0J5K5l9K5l7J9M6m1oL8K0J6m6lRK5m4L4nm8J8J0n1qNRN8n0O4
5428C3m2K1m0Ml2R9Kp1JM2l3Lj3M7K1p2O2m2RK4oj8L7k6l8MNk9K1MK8k1l7M6L1
5463B4m2M3n5P5l3oL5k2J3q5N2K3k2M3m4n6M4j3P4m3k1N4o8o4J14l1k8OM3%j3
$$ plain form
5223 -11 -8 64 27 4 -23 3 58 11 0 5 -4 8 -9 -3 -51 -87 -41 -56 -32 -2 -5 -25 -31 32 -21 15 21 -4 9 -48 -54 26 -18 -17 -21
5258 -21 -16 -20 56 -39 12 -3 3 12 -4 -18 -19 -16 12 -13 -42 -16 -26 -32 38 2 22 52 -2 -19 33 -28 -31 -17 -21 5 -33 -32 18 -3 -20
5293 -20 -21 -77 10 -52 -10 -39 28 15 -24 -54 17 12 -7 -26 -21 -3 37 4 8 17 -12 -6 -8 16 -24 5 -23 -47 -44 9 -38 -91 -20 -3
5327 -3 15 -16 32 28 24 -32 25 54 -9 61 46 -45 -13 39 -20 -25 -31 21 21 5 -19 3 -4 -12 5 8 21 11 16 -12 -45 -33 -2 26 -35
5362 -35 35 20 -14 44 -30 -16 -11 -27 -13 -14 -31 3 -30 -14 -15 47 33 12 22 -20 14 -17 20 -30 -15 77 21 4 10 -5 79 44
5394 44 45 -48 54 15 -25 -10 15 -24 1 -36 -17 29 -12 -18 20 40 56 10 7 16 41 -3 31 26 -22 -4 6 -45 -53 -48 -39 19 -31 33
5428 33 -9 12 -28 -24 -56 43 45 -26 -25 17 -16 -13 -26 21 42 -30 32 -10 -1 23 17 -1 36 10 -28 -24 -19 -48 -27 -23 5 -16 -53 -7 24
5463 24 -18 25 -30 45 12 6 41 19 32 -53 -1 22 0 43 -1 -57 -13 -26 48 5 -16 38 -30 -94 20 -11 -39 -33 10 10 -3
5494cJ0L4o2jO6j2k3rL5l5l4M6rk7J6l1L2K7m6J6q%L7n7K6k1N0j3N7n4k0J8L1
5527C6l1L7p8m1J8L3L7J8j2o0L1JK5kj5MJ6l8M7p5O9nl7L5qRk5k2N8k3J4Ljql1
5562b1NM5qj4MK8q6L4jk3K6M1l1j4k5P0p4P1Ll8K5l8N1kNn7M1Lj7N7p2j2K3qj1
5597b0J1k9J3K8j2K9k7k2PN0n2M6j2Np5O0j0j4J8m7R4k4k2j2K5mJ6OL9n6j7K8
5629B0lj2OJ5n1K1l7K3l9O0K4n4M4k6l7P1l9j1K1m9M0Nm1N1n0kM7j4j1m3O0k7
5661c8J8L9m5N6Oq6M2j9J8L2m8k7L3L8k9M5l8l2O3o5L2n9L8K4N7m7k2J%QO3n4
5693Dm0M8ol1J2J6J5m3j4RL0OJ2j7k0M5%rJ6m2j2O9l9rM0k6jj3N7m7K3%l7O1r1
5728c4N2j7J6j8J8k6O8n6n0L2%k6Q4k9m7PN7nkm7N6l4M9j4r7J04J8n9kJ2Jk7K9
$$ plain form
5494 -3 7 41 -21 -22 44 32 9 0 35 0 -34 12 3 -24 -8 -39 -7 20 -26 -10 -18 -18 19 -38 -12 -33 17 4 61 7 -13 5 36
5527 36 5 42 -36 -77 -59 -26 11 29 17 -43 -12 -11 14 12 -3 1 17 -21 26 -49 20 15 -22 13 5 14 -11 -33 25 2 16 19 18 10 -21
5562 -21 -16 29 21 7 11 39 -47 -13 -14 -37 -11 30 -1 -15 -40 30 -44 27 30 -8 17 -21 30 28 33 -24 17 20 3 60 -12 -24 -1 -9 -20
5597 -20 -9 -38 -25 3 -9 20 -7 -29 -22 28 -24 22 10 15 -60 0 -10 -24 -6 -53 41 17 -5 -17 8 4 20 26 65 9 -8 20
5629 20 17 5 11 26 -25 -4 -41 -18 -57 3 27 -27 17 -9 -46 25 -14 -25 -4 -53 -13 -8 -49 2 -48 -50 -3 -17 -28 -71 -11 -38
5661 -38 -20 19 -26 30 36 -50 -8 -27 -9 23 -25 -52 -19 19 -10 35 -3 -35 28 -37 -5 -64 -26 -2 55 8 -14 -13 -13 -5 58 4
5693 4 -36 12 6 -25 -13 3 18 -25 -39 -30 0 6 18 1 -19 26 26 17 33 -9 -21 48 9 0 40 14 13 0 57 10 33 33 -4 57 -34
5728 -34 18 1 17 -1 17 -9 59 3 -47 -15 -15 -41 43 14 -33 -26 31 26 24 -23 33 -1 48 34 -63 41 59 0 -2 10 11 -16 13
5761A3j4L3o3%O7j3m5M3ok4L8n5K6jokL7l9J3j7J8l2P0n9jJ1K7lk5n0J00k3m7
5794b9j2P9j5k2k3KQj5L0j8L3k7K4p0M7M0m0L8j8k2qM5j2K1p1L7J4o4N6jkRj5
5827aO2r1j1k5J9O1Po8N6k1N4n3k7M9j6PLK5m1K2l7L9m2M4K1m7J0j5J6jN%m6O6
5861B4l5m3N2lk8J1KJ7m1O4l7O3l0M0l5n6J05l4K1l7n7K2L5J7l2mJKm3k5J03q0
5893d1O4l0m6K0M3j1L9j0j3l6L5n3J8%k3O9K3o9Q2o7J1J6l5O5m3Ql0K0j9O7r9
5924d5P0Kk8j0k6J1oL8n7M1k2P6p7N2Kk6K6%n7J6k1P0p4J1J7mk1N7l6MK1m6P2
5957C0n0J6M9k9RJ3n4L2K3m5K9k6QM3m5j2L9o5l2P8j8J6jNo6jM6J4m9M9q5J23
5989D4q3N2l4N3n3J1J0P7l3r4P5j5k1j1Q0k4m0L3k3OK9%k4j5K9m3j6R4k0p6K1
$$ plain form
5761 13 -1 32 -31 -31 36 23 -22 21 15 -9 29 -26 0 -1 -7 -9 28 -11 2 -15 3 -29 41 -18 -19 -8 19 16 -9 -59 41 18 -29
5794 -29 -41 38 23 1 -22 -20 -12 -27 3 -15 18 -9 15 -55 -8 32 -8 30 12 -10 -18 27 15 36 -35 2 16 -48 8 7 5 14 -1
5827 -1 61 -30 -41 -66 -47 14 21 -47 9 -12 42 -11 -38 11 -5 2 5 30 -11 11 -26 13 -29 15 36 -11 -1 -16 0 -1 4 4 -42 24
5861 24 -11 -54 -2 -5 -33 -22 -20 -3 -44 20 -17 46 16 56 21 -35 70 36 57 20 -37 -15 20 37 5 1 2 4 -39 -64 39 -41
5893 -41 23 -7 -53 -33 10 -1 38 28 15 -21 14 -39 -21 -21 -44 25 48 -21 61 -6 5 21 -14 51 8 16 -14 6 -13 54 -45
5924 -45 25 27 -1 -11 -37 -26 -32 6 -51 -10 -32 44 -33 19 21 -5 21 21 -36 -20 -41 29 -45 -34 -17 -21 -42 15 -21 -17 4 -42 30
5957 30 -20 -4 45 16 25 38 -16 16 39 -6 23 -3 5 48 3 -9 30 -35 -67 11 -7 9 8 13 -53 -54 -8 6 -43 6 -79 44
5989 44 -39 13 -21 32 -21 -10 0 77 44 -50 25 10 -11 -22 58 34 -6 27 4 10 39 39 15 0 29 -14 -30 64 44 -32 -11
6020a1L8k0k5k2rK9K3r7Q5J7J1l8K3j2J2k6L5J9o3L2Pm3K2K1L2k6k7J4Jl2OL5
6052A1l1nP5n9Qk1JK3m2L0Pn6J3O9K4o0KL1m0K4Pk3J7k9K3k4Mj1J4RQJ1k0k4L0
6087dJ2o3Q1J3J3q8O6j5rj8Q6n7j9njn4J11p8nN3m3l7O3J1l5L1m6L9k8K2j4Qr
6120a9N0k3plK8k6K4MMm6OJ4N2o7N2n7Qm1L3rNL2k4M0p9O4k1L5m0%oM1j2n8J1
6155c5J5PKj4O3k0k3KN0r6L3L7k4m0O2pqm0J7k4O0n3lO9l7O3o5P4n3J6pMn7J9
6189a3J2k6R9l6j31J0J03j6Kl4K8QK5n0K5lK2n1P9m0k7NN0m4Ql3M8j4L6lk4l5
6221b0J0l5P1K6m4L3l7j1rJ3M6n0n2L6J7KkJnkK3L0o0l8K5L8o9O4j0N7j07J5J03
6254E9j10M8J1K4Rk8k6rO4k8n1L9j1M1o4J5j5K7k9qJj4M9J0k2Lj8L4J4l7M1pj3
$$ plain form
6020 -11 27 7 -18 -40 -49 -20 3 -94 -9 8 19 -19 4 -8 4 -22 13 32 -31 1 8 -35 -13 8 40 14 -13 1 2 -30 -24 11
6052 11 -20 -25 50 -9 -1 -22 -21 2 -40 -10 -3 -59 -46 23 47 -13 -11 20 -20 4 11 -12 5 -24 -1 -25 -21 -32 -18 -9 -1 10 -10 -34 -4
6087 -4 8 -55 26 39 52 -36 30 15 6 -12 74 17 -2 -7 -8 -62 49 -29 -34 19 -24 -61 2 13 -22 9 -37 2 -26 -4 -18 -10 -19
6120 -19 31 8 1 -2 26 0 24 28 32 -14 -8 6 58 -9 43 -14 -6 -47 -14 -23 -18 14 -10 30 -49 15 -6 29 -11 -11 -17 24 12 -46 -35
6155 -35 -20 -13 -11 -25 38 18 -5 -3 47 -49 -16 21 -3 -43 19 12 4 -36 -19 -43 17 -36 -39 30 -7 56 -9 65 12 28 21 25 -32 -13
6189 -13 -1 -27 72 36 -95 -85 18 2 4 -30 -2 6 31 -19 6 3 25 -26 53 13 -14 -9 41 -3 5 -28 20 6 42 39 15 -20
6221 -20 -10 -45 26 52 8 41 4 -7 -16 -3 43 -7 -59 -23 -6 -4 -6 -5 -10 -12 11 41 -19 -57 -32 6 -63 1 -9 48 -59 -44 59
6254 59 -51 -3 8 32 41 13 -13 -22 42 14 -37 2 -9 32 -32 -17 -32 -5 -34 -42 -41 -55 -6 4 -18 -15 -33 1 15 -22 19 12 -1
6287aM5m5L5p1J13n3qj9m5M2Q4r2mN7l8nk2nM6lnj0L9j2K0m0L4o4M0j0KJ5m2M9
6321B7pq7O9m6O0l0j7J5k4J7M5j4k4L7j5K0kkjM0m8k5O3l5J6j9j8M6m8K4rJ3P
6354B8n5pJ1ql6J1P6k3jn2P5m0M9j8l0J0n8N1O4Ok0j4Nj5K0k4L1n6l3O7l8M6l1
6387irK5l1K7l8Lk5J4M0K7l2J8J2k4oM6K6l9k9nj5j4J9m2N3K1J9m9kL4k1Mj5L9
6421B2o6N7J7M1p4O4p9N4o7oN2K1k5j8L3n0Lj0N7ol2%L7rl6LM4p2P9k0l9%L5j1
6455ajL0j1qlm6P0j3Lrl9L7m0O1k5J5mmL0k6n6N7nL5q7M6Qk8MK4K7l6l3M7pm0
6491b8RqlJ4N6l9Lj9M4j8mL5j9jK5l7j9N8j8o6O4l3K7l3J4PMJJ6o7m2N2Ok6OM7
6527Hm8k1P1l4K0J6J6j6K1k7j7M8l5J3p1M8j9L7M1m3%K6no9nN3j7J5j3N6j0q4
$$ plain form
6287 -1 44 -1 34 -37 76 23 15 -4 -49 -7 77 -15 -19 38 0 -5 -27 -32 14 11 6 -4 35 23 43 3 37 -27 13 3 5 20 -22 27
6321 27 20 -67 2 -44 16 -14 -31 -16 -40 -23 22 8 -16 21 6 26 24 22 21 61 13 -12 51 16 32 13 -5 41 -7 17 8 21 28
6354 28 -27 -34 -23 -31 -67 -56 20 -3 -4 -56 19 -21 28 10 -20 -10 -68 -17 47 53 33 19 24 9 29 5 36 -20 -53 14 -24 22 -9
6387 -9 -18 7 -24 3 -35 -32 -57 -43 -3 24 -8 10 22 -2 -8 38 64 25 -4 -9 -24 -38 -19 -61 -8 13 32 -17 -19 15 -6 -2 -17 22
6421 22 -44 13 30 71 -3 61 -18 36 -31 -37 15 36 11 -7 26 -24 -21 -31 26 20 -12 -12 25 16 -20 -17 27 -45 34 14 -25 -25 10 -1
6455 -1 -2 28 17 9 6 -40 30 17 20 11 -28 9 -31 30 5 20 16 12 42 16 -40 17 12 47 -40 6 14 -14 -10 14 41 5 -28 19 12 -28
6491 -28 -19 -27 -30 -16 40 1 4 -15 29 11 7 42 23 22 47 10 -9 49 31 -35 29 -4 23 -10 4 11 15 16 32 -35 -77 -25 -19 -45 -39 8
6527 8 -40 -61 10 -24 -4 12 28 12 33 6 -11 37 2 15 -56 -8 -27 10 51 8 8 34 29 -40 -45 8 -9 6 -7 49 39 -45
6559d5RL1L1o3O2k5JJ5n4N2r3O9k3nL3J5l8J4Nj5MJ5J4j3Pl8M6m7POqQ3l8L3j13
6594f6J26l6Ro5L4m4J3N6n4Nl0N0j5J9nl8M9k2O0n3L4m5K0RJ8l0K3jn2M2l4P5
6626E2n6Qj3N8l5%%J4m6oO3k6m5L4k3k1lQ3o6L6o9kL2K6L1m1JK0k8M7o0jKrRN2
6662A8K4m6k0oN8rj3k5OmO1o9L6k1KL5L1n5k6Kj3M0Nn2%Pk2L3kK2K8k3Mk9qK3
6698hm7M6k4P5k1n0J5J2l0J3K4K5p2M3m4K1P2j00P1n1K0N9m0m4M3Lk0lj8J7M1
6729B8l0O3p3j4K1rk4Rj8N3m0L%mM9k1j9K5J0j5M1k3k1LL9n2J5k5N5n6M5k5mM4
6763C0mj4Pl7ORj0M1l9qKM4m2l6M3J5k5L1n3j1R2n9j0Q0n6PJ5rM0m6k3K9k3K6
$$ plain form
6559 -45 -36 -5 26 -37 25 0 1 16 -38 14 -79 -10 -33 -38 -5 10 -28 -14 -9 -24 -20 -5 9 -4 3 -35 11 -36 -29 -23 -31 52 14 47 -66
6594 -66 60 24 33 -32 2 -42 -29 27 -27 -22 -52 -2 -17 2 -3 -41 8 -14 46 -7 27 -18 2 11 29 -1 22 21 -31 11 -23 52
6626 52 -4 4 -9 49 14 14 14 28 -18 -24 39 13 -32 2 -21 -42 -45 38 -28 8 -61 -63 -31 -5 26 -15 -14 6 -22 25 -35 -36 -34 -43 -34 18
6662 18 42 -4 -24 -30 28 19 6 -19 -13 -17 44 -25 11 -10 -8 27 58 3 -23 -21 -34 6 11 -41 -41 -34 -56 -23 -25 -3 25 2 6 -23 -31 -8
6698 -8 -55 -9 -33 42 21 -29 -14 -2 -32 -19 5 30 -42 1 -43 -22 50 -50 21 -30 -10 49 9 -35 8 11 -9 -12 -30 -13 28
6729 28 -2 61 -12 -26 -5 -14 -38 -29 -47 6 -34 -31 -31 -35 14 -7 -26 -1 9 -6 35 12 -9 -6 33 -19 -4 -29 26 -30 15 -10 -14 30
6763 30 26 12 19 -18 -12 -3 -13 28 -11 -19 -17 27 -15 -51 -8 7 -18 13 -40 -51 41 -18 -28 52 -4 3 18 9 49 3 -20 9 -14 12
$$ [...]
8191A6
##END NTUPLES=NMR FID
##END=
