##TITLE=1H_X 2508-1
 CD3CN
 8 sc, 
 28.8.2023
##JCAMPDX= 6.0         $$ Bruker NMR JCAMP-DX V2.0
##DATA TYPE= NMR FID
##DATA CLASS= NTUPLES
##ORIGIN= UXNMR, Bruker Analytische Messtechnik GmbH
##OWNER= root
$$ XWIN-NMR		Version 3.5
$$ Mon Aug 28 14:21:00 2023 Russian Standard Time (UT+4h)  she@DPX200
##.OBSERVE FREQUENCY= 200.13135
##.OBSERVE NUCLEUS= ^1H
##.DELAY= (6, 6)
##.ACQUISITION MODE= SIMULTANEOUS
##.ACQUISITION SCHEME= undefined
##.AVERAGES= 8
##.DIGITISER RES= 18
##SPECTROMETER/DATA SYSTEM= spect
##.PULSE SEQUENCE= zg30
##.SOLVENT NAME= CDCl3
##.SHIFT REFERENCE= (INTERNAL, CDCl3, 0, 15.7039)
##AUDIT TRAIL= $$ (NUMBER, WHEN, WHO, WHERE, WHAT)
$$ ##TITLE= Audit trail, XWIN-NMR		Version 3.5
$$ ##JCAMPDX= 5.01
$$ ##ORIGIN= Bruker BioSpin GmbH
$$ ##OWNER= she
$$ F:/spectra/data/she/nmr/H-F/1/audita.txt
$$ ##AUDIT TRAIL=  $$ (NUMBER, WHEN, WHO, WHERE, WHAT)
(   1,<2023-08-28 14:19:33.67 +0400>,<she>,<DPX200>,
      <created by zg, POWCHK disabled, PULCHK disabled
       configuration hash MD5:
       00 E9 B6 7A A2 85 ED C7 34 08 36 98 17 FE 4E 26
       data hash MD5: 16K
       D5 1A 33 7E 0F 7C 72 CF 0D 6C D5 67 C4 D0 0B C3>)
$$ ##END=
$$ 
$$ hash MD5
$$ 8D 23 AF 81 C7 A9 FE 22 30 1A 7B C1 32 E1 4F E8
##$RELAX= 
##$RELAX= 
##$RELAX= 
##$RELAX= 
##$RELAX= 
##$RELAX= 
$$ Bruker specific parameters
$$ --------------------------
##$DU= <F:/spectra>
##$EXPNO= 1
##$NAME= <H-F>
##$PROCNO= 1
##$TYPE= <nmr>
##$USER= <she>
##$AMP= (0..31)
100 100 100 100 100 100 100 100 100 100 100 100 100 100 100 100 100 100 
100 100 100 100 100 100 100 100 100 100 100 100 100 100 
##$AQSEQ= 0
##$AQ_mod= 1
##$AUNM= <au_zg>
##$AUTOPOS= <>
##$BF1= 200.13
##$BF2= 200.13
##$BF3= 200.13
##$BF4= 200.13
##$BF5= 200.13
##$BF6= 200.13
##$BF7= 200.13
##$BF8= 200.13
##$BYTORDA= 1
##$CFDGTYP= 0
##$CFRGTYP= 5
##$CHEMSTR= <none>
##$CNST= (0..31)
1 1 145 1 1 1 1 1 1 1 1 1 1 1 1 1 1 1 1 1 1 1 1 1 1 1 1 1 1 1 1 1 
##$CPDPRG= <>
##$CPDPRG1= <>
##$CPDPRG2= <>
##$CPDPRG3= <>
##$CPDPRG4= <mlev>
##$CPDPRG5= <mlev>
##$CPDPRG6= <mlev>
##$CPDPRG7= <mlev>
##$CPDPRG8= <mlev>
##$CPDPRGB= <>
##$CPDPRGT= <>
##$D= (0..31)
0 1.2 0 0 0 0 0 0 0 0.06 0 0.03 0 0 0 0 0.0002 0 0 0 0 0 0 0 0 0 0 0 0 
0 0 0 
##$DATE= 1693217973
##$DBL= (0..7)
120 120 120 120 120 120 120 120 
##$DBP= (0..7)
150 150 150 150 150 150 150 150 
##$DBP07= 0
##$DBPNAM0= <>
##$DBPNAM1= <>
##$DBPNAM2= <>
##$DBPNAM3= <>
##$DBPNAM4= <>
##$DBPNAM5= <>
##$DBPNAM6= <>
##$DBPNAM7= <>
##$DBPOAL= (0..7)
0.5 0.5 0.5 0.5 0.5 0.5 0.5 0.5 
##$DBPOFFS= (0..7)
0 0 0 0 0 0 0 0 
##$DE= 6
##$DECBNUC= <off>
##$DECIM= 32
##$DECNUC= <off>
##$DECSTAT= 4
##$DIGMOD= 1
##$DIGTYP= 9
##$DL= (0..7)
0 120 120 120 120 120 120 120 
##$DP= (0..7)
150 150 150 150 150 150 150 150 
##$DP07= 0
##$DPNAME0= <>
##$DPNAME1= <>
##$DPNAME2= <>
##$DPNAME3= <>
##$DPNAME4= <>
##$DPNAME5= <>
##$DPNAME6= <>
##$DPNAME7= <>
##$DPOAL= (0..7)
0.5 0.5 0.5 0.5 0.5 0.5 0.5 0.5 
##$DPOFFS= (0..7)
0 0 0 0 0 0 0 0 
##$DQDMODE= 0
##$DR= 18
##$DS= 0
##$DSLIST= <SSSSSSSSSSSSSSS>
$$ [...]
##$SUBNAM2= <"">
##$SUBNAM3= <"">
##$SUBNAM4= <"">
##$SUBNAM5= <"">
##$SUBNAM6= <"">
##$SUBNAM7= <"">
##$SUBNAM8= <"">
##$SUBNAM9= <"">
##$SW= 18.05172834244
##$SWIBOX= (0..15)
0 0 2 0 0 0 0 0 0 0 0 0 0 0 0 0 
##$SW_h= 3612.71676300578
##$TD= 16384
##$TD0= 1
##$TE= 0
##$TE2= 300
##$TE3= 300
##$TEG= 300
##$TL= (0..7)
0 120 120 120 120 120 120 120 
##$TP= (0..7)
150 150 150 150 150 150 150 150 
##$TP07= 0
##$TPNAME0= <>
##$TPNAME1= <>
##$TPNAME2= <>
##$TPNAME3= <>
##$TPNAME4= <>
##$TPNAME5= <>
##$TPNAME6= <>
##$TPNAME7= <>
##$TPOAL= (0..7)
0.5 0.5 0.5 0.5 0.5 0.5 0.5 0.5 
##$TPOFFS= (0..7)
0 0 0 0 0 0 0 0 
##$TUNHIN= 0
##$TUNHOUT= 0
##$TUNXOUT= 0
##$USERA1= <user>
##$USERA2= <user>
##$USERA3= <user>
##$USERA4= <user>
##$USERA5= <user>
##$V9= 5
##$VALIST= <valist>
##$VCLIST= <CCCCCCCCCCCCCCC>
##$VD= 0
##$VDLIST= <DDDDDDDDDDDDDDD>
##$VPLIST= <PPPPPPPPPPPPPPP>
##$VTLIST= <TTTTTTTTTTTTTTT>
##$WBST= 1024
##$WBSW= 4
##$XGAIN= (0..3)
0 0 0 0 
##$XL= 0
##$YL= 0
##$YMAX_a= 277614
##$YMIN_a= -288211
##$ZGOPTNS= <>
##$ZL1= 120
##$ZL2= 120
##$ZL3= 120
##$ZL4= 120
##$ABSF1= 10
##$ABSF2= 0
##$ABSG= 5
##$ABSL= 3
##$ALPHA= 0
##$AQORDER= 0
##$ASSFAC= 0
##$ASSFACI= 0
##$ASSFACX= 0
##$ASSWID= 0
##$AUNMP= <proc_1d>
##$AZFE= 0.1
##$AZFW= 0.1
##$BCFW= 1
##$BC_mod= 2
##$BYTORDP= 1
##$COROFFS= 0
##$CY= 11.3945322036743
##$DATMOD= 1
##$DC= 2
##$DFILT= <>
##$DTYPP= 0
##$F1P= 15.7292609196834
##$F2P= 12.9074282941183
##$FCOR= 0.5
##$FTSIZE= 0
##$FT_mod= 4
##$GAMMA= 1
##$GB= 0.15
##$INTBC= 1
##$INTSCL= 1
##$ISEN= 128
##$LB= 0.24
##$LEV0= 0
##$LPBIN= 0
##$MAXI= 10000
##$MC2= 0
##$MEAN= 0
##$ME_mod= 0
##$MI= 1.114404
##$NCOEF= 0
##$NC_proc= 0
##$NLEV= 6
##$NOISF1= 3.799351
##$NOISF2= 2.8
##$NSP= 1
##$NTH_PI= 0
##$NZP= 0
##$OFFSET= 15.70392
##$PC= 1
##$PHC0= -21202.63
##$PHC1= 9.05272
##$PH_mod= 1
##$PKNL= yes
##$PPARMOD= 0
##$PSCAL= 0
##$PSIGN= 0
##$REVERSE= no
##$SF= 200.130013532006
##$SI= 16384
##$SIGF1= 3
##$SIGF2= 2
##$SINO= 400
##$SIOLD= 16384
##$SREGLST= <1H.CDCl3>
##$SSB= 0
##$STSI= 0
##$STSR= 0
##$SW_p= 3612.71676300578
##$SYMM= 0
##$S_DEV= 0
##$TDeff= 0
##$TDoff= 0
##$TI= <>
##$TILT= no
##$TM1= 0
##$TM2= 0
##$TOPLEV= 0
##$USERP1= <user>
##$USERP2= <user>
##$USERP3= <user>
##$USERP4= <user>
##$USERP5= <user>
##$WDW= 1
##$XDIM= 8192
##$YMAX_p= 0
##$YMIN_p= 0
$$ End of Bruker specific parameters
$$ ---------------------------------
##NTUPLES= NMR FID
##VAR_NAME=  TIME,          FID/REAL,        FID/IMAG
##SYMBOL=    X,             R,               I
##VAR_TYPE=  INDEPENDENT,   DEPENDENT,       DEPENDENT
##VAR_FORM=  AFFN,          ASDF,            ASDF
##VAR_DIM=   8192,          8192,            8192
##UNITS=     SECONDS,       ARBITRARY UNITS, ARBITRARY UNITS
##FACTOR=    0.0002768,     1,               1
##FIRST=     0,             0,               0
##LAST=      2.2672688,     0,               0
##MIN=       0,             -288211,         0
##MAX=       2.2672688,     277614,          0
$$ Real data points
##PAGE= N=1
##DATA TABLE= (X++(R..R)), XYDATA
0@%%%%%%%%%%%Qj6J6j6J9k7L4m2M9n7P2q8J04j20J38j60J85k13K45k79L18l62
33a92M08m61N20n84O56p33Q16r07J006j116J237j367J509j665J836k025K230k456
51a288K707k983L291l637M028m471M980n574O272p112Q143r440J1130j3433J6767
66I380k2033L1568n3945J93402Q6530n33113K07493L01488k65484p2329K49666
77A32623j69404p1501K66469j47910k52625L67382J11873m55927N2225M03484
87B36689j93177k12091K34658j3610j75533K00285J8390k69135J74171K20992
97B21639l37700q6040L96798n9586l34199J60399J73371j78675J2099J14097j51503
108f9300J3280J91563j58596j32729K67466J5699k95588R6411K32685j57975j03305
$$ plain form
0 0 0 0 0 0 0 0 0 0 0 0 0 8 -8 8 -8 11 -16 18 -24 25 -32 40 -48 56 -64 74 -86 99 -114 131 -148 170 -192
33 -192 216 -245 275 -309 347 -386 430 -477 529 -587 650 -717 792 -873 963 -1062 1168 -1288
51 -1288 1419 -1564 1727 -1910 2118 -2353 2627 -2947 3325 -3787 4356 -5084 6046 -7387 9380
66 9380 -12653 18915 -35030 158372 244902 -288211 -80718 220770 -44714 -117043 132623
77 132623 -36781 -108282 158187 10277 -242348 125034 236907 -219020 -166795 236689
87 236689 43512 -168579 66079 52469 -123064 77221 95611 -173524 647 221639
97 221639 -116061 -202101 194697 135111 -199088 -38689 134682 -43993 -31894 82203 -69300
108 -69300 -56020 135543 -23053 -155782 111684 127383 -168205 -71794 160891 2916 -100389
119a00389J51346l9412q3055J39270k1708j58139J28061J01218j99128p664K12631
130A23031p2722j66098J08208P6958r0771J8951L1534q2051M4753Q6633j12438
141c4012l9526J50945k9286j52391Q3985J17066j02642n5207Q0626j0694k9248
152b0384N3566k8874n6065P4717K3977r7771K2955R6513n9431p1509O7423L0054
164C5171m2308J2137m208l6714N1071L2990q3141n088R3814l3716q4338O2829
176a501N7357o6439k1470M0594r616J876K4177m0839j7270O3132o558o4020L7020
189c557M6027n6249j5858N1422j4370k1369L3055j9570l4941N3804J9662o9806
201c1750O846O3211l4581l8766M8592O928l9810J7789J1328k7202K2994K0373
$$ plain form
119 -100389 50957 11545 -71510 67760 46052 -112087 15974 117192 -81936 -89600 123031
130 123031 50309 -115789 -7581 69377 -21394 -2443 29091 -52960 -8207 78426 -34012
141 -34012 -73538 77407 48121 -104270 -20285 96781 -5861 -61068 19558 8864 -20384
152 -20384 33182 4308 -51757 22960 46937 -50834 -27879 68634 9203 -62306 5117 35171
164 35171 -7137 5000 792 -35922 15149 48139 -35002 -40090 53724 20008 -64330 -1501
176 -1501 55856 -10583 -32053 8541 -1075 801 24978 -15861 -33131 30001 23443 -40577 -3557
189 -3557 42470 -13779 -29637 21785 7415 -13954 19101 -469 -35410 18394 38056 -31750
201 -31750 -24904 38307 3726 -35040 13552 20480 -19330 -1541 9787 -17415 5579 25952
213B5952m8775n57N5961k5104m1151M6330J1425n0898K0000L5687l9134o689M1374
226B4421k3906k8269M4384N434m7106J8548L0386l3677l224L2305k1055j6390
238a8149L1727p006k7517K8274J1534l9766J0148L6044k8780j7948L6457m567
250A0451l0717K1657J6602k7610M77K2989j4380j0622K0679m352j6171J4647L923
263G573j6149Q576R960j6224q07J7144r044j2328J6136K974j8001O707J3363j1931
277b051n822J1993l65q941M044N396n097j282L623j403K52J288l063J291L242
292C105l614j836M458M79n186P37N316k769m453L971K404l707j626L173J761l793
308a580j227M480q1l974R71L370p31l467J513L668k534k683K917J778k351k093
$$ plain form
213 25952 -22823 -23380 32581 7477 -33674 12656 24081 -26817 -6817 28870 -10264 -16953 24421
226 24421 515 -27754 16630 22064 -25042 -6494 23892 -9785 -13009 19296 -1759 -18149
238 -18149 13578 6572 -20945 7329 18863 -20903 -10755 25289 -3491 -21439 15018 10451
250 10451 -20266 1391 17993 -9617 -9140 13849 -531 -11153 9526 5174 -10997 3650 7573
263 7573 -8576 0 9960 -6264 -7071 10073 1029 -11299 4837 7811 -10190 -3483 9880 -2051
277 -2051 -7873 4120 3755 -5186 -1142 4254 -843 -2125 1498 95 347 1635 -1428 -137 3105
292 3105 -509 -2345 2113 2592 -2594 -1857 3459 690 -3763 208 2612 -1095 -2721 452 2213 -1580
308 -1580 -2807 1673 1592 -2382 -1411 1959 1228 -2239 -726 2942 408 -2275 642 2420 69 -2024
324b024K972J895m074o51M048j047k983J173K113j132k027J306J158r25n37o02
340a337J604J399l822J03N270k455m972M860L956o794j617Q409k227p486O126
355A017L809p633R33N757m263k380N478j605m792N225R68o783M451M044q708K031
371b451Q599q229m636J2411j380j3645Q379J1008j3591l889J4257m545q703R608
385C193J70q839P851L218j2646N233J2962j4009p076J7809l483j3530J2612K311
399E776j5822J0478J1013k0337J60K3873j4036j9278K4617P203k5063P155J3865
412I604j5871M089J5003k0747l681K9656j4167k7053L1895J3073m0166O944L2224
425B0803k3538j0012K8263j6961j9014L7340k186m3108K8146L1001m8422n819
$$ plain form
324 -2024 948 2843 -1231 -1882 2166 1119 -1864 -691 1422 290 -1737 -431 727 -198 -735 -1337
340 -1337 267 1666 -2156 -2053 3217 762 -4210 650 4606 -2188 -3805 4604 2377 -5109 1017
355 1017 4826 -2807 -1874 3883 -380 -2760 2718 1113 -3679 1546 2514 -4269 182 4226 -4482 -2451
371 -2451 6148 -2081 -6717 5694 4314 -9331 -952 10056 -3535 -7424 6833 2288 -6415 3193
385 3193 3363 -5476 2375 5593 -7053 -1820 11142 -2867 -9943 7866 4383 -9147 3465 5776
399 5776 -10046 432 11445 -8892 -8732 15141 1105 -18173 6444 13647 -11416 -4261 9604
412 9604 -6267 -2178 12825 -7922 -11603 18053 3886 -23167 8728 21801 -18365 -11421 20803
425 20803 -2735 -12747 15516 -1445 -20459 16881 14695 -28413 -267 30734 -17688 -23507
437b3507N1679k1055l3442L6531K93l3285L4484J1754n5651K1552N4074n5088
449a1661k8452P4739r974o9327M3161L8479n5589O747M1335m8587n589O9642m0190
462D734n9450P8527K1303r3891K6921P7929o2044l5373O7150j8411l9713O3676
474C1358j0450q1563O5565O3163j04603j5915J13027l7317q7554P1094L7557o9682
486b5320K0417L2636o5920K6169Q1022q4560n8765J20127R279j21213M3456Q8788
498F6116p4821l4453O9230k5077k6727O9971l6757q3693R6316O1246j29301j3106
510f1056J26064l8216r0301O9315L4619o3406K4022K0030o6887M4103P9877j02538
522b4374n9658J33006J5300j27439L3920R0232o5662l4577O2132k2441k1641O3527
$$ plain form
437 -23507 28172 7117 -26325 10206 10499 -22786 11698 23452 -32199 -10647 43427 -11661
449 -11661 -40113 34626 24652 -44675 -1514 36965 -18624 -11877 29458 -19129 -24718 44924 4734
462 4734 -54716 23811 45114 -48777 -21856 56073 -5971 -41344 25806 7395 -32318 31358
474 31358 20908 -60655 4910 68073 -36530 -52445 60582 23265 -64289 6805 44362 -25320
486 -25320 -4903 27733 -38187 -12018 69004 -15556 -74321 45806 55085 -66128 -22672 66116
498 66116 -8705 -43158 26072 995 -25732 44239 7482 -76211 20105 81351 -47950 -61056
510 -61056 65008 26792 -63509 5806 40425 -22981 1041 21071 -45816 -1713 78164 -24374
522 -24374 -84032 48974 64274 -63165 -29245 60987 -4675 -39252 22880 439 -21202 42325
534D2325l9964p7129R6846O0874j27695k1168J23220k5900q6946N9014L2765n9331
546b3089K1508K3306n9549L5248P1937r1784n6390J24051J8297j20582K7923Q3683
558E4559o0825k9314O1888k2743k7313N6229l0221o3913Q7144M5041j19424o945
570e5837J13883l5353p4113O2097J9394n8007K8264K1130n3456L6096N1803r0318
582c4417k6786J17730j0665j06148M4692O2840n9739r754M6565l0363p396M4344
594C0903m5242l1926Q9975K002j06409L0429Q6821n0897m1931N0069n445k6665
606a8316L4620j3067l5796N7114J2940q7569J9807R0337m4552o3412M9578K0213
618B1897l3083J8045J161l4254L6223K2385o7504Q820Q0201m1043o8143N5517
$$ plain form
534 42325 2361 -74768 22078 82952 -44743 -65911 57309 31409 -55537 3477 36242 -23089
546 -23089 -1581 21725 -37824 -2576 69361 -22423 -78813 45238 63535 -57047 -29124 54559
558 54559 -6266 -35580 26308 3565 -23748 32481 2260 -61653 25491 70532 -48892 -55837
570 -55837 58046 22693 -51420 10677 30071 -27936 328 21458 -31998 4098 55901 -34417
582 -34417 -61203 56527 45862 -60286 -15594 47246 -12493 -22247 24318 -6045 -13441 30903
594 30903 -14339 -46265 43710 45712 -60697 -30268 56553 5656 -36275 13794 8349 -18316
606 -18316 16304 3237 -32559 24555 37495 -50074 -30267 60070 15518 -47894 1684 21897
618 21897 -11186 6859 8020 -26234 9989 32374 -35130 -26310 53891 12848 -55295 222
630B22L6016m5475J970J6100k8540K0600L1636n1999j0059O8307k3765o3906N0311
643A418M1488n4075r920L3367j8191J782L1725l6661k4124N8398j746o0655L2357
656d837M4583n1062j8550M7139p654k2889K5257j0762k8681L9783J5674n2731
668b4730Q828M6400l3057k5868M4806J786l7756J7544J5131k6943J4035K3989
680B4165l6892r598M4242j1010l4749K8676J5315l5967M287K9514j7969j1647
692a1633K2229j0693j7200K7575M782l1955J0184K3575k1775q665K6547n529k2478
705a5036J5172J0305j7608N650J3294j7989m487K1935n180j7468J3207Q008j7787
718g984K074J6715r775r444J2214j510r697J0719M123j5078K273J3800q624p760
$$ plain form
630 222 36238 -9237 -7267 8833 -19707 893 32529 -19470 -29529 38778 15013 -48893 1418
643 1418 42906 -11169 -21089 12278 -5913 -4131 27594 -9067 -33191 25207 23461 -37194 -4837
656 -4837 39746 -11316 -29866 17273 9619 -13270 11987 1225 -27456 12327 28001 -24730
668 -24730 -15902 30498 -2559 -28427 16379 18165 -19591 -2047 13084 -13859 176 24165
680 24165 -12727 -22325 21917 10907 -23842 4834 20149 -15818 -11531 17983 14 -11633
692 -11633 10596 -97 -17297 10278 15060 -16895 -6711 16864 -4911 -13576 12971 7442 -15036
705 -15036 136 10441 -7167 -1517 11777 -6212 -10699 11236 6056 -11412 1795 9803 -7984
718 -7984 -5910 10805 1030 -8414 3800 2290 -7407 3312 7435 -7643 -5370 8430 -194 -7954
732g954J3175k23j3500P070Q958r775j290Q740n902n128J0386M66j0784M783O805
747E827q670m79Q983m908o047P260R28o758M005M204p739m49Q261l688n198O284
763A816M37o131L322M160m709j223M632j887k908M336K44m401K330K218l272N22
779e14K702k383j523K905Ok776J540J508k856L09K362j513j022J455J9j108N68
796c21Q51r50j64J101n92k86J013n51m08Q30q5n27K52N59n66n56J047p3j150O96
816A20M08q15K1L91j15m68J86L52o30K74L78o82M00N07q52K79P67n83k87P73J09
837E33q74L96Q90j185J27J075j028j50J005p22m66P89l48n01O57l1j227J132Q97
856I69k534O51K713k462j291L236n90k414K194P90k840J529K406l922J11N066
$$ plain form
732 -7954 5221 4998 -8502 -1432 7526 -2249 -3539 5201 -701 -5829 4557 5023 -5761 -978 5827
747 5827 -2843 -3322 5661 753 -5294 1966 2894 -3864 141 4345 -3394 -3843 4418 730 -4468 1816
763 1816 2253 -3878 -556 3604 -1105 -2328 2304 417 -2491 1845 2089 -2312 18 2236 -1036 -514
779 -514 2188 -195 -1718 1187 1193 -1583 -43 1465 -1391 -1082 1280 -233 -1255 200 219 -889 -321
796 -321 530 -420 -584 517 -75 -361 652 101 -307 523 438 -89 163 722 156 -400 647 574 -576 120
816 120 528 -287 -266 125 10 -458 -272 80 -550 -276 102 -580 -180 327 -525 -246 521 -62 -349 424 533
837 533 -341 55 945 -240 -113 962 -66 -216 789 67 -399 390 42 -459 198 167 -1060 72 969
856 969 -1565 -914 1799 -663 -1954 1282 692 -1722 472 1262 -1578 -49 2357 -1565 -1454 3612
872C612l661l434O056J62o151L298L724n747J35N994m908l431Q388k050q709P857
888A135N142j1300O79J0639o022o362R514m51r174Q244L942j3030N069J2472j3719
903c222o603J8527j874j7695J0177J0659j5100O13J3597j2276n072J8896q037
916B590j7889K0432R741k7619K149K6465j3728j6261K0069K4j7348J6231N354
929A0210k5163J1898K4279k8342j4014L8489j893l7055J7177K3188k5078j329
941g633K1080j9989o044L2489j5684l2082L6612J8980m9307J532M6943k0769k8761
954b2633K9832R21k4059K5725N289m1273K1027M0140m5646k2823N9360l141n4467
967c1748K5795L1530l4832J403K6351l1942l192M8509k7106m4844N3550K2538
$$ plain form
872 3612 -49 -3483 2573 2735 -3416 -118 3606 -2141 -2006 3988 -920 -4351 4037 1987 -6722 1135
888 1135 6277 -5023 -4344 6295 273 -6089 3425 2974 -6200 2044 5986 -7044 -1975 10497 -3222
903 -3222 -9825 8702 6828 -10867 -690 9969 -5131 -4518 9079 -3197 -8269 10627 2590
916 2590 -15299 5133 14874 -12745 -10596 15869 2141 -14120 5949 5973 -11375 4856 10210
929 10210 -14953 -3055 21224 -7118 -21132 17357 15464 -21591 -4414 18774 -6304 -7633
941 -7633 13447 -6542 -12586 19903 4219 -27863 8749 27729 -21578 -20046 26897 6128 -22633
954 -22633 7199 8120 -15939 9786 15075 -26198 -5171 34969 -10677 -33500 25860 22719 -31748
967 -31748 -5953 25577 -9255 -7852 18499 -13443 -16635 31874 4768 -40076 13474 36012
979C6012o5663P568N7059l1319l0335L8097n017k5506L6016j661n0900L3808M3716
992D1875n8743j8099O6969j2982n4832L4677K7109l7572O947K0898l4887Q495
1004a0145M5993l9464l5830N9946R810o2966J8493M8272l5578k1763L3471p668
1016B571j3274K9658j6716l5774M4041K3912n8098o33N5580k1846l9304L2424
1028B541J6321k5087N874K567j9859K5438K1203m7035j0137N4030o990m6899K1194
1041f839L1043k4890j3318J4171j013P643P848l1189o677M6237n97m7808R870
1054a5519L8367j6098k4032J4853J0989l320k824j5519P69L3907k760m3719O284
1067a8622M2122r787l1458J0991J7519p055o771m060K392J9941l824l4542P213
$$ plain form
979 36012 -29651 -22083 34976 3657 -26678 11419 6402 -19104 16912 15251 -35649 -1841 41875
992 41875 -16868 -34967 32002 19020 -35812 -1135 25974 -11598 -4651 16247 -18640 -10145
1004 -10145 35848 -3616 -39446 20500 30310 -32656 -14163 34109 -1469 -23232 10239 2571
1016 2571 -10703 18955 2239 -33535 10506 34418 -23680 -24313 31267 9421 -29883 2541
1028 2541 18862 -6225 -351 2216 -17643 7795 28998 -18037 -28174 25856 18866 -28033 -6839
1041 -6839 24204 -686 -14004 167 -846 6797 14645 -16544 -23221 23016 22419 -25389 -15519
1054 -15519 22848 6750 -17282 -2429 8560 5240 2416 -13103 -12334 21573 18813 -24906 -18622
1067 -18622 23500 13713 -17745 -6754 10765 3710 -3061 -7121 -4729 15212 11388 -23154 -15941
1080a5941M1426r946l7744J0777K5633r158j0787L381M26P672J825k1473K372
1093a1537L3931q476l9314J2650L4861j3750k1196J0911M730l734O528p686q271
1106a0353K1062J751l2858Q025L7655j6180l1973J9422J6267j6061K386O615j4932
1119i174O927J6114k1480o297L3045q549l6623K1714K8474k6899j0365K1884r775
1132a004q672K2271q123k1523K4001P904l4544J1906L5080k8452k3800L3687M004
1145A2735k5712J5690Q543k6316J1021K2753k6801o147L4458j5825l0821L2464
1157F042J6873l5601K347K4578j8875n313K5983j4461j9895K8049K420l1306J8089
1170a070K3944l1772r313L1763o809j9300J8624M67k1661J6775J4110k6171J538
$$ plain form
1080 -15941 25485 15539 -22205 -11428 14205 5047 -5740 -2359 -1933 5739 7564 -13909 -11537
1093 -11537 22394 13918 -25396 -12746 22115 8365 -12831 -1920 2810 -924 5604 -2082 -10353
1106 -10353 10709 12460 -20398 -12373 25282 9102 -22871 -3449 12818 -3243 -857 5758 -9174
1119 -9174 -2247 13867 -7613 -13910 19135 10586 -26037 -4323 24151 -2748 -13113 8771 -1004
1132 -1004 -9676 12595 4472 -17051 6950 14854 -19690 -7784 27296 -1156 -24956 8731 12735
1145 12735 -12977 2713 11256 -15060 -4039 18714 -8087 -14234 20224 4399 -26422 6042
1157 6042 22915 -12686 -10339 14239 -4636 -9949 16034 1573 -18322 9727 12147 -19159 -1070
1170 -1070 22874 -8898 -18211 13552 6743 -12557 6067 6534 -15127 1648 15758 -10413 -8875
1183h875K5061j7829j5449K6914K356k4504R309J2488j5876L505J5513j6599p765
1196a1751K1434m226j7301J5013P566j9425K287J5829r157o094J1283n445q696
1209h683J3367K498j4511M815R348r953j943J1215m021q049O718K120o362M629
1223A188L522q415K83P690l222l781M681n24m657L086L243l777l90K440k551n39
1239a723L899j066l006J383J087j188O08J185j526j078J546L83m95M56l89p61
1255f85L74P25L58o26n65L42QJ51N75k77q73J0P74p9m67P00l89j188J174P85j324
1276d97K27P18r88r7J328k89j301R21N89j304P04J141j555k91J470o65n46J060
1294F25m5j353O81J125j400j21J346j048o50J344k07j060O81M66q74P7R23o05
$$ plain form
1183 -8875 16186 -1643 -17092 9822 12178 -12326 -3017 9471 -6405 -2900 12613 -3986 -11751
1196 -11751 9683 5457 -11844 3169 10735 -8690 -6403 9426 269 -5825 5458 13 -8683
1209 -8683 4684 7182 -7329 -2514 6834 -3119 -5062 6153 2132 -5917 801 2921 -3441 1188
1223 1188 4710 -3705 -3422 4268 1046 -2735 1946 1422 -3235 -149 3094 -683 -1073 1367 -1184 -1723
1239 -1723 2176 1110 -1896 -513 574 -614 -6 1179 -347 -1425 121 504 9 465 76 -685
1255 -685 -311 414 772 146 -419 -77 -69 82 657 380 -493 -483 291 212 -255 445 56 -1132 42 827 -497
1276 -497 -270 448 -540 -637 691 402 -899 22 611 -693 11 1152 -403 -694 776 111 -435 625
1294 625 580 -773 -92 1033 -367 -488 858 -190 -840 504 297 -763 -82 384 -490 -413 510 -95
1312i5o08J023j27p00O98J00m77K25J92j49k3M5lo9J57r3m2K46m88R0O01p47j99
1335d43R72o76n98J144o6j294P63J284j789m11K461j106j903K512K82k731J569
1352c0J870k922j18L693k264l037M577P41n521K453M029m857r12N275k779l692
1368c494N859K3p086M513N577q559j281R576l795o982P590J770q313M332N615
1383E345r426N23J1137p631q422J3081K101j4175N214J0146j0297k696J1393o204
1397H9p270J3158j254j5294J0944J1289j7729l026J8600o161j3324J2731L383
1410F136j3886Q079Q443j6635K358J8743j3930j3598K1654L788k2546P105J5939
1423A1650j4822l733J5756r647q955J8921l291k0852J6200J4901k4708l994K5469
$$ plain form
1312 -95 -703 320 193 -507 191 291 -186 39 231 82 59 104 101 32 189 96 54 300 -188 -98 503 -244 -443
1335 -443 529 -147 -745 399 333 -961 -198 1086 -703 -1114 1347 241 -1662 850 1132 -1599 -30
1352 -30 1840 -1082 -1200 2493 229 -2808 1769 2510 -3011 -558 3471 -1386 -2298 2977 198 -3494
1368 -3494 2365 2388 -4698 -185 5392 -3167 -4448 5128 1333 -5649 1941 3711 -4602 -270 5345
1383 5345 -4081 -3558 7579 -52 -8474 4607 6708 -7467 -2253 7893 -2404 -5100 6293 89
1397 89 -7181 5977 4723 -10571 373 11662 -6067 -9093 9507 3346 -9978 2753 6136
1410 6136 -7750 329 8772 -7863 -5505 13238 -692 -14290 7364 11152 -11394 -4289 11650
1423 11650 -3172 -6905 8851 -796 -9751 9170 5879 -14973 1227 16128 -8580 -12574 12895
1436A2895p792j7985J5866M472j6508R890R001j9419L908K1287j7429j5316K6729
1449I599M211k8067P870K0471j5886o422J6210q345q506J8346m725k0465J8839
1462C130J4565k8946l350L0513q467k2604J5604P988j4787P095O244j7159P421
1475b753J9033k1825j2370L1363J197l2096R718K2970j4613p887J1548o924j575
1488d214J6227j2368j6871K5841R023l3453K342L1732j1113k1329J2924N941o669
1501a987P910n288j5315J9190J3400l0099m052L3875o789k8734J2867J6554j0366
1514A166j806K62r858J3882J3786k6714q523L3435k537l1408J2147K1713j4409
1527A136p893O717m930P675J2142k3147j1017L3491J707l4139J0263K5434j7637
$$ plain form
1436 12895 5103 -12882 2984 7456 -9052 838 9839 -9580 -5672 15615 -1814 -17130 9599
1449 9599 13810 -14257 -6387 14084 -1802 -8224 7986 -359 -8865 9481 4756 -15709 3130
1462 3130 17695 -11251 -14601 15912 7445 -15159 445 8433 -6354 741 6985 -10174 -2753
1475 -2753 16280 -5545 -17915 13448 14645 -17451 -7733 15237 624 -7263 4285 -2639 -4214
1488 -4214 12013 -355 -17226 8615 17638 -15815 -13473 18259 7146 -14183 -1259 4682 -1987
1501 -1987 5923 635 -14680 4510 17910 -12189 -16241 17634 10845 -17889 -5022 11532 1166
1514 1166 -640 -378 -10236 3646 17432 -9282 -17805 15630 13093 -18315 -6168 15545 1136
1527 1136 -6757 -40 -4970 2705 14847 -8300 -19317 14174 15881 -18258 -7995 17439 -198
1540a98j1303J5181k547k631J1653j5295j2798L1153N552l7535O859L1922j8137
1553A876j7467K1914R65j4896J1125j467j5156K0915J0210l5396J540L7731j4859
1566G035k7427K3734R743k3568O963J3301j6349M742J5613k3895n842L6047q202
1579A1895l5266K0556K2574k6359m092K3012j1708j0740J8384p152j4100K4404
1591A1408J585l4084J2911L1632k3272j8743K6056J362k0640J2689Q141j7347
1603h302P877J1458k2238J309K9756j4244k7356K2232J6511k3134j725J7353j0377
1616h80o560J4606o582r630J8111j118k4612J1771K3883j8401j5977J9238L597
1629G446j4591P651N859j2731M599R951j4305j423K0563p994k1288J4848J5394
$$ plain form
1540 -198 -11501 3680 1133 -1498 10155 -5140 -17938 13215 18767 -18768 -11909 20013 1876
1553 1876 -15591 6323 7288 -7608 3517 2050 -13106 7809 18019 -17377 -15837 21894 7035
1566 7035 -20392 3342 13085 -10483 -3520 9781 -6568 -1826 13787 -10108 -15950 20097 11895
1579 11895 -23371 -2815 19759 -6600 -10692 12320 612 -10128 8256 1104 -12996 11408
1591 11408 12993 -21091 -8180 23452 180 -18563 7493 8855 -11785 904 9045 -8302
1603 -8302 -425 11033 -11205 -9896 19860 5616 -21740 492 17003 -6131 -7856 9497 -880
1616 -880 -7440 7166 584 -9046 9065 7947 -16665 -4894 18989 588 -15389 3849 7446
1629 7446 -7145 506 6365 -6366 -1767 8184 -6121 -7544 13019 5025 -16263 -1415 13979
1642A3979j6594m494J3006o418n478J2398l393j1268J1751M068j7614N371J8572
1655A3886j2804j3559J5194L727j2008O358N206j2603K922J2035j0266n398J5185
1668G875m122j5510J1941J0495j4258j698J0903p098m101J2451l614j1493R819
1681A590M766j2900M555J1579j1682o252J3084j204q981P929J778j1169N200R105
1695G398r739k306J0294n808p118J1099J658j0774L851N935p650Q50Q536o585
1709c59n338Q840n62p163O482K799r233J736P658n111k870O436k872n286O717
1724A874J766p024K586M049n922K87O495l506m319M863L42m226L672K204n597
1739b456O45M620l030j451M105j812l516L478J751l576Q17K197l130j53L631j600
$$ plain form
1642 13979 -2615 -7109 5897 -521 -5999 6399 3006 -8262 3489 7557 -10057 -4686 13886
1655 13886 1082 -12477 2717 6444 -5564 794 6000 -6603 -3681 8354 -1912 -7310 7875
1668 7875 3753 -11757 184 10679 -3579 -5277 5626 -1472 -5573 6878 3264 -8229 1590
1681 1590 6356 -6544 -1989 9590 -2092 -8344 4740 3536 -5445 2484 4262 -6907 -1707 7398
1695 7398 -2341 -4647 5647 -161 -7279 3820 5478 -5296 -1445 4490 -3160 -2310 6226 -359
1709 -359 -5697 3143 2581 -4582 1900 4699 -4534 -2798 4860 -251 -3121 3315 443 -4843 1874
1724 1874 3640 -3384 -798 3251 -2671 -2384 4111 605 -3714 1149 1491 -2735 937 3141 -2456
1739 -2456 -1811 2809 -221 -1672 2433 621 -2895 583 2334 -1242 -425 1772 -1358 -1511 2120 520
1755E20k241K238j7k020J716J291k383k44J828p67o17J688o88j513J320N66q63
1772a86L91L43r01j6R42j54n34K78j97k92O23l2l93J96l08j34N38J3l64k8J02
1793a13j52J45M31m14l24N66j13k28M74m3m17Q9L28pk11O8J50m15J20M62k44l53
1815b01J29M15m51k94Q38l20r11R27L90j289M43J195j233o89J843j47j953J440
1833A32J200k434N46K260k125j000L100q32k983K642J778m016M26L929k946k100
1849b423M312q36l913L614J791n252J260N130m492k877O390o45o063M413L059
1864C468o264J308N535n186k487P543k047p134O503L863q964J223P922n769l999
1879d485P987j623o910O715K703r539L144Q759q656m390J1258j762r756P123M765
$$ plain form
1755 520 -1721 517 500 -1520 196 1487 -896 -1140 688 -79 -696 992 304 -1209 111 677 -186
1772 -186 205 548 -353 -369 573 419 -115 163 -34 -326 297 265 -128 68 -240 -374 164 177 -187 -215 -113
1793 -113 -265 -120 311 -103 -427 139 26 -202 272 229 -188 -99 229 222 11 79 229 -186 -66 396 152 -201
1815 -201 -72 343 -108 -402 436 116 -795 132 522 -767 -324 871 -362 -1051 792 645 -1308 132
1833 132 1332 -1102 -556 1704 -421 -1421 1679 847 -2136 506 2284 -1732 -1306 2623 -323 -2423
1849 -2423 1889 1053 -2860 754 2545 -2707 -1447 3683 -809 -3686 2704 2059 -4004 409 3468
1864 3468 -2796 -1488 4047 -1139 -3626 3917 1870 -5264 1239 5102 -3862 -2639 5283 -486 -4485
1879 -4485 3502 1879 -5031 1684 4387 -5152 -2008 6751 -1905 -6295 4963 3201 -6555 568 5333
1894E333r327J837P790p810k554J0925m625r515J0737M365j3213K431J1103p878
1908d01n467R983j993p642Q410J321j1298O590R258j2805l568J4763l284j1836
1922g969Q335N208r360K651N664q615J627J0425r523p530J4745J735j5209M315
1936c501J0899p697l823P126l749j964Q406n746q556J2537M843j5756L53J4398
1950G770m840q922O251J487l525M872k679p447R739N859j4576j817J5733k682
1964E223j2324N128N953m216J194n08n785P129O294j3307k871J6191j951j4858
1978h708N456R699n920k345K297m177M381O914j1533m954J6357k40j7147N869
1992d051J3631q858o577P255j319j241P125p269p997J4837L933j8830K990J8036
$$ plain form
1894 5333 -3994 -2157 5633 -2177 -4731 6194 1569 -7946 2791 7156 -6057 -3626 7477 -401
1908 -401 -5868 4115 2122 -5520 2890 4211 -7087 -497 8761 -4044 -7612 7151 3867 -7969
1922 -7969 366 5574 -3786 -1135 4529 -4086 -2459 7966 -1557 -9087 5658 7393 -7816 -3501
1936 -3501 7398 -299 -4122 3004 -745 -2709 5697 -49 -8605 3932 8775 -6981 -6628 7770
1950 7770 2930 -5992 259 1746 -1779 3093 414 -7033 2706 8565 -6011 -7828 7905 5223
1964 5223 -7101 -1973 3980 -236 958 450 -5335 1794 8088 -5219 -8090 8101 6150 -8708
1978 -8708 -3252 6447 527 -1818 479 -3698 683 7597 -3936 -8890 7467 7227 -9920 -4051
1992 -4051 9580 722 -5855 1400 81 -1160 5965 -1304 -9301 5536 9469 -9361 -6371 11665
2006A1665r559j2666J2320M343r421M005J282r123Q828Q803j7191l302K1176n331
2020E829j9462J3154J2715j6272l076J2435n953k331J0812r836r681J9824K603
2033A0761k4069P728K1483j7057j2778K0259J458j5027Q336K665j2867J1817J0530
2046A3239k3328j748K7446j0180k3095K0233J2034k2889Q65J6167j0918j918J4499
2059A0407j4188j0706K6444M11k9776J2406K3334k2097j0233K3744l748j5674
2071i676J3317L73j5545J6495R863k8175J500K9837j4103k1309K2371O960k2412
2084a0504O963J3280j5136K060J5262j7992p641K7782m164k7191J5202J7068k0895
2097e906k467J8759j0013r160J5779m931j3184J8008M295k4786O783K1963j5108
$$ plain form
2006 11665 2106 -10560 1760 6103 -3318 687 1969 -7154 1674 10477 -6714 -10016 11160 5829
2020 5829 -13633 -479 12236 -4036 -7112 5323 -630 -2961 7851 -1985 -11666 8158 10761
2033 10761 -13308 -5580 15903 -1154 -13932 6327 7785 -7242 1094 3759 -9108 2709 13239
2046 13239 -10089 -11837 15609 5429 -17666 2567 14601 -8288 -7423 8744 -2174 -4092 10407
2059 10407 -3781 -14487 11957 12368 -17408 -5002 18332 -3765 -13998 9746 5998 -9676
2071 -9676 3641 4014 -11531 4964 14827 -13348 -11848 17989 3886 -17423 4948 11908 -10504
2084 -10504 -3541 9739 -5397 -3337 11925 -6067 -13708 14074 9910 -17281 -2079 14989 -5906
2097 -5906 -8373 10386 373 -8787 6992 2061 -11123 6885 11180 -13606 -6823 15140 32
2110C2j1412J7582j608j3884J1524M854j4384O510R725j5878m92J9401q550j5521
2124a2101J3668O256j3505M053Q856j0808j362J1270o598n704J2176k532j3123
2137i454Q974R348j1279k484R351m677m598Q616j063p568N700K348q103M051P646
2152F808q082m799Q503N41n840L809J621n904K231M552m393n21M832l926l933
2167d501O380K365o169k51L826k291m38L461j986k805K904L22k661K467K295m473
2183a555j693M620O31l035J002O32k236J241K468j917j415K194q68k178L152J807
2199B850m158p91L242p06j191K216q51k959K112K147k669M5K606k703j787M096
2215A499M30l547J143J579k529O85L296k510k376L250J1k716K630J369m033K62
$$ plain form
2110 32 -11380 6202 4594 -9290 2234 7088 -7296 -786 8939 -6939 -7431 11970 3420 -12101
2124 -12101 1567 7823 -5682 -1629 7227 -3581 -4943 6327 -271 -5975 6201 3669 -9454
2137 -9454 -480 8868 -2411 -4895 4456 -221 -4819 3797 2734 -4834 866 3214 -4889 -838 6808
2152 6808 -1274 -6073 2430 2971 -2869 940 2561 -3343 -1112 3440 -953 -1474 3358 -568 -4501
2167 -4501 1879 4244 -1925 -2176 1650 -641 -1079 2382 396 -2409 495 817 -1844 623 2918 -1555
2183 -1555 -3248 1372 2003 -1032 -30 602 -1634 -393 2075 158 -1257 937 69 -2109 1043 2850
2199 2850 -1308 -2099 1143 437 -754 1462 611 -2348 -236 1911 -758 -713 1893 -810 -2597 1499
2215 1499 1929 -1618 -475 1104 -1425 -740 2556 46 -2330 920 931 -1785 845 2214 -1819 -1557
2231a557L575j716j632K784r14l011K889J825l455M00K389k597o31L570j028k930
2247b039K122J064k605J334K192k949p40K949q86j614K256k71k494J484J755j971
2263d13k61J842j485r73K333k12j905J136N34j533P99J318j491o98J582m37r41
2280h05J399r0j490Q40Q72j149L17R32j176m43J504j81j203R94K78j411Q04J032
2298A024j428j26J288q26p84J405K9j593Q58J037j538J20J509j196r46J852j02
2315E83j655J122R69j783M3J991j210j273K117j21k119J562J272k373LK400j396
2332A32j695K503J02k678J568J622k729J99K794k029j745L107J43l350J836K286
2348B066l226j85L267j991j834L405l83l410K590K152m055n2M234k187k822L606
$$ plain form
2231 -1557 2018 302 -1330 1454 540 -2471 418 2243 -1212 -812 1577 -1020 -1651 1919 891 -2039
2247 -2039 83 1147 -1458 -124 2068 -881 -1621 1328 442 -1172 1084 813 -1681 -197 1558 -413
2263 -413 -674 1168 -317 -1290 1043 831 -1074 62 596 -937 -138 1180 -311 -1009 573 136 -805
2280 -805 594 504 -986 -146 726 -423 -106 826 -350 -793 711 530 -673 321 599 -812 -8 1024
2298 1024 -404 -530 758 -68 -852 553 582 -1011 -153 884 -654 -534 975 -221 -1167 685 583
2315 583 -1072 50 1019 -764 -721 1270 60 -1213 904 783 -1336 226 1498 -875 -872 1528 132
2332 132 -1563 940 1042 -1636 -68 1554 -1175 -976 1818 -211 -1956 1151 1294 -2056 -220 2066
2348 2066 -1160 -1345 1922 -69 -1903 1502 1119 -2291 299 2451 -1604 -1656 2578 391 -2431 1175
2364A175J69l322K255J521l646R55L651l445k176M881k18m651K518K681l474Q4
2380a042K713k490n26L596k048l257M370J558n336Q79M370k599j929K661o88j231
2396i99K511j137l148L581K335n285l85N229j629l387K351P18j469J600o86k687
2412b487L223K559n481q35O072j264m707K690J895k219R92J67k928K979L020n845
2428b169j483P416j284o751L696L710m266J57K411l337J344M454n639l036Q831
2443D054k93r521M260P189o738k450O243k639k472N841k998n958Q560K695j2042
2458f269K587J1778p679p590R876J230q165M847K614q080M751P076j1558k006
2472f588J5027n006j3744J0911P992j2668k07R630o621k332R738o811p493J4345
$$ plain form
2364 1175 1344 -1978 277 1798 -1848 -893 2758 -687 -2863 2018 1800 -2851 -333 2348 -1126 -1042
2380 -1042 1671 -819 -1345 2251 203 -3054 1316 2874 -2462 -1583 2787 188 -1741 920 232 -999
2396 -999 1512 375 -2773 808 3143 -2142 -2527 2702 1073 -2314 37 755 -714 886 200 -2487
2412 -2487 736 3295 -2186 -3021 3051 1787 -2920 -230 1665 -554 438 605 -2323 656 3676 -2169
2428 -2169 -3652 3764 2480 -4271 -575 3135 -1131 -974 1437 -1900 -556 3898 -1741 -4777 4054
2443 4054 3761 -5760 -1500 5689 -1049 -3499 2744 105 -2367 3474 476 -5482 3078 5773 -6269
2458 -6269 -3682 8096 417 -7173 2703 3933 -4232 615 3229 -4851 -100 6976 -4582 -6588
2472 -6588 8439 3433 -10311 600 8592 -4076 -4283 5347 -1274 -3606 6132 -679 -8172 6173
2486F173Q64j7539P544J4996j3710p870J4784r75j0117Q053J062j0525R104P189
2500I033j6814O85J8997r541j5234J5308P119j5213J939R322q698P20J0447j1064
2514b994o359J7940j659j9076J0160J4491j5169o414J4568k348q181Q577j932
2527A604r784J1641N638j7456J753J7850r403j3141J3887N425j3134K494P058
2540D432p846K286Q707j0969n006J5914j569j5707Q269J1192j2356m141J1642
2553D848k746o067O987k152p480R741M220j3885J362J3453p177r269J0857K946
2567E638j0358K863N608o230J612O364q348l444J2065j309j1651O489P652r860
2581b909j871R590l140n494N797j093n412P309K512j0855K038J0264o757n943
$$ plain form
2486 6173 7037 -10502 -2958 12038 -1672 -9542 5242 4267 -5850 2203 3265 -7260 1844 9033
2500 9033 -7781 -7096 11901 2360 -12874 2434 9553 -5660 -3721 5601 -3097 -2377 8070 -2994
2514 -2994 -9353 8587 6928 -12148 -1988 12503 -2666 -9080 5488 3140 -5041 3536 1604
2527 1604 -8180 3461 9099 -8357 -6604 11246 1843 -11298 2589 8014 -5120 -2626 4432
2540 4432 -3414 -1128 7579 -3390 -8396 7518 5949 -9758 -1489 9703 -2653 -6794 4848
2553 4848 2102 -3965 3022 870 -6610 3131 7351 -6534 -5172 8281 1104 -8165 2692 5638
2567 5638 -4720 -1857 3751 -2479 -867 5497 -2851 -6295 5770 4461 -7190 -701 6951 -2909
2581 -2909 -4780 4810 1670 -3824 1973 880 -4532 2777 5289 -5566 -3528 6736 -21 -5964
2595e964R351L09q686M033M714n757J527M365p372o38J0157l816q688P426L975
2610D936q747J610P018n179k673N523k935k852P727j622r290N724O781p926j702
2625c607P537l429m730O120J61n135M639J210p884L644P983p198m567P870m27
2640B187n980M912K208o438K131M317n643M27P123n243n743P609K116o925K279
2655f63L724n535M44N836m002k947N802j760n448N842L119p021J16N239l214j555
2671b023M928k167m329M515J486m815K460L258n196r17N490j427l339K983M3l514
2687b564K754K530l885l87L238k230j256L685n41l473J501J786j817N77J602k194
2703f74r41K450r9j368J157p1j664Q98J538q61q14M81k31k27J063K7r68j32K36
$$ plain form
2595 -5964 3387 3696 -4990 -957 3757 -2000 -473 3892 -3480 -4118 6039 2223 -6465 961 4936
2610 4936 -3811 -2201 4817 -362 -3035 2488 -447 -3299 4428 2806 -6484 -760 6021 -1905 -3607
2625 -3607 3930 501 -4229 1891 2052 -3083 1556 2766 -5118 -1474 6509 -689 -5256 2614 2187
2640 2187 -3793 1119 3327 -3111 -980 3337 -2306 -1879 5244 1 -5742 1867 3983 -2942 -663
2655 -663 3061 -2474 -2030 3806 -196 -3143 2659 899 -4549 1293 4412 -2609 -2493 2746 -468 -2023
2671 -2023 2905 738 -3591 924 2410 -2405 55 3313 -1883 -2800 2690 1263 -2076 907 950 -2564
2687 -2564 190 2720 -1165 -1552 1686 -544 -1800 1885 1344 -2129 -628 1158 -659 -82 1520 -674
2703 -674 -1615 835 736 -632 525 454 -1210 -312 1226 365 -449 32 -199 -426 637 664 -304 -436 -200
2722b00J62M09j3m80l30MM95M55k53o55J34J80j24O34K14j112n4Q03k48Q5N42
2743F48p44p73J064M68q13K29L67j115J73J371o11q37P65l15n78J109L36j281
2761e37J03R02q26K7J191p98j002J153J95q79Q07K05j304L61J233p89m82J104
2779F64o59q95J370J88j293O72M31j170M32J228j094p71J399k62j066J189L70
2796G33j649O44J070j207m5J365q81j121J581K84j594P99Q72j488K24J475j157
2813i5p94J582l09j396J132Q72j706J73J393j034n53J532o21j280J369N67j515
2830f83K96J313j080n54J201j96q95R92L1j126Q28P45j284k17J325m18q60O41
2848E9K70o37M52M1o91N44N36r57k19J107k21q28M00K97k33K44k07n19R13L34
$$ plain form
2722 -200 -38 371 358 -122 -452 -448 47 502 249 -406 -272 -92 -216 418 632 -480 -534 269 21 106 648
2743 648 -96 -869 195 663 -150 79 446 -669 -496 875 264 -573 192 -123 -701 408 744 -537
2761 -537 -434 468 -358 -331 860 62 -940 213 408 -471 336 541 -763 -402 831 42 -440 664
2779 664 5 -890 480 668 -625 47 478 -692 -260 968 -126 -897 502 240 -826 363 733
2796 733 -916 -272 798 -409 -454 911 30 -1091 490 774 -820 -21 851 -637 -413 1062 -95
2813 -95 -889 693 384 -1012 120 992 -714 -541 852 -182 -735 797 176 -1104 265 832 -683
2830 -683 -387 926 -154 -708 493 297 -598 394 425 -701 127 872 -412 -629 696 278 -582 59
2848 59 329 -308 144 185 -506 38 574 -383 -602 505 284 -544 -144 153 -80 164 -43 -562 351 685
2868F85j324J19J437o63q88Q33J03n81O26j78j006J221Q24k173l4K524j181j822
2886a478J719P44j795O16R81j731O55J970k517r94L677o32l709K359K520l329
2902i44m91L038j607j403K978j234k912L988J181n463J377N159l672l356M823
2917A462O10m348K296J876m070J907L564n201j352P127j926o821M870M423o263
2932a846p40N316k804k099M778k334m245O351J625q671K191Q303n685n362P269
2947B047R23o074L237K256n491K919M849p438j851R959k445r447O269O049p913
2962b151r92O458l621k217O018l296n365Q166K125j0763K398J0160o495o418Q201
2977B208J003o564L860K253o646L548N869q524k414J1172k567j0212O735O150
$$ plain form
2868 685 -639 -520 917 254 -634 199 302 -279 347 169 -837 384 1208 -965 -999 1525 344 -1478
2886 -1478 241 985 -810 -194 787 -944 -289 1681 -836 -1830 1847 1215 -2494 -135 2385 -944
2902 -944 -1435 1603 -4 -1407 1571 337 -2575 1413 2594 -2869 -1492 3667 -5 -3361 1462
2917 1462 2072 -2276 20 1896 -2174 -267 3297 -1904 -3256 3871 1945 -4876 -6 4417 -1846
2932 -1846 -2586 2730 -74 -2173 2605 271 -3974 2377 4002 -4669 -2478 5825 140 -5222 2047
2947 2047 2970 -3104 133 2389 -3102 -183 4666 -2772 -4623 5336 2891 -6556 -287 5762 -2151
2962 -2151 -3143 3315 -306 -2523 3495 199 -5166 3000 5125 -5638 -3240 6920 425 -5993 2208
2977 2208 3211 -3353 507 2760 -3886 -338 5531 -2993 -5407 5765 3198 -7014 -279 5871
2991E871q205o35O448m300j910O781l818n669Q522J953j0821L141R478p095n187
3006e446Q090r1n963M579J293o501M218M829q289p29R658m081p877P320L774p594
3022b810Q50M978m397l05N395m623l298P782p71q155M862O035p142k419O703j305
3038A380l569L688r37l800N034J378o975K248O408n360m072O538J051n292J574
3053g06J842k649K259J748n178O58N867l391m486N231K161n411J72L478j454j42
3069aJ327l180J45M944k140m668L860K892m653p00L971q58j937J207r48l43L391
3086B309j182m400K663L717l420j972L582jk778J172J071j162J194nl050J451
3102h11L718k349l231K900J513k712K25K068j384q07J292q53l13K416r14l271
$$ plain form
2991 5871 -2334 -2969 3479 -821 -2731 4050 232 -5437 3085 5038 -5783 -2642 6836 -259 -5446
3006 -5446 2644 2553 -3410 1169 2462 -4039 179 5008 -3281 -4010 5648 1567 -6310 1010 4784 -2810
3022 -2810 -1960 3018 -1379 -1684 3711 -912 -4210 3572 2801 -5354 -492 5543 -1599 -4018 2685 1380
3038 1380 -2189 1499 562 -3238 1796 3174 -3801 -1553 4855 -505 -4577 1961 3012 -2280 -706
3053 -706 1136 -1513 746 2494 -2684 -2026 3841 450 -4036 1195 3356 -2055 -1883 1595 141 -1
3069 -1 1326 -1854 -1709 3235 1095 -3573 287 3179 -1474 -2174 1797 939 -998 209 -739 -1082 2309
3086 2309 1127 -3273 -610 3107 -313 -2285 1297 1296 -1482 -310 761 -401 793 788 -2262 -811
3102 -811 2907 558 -2673 227 1740 -972 -747 1321 -63 -870 422 -431 -744 1672 758 -2513
3118b513J880K958k372j568K470l05j999J672J051j851L76J083k033L43K994j441
3134G45l083K269J718k447K40K168j965j332K589j64j812J822K40l131J477L172
3150B506k562j812K887m91k335K410J232l115L01K321j952l17L032j728k904K986
3166D59J442l100Q38K138k778n98L225q78k184K184p9k666K226K087l201o05K653
3183A163j127j373K560k47k743J501J455k033P05J799k380r74K833k60j876J322
3199C25L36j922J004J748j735n75J617j121p51K104j63k035Q04J019j203M29J227
3216A108j525o88J640k23p99J093k25j418Q29J128j019j26O88q39k96J335j55
3233E08j033N47J17p96R05N21j057k82P72k66j61P19k95r17N60M09m12L69J38
$$ plain form
3118 -2513 -633 2325 -47 -1615 855 550 -1449 223 1274 -577 -201 882 -1151 -808 2186 745
3134 745 -2338 -69 1649 -798 -558 1610 -355 -1687 902 738 -1074 748 988 -2143 -666 2506
3150 2506 -56 -1868 1019 528 -1807 603 1835 -1280 -979 1342 -610 -927 2105 377 -2527 459
3166 459 1901 -1199 -361 1777 -1001 -1599 1626 748 -1436 748 669 -1997 229 2316 -885 -1490 1163
3183 1163 36 -1337 1223 976 -1767 -266 1189 -844 -139 1660 -720 -1694 1139 879 -997 325
3199 325 661 -1261 -257 1491 -244 -819 798 -323 -1074 1030 867 -1168 -364 655 -548 -119 1108
3216 1108 -417 -1105 535 312 -487 606 381 -1037 -208 920 -99 -225 463 -376 -672 663 508
3233 508 -525 22 139 -657 248 769 -288 -570 202 -64 -225 494 199 -718 -158 251 -161 208 346
3252C46p59M2P72j61l75K00j45k64N14K30m48N3p5k16L90K86k96k97Q6j2J33K99
3274C03l10k90L07q3j61M83j9n90J65L31k29J44K36n73j00P33j25n22M98L6o77
3295d43L56N99n88j81N67l49l14P38n6p84K62N52n84N7N44m99k75N86n9m30L46
3316D5K91o14M1N87k42l37L40K8k55K71l8k21J24Q3r8j09K08M7j75k46K21L61
3338C12k50l76L25K10m11Q5L30l67P5M09m74l55J016q0j284P57J072j287l69J256
3358E94m17p61R83k7j196J011Q12j933J64K180j255j722K024O44k094O39J340
3375I86j580j3J872j571j274K919j71l207J700K546k789j014K877p63j821K120
3391H17K0k564K112J743l794J7M242k020l304L305J426l516Q76K244k609lL212
$$ plain form
3252 346 -413 -371 401 240 -135 65 -80 -344 170 400 -48 5 -70 -286 104 390 94 -203 -117 -129 4 303
3274 303 -7 -297 10 -73 -234 249 230 -360 -195 136 -93 51 287 -286 -386 347 222 -300 198 234 -443
3295 -443 -87 512 -76 -257 310 -39 -353 385 329 -455 -193 359 -225 -168 376 -123 -398 188 129 -301 45
3316 45 336 -278 -237 350 108 -229 111 139 -116 155 117 -104 20 103 5 -104 104 151 -24 -270 -49 312
3338 312 62 -314 11 221 -190 -105 225 -142 -67 342 -132 -487 529 449 -835 -78 994 -293 -662 594
3358 594 177 -584 399 372 -824 187 999 -934 -770 1410 155 -1567 457 1101 -993 -354 986
3375 986 -594 -607 1265 -306 -1580 1339 1168 -2039 -339 2207 -582 -1596 1281 518 -1303 817
3391 817 837 -1727 385 2128 -1666 -1649 2593 573 -2731 574 2000 -1516 -640 1604 -1005 -1008 2204
3408B204k641k185M536J31m980K106L921l712j649L991j001k587L004l2l651L043
3424D98K494n024k52N479k236m325L998J834m253J040K788l355P7L820l023k663
3440c103N156L63n719K332M424m141j817M364j144k651L169Rl815L075K391n009
3456b116j63N528k327m329M107J731m200J005K588k850J18L086k813j850M667
3471B182k85n082K464L853l852j575L842q14k218K299k74k311K641J241m336P13
3487a512M604k589l575L632J558l325N10J661j633N03J638k657n65M154j215m217
3503c028K730L048l204j333K616l73r79J303j177j018K966j45l968J808L655k874
3519B7k375K886O81j736N78J7j072J882M52l214Q22L645k383k868L023J411k427
$$ plain form
3408 2204 -437 -2622 1914 2045 -2935 -829 3092 -620 -2269 1722 721 -1866 1138 1106 -2545 498
3424 498 2992 -2032 -2284 3195 959 -3366 632 2466 -1787 -747 2041 -1314 -1237 2583 -440 -3103
3440 -3103 2053 2416 -3303 -971 3453 -688 -2505 1859 715 -1936 1233 1242 -2573 502 2893 -2116
3456 -2116 -2279 3249 922 -3407 700 2431 -1769 -764 1824 -1026 -908 2178 -635 -2485 2182
3471 2182 1897 -3185 -721 3132 -720 -2295 1547 733 -1485 814 540 -1771 870 2111 -2225 -1512
3487 -1512 3092 503 -3072 560 2118 -1207 -697 964 -669 -166 1472 -1185 -1750 2404 1189 -3028
3503 -3028 -298 2750 -454 -1787 829 456 -523 780 -397 -1415 1551 1406 -2562 -754 2901 27
3519 27 -2348 538 1219 -517 61 78 -994 888 1340 -1874 -1052 2593 210 -2658 365 1776 -651
3536f51L9R88j013R74J109k763RL557j636l227K946K012l260k89K194j084k35
3553c30J654j984r87L418n70l622K302K645l518q49L352r33j768J954n62j974
3569a772K794P18l796J092L437k901j753L768k98l185J831J384k413J129J771
3584A806l146j80L764j771k761L135Q27l549J139K757k288q59K183j344j159L038
3600A592n58l222K134K032l001j98K982j380k110K168M89j833J369N12k483R46
3616e61K531k062j417K317K5k242J344J384j711k35J140r42M8J592j066j608J558
3633I5R66j527N8J206q01q64J022L10o09L73j89p65P51R98r07q78Q19L68o64J91
3653d7N42m88m91L64K27%K11k64q10M38J022n31o83N20J32n67L73O58n63m96M58
$$ plain form
3536 -651 -612 376 -637 337 1446 -1317 -1308 2249 613 -2614 332 2344 -916 -1205 989 -95 -330
3553 -330 1324 -660 -1647 1771 1201 -2421 -119 2526 -992 -1841 1511 578 -1190 764 202 -1772
3569 -1772 1022 1740 -2056 -964 2473 -428 -2181 1587 1289 -1896 -65 1319 -1094 35 1806
3584 1806 -1340 -1520 2244 473 -2288 847 1674 -1875 -736 2021 -267 -1126 1057 -287 -1446 1592
3600 1592 1034 -2188 -54 1978 -1023 -1221 1761 381 -1729 439 928 -905 464 976 -1507 -561
3616 -561 1970 -92 -1509 808 833 -1409 -65 1319 -392 -627 513 -429 -381 1211 145 -1463 95
3633 95 1061 -466 -408 798 -3 -867 155 465 -144 229 40 -725 26 1024 117 -761 58 426 -238 -47
3653 -47 495 7 -484 -120 107 107 318 54 -756 -318 704 173 -510 10 142 -425 -52 606 43 -453 5
3674El3j05P35j78j263O07Q57n75j87N76n14o24R54L89r08K42K37q93M45J091
3694H58p89p42P70Oo03Q34K82j279J43J002n94r5R12p85p64J130L09r88N21L69
3714D97j130J95J297o92o92Q11k53p37J112L67j360J97R11p77j15J128o13j001
3732h55R70L49q37N37L81j206J79J119n46n48Q39k96q00Q90N42j060N2O15o79
3751c54R0R16n29p64P31J94o08L46M55q25l7O64k65j37M87l76n24O24L46n68P8
3772e6K93m32L8N38k87k44K15r1j78M80l1n43J58L38k85LL85m63j42M55j33k64
3794b46M71j18m96K57N43m32p9K75k93j88N95p2o11M42K65n20Q5N61l52m97N95
3815A85M6m83L84K38q24J69P92m96n64P80K14q97K79O14n33k72O78l48m78R42
$$ plain form
3674 5 -28 -133 602 424 -839 -232 625 50 -137 439 -75 -699 255 644 -264 -22 215 -678 -233 858
3694 858 69 -673 97 103 -500 334 616 -663 -520 482 -112 -207 705 -80 -844 286 595 -393 128 497
3714 497 -633 -438 859 167 -525 286 33 -704 408 775 -585 -388 523 -254 -369 759 146 -855
3732 -855 115 464 -373 164 545 -661 -482 637 91 -457 382 86 -714 176 718 -342 -290 325 -354
3751 -354 -264 652 123 -641 90 284 -324 22 477 -348 -385 279 14 -123 364 -12 -536 88 434 -134 -56
3772 -56 237 -195 -157 381 94 -150 65 -26 -204 276 245 -298 -140 198 -87 -84 301 -162 -304 151 18 -246
3794 -246 225 107 -389 -132 411 -21 -100 175 -118 -306 289 217 -394 48 313 -207 -122 439 87 -410 185
3815 185 231 -252 132 370 -454 -285 507 11 -553 227 441 -456 -177 437 -96 -368 310 -38 -516 426
3835D26Q2j184L38J135q42o70J215m5j045O47N36j104L73R35j187m13J683k90
3853E90j764J126J133j629j32J562q71p72J431l71j459J480Q42k208K50K220j295
3870A33j565K074K31j986J125R73j812L39J901j691j202K657k23k619J527J784
3886A646k320l12K211j143j272K086l12k124J892J228k876K21K955j751j932K619
3902H16L12k403J161J357k136L71K127k038j170L076m59k966J840J999k653m26
3918a192K430j093j233J972n13j912K121Q60k959O43K811j844j838K466M23k210
3934a068R98R63j735P42J501k174m80K899q40k722J959J609k304k55J738r14l97
3951d80J266j097r05K276l6k755J194K318j883j237J827Nj019P91k36q97J579
$$ plain form
3835 426 508 -676 -338 797 -45 -715 500 455 -590 57 593 -511 -138 797 -390 -803 880 590
3853 590 -1174 -48 1085 -544 -676 886 15 -757 674 303 -1156 324 1166 -1042 -792 1428 133
3870 133 -1432 642 873 -1113 12 985 -827 -488 1413 -278 -1480 1177 954 -1665 -138 1646
3886 1646 -674 -986 1225 82 -1190 896 584 -1540 352 1580 -1296 -1075 1880 129 -1803 816
3902 816 1128 -1275 -114 1243 -893 -522 1605 -433 -1603 1473 1014 -1952 -112 1887 -766 -1192
3918 -1192 1238 145 -1088 884 371 -1541 580 1440 -1519 -876 1935 91 -1747 719 1142 -1068
3934 -1068 -70 893 -842 -100 1401 -773 -1253 1646 806 -1916 43 1652 -652 -907 831 -83 -480
3951 -480 786 -311 -1216 1060 1024 -1731 -537 1781 -102 -1339 488 493 -526 265 29 -868 711
3968G11L15k338O12K304j400j602J684N40j193K77L33p69R43M22j870L31K087
3985A387j023j831J556R55j464J2P88p67M44O81j494j0K027q28j934J588J245
4002A332j820k61J444p49k88J051r12o54J786j93k151J226J788j990q54K049k81
4019E23j347J110N1j245J272N63j988M85K102j581j571K318N44k278O42J360j312
4036c52n8J361j218p18K050n36k101J787J482k526l76K382p67j459J499Jj470
4053a019J338O77k087N08K243j851j542K709K92k509P61J564j488n1J493j371
4069c33p75K296n66k303J866J535k740k36K527q59j475J579j76j465J605O59k383
4086a244O51K238j968j236K613k5k245R93J115j501M72J238j748m05K383q65j925
$$ plain form
3968 711 1026 -1312 -700 1604 204 -1398 286 826 -367 -90 243 -526 417 839 -1031 -700 1387
3985 1387 364 -1467 89 1044 -420 -408 380 -387 57 738 -756 -766 1261 433 -1501 87 1332
4002 1332 -488 -749 695 -54 -342 709 -203 -857 929 736 -1415 -189 1599 -391 -1245 804 523
4019 523 -824 286 337 -908 364 927 -1061 -576 1526 -55 -1626 692 1236 -1042 -400 960 -352
4036 -352 -410 951 -267 -985 1065 529 -1572 215 1697 -829 -1205 1177 410 -1049 450 451 -1019
4053 -1019 319 996 -1091 -583 1660 -191 -1733 976 1268 -1241 -480 1084 -404 -455 1038 -333
4069 -333 -1108 1188 622 -1681 185 1720 -1020 -1256 1271 412 -1063 516 340 -1125 480 1139 -1244
4086 -1244 -593 1645 -323 -1559 1054 1029 -1216 -223 892 -609 -137 1101 -647 -1052 1331 466 -1459
4103a459J898P71k232M16J827j270p16J437p38r03J848o5k112J050J446j768k23
4120g93J821q59j256J352K36j205J062L88j750N13J625j186q15J440k71j250J144
4137A96O13j293L26P27j108J62J290q58j016J257J71j014O91M72j107kJ042n54
4155el74R44n71q06J051M29j008J66O06o87j64R82l61o68M91K7m83O40L19q75
4175c47j04P47k79k60N17j43n43K99M27l13L7R6m57M5N80J8m57N7J31j67J25K66
4197B75j56k99P4J01J17K1o9j81j79L12K63k31j27J10j61k1L24J15l75k08L41
4218D6m2j02M15l10l63L19K96l76J53K20m44j70O41O4n92L19L3m15L55L77n72
4239a48j51M85k14k85O00k8p15K89M62m14P9L47n28j24O76j92l63L57O4o11L39
$$ plain form
4103 -1459 439 1210 -1022 -606 1221 -49 -765 672 -66 -969 879 814 -1298 -248 1198 -570 -793
4120 -793 1028 169 -1087 265 501 -704 358 746 -1004 -491 1134 -52 -867 573 302 -948 196
4137 196 809 -484 -158 569 -539 -377 913 55 -961 296 467 -547 144 616 -491 -493 549 -5
4155 -5 -379 565 -6 -812 239 668 -340 -174 432 -255 -419 563 202 -466 25 52 -431 209 528 -347
4175 -347 -451 296 17 -243 274 131 -412 -113 314 1 38 134 -323 -278 302 320 -137 -80 51 -116 9 275
4197 275 119 -180 -106 -5 112 133 64 -117 -296 16 279 48 -79 31 -130 -151 173 288 -87 -295 46
4218 46 4 -98 317 7 -356 -37 259 -117 36 256 -188 -358 283 347 -245 74 107 -308 47 424 -148
4239 -148 -299 186 -28 -313 287 259 -456 -167 295 -119 -40 307 -221 -345 331 139 -224 133 197 -414 -75
4260g5N54n07j79M31l25j62O82k18n75L42K77m95K47M14n60j93O09k32k56N96
4280C75k98o64O77L46o75J61M18n40j05P28k72n90O90mq14O23N63q96r6Q17m64
4301b0l96Q18k43p69O84M25r68K44Q83q45m36J069j00q52O35L48j041M10Q65j004
4321b93k69J149l86j000J046M48j240K69R62q14k93J000n25q81J178K18j216L98
4339b49J035j027m25J230l06r34Q73L03j122N83Q54j132k72J362n20j114J058
4356A97N79j305K08J021q31k83R98n12q00J139K48j426M21J237j003p08J309j06
4374C83r93P18K55q16M13P89j225j18J434n44j200R85O37j110N4Q14n30j93P23
4393D76n58n18J163Kj309M49J154r49m97Q44l0n40N07p8n90P34K86j102J24J191
$$ plain form
4260 -75 479 -28 -207 224 -101 -263 419 201 -374 -32 245 -250 -3 411 -149 -342 267 35 -221 375
4280 375 77 -587 90 436 -239 -78 340 -200 -305 423 151 -439 251 247 -567 56 619 -277 -373 444 -20
4301 -20 -416 402 159 -610 74 499 -469 -225 658 -187 -623 446 346 -506 129 477 -564 -154 711 -293
4321 -293 -562 587 201 -799 247 695 -545 -276 686 -128 -421 579 54 -827 351 569 -647 -249
4339 -249 786 -241 -666 564 258 -676 197 500 -622 -39 815 -317 -589 773 253 -861 197
4356 197 776 -529 -321 700 -131 -414 584 72 -728 411 659 -767 -346 891 -112 -820 489 383
4374 383 -610 108 363 -453 -40 749 -476 -594 840 296 -904 81 718 -392 -338 476 -54 -247 476
4393 476 -82 -600 563 565 -744 -295 859 -90 -587 257 227 -313 194 116 -474 260 546 -556 -432 759
4413G59o76p50P82K92o06J64R9l65M68K90r47J14R52l55q68O92L93o07M7K47l18
4434a93K93K99p77j6J031m23r35Q14M82q64L7N11l91O4M48o48j83J061l14j112
4454h16Q36P70j138j39R47m10m38P55k43p66J030J73j414O13J213j248o30J481
4472E76j62j133P86N11j135N11P52j287J0J674r77j308J612N84j783K95J350j007
4490a31l73J172p01q28J552j06j832J151J396j839n19J959m55j399J231K88j386
4507h20R77P28j750L60J827j329j390J973M19j978O50J256j317j10J363j087o24
4524h52J808m34j881J404J302j935l00J814p07j019J198rj223J157M25j657M70
4541d39J666j345j018J590L01j492O27P00j070L03Q91j080k27J362m42j320J125
$$ plain form
4413 759 83 -667 115 407 -199 -35 64 -301 167 457 -490 -376 576 221 -647 45 438 -169 -122 125 -193
4434 -193 100 399 -378 -394 637 214 -721 93 575 -289 -252 259 -132 -68 380 -268 -451 610 296 -816
4454 -816 20 790 -348 -487 460 50 -388 367 124 -642 388 561 -853 -240 973 -275 -905 576
4472 576 414 -719 67 578 -557 -46 706 -581 -571 1103 126 -1182 430 1014 -769 -474 876 -131
4490 -131 -504 668 -33 -861 691 585 -1247 -96 1300 -539 -1058 901 446 -953 278 566 -820
4507 -820 157 885 -865 -505 1322 -7 -1397 576 995 -983 -333 923 -394 -504 859 -228 -852
4524 -852 956 522 -1359 45 1347 -588 -888 926 219 -800 398 389 -834 323 748 -909 -439
4541 -439 1227 -118 -1136 454 755 -737 -110 590 -480 -177 714 -366 -593 769 327 -993 132
4558A32P81j392p9J154n25n05R03m15o95R29J89j111M70R62r49o08J201j9r01
4577d78M88K88o56L67N27q62q9R26l68p30P97L99j039R6P22m27j93M97k95m04
4597d34O86J25q45L59O77q67j29Q59j26p33M80J52n23M15L10p45N8P82m11n74
4617d84Q13K6r13L71O91n39j83N36n00k91Q97q1r17N65N44r35N2R68n55o25P49
4638A89Qo30O67K11r97L04Q91p02m22J010l01q99P14N14q79J63N98p39j44J032
4658E88l66r40Q91K71r54M06P31q66l17R63l36n24Q09l7r39N53P00q61q4P82n59
4679h9m39Q75N0p89M05L02o53J95P29o58m29P88j63n07N75J38p07J55N49l90j08
4700a71M93l18m05O05R2n10J78J65l52K2O00l31k78K19K8j94L12Q7l98J9K32r9
$$ plain form
4558 132 913 -479 -558 596 71 -434 469 54 -641 288 477 -634 -164 798 -151 -759 442 423 -478
4577 -478 10 298 -358 9 536 -326 -415 511 143 -587 210 609 -430 -334 388 -39 -232 265 -30 -434
4597 -434 252 377 -468 -109 568 -299 -428 431 305 -428 52 204 -319 96 406 -339 -281 501 90 -484
4617 -484 329 355 -558 -187 504 -35 -218 318 -182 -473 424 343 -574 -9 535 -400 -348 620 65 -560 189
4638 189 197 -433 234 445 -552 -248 643 -59 -481 529 228 -671 43 557 -322 -159 439 -300 -444 588
4658 588 222 -718 173 444 -510 -104 627 -239 -556 407 71 -453 356 319 -620 -67 633 -228 -312 470 -89
4679 -89 -528 347 397 -392 13 315 -338 -143 586 -72 -501 287 124 -383 192 330 -377 -222 327 -63 -171
4700 -171 322 4 -401 204 296 -214 -36 129 -223 -201 399 68 -210 9 37 -157 155 242 -156 -137 95 -4
4722dj17K88j96j78J47J85j34N6q8j63J21K40q6j55Q1jl6J06M7q8p2oQ7M6Q3j28
4748C5j64K2J83J9j08kj5p0P5J61m8k05P1J5k2J63K1k88L1K10p2q5K39j24k17
4773a75J81K29l04P4K04l55k4M69j45l81K56J02l14J33L83l78k42N04j96l10N30
4794B41Jo65K98M72m72j31O12l12m75O15J10o72L86L97p24O2P88m21n73O58Q7
4815B82o38M29K45n78M2N95m47l21P74j19q11N27N05o71p0N67l63j77N89k82n02
4836d24O21J73p46K57O01n41l59O16q3l20K90L1m10L27L68o57n7O83k59m10L21
4857B2K60m00N8J78k73J52K80l89r0M61q1m40K51J95k22n5J57j57J61R8l53J6
4879a71L70q2l66K25K39k72k0R6j17J51R4l77J2N42k65l59L29K44l18q7K53k05
$$ plain form
4722 -4 -121 167 -29 -207 -60 125 -9 47 -41 -204 -83 157 71 -84 -3 -4 -40 66 113 25 -47 -53 34 80 163 35
4748 35 -129 -107 76 95 -13 -15 -30 -100 -25 136 88 -117 -46 -31 -53 110 131 -157 -126 84 12 -73 166 42 -175
4773 -175 6 235 -69 5 209 -146 -170 299 154 -227 29 131 -183 -50 333 -45 -287 217 21 -289 241
4794 241 242 -423 -125 347 -125 -256 356 44 -431 184 294 -378 8 405 -319 -257 531 110 -463 195 282
4815 282 -356 73 318 -260 -218 377 -70 -391 383 264 -547 -20 485 -186 -256 311 -52 -229 360 78 -424
4836 -424 197 370 -376 -119 482 -59 -418 198 115 -205 85 116 -294 33 401 -256 -313 370 111 -299 22
4857 22 282 -118 -60 118 -155 -3 277 -112 -202 259 178 -262 -11 184 -38 -93 64 -93 68 166 -187 -171
4879 -171 199 117 -249 -24 215 -57 -77 19 -98 53 147 -230 -218 324 59 -300 29 273 -45 -132 121 -84
4901h4J9L07l49j44N93j17o26M42M07n79j31N70k54l35M88j02m60M72K28p52K27
4922a80P34o16n22Q21J50q38M07L86n75Q9N70o37j95R49k72j006P98N88j004p9
4942d32R30m10n31P74j94o26Q00K01j106L53J070r15o52J147J13j067M75N41p97
4961c26J64P50q37l34J214k60j250R30P89j178j51J029n31m42Q66k29q43R10L48
4980F19j286L17J153p93p93J117J10r85N37M36q09J81Q01p98m30J259l43j090
4998g97Q25O73j040l0R00n47l49P33k84o65Q19L12j164K94R83p01o20R93oq24
5018d95N64K66o87K75O04p95j55J027m24q08P70M22r27J86O53o27j30P17m60m22
5038d46P73j8q92O10N76q57j22P50k93n27O46o3n83N88J98q04K72Q38p48m48Q31
$$ plain form
4901 -84 -65 242 -107 -251 342 225 -401 41 448 -131 -262 308 54 -281 207 105 -355 117 345 -407 -180
4922 -180 554 -62 -584 237 387 -451 -44 342 -233 -144 426 -211 -406 543 271 -735 63 651 -353 -432
4942 -432 498 88 -443 331 137 -489 311 512 -594 -241 829 -86 -738 409 522 -545 -70 471 -326
4961 -326 -162 588 -249 -583 631 371 -879 51 840 -338 -489 540 9 -433 433 204 -639 271 619
4980 619 -667 -350 803 10 -783 334 444 -541 -4 432 -377 -196 605 -193 -623 636 293 -797
4998 -797 28 701 -339 -369 531 -16 -365 368 84 -581 238 550 -614 -320 663 -38 -658 335 329 -495
5018 -495 69 335 -352 -77 527 -268 -423 604 180 -628 142 564 -363 -177 476 -151 -281 436 -24 -446
5038 -446 327 309 -583 27 603 -254 -376 374 81 -446 200 137 -446 142 340 -464 -192 646 -102 -550 281
5059B81L0o74L76K45n76K71L87n70k1P23m55n28P12K48p81J61N00l93m2M42m85
5080a49j83O77j69o55N95L72p62n4O63k42l32M40j48l83N20J52o91J66O16n13
5100h0l50P12Kn94K44K95m15J63K89m45q4N23j06n00L86K76n44m3N85k42k53L32
5122A51j72k17L99J13m85L1N06k94l12M24P2m58J90L17l00p2K69k01k90M42J22
5143B35m72J60L31l71j23M41l2m15K14K16l75J90L78m50j79M40j02l58L86J24
5163B38m89O2N54k86l01M07j01l74M35J76n70J19L70l68j30N47j77m99M25J92
5183B30m60K30K56m32k6M72j87k40L69l8n29L62M08n11q0M14l05j51N05k16l83
5204c12L16J99m53K69L49m87k04N00q3k90L67n2m19K74K62l90J7L50k96k59N25
$$ plain form
5059 281 311 -363 13 258 -318 -47 340 -230 -251 472 17 -511 201 449 -332 -171 329 -64 -106 336 -149
5080 -149 -332 345 176 -479 116 488 -274 -328 335 93 -239 201 53 -330 190 342 -349 -183 433 -80
5100 -80 -430 282 284 -310 -66 229 -186 -23 266 -179 -263 260 154 -346 40 316 -228 -271 314 72 -181 151
5122 151 -21 -238 161 274 -211 -180 326 32 -280 144 216 -242 -52 265 -35 -107 162 -39 -329 113 235
5143 235 -237 -77 254 -117 -240 201 169 -246 -32 184 -191 -1 377 -73 -252 188 86 -272 114 238
5163 238 -251 -189 365 79 -222 185 84 -290 145 321 -249 -130 240 -128 -258 289 112 -387 38 230
5183 230 -230 0 256 -176 -202 270 83 -157 212 174 -355 7 415 -96 -176 238 -67 -218 287 71 -312
5204 -312 4 203 -250 19 368 -119 -323 177 94 -196 171 119 -300 -26 236 -154 -137 213 -83 -342 183
5225A83O5m49J84J24k84K02K42l34j54M42j55k68L91M5m64J45K91k13k8K63l07
5246g9j50M16k0l27J81J16l25N5L87j68k36J93j3r8J64L7k97K6K87j07j48K49
5268A43o4k43R9J58j06LL9m8m3J96L9k56m8J71l8m7J38k1j13o3J58l1j1P7q6j85
5294a82K55J24k29j09K34k7j43R3J01k03M6N6j30J16J78k48j21K45J32k93L6K13
5316A44j64j01J95p3l3J38l7k13K10J45k94n3K27Q0k32PJ05o9pJ4l0K9R8j29j38
5341a81K15J45j90q3Q1J06j00o6N7J07j01o8P2Q4j6k8o9l2J98kk82N1L15j89k26
5366b02K35J45k53K8J25j52P0J66l09n6M70p2n59L12L48m52o3M47k02j74L11n2
5388A11l56L56K13o29Q6O90m55m74O44J28n56J88L26m75J24M96o36j92Q14j12
$$ plain form
5225 183 248 -201 -17 107 -177 25 267 -67 -221 221 66 -202 189 234 -230 -85 206 -7 -35 228 -79
5246 -79 -229 187 167 -160 21 137 -188 -133 254 86 -150 43 30 -68 96 133 -164 -138 149 42 -106 143
5268 143 79 -164 -65 93 -13 -10 29 -19 -62 134 173 -83 -131 40 2 -45 93 72 -41 -104 54 23 12 89 3 -182
5294 -182 73 197 -32 -141 93 66 -77 16 117 -86 -40 16 -114 2 180 -68 -189 56 188 -105 -69 144
5316 144 -20 -121 74 1 -32 106 69 -144 66 211 -83 -136 91 171 -61 -54 51 -18 -25 -11 -41 -12 86 -43 -181
5341 -181 34 179 -11 -94 -13 93 -7 -73 -16 91 -10 -78 -6 78 62 34 -35 -67 131 129 -153 -102 213 24 -202
5366 -202 33 178 -75 -47 78 -74 -4 162 -147 -203 267 195 -364 -52 296 -156 -219 228 26 -148 163 111
5388 111 -245 111 324 -305 -219 471 16 -458 186 314 -242 -54 272 -203 -79 417 -219 -411 403 291
5408B91q61N60M95o98n1N97k99l42O54j80o38O95K46q88J30R41o22n82P68N1p07
5429d40M28L11o42K15O41p16l05Q80q8q89N02O60p68o2O81m10l54P16j72o65O19
5450A42L36q54J07P43m57m40P22J6o33L28L21o90K20N14n28k74Q22j79p74N53
5470eM49p31P5N37l60k26N45k24m23N77J52p47K00O62m75m10O34m9m24L35J37
5491B29m23K48K31m79nN49k57m73M82J68m50M6L50l00J4K88l12k16O04j02n53
5512c61K87M44m44j68L87j04j22J94j03k66M19J08o52K31N27m18k76M46K9l18
5532a60J66J24l84L44K34n41m0N96j82n23M39K46m69J1L25k88J2K97k45k40N90
5553C12m0o89L58M20m20k09M40j56k38L14R8n77M21K88o22K9P08l34m99N14K00
$$ plain form
5408 291 -570 -10 485 -213 -264 333 34 -308 346 166 -472 223 469 -419 -289 652 30 -552 216 267 -440
5429 -440 -12 299 -343 -128 513 -203 -508 372 284 -605 -103 557 -211 -273 408 -2 -356 360 188 -477 142
5450 142 478 -376 -269 474 17 -423 299 315 -318 10 331 -359 -139 375 -153 -427 395 216 -558 -5
5470 -5 444 -287 -212 325 -35 -261 284 60 -363 214 366 -381 -181 481 6 -404 230 181 -243 92 229
5491 229 -194 54 285 -194 -199 350 93 -380 102 270 -180 -134 216 -84 -70 218 -94 -310 294 192 -361
5512 -361 -74 370 -74 -242 145 41 -81 113 10 -256 163 271 -381 -150 377 -41 -317 129 158 -160
5532 -160 6 130 -254 90 324 -217 -257 339 157 -366 73 319 -150 -139 186 -102 -90 207 -38 -278 312
5553 312 272 -417 -59 361 -59 -268 172 16 -222 92 190 -387 34 322 -300 -271 437 103 -396 118 318
5574C18n81K63K67m21nN79m42l57P08q6o70L42N65o59n3M96k61k89N32p5n83M16
5596DL41o79J20O15m01m21N58O1m93L52J71m73J78M04m20j64N21j63m72L79K70
5617B88m48rL78k62m2L62k59k02K71Q4l26J04L04l46j97M17J1k63J65J01l18J55
5639c2J92k30j9J75l5k11K22O3k26l3K30j9p2L4r8p0J44J0k0J2N3p7j47J83Q4
5664A13j33n4M5P0r7J38o6q4MJ28n4N4j8p4q3J77L5j50O4N0j99R8J49j06m1O6
5690C2k2j34J52Q5k41J2J86o4j20K90j96r7J90k3j17J15J30l15PL46p3k60J65
5713D8R8l37K92P6k79M0J59k30j9L77j82l09K33J92l16J40J69k89k6L43j66k12
5735a98L63m4m18K35L68l51j15L21j60j28L52r5l48K29J78l75J23L33l41j51K91
$$ plain form
5574 318 -263 0 267 -154 -159 420 -22 -379 329 243 -427 -85 480 -179 -232 264 3 -286 246 171 -412 4
5596 4 345 -334 -214 401 0 -421 137 198 -295 57 228 -245 -67 337 -83 -247 274 111 -361 18 288
5617 288 -160 -169 209 -53 -95 267 8 -194 77 161 -165 -61 243 -103 -300 117 128 -135 30 131 -187 -32
5639 -32 160 -70 -89 86 51 -160 62 125 -101 -134 96 77 5 39 -59 -129 15 25 5 17 70 -7 -154 29 113
5664 113 -20 -74 -29 41 -56 82 16 -68 -64 64 10 64 46 -28 -111 66 101 -49 15 65 -134 -36 113 7 -34 32
5690 32 10 -124 28 113 -128 -116 70 6 -114 176 -20 -117 73 50 -67 48 178 -137 -130 216 143 -117 48
5713 48 146 -191 101 177 -102 -62 97 -133 -152 225 43 -266 -33 159 -157 -17 152 -137 -163 180 14 -198
5735 -198 165 121 -297 -62 306 -45 -160 161 1 -127 225 130 -218 11 189 -186 -63 270 -71 -222 69
5756F9J2j77J72L7l69K32K74l21r8L10j25j99K86J9j82J24r7p9J06J80k13j43
5778a82J96O3j55J29Mj47N9L7j5J18p8j75M8K14Lj42K6m0mJ44r9p6J64J2k50R8
5804d8K72k01j59J05J23k05J59n7j89J95J09k92R3L75l16k29L24R6k11K3J49k25
5826a09O3K76k52k39M36K3m53K39L41l81r6K56n3k15K80p2k97L75J67m36n5N06
5848C04k01m83M35J27l53J1K70k46L4L48k28l10M16J11n66K47M36l53l55M85P3
5869B02l61J64J90l81J48M05m57k34O31q7n68L12M21n37q4N02k62k55M67r8m91
5890c73M40K96o90O9O61l82m53O23J10n77K45L14n07N2N61m34l29O32lo58M09
5911FM23o25j32O32k17l56N02p4n51N05K60o16L0O63m64m14N92J36n99K94K55
$$ plain form
5756 69 81 -96 76 113 -256 -24 250 -71 -169 141 16 -183 103 122 -60 64 -33 -112 -6 174 -39 -182
5778 -182 14 77 -78 51 55 -92 -33 4 -11 107 29 -146 -98 116 119 -23 3 -37 -41 103 4 -72 92 104 -146 -48
5804 -48 224 23 -136 -31 92 -113 46 -11 -200 -5 104 -188 -95 280 -36 -265 59 155 -56 -33 116 -109
5826 -109 -46 230 -22 -261 175 198 -255 -16 325 -56 -152 104 51 -164 116 44 -253 122 289 -147 -202 304
5848 304 103 -380 55 182 -171 -160 110 -136 -102 246 18 -292 124 235 -331 -84 352 -1 -356 129 202
5869 202 -159 5 195 -186 -38 367 -90 -324 307 220 -348 -36 385 -152 -236 266 4 -251 216 118 -373
5890 -373 67 363 -327 -258 403 21 -432 191 301 -276 -31 283 -224 -172 389 -45 -374 258 255 -403 6
5911 6 429 -196 -328 304 87 -269 233 159 -392 113 373 -243 -213 450 -14 -428 164 300 -299 -5 250
5932B50m46J07M44n62j36P08j90o20M05L94n25m4M65k46j82L63j81l00M85L9n77
5953c49K61M69l80k67M28j4l06K19N9l18K63K09n14K8N30j92m19L60J08l22J14
5974c3J95k66Q6K34l58j12N24j35m45L28K51m08J6K68k22o5M06k96k68N56m3n29
5996c16L04L29l64j71L89j33k25L61j32l58M84J18n29J00N45l41l93N13l3l61
6016b13K00J92m05J47M19m61j96O05j26n33L49L19m99L0L96k82j68M31j42l95
6036c32M74J22n52J11N80m31k34M60J5l83K57R0m08J61L56l94j30N11o7m89L51
6057F8K44m91L1L35k25j16L25r3l48L97J32n40J30M55k81l10L75J24l71J72J70
6078A83l33N1L47l00k24N07m0n45L25L17l40o0K90j62j95L54j09l26L62J36m84
$$ plain form
5932 250 -196 -89 355 -207 -343 365 175 -445 -40 354 -171 -215 250 4 -178 185 4 -296 189 228 -349
5953 -349 -88 381 1 -266 162 148 -158 61 120 -198 65 274 -240 -212 318 126 -293 67 175 -147 -33
5974 -33 162 -104 -18 216 -142 -254 270 135 -310 18 269 -139 -123 145 -77 -142 264 -32 -300 256 213 -316
5996 -316 -12 317 -47 -218 171 38 -187 174 42 -316 168 286 -243 -143 402 61 -332 181 148 -213
6016 -213 -13 179 -226 -79 340 -121 -317 288 162 -371 -22 297 -202 -172 224 -58 -226 205 63 -332
6036 -332 142 264 -288 -177 403 -28 -262 198 213 -170 87 177 -231 -70 286 -108 -238 273 206 -283 68
6057 68 312 -179 -148 187 -38 -154 171 78 -270 127 259 -281 -151 304 23 -287 88 212 -159 13 183
6078 183 -150 -99 248 -52 -276 231 191 -354 -29 288 -52 -112 178 16 -179 175 66 -260 102 238 -246
6099b46R9M59k56l51M13n7k49K28J10l18J33K15k82m4L82j05m07L20J51l10J9
6120i6K37k32j7K46j53j48L16o8k80K00J74k54l8K76j97j10K73o6k48K10N4k79
6142b00J68K14k92j05L55r7j44K23o0j65J40R5j72N7J28k70K3K61q7k26J76O0
6164H2j58J39O1k34K9J73o4j27K64r4k12N9K36j30n0J01j13q2J82l6j15J28K5
6187F4j92Q5K29j95q3R1L2n4P8l8j02L5O7p7Q0J09q7j48K5J64k4j04j8K3RN7k4
6214BJ6Pk6j9J6Q3N8j99k9J71Q1k14%J10q5MJ27j31p7J08pq8K41k5k29n2K27m0
6242C0l9L7m0r8J50Rj26J41J08k11p9K25L7k49N4J9k4J21l3o5J0J18j58K9J71
6267A37q0j87R4jJ47k8j03j40J24J53j93M4J68j80m3J20l9oJ39j50j66L23P7m09
$$ plain form
6099 -246 -147 312 56 -295 118 61 -188 40 150 -168 -35 180 -102 -146 236 131 -276 44 195 -115 -96
6120 -96 141 -91 -108 138 -15 -163 153 85 -195 5 179 -75 -113 163 -34 -144 129 63 -185 25 79 -200
6142 -200 -32 182 -110 -215 140 43 -101 122 62 -103 37 132 -40 17 145 -125 -102 159 72 -154 22 82
6164 82 -76 63 124 -110 -81 92 28 -99 165 71 -141 -82 154 24 -26 75 -38 -120 62 26 -89 39 64
6187 64 -128 -43 186 -9 -92 -1 31 -23 55 17 -85 -50 17 -60 20 129 42 -106 -81 83 59 -45 -63 -40 -31 26 2
6214 2 18 25 -1 -20 -4 79 137 -62 -91 80 161 -53 -53 57 -28 -24 103 -28 -105 3 -4 -92 149 124 -105 -157 70 30
6242 30 -9 28 -12 -110 40 49 -77 64 172 -39 -118 107 144 -105 -51 -32 -56 65 32 -33 -23 95 -63 -34 137
6267 137 57 -130 -36 -37 110 82 -21 -161 -37 116 -77 -33 135 -45 -88 32 -7 -13 126 -24 -190 133 210 -199
6291a99R2K77j43j15J94n6j92K18k6k85L45K63o08l8N09j56l61L85j9l10K58K17
6313B50n15J99L58m85j57O57q4o15L48L31m79R7M30m63j08N14j49n07N91J29p05
6334c63J49O57m51k93N28j27l78M37J24n89K41M21n89p0O95k16o16N17K60n71
6354b34J72L24m01j37O01l18l30N38P4p03L31N34n21k60N36q0l90L67Q0m26K39
6375dL54n30o4N65k27m21M16K30m59M8K69k77K7L25k04k87M18N8n19J74M17l20
6397a1k62L38K4k38J85l1j66J80K05m12J8M96k61l22K18K35k33j04K52j38NK18
6419A96k08j81L87o9l26J67K81k42j30K03l3j32J72q3j22K37Jl31J66K42k55p7
6441a37K26%k39K18k3j96K53M6l70J47L26k87j99L31j8k52J46J37k56J98J54l63
$$ plain form
6291 -199 -107 170 27 -88 106 50 -142 76 50 -235 110 373 -235 -273 236 80 -281 104 85 -225 33 250
6313 250 -265 -66 292 -193 -350 307 223 -392 -44 287 -192 -95 335 -128 -236 278 129 -378 213 342 -363
6334 -363 -214 443 -8 -301 227 100 -278 159 283 -306 -65 356 -233 -303 392 176 -440 77 337 -234
6354 -234 -62 262 -139 -276 325 7 -323 215 289 -414 -83 451 -70 -330 206 126 -264 103 183 -243 -4
6375 -4 350 -180 -244 321 94 -327 89 319 -140 -92 177 -100 -73 252 48 -239 179 237 -282 -108 309 -11
6397 -11 -273 65 89 -149 36 5 -161 19 224 -188 -170 326 65 -257 -39 196 -37 -141 111 -27 -22 196
6419 196 -12 -193 194 125 -201 -34 247 5 -125 78 45 -87 85 2 -120 117 118 -213 -47 195 -60 -137
6441 -137 89 89 -150 68 45 -151 102 148 -222 -75 251 -36 -235 96 78 -174 -28 109 -147 51 205 -158
6463a58NM29j82l45K70K40m14O0L47l30q7L49j73k72L92J9m70K96L68m16j35L79
6485A72r2l66L86O3m80L24K23m22L0M93l08l69M48J56m70J47L03m05L2M20l47
6506f2k30N53m3o10L92L89m91q3M31k60j72L43q1l55L67K26n70L0N53l02l71M52
6528A06P4m24K11J73k96P3L69l87j53M80k5m99K69L57m20p1L03j66l9J83p3k17
6550a72K83J31m26N8L97k65j91K60M1j99O5N4j29J19J29k63k8K86n1k79K57L9
6572A16j72L5M7q6N2Q2j48j7J82K1k45J13J52j13p4Q0k9o6J67p7q8J63k8j51O8
6597a6J17j20nO3Qr5J03k0r3P1Qj29R6J57j25j30J00J32j65N4L8m3k6J05j27n6
6623i8J31k0j49J40J33k51L4J57J5j91K09j2k18J66kj11O2J46j69j10K43J3k18
$$ plain form
6463 -158 -153 276 94 -251 19 259 -155 -95 252 -78 -165 184 11 -261 131 150 -320 -24 344 -72 -207 172
6485 172 80 -286 100 163 -317 7 230 -192 -162 331 23 -346 102 258 -212 -65 238 -167 -135 285 -62
6506 -62 -292 261 218 -392 0 389 -102 -185 246 -14 -186 157 76 -279 88 314 -256 -226 327 25 -346 106
6528 106 180 -244 -33 140 -156 -83 286 -101 -254 226 201 -298 -29 328 -92 -163 140 -26 -65 118 45 -172
6550 -172 111 242 -184 -126 271 6 -185 75 116 -83 -18 36 -93 26 155 -108 -136 150 99 -180 77 116
6572 116 -56 -21 26 -60 -8 74 -74 -91 91 112 -133 -20 132 19 -55 25 -4 -70 97 20 -68 95 67 -84 -16
6597 -16 101 -19 -24 39 47 -48 55 35 -58 13 21 -108 -12 145 20 -110 -10 122 -43 11 49 6 -20 85 -42 -98
6623 -98 33 13 -136 4 137 -114 -80 77 92 -99 110 98 -120 46 44 -67 -5 141 -28 -138 105 118 -100
6646a00N2J90j74p9K38j23j42K23k2k43K20J32l37j7L18j27k16L07%k78J42J87
6668A51k68O6K99l50j2L13q0l14K01J15k91J09K86k54j25K87j46j62L20N9m26
6689b22J66K74k53n4K38j41j54K22j2j95J85J03l88J15L35j60k12K12ok43L04
6710A14m3k12J60J04k70Q5K82k79j79L27Q9k25J55l1j93J48J66k90lK37j47k53
6732b58L53P2k78R8K8j61J55J49k47n1K69p8k24J78J62k81LK17r8n6J65j33j63
6755a79L01N0k89M0J97j07j83K58N0k44J03M6j37J16J87l10m0K57J1k54J05J87
6777A65k85k2J95Oj66J52l4j68J94J63l07j31L37l8k27J53J96k88p3K63o2j05
6799h2K79k60k15L68J84m12j2L92k83k14L87R0m06J92J36l12K02K90m64j89N47
$$ plain form
6646 -100 -48 142 -32 -111 127 4 -138 85 63 -180 40 172 -165 -182 136 9 -207 100 100 -178 -36 151
6668 151 -117 -51 248 -102 -114 199 119 -195 6 121 -170 -61 225 -29 -154 133 -13 -175 145 204 -222
6689 -222 -56 218 -35 -89 149 8 -146 76 64 -131 54 157 -231 -116 219 59 -153 59 53 -190 114
6710 114 71 -141 19 123 -147 -62 220 -59 -238 89 178 -47 108 77 -116 32 198 -92 -95 142 -5 -258
6732 -258 95 167 -111 -13 15 -146 9 158 -89 -140 129 51 -173 5 167 -114 -111 106 8 -48 117 -16 -179
6755 -179 122 172 -117 -77 120 13 -170 88 138 -106 -3 43 -94 22 209 -101 -141 116 127 -127 -22 165
6777 165 -120 -142 53 59 -107 45 11 -157 37 200 -107 -238 99 61 -166 -13 183 -105 -178 85 23 -82
6799 -82 197 -63 -278 90 274 -138 -150 242 -41 -255 132 222 -184 8 144 -168 34 324 -140 -329 218
6820B18L7n70K82L06m79%M36k82j26L30j51l45M57K12o11J31M49l35k48N34j44
6841A01k48K61M6l85K83K36m39j63N93p7n28L16J74l07J02K24k67qK26k41j45
6862b46M42K4n16K47L17l03q0J74n9p2K04j05j49K77l3l19J09K90j88j81K26O
6884F5j09J34m2j35J82J3k76J40K36k20k06K86N2j77Q3K0j51J92M1k82J28K40
6906B14l08j09L13k4k18Q3J04j66R2J47k42L7K49j75j90L06R3l44K8K52j61r0
6928a09K55j67j28L05Ll85J91L26m26n8L89r7k95K51K9k65J76J52l36O8L70k39
6950A0l20M20J01m45J46K92k39j10K96j72j37L66m7m78L19K66m10m3L95j14k44
6971a48J90K9j95J56R3l28P5L52j47l62L07J34k68l2L35k07o7K43j53k34L81k3
$$ plain form
6820 218 255 -315 -33 273 -206 -206 230 -52 -178 152 1 -344 113 325 -286 -155 294 -41 -289 245 101
6841 101 -147 114 160 -225 58 294 -145 -308 285 208 -320 -4 170 -137 -35 189 -78 -86 140 -101 -246
6862 -246 196 220 -296 -49 268 -35 -115 59 0 -72 132 27 -122 155 122 -197 -88 202 14 -167 59 65
6884 65 -44 90 48 -87 95 108 -168 -28 208 -12 -218 68 120 -57 26 46 -105 87 128 -154 -26 214
6906 214 -94 -203 110 86 -132 -49 55 -111 -19 128 -114 -77 172 -3 -193 113 206 -138 -110 142 -19 -109
6928 -109 146 -21 -149 156 159 -226 -35 291 -135 -193 196 99 -196 55 84 -181 -5 147 -189 -121 249 10
6950 10 -310 110 211 -234 -88 204 -35 -145 151 -21 -158 208 161 -317 2 268 -142 -185 210 96 -148
6971 -148 42 71 -124 32 125 -203 -128 224 77 -285 22 156 -112 -144 191 -16 -83 160 7 -227 154 131
6993A31m08K25K69k30j40L11j23j43J86l0j91J52J56k74j3K58n2k28J36J18j92
7014h2P5N6j34P5J26k15mK35m8k02Q6J81j97j6J28q2M5L4m7j46K32J1k31N9J51
7039I0q1j20K07j18m4J32J5k03J99J6k36Q0J47o0j46J31P7j44Q5K0j33J56Q1k90
7063a39Q3J60r3j77K35K8k20J47Q9k19P7J44k75K4L46j90k96K74J54k58J0K92
7085A96k17q6K40j36j67K66Nk76J11K84l11r9L96j11k57K36L6k65J38K10l14j0
7107a31L90k66k47L55J47m39J36K57l16J2K27j52j12K31k6k56J53K27k89o5L29
7128A65j33j76K42J9k03M3J27j74N7J29j11j31K52Pk50J00J33q7q7J41j9j49R8
7151gQ3j22O2J18j95o0K21k0j91Q8J21k27N6J57j9r3J01n2j24J67N6k02MK54j84
$$ plain form
6993 131 -277 -52 217 -13 -153 158 35 -108 78 48 -143 9 165 -109 -122 136 84 -144 -8 110 -82
7014 -82 -7 49 -85 -10 116 -99 -103 132 84 -118 -32 149 -48 -64 64 -18 27 61 14 -132 100 111 -120 -61 90
7039 90 9 -111 96 -22 -66 66 81 -122 77 93 -143 -63 84 24 -122 9 86 -58 27 47 -86 70 151 -139
7063 -139 -56 104 11 -166 69 97 -123 24 113 -106 -29 115 -160 -136 210 20 -276 -2 152 -106 -96 196
7085 196 -21 -107 133 -3 -170 96 101 -175 -64 220 -91 -190 206 95 -162 74 110 -155 -17 193 -121 -131
7107 -131 259 -7 -254 101 248 -191 -55 202 -114 -102 125 -27 -139 92 66 -190 -37 190 -99 -164 165
7128 165 32 -144 98 117 -86 -43 84 -90 -33 96 -15 -146 106 113 -137 -37 96 9 -78 63 44 -105 -7
7151 -7 76 -46 16 134 -61 -121 100 80 -111 -23 98 -129 -73 84 65 -28 73 21 -103 64 120 -82 -78 176 -8
7176hr8J35N4j89P6Q3j28P4J08k07n4K90n2k27J97J6j86N1J88j62j7J74j43j35
7200a60L89n3l89J17K62k50r7K74r8j41K05K1k30K43N1l55Q9L73j94k63L06q9
7222A1j91L08j6k66J78J91l83K9M31k74l21L89J21l67J67K03l75M4L54k68k66
7243c01M61n5l98L14K21l97l7L25k59n1M03j81l40L12K10m18J14M12l42k34L58
7264A17kk71K17M5k89J94K99m07j39M04j04k77K69J55k60J0J02j22Q2J91k11k81
7286b78L69N5k35K4K01j73j03J36R3j46K6Nj06J63J41k02r0J62J6j49L2J54j13
7309a8q0J14K4J8Qr9q4J09J89j99l8J40J0j74N2K07j70j04M8J8L0J25j16j32J33
7334A1J26j50j00J94n3j63J04J51j17p1N4q1J02R4j71k2J25O3j65P6J01o1r1J3
$$ plain form
7176 -8 -106 29 83 -106 -30 53 -75 -1 107 -100 -154 136 84 -143 54 70 -116 -65 123 -39 -56 118 -25 -160
7200 -160 229 176 -213 -96 166 -84 -181 93 -5 -146 59 80 -150 93 144 -211 -122 251 57 -206 100 11
7222 11 -180 128 112 -154 24 215 -168 -139 292 18 -303 86 207 -160 7 210 -165 -121 233 -35 -301
7243 -301 160 105 -293 21 242 -155 -192 133 -126 -177 226 45 -295 17 227 -191 -77 335 -7 -241 117
7264 117 115 -156 61 106 -183 11 310 -97 -236 168 64 -213 56 211 -49 -39 63 -59 23 214 3 -278
7286 -278 91 146 -89 -65 136 -37 -140 -4 89 -57 -31 -26 -132 31 172 -30 -120 42 58 -91 -59 95 -18
7309 -18 -98 16 40 58 66 -33 -117 -8 181 -18 -56 84 94 -80 -28 179 9 -95 -47 -29 1 126 10 -122 11
7334 11 137 -13 -113 81 28 -135 -31 120 3 -68 -14 -95 7 101 -70 -92 33 96 -69 7 108 47 -44 -31
7358c1L8L7m3o8K4J09Pq2k6N7m4n0L4N5L5n5j45J71J15j41o1J02J1q0pJ2jJ7N5
7387D5q8L0J97j76k21K94L7k74J25J34j52M4P0j56L7J95j05k55K13J89l17j9L05
7410A52j31j26J48k3j25J76J2k59J66K41k92j78L67N6l19L5J97j97N8J79k29l3
7432a25K79j36k30K28J52k79l0L18j57j13K39j21j32K33l3k44J08K47k09j70K65
7453I0o8j40J66L7j95J34P7j90l0K29j19j29J78N5j74M2Q1n1k6J50j32l4J40l8
7477E3j74J41L6j04M5O5m5m0J05r0k1J12l5j18Q3N4n5m0N1k7l4M9kp7J48n7r2
7504f9J18%r3K6R2o1j7J8l5j7O1O0k01J46J10k06J8J11Rj42P1Q1j45N0J16j53
7530e2l2K63j42j81J46J31k31M9J19n2p6J13m6j22J56k1k08J90J96k30j48K77
$$ plain form
7358 -31 7 44 1 -67 -43 66 73 -9 -35 22 -22 -72 -38 17 52 -3 -148 23 138 -3 -64 38 49 -31 -38 -26 -27 -10 45
7387 45 -43 -13 184 8 -213 81 118 -156 -31 103 -49 -5 65 -91 -54 141 36 -219 -6 183 -134 -153 152
7410 152 21 -105 43 20 -105 71 83 -176 -10 231 -61 -239 128 184 -135 -100 97 -100 -42 137 -92 -125
7432 -125 154 18 -212 16 168 -111 -141 177 20 -93 146 25 -107 126 93 -151 -43 204 -5 -175 90
7453 90 22 -118 48 85 -110 24 101 -89 -119 110 -9 -138 40 95 -79 -37 44 -7 -33 117 -15 -49 91 53
7477 53 -121 20 56 -48 -3 62 17 -23 82 -8 -29 83 48 -70 13 67 12 -28 23 -4 -38 11 9 -68 80 23 -69
7504 -69 49 49 -44 -18 74 13 -4 14 -21 -38 23 83 -118 28 138 -68 -50 61 70 -72 -1 80 -65 -15 101 -52
7530 -52 -84 179 37 -144 2 133 -98 -49 70 18 -58 55 9 -113 43 22 -186 4 200 -30 -178 99
7552I9n6j75J43N4j31M5J35k23k7K73q3l05K59K14l31J2K37j05j91L00r3k01K36
7575H6M6l24J51K79k19k75L63M5l20J76J68k61oK25j69j18L16o5k66J83J71k88
7597a02m0K89j23k24K89%k77K16J11k42KL13k32j77L55l1l44K08K08l04l3K32
7619I4j19j87L84j27k75K36J52k84PL00k49q8K01L1j50Q6O3k18J50J61k23k3K03
7642A25Lk72J90Q5k04R0J12j65N8N5j42n3J92N6k59J27O0j21m8J41po1K4qr9K23
7668A02l8j59P8J57j18j61J95J4j12k9J30n5qR0j27o2J71K5k01O0J31q3q0J22
7692D2nj06M3N3q9J38J1j96M0J10nj92J30P1j33N8Q5l1n4P6p6o9J46J10l53J10
7718h6K89k48p2J95m5j94J95kj82J93J35k74m3L78j39l24K78Q3k57J70M9k52P1
$$ plain form
7552 99 43 -132 11 65 -66 -21 114 -109 -136 137 54 -251 8 222 -109 -97 140 35 -156 144 51 -150 86
7575 86 132 -192 -41 238 19 -256 107 152 -168 8 176 -85 -91 134 -35 -153 163 98 -168 15 186 -102
7597 -102 -142 147 24 -200 89 89 -188 28 139 -103 -101 212 -20 -197 158 127 -217 -9 199 -105 -138 94
7619 94 -25 -212 172 45 -230 6 158 -126 -119 181 -68 -156 45 76 -74 12 75 -143 7 168 -55 -78 125
7642 125 128 -144 46 131 -73 17 129 -36 22 77 -65 -118 74 130 -129 -2 58 -63 -111 30 23 -38 -14 -22 -121 102
7668 102 64 -95 -17 140 22 -139 56 70 -42 -71 59 4 -4 86 -41 -103 68 93 -108 -48 83 0 -80 42
7692 42 37 -69 -26 27 -62 76 87 -109 -69 41 36 -156 -26 45 -88 -30 55 24 -30 46 -30 -99 47 157 -196 -86
7718 -86 203 -45 -117 78 33 -161 34 32 -150 43 178 -96 -139 239 100 -224 54 137 -120 50 99 -153 -82
7741h2J92j33j66L80p7l06J13K54k28k5K22k06j05K52K3l65L07J25l52P2L10j10
7763I5k90K57m5j27K10M8k49L5K68k61o3L29m5l07J31J12q9M6N1j71j4K27p5k12
7787a39K30Qk16N4J92j66q2J13nN5K7Lq8L6M5j51L3P0o9nmL8R5j15o4Q2R3l6j20
7816h6J52j7j12L6M4l7Q1l2j11R7J06j41j21Q2J66j50OJ24j44K0M7o6P2P7j00
7841gj32K17Q4j54j69K04lp3R8n1o4P9K1j59R0K09k49p6K04L9j41RN0m0l0J33
7867H9j21K6R0r7j68K07R6j88j3R4J00j74k3J26n9Oj0Pl3J55j72j11J46J97j18
7892E2j70J96j3j54P2J17j76K9J09r1LJ34q6j59J40J74k26m1J76J7j80J09O9j76
7916g5J2J62j97M8J73k01q1J74Q5k27O6J60q8p3Q6k2jQ3p2j55K14R7k46N5J79
$$ plain form
7741 -82 110 -23 -189 191 114 -192 -79 175 -53 -78 144 -62 -167 85 108 -257 50 175 -177 -105 205 95
7763 95 -195 62 17 -110 100 148 -101 -66 202 -59 -122 207 162 -145 -14 98 9 55 106 -65 -79 148 73 -139
7787 -139 91 99 -117 -63 129 -37 -119 -6 -11 44 71 74 -14 22 67 -84 -51 19 -50 -55 -59 -21 74 -41 -105 -23 70 34 -86
7816 -86 66 49 -63 -27 17 -20 61 29 -82 15 121 -20 -141 -59 107 -43 -37 87 -57 -37 10 -56 16 93 -7
7841 -7 -139 78 162 8 -161 43 40 -33 65 14 -50 29 50 -109 -19 190 -59 -135 69 108 -33 -24 26 -14 -44 89
7867 89 -32 -6 84 -13 -181 26 122 -66 -79 15 115 -59 -82 44 -15 -9 -19 -12 -45 110 -62 -173 -27 170 52
7892 52 -118 78 65 -89 -17 100 -76 -47 62 -29 -26 108 22 -137 3 177 -49 -90 86 103 -77 32 101 -75
7916 -75 -63 99 -98 -50 123 -78 -159 15 100 -127 -61 99 11 -62 24 2 1 84 12 -143 71 168 -78 -23 156
7941A56j48n1Q2k6o9J09l4p1N9J69k17l3J53n9p1J5J14r2K0ko8N5N3j00nR9J6
7968E4n8J8j3k7L6l4n1Q9P2q1m8J18k4j08J05o5l2R2k7r5J08J26j57j48K24j3
7994F1j22J27Rj74P6R9j43K9J96p5k31K26L4k09M4J75j28q7K31j49j71K46K9k98
8018b05J70K14k44r5K82j06j58K24l4j81J19J97k76K1L04j91j85J79J14l10R5
8039f6K19k15m2J97j16j43K67J7l38J44K71k13j31K50Kk56J91O9k43J32J59k47
8061i2k4K62p0k55K19J46l02O4K38j90j45J97J8k38K19Q8k56R3J86j91j62L35
8083A40m7j86O7J47k08RK07j39r1J92Ok44J88J53l41Q5K40j45k05K20R9k45J51
8106E3J14k51J8K09j55q0J83K3l11J56J25j65KJ67j09j16J95K1j98J47J21k49
$$ plain form
7941 156 8 -43 39 13 -56 53 19 -52 7 176 -41 -74 79 20 -51 -36 78 -14 6 4 -64 -9 44 -56 -61 38 54
7968 54 -4 14 1 -26 10 -24 -75 14 86 5 -43 75 51 -57 48 -17 -49 43 16 -79 29 155 -2 -150 74 61
7994 61 -61 66 75 -99 -23 76 -67 -38 158 83 -148 78 112 -97 -53 122 -6 -93 138 -11 -182 64 93 -205
8018 -205 -35 179 -65 -160 122 16 -142 82 48 -133 -14 183 -93 -72 232 41 -144 35 149 -161 -66
8039 -66 153 -62 -104 93 -23 -166 101 118 -220 -76 195 -18 -149 101 103 -153 38 107 -136 -4 155 -92
8061 -92 -116 146 76 -179 40 186 -116 -52 186 -4 -149 48 66 -172 47 135 -121 -28 158 -33 -195 140
8083 140 93 -93 -26 121 -87 -78 129 -10 -101 91 97 -147 41 194 -147 -62 178 33 -172 48 147 -98 53
8106 53 167 -84 -66 143 -12 -92 91 114 -197 -41 84 -81 -79 88 -21 -137 58 79 -119 28 149 -100
8128a00K1K13j67j19K48m3j28J45m7j60J70Q4k16j2J89o2j43J14J45j70j2J02
8150E2j23Q1J22j97n7K09Lk08J34J00j51J5M1n1m3J62q6r5J97L7k01N8J60j83
8174b4o3J77n0j29J23kj80K33L7k08J3J85p1j30J67m2j10
$$ plain form
8128 -100 -79 134 -33 -152 96 53 -75 70 23 -137 33 117 -99 -111 78 16 -127 -13 132 -38 -50 52
8150 52 -71 10 132 -65 -122 87 90 -118 16 116 -35 -20 21 -30 -73 89 3 -92 105 142 -59 -1 159 -24
8174 -24 -87 90 40 -89 34 32 -148 85 122 -86 -73 112 41 -89 78 36 -74
8191g4
$$ Imaginary data points
##PAGE= N=2
##DATA TABLE= (X++(I..I)), XYDATA
0@%%%%%%%%%%%JrJ6j6J6k4L2m0M9n7O6p6R2j12J35j55J79k08K39k75L15l59M09
34B18m60N17n82O55p37Q23r17J019j134J260j392J538j700J878k072K282k514
51a318K768l049L362l707M095m536N037n611O277p063Q006r163J0624j2530J5132
66H324j8924K5024l6800R5102l03066M7914M60040k71100j73349K61465m7868
77D6762j83450K42776m2036k69726K60894J96958m34825k5819M45064j28139l22442
88b13983K29762R6226k16186J15904J07990k52187P8982K57766k63453j60760
98b19939L83860R766l79438J18145K62650j80886p8579J55664r1371n6324J85466
109A09014q7455j72711K20584P7382k93514M4424K74410j35420j73567J63114
$$ plain form
0 0 0 0 0 0 0 0 0 0 0 0 0 1 -8 8 -8 8 -16 16 -24 25 -32 34 -42 50 -62 73 -82 97 -111 128 -147 168 -191 218
34 218 -242 275 -307 348 -389 434 -483 536 -598 662 -730 808 -892 986 -1086 1196 -1318
51 -1318 1450 -1599 1763 -1944 2151 -2385 2652 -2959 3318 -3745 4261 -4902 5722 -6808 8324
66 8324 -10600 14424 -22376 72726 -230340 -182426 277614 6514 -166835 94630 46762
77 46762 -136688 106088 64052 -205674 55220 252178 -182647 -208466 236598 108459 -213983
88 -213983 15779 112005 -104181 11723 119713 -132474 -53492 204274 -59179 -219939
98 -219939 163921 173687 -205751 -87606 175044 -5842 -84421 71243 -20128 -76452 109014
109 109014 21559 -151152 69432 146814 -146700 -102276 172134 36714 -136853 26261
119B6261K9859j23745R7911L3358j59621P7337J37399j69677n5563K13864l6563
130G0820j96124R7295J25137j05644k7227O5166n6877O179R2080q1307o8083J35944
142E7359N303j56594O0016J38777r8716q8458R6186K0853n7383L6451l57n9984
154d6547N4337M3349q9265n66J00238m3744q6654O7878N2191n8541p684K0607
166E599k7478K8944L8515o9564k1386R1013j4299r1538N0480P2485o8589l9936
178d5754N6571M404k0286J9348k2840k3430N4533O897o6129K1962N7202m9006
190f528l1716N7514Nl8710K5857J205l6080L8459K9320o4480p337O9192k1496
203A5205n2747M4100K2726m7285O976K7236k4798N945K5625l7842j1845N4957
$$ plain form
119 26261 56120 -67625 30286 63644 -95977 -18640 118759 -50918 -106481 107383 70820
130 70820 -125304 -28009 97128 -8516 -35743 29423 -27454 -21275 70805 -10502 -78585 57359
142 57359 62662 -93932 -33916 104861 6145 -82313 13873 34726 -22657 13794 13437 -46547
154 -46547 7790 51139 -38126 -38692 61546 17802 -68852 -974 51217 -7324 -15008 5599
166 5599 -21879 7065 45580 -23984 -45370 45643 31344 -60194 -9714 62771 -5818 -45754
178 -45754 10817 15221 -5065 14283 -8557 -31987 22546 29443 -36686 -14724 42478 -6528
190 -6528 -38244 19270 19275 -19435 6422 7627 -28453 10006 39326 -25154 -32491 36701 15205
203 15205 -37542 6558 29284 -18001 -11025 16211 -8587 -2642 22983 -14859 -26704 28253
215B8253j2160n1154L7049K7470n1148N131M5711l1470k2113M2497r067l6259
227b7260L6160J7636m8286P222M0802k7885j7189L5165j0137k5859K8268M971
239A3608l1405J8266K0523l5816j003L9834k0511k8400L4216O620l5190J4415
251d843K4438k6134p935K6643q095j7413J8831L135j9655J0537J0619j6409K741
264c540J3867j3197n539J7430m299j5463J3106P908j8068K064J6211j0086r774
277i380J2467K373j0677K447P255m879l304M674k90j807J865j872l4L628k599
292a33k476M305J132m785J20N409j852n021L502L301l955j941L280J685l539j731
308b699M260N10m482N93L545q35l386J022L695j961l211K973K167k557j805K603
$$ plain form
215 28253 16093 -35061 1988 29458 -21690 -16559 29152 -2318 -24431 18066 8999 -27260
227 -27260 8900 26536 -21750 -14528 26274 -1611 -18800 16365 6228 -19631 8637 13608
239 13608 -17797 469 20992 -14824 -15827 24007 3496 -24904 9312 15932 -19258 -4843
251 -4843 19595 -6539 -14474 12169 4074 -13339 5492 8627 -11028 -491 10128 -6281 -3540
264 -3540 10327 -2870 -8409 9021 4722 -10741 2365 10273 -7795 -5731 10480 394 -9380
277 -9380 3087 5460 -5217 -2770 4485 -394 -3698 976 686 -1121 744 -1128 -1162 2466 -133
292 -133 -2609 1696 2828 -1957 -1837 3572 1720 -3301 201 3502 -453 -2394 886 2571 -968 -2699
308 -2699 1561 2071 -2411 -1818 1727 892 -2494 -1472 2223 262 -2949 24 2191 -366 -2171 432
324D32K239l556j308M290k68l513J191K550j184k090J157J548j276p87J81P03
340C09J144k749r89M742j328n309L781M488n783k936P689J4q305M441O003p256
356b044j340P092k833m036N062M62n417L555L278o505J613N955p082j339R182
371E603n348p022J0566J722j3452M805J2910j1484p824J4754m42j2181P797M661
385E065r965M162O617j0662Q38J3646r903j0660J6818K040j6711Q541Q509j5259
399f924M168J4321j6081o151K3013p117k2737K0199J3809k6297J31K0715j2570
412a521n234J6776j3008j0428K6497m668k9829K3696K1331l7800l183L8329j6173
425D785k2447K7674l542k5389K8540R573m2419J5065L9165l9825j9554N2678q335
$$ plain form
324 432 2671 -885 -2193 2097 1829 -1684 -493 2057 873 -1217 -60 1488 212 -575 -394 309
340 309 1453 -1296 -2285 2457 1129 -4180 -399 4089 -1694 -4630 3059 3073 -5232 -791 5212 -2044
356 -2044 -3384 3708 875 -3161 1901 2363 -3054 501 3779 -2726 -1113 4842 -2240 -3579 5603
371 5603 255 -6767 3799 5521 -7931 -3126 9784 -1700 -9524 5230 4788 -7393 404 5065
385 5065 -4900 -738 5879 -4783 -3945 9701 -202 -10862 5956 7996 -8715 -174 8335 -6924
399 -6924 -2756 11565 -4516 -10667 12346 5229 -17508 2691 16500 -9797 -9666 11049 -1521
412 -1521 -6755 10021 -2987 -13415 13082 8414 -21415 2281 23612 -14188 -17371 20958 4785
425 4785 -17662 10012 6470 -18919 9621 19194 -23225 -8160 31005 -8820 -28374 24304 15969
438A5969m5150L0858J7876l7440J7885K4533m7489L937N8134l9109m3788O7562
450B3778R844p5443K8418N6626n2471j6590N1758k9246k5474O2559j7070o8592
462e1903O1328M2936q9866L054Q9725m7564n9242O8783Q717n7245M3379J6514
474B8616p6983L8669P6930q8340m1945J13239j1631j04174N7910O4853p5096q322
486b6274N5190m5981m627P8115n6931p4323J06199L6216j25232J8358J08513o3140
498F083o3453P7032M108n2073N0481l854q1485O8661P6669j17130l9186J32224
510E8077j3679j11598N7672O3971p1378m459M5814m8474J1061P7804p5601p3664
522h4454J22066L9510j34661J0151J12089n3333o3689O8805N111m5988M5818q105
$$ plain form
438 15969 -29181 1677 19553 -17887 -2 24531 -22958 -19021 39113 4 -43784 23778
450 23778 33622 -41821 -13403 43223 -9248 -25838 25920 -3326 -28800 33759 16689 -51903
462 -51903 9425 52361 -37505 -34451 55274 7710 -51532 17251 25968 -31277 12102 28616
474 28616 -48367 -9698 67232 -21108 -63053 50186 38555 -65619 -7709 57144 -17952 -26274
486 -26274 28916 -17065 -21692 56423 -508 -74831 31368 67584 -57648 -39290 69223 6083
498 6083 -57370 19662 23770 -28303 22178 18324 -63161 5500 82169 -34961 -74147 58077
510 58077 44398 -67200 -9528 54443 -16935 -21394 24420 -24054 -12993 64811 -10790 -84454
522 -84454 37612 77122 -57539 -47388 64701 11368 -52321 16484 21595 -24393 21425 13320
534A3320p4269P0506P2598j16560m3179J29927k771j08417M5659O1018o3985m383
546b0536M5354m3305M710O9364o5368o7464J12088L9486j26924N175J05492m7375
558A0697n7426O6017J724m8637M2425k7o3509O0371N7443j07569k7750J21610
570E5369j4936r7432N1861M7168o4414O585M3169m4166O273N5979o5128m1593
582f1265J08555Q795j16775K9173Q7296n5303l5928N6881j3074k9705M0886j8555
594I81m0979P0026J8194j02783J4903J00855m2976o6259N3377J7046m1160K3279
606D504Q291l8902L5716K6659p5117L472R2970l4128p9920M9881M2606m3641Q88
619f721J8417k9524J7533L1615n3511q128P6713k6191p7257N1253N3838n3606
$$ plain form
534 13320 -60949 9557 82155 -34405 -77584 52343 49572 -58845 -13186 47832 -16153 -20536
546 -20536 24818 -18487 -13777 55587 -9781 -77245 34843 74329 -52595 -47420 58072 10697
558 10697 -46729 19288 21012 -27625 14800 14773 -48736 11635 69078 -38491 -66241 55369
570 55369 40433 -56999 -5138 42030 -22384 -15799 27370 -16796 -10523 45456 -19672 -61265
582 -61265 47290 56085 -60690 -31517 55779 476 -35452 21429 8355 -21350 19536 981
594 981 -39998 30028 48222 -54561 -39658 61197 18221 -48038 5339 22385 -18775 4504
606 4504 12795 -26107 9609 36268 -38849 -35377 57593 23465 -56455 -6574 36032 -7609 -6721
619 -6721 11696 -17828 -295 31320 -22191 -30319 46394 20203 -57054 -5801 48037 -5569
631e569j6726L2444j7663K203L3355l7710k3506O2490o495o8743L9272N4522n5453
644g579k6029M6359n318j6600K7416k0099l0553M9767J2875o2049J7547N4558
656D0295m4181l2229N2154M799l7114J7889O303k9026K6649K4008m8789m242N1764
669B8280k1837l7313M1113J3716m3677Q953K7976k3687n25K7076k6796j7972M2790
682A8097l36m1308K0818K5682l3927n117L4519j2175k1726K1344L71k0938K0332
695E636J1679l1619K688K8988j6707j6575K5311J117k5768J1237J7225j7303k401
708f492J6312j2623r170K1170l96k0458R563J3128j6030k714J8043o552j3692
721i911J1632M056j1416O618O968j3745r41J5058n632j1271J1250L776j3986L969
$$ plain form
631 -5569 -22295 10149 -7514 -5311 28044 -9666 -33172 29318 22823 -45920 -6648 47874 -7579
644 -7579 -33608 12751 7433 -9167 18249 -1850 -32403 17364 30239 -31810 -14263 40295
656 40295 -3886 -36115 16039 20838 -16276 1613 7916 -21110 5539 29547 -19242 -23484 28280
669 28280 6443 -30870 10243 23959 -19718 -10765 17211 -6476 -7001 20075 -6721 -24693 18097
682 18097 17761 -23547 -2729 22953 -10974 -16091 18428 6253 -15473 5871 6242 -14696 5636
695 5636 17315 -14304 -11616 17372 665 -15910 9401 10518 -15250 -4013 13212 -4091 -6492
708 -6492 9820 -2803 -11973 9197 8801 -11657 -2094 11034 -4996 -7710 10333 3781 -9911
721 -9911 1721 5777 -5639 979 7947 -5798 -6739 8319 2687 -8584 2666 6442 -7544 -3575
735c575J1816r033n270R691k516p041Q578L021j1069K189R345p001l721R357k482
750B289p872O494L624p309J666N595o151k532Q403j747p110N279K759o577J598
765a591N273m323k722M824l69l817L253J652m570J188L576k940p14L072j446k148
781a802K754Q61k906P30K255k291o86K725j057j732J455L03j209K43R49q46o72
798i26J171k82q38R85j47p26Q40M8n58L30M71l04n30Q00M23j194M97Q37r05j15
818a23O51j18m69L6N45n36k71O23o17r6P49q61o0Q22n60m37P18K25p62P7J030
839E66p83l63J293o29n98J238l65p34Q89k2o62M65K59r52M33J142j952l03K742
858A664j641k182L060K25k976J457J702k513J71K855k761j318M804j800m548N130
$$ plain form
735 -3575 8241 -792 -6062 3629 1113 -5928 2650 5671 -5398 -3209 6136 -865 -4586 4771 2289
750 2289 -5583 911 4535 -2774 -1108 4487 -1664 -4196 4207 2460 -4650 629 3388 -3189 -1591
765 -1591 3682 -641 -3363 1461 1092 -2725 528 2180 -2390 -1202 2374 -566 -1280 1792 346 -1802
781 -1802 952 1813 -1093 -363 1892 -399 -1085 1640 583 -1149 306 609 -600 -357 592 -254 -926
798 -926 245 -37 -875 110 -37 -763 77 125 -433 -103 368 64 -466 334 757 -437 60 897 -8 -123
818 -123 528 410 -59 -23 522 -14 -285 338 -279 -375 374 -487 -547 275 -285 -722 -4 221 -541 -464 566
839 566 -217 -580 713 84 -514 724 359 -375 514 492 -170 295 554 -398 35 1177 -775 -1078 1664
858 1664 23 -2159 901 1126 -1850 -393 1309 -1204 -1033 1822 -939 -2257 2547 747 -3801 1329
874A329K059o424J722N185m701j933O249k548n087O911Q93r113N055P300j0086
889c189k465J1507l498r075Q089L169j0003M534P182j1202L69J3549r667j0018
903a0718J6872K596j8878O280J4951j3249n391J5361o755j0071J6371j237j9362
916a3230J4602J4487k4931m151K8161q297k2462J7838Q450k0043Q622J2335k1964
929a0583L047K6029k0645k0018L4626O447l9323J0111L1584k2383j2687K4672
941A0877r976j4681K7700m435l3964K6744K6802m4498r207N0153j1924l9719K6956
954H28J5436k8910J3158J6053l5348P323M2936l4181l3143N4586J0215n9371J5635
967a4783M4970l2371j5512L2795j7781j6150M2576j1634m9344M1535L5532o1972
$$ plain form
874 1329 3388 -3036 -1314 3871 -830 -2763 3486 938 -4149 2762 3655 -5458 -403 6897 -3189
889 -3189 -5654 5853 2355 -6720 1369 4538 -5465 -931 6251 -4951 -4582 8967 -700 -10718
903 -10718 6154 8750 -10128 -3848 11103 -2146 -7537 7824 1069 -9002 7369 6132 -13230
916 -13230 1372 15859 -9072 -13223 14938 6641 -15821 2017 10467 -9576 -954 11381 -10583
929 -10583 -7536 18493 -2152 -22170 12456 18903 -20420 -10309 21275 -1108 -13795 10877
941 10877 901 -13780 13920 9485 -24479 2265 29067 -15431 -24638 25515 13591 -26128 828
954 828 16264 -12646 512 16565 -18783 -11460 31476 -2705 -35848 18738 28953 -30418 -14783
967 -14783 30187 -2184 -17696 15099 -2682 -18832 23744 12110 -37234 4301 39833 -22139
979b2139p709O4004k1013m5615L7084J2952l4119K1854J3190m6134J7919N0025
991D0299m7932l2498O5346K233o3326K5809M2518l8662j0082L1362k2322p063
1003a4318M3068k4594m3413N1590K4098o3811M982N7540k9102l6036L7060O715
1015A3779k5353K0193j334l5074L1512L1923n3277j3000N8810j1494m8788K9253
1027b850K8191l0952m658J5268j4267J1641K2360l7783j6870N2513J925n2012
1039b7494J5040L9604k4739k2061K1276N410m158N375j9940q243M0245L527m8730
1052b4888N199M4087j3728l1417J6792J7076j0431o107n576J163K5381j321m0243
1065b4013M443M4471q149l7587J0881K4534r882j1455K339L697J1743k607k7895
$$ plain form
979 -22139 -29848 34156 13143 -32472 4612 17564 -16555 5299 18489 -27645 -9726 40299
991 40299 -7633 -40131 25215 27448 -35878 -10069 32449 -6213 -16295 15067 -7255 -14318
1003 -14318 28750 4156 -39257 12333 36431 -27380 -22398 35142 6040 -29996 7064 13779
1015 13779 -11574 8619 7285 -27789 3723 35646 -17631 -30631 28179 16685 -32103 -2850
1027 -2850 25341 -5611 -10269 4999 -9268 2373 24733 -13050 -29920 22593 24518 -27494
1039 -27494 -12454 27150 2411 -19650 1626 7036 2878 8253 -11687 -19930 20315 23842 -24888
1052 -24888 -19689 24398 10670 -20747 -3955 13121 2690 -3417 -8993 -7830 17551 16230 -24013
1065 -24013 -19570 24901 16752 -20835 -9954 14580 4698 -6757 -4418 -721 11022 8415 -19480
1078a9480N511L9184q840m0916J0569L2423j0412j8138O846M755J576J654j4395
1091i663k79K8305n428l7819J0962L8497j3646k8865J2933J2867p845J981j550
1104D50q643J4320N717k7451L103L6306j2577l6238J8525K4968j8641o671J1971
1117E139r960j80J7032j4323j2208K7885r78l6124J5849L4136k5550k0200K5557
1130F075L6j6058J7499M81k3706J6556J6063l0335J802L6311k1230l0875L2734
1143E353J4429l1112O411J7744k2593J300K6411j9711j5760L1929m827l4177K5530
1156I27K4953l5925p515L1634j1377j5402K3916m927k4592K2347J2237l1063Q068
1169f719K8853k6348j7244L3606J055k6870J3522J0211k1461Q761J9161k2717
$$ plain form
1078 -19480 -13969 25215 16375 -24541 -13972 18451 8039 -10099 -3253 1502 3078 4732 -9663
1091 -9663 -9942 18363 12935 -24884 -13922 24575 10929 -17936 -5003 7864 19 2000 450
1104 450 -8193 6127 11844 -15607 -12504 23802 11225 -25013 -6488 18480 -161 -6832 5139
1117 5139 -4821 -5001 12031 -2292 -14500 13385 12407 -23717 -7868 26268 718 -19482 6075
1130 6075 6111 -9947 7552 8033 -15673 883 16946 -13389 -11587 24724 3494 -27381 5353
1143 5353 19782 -11330 -4919 12825 -9768 -8468 17943 -1768 -17528 14401 9574 -24603 927
1156 927 25880 -10045 -17560 14074 2697 -12705 11211 6284 -18308 4039 16276 -14787 -6719
1169 -6719 22134 -4214 -21458 12148 13203 -13667 -145 10066 -11395 -2634 16527 -6190
1181f190o981K6972j0162k1183K3711Q993k7162L909J9450j3426m448J6721j0882
1194f78j2410K0278J992k0315J0131J2811j8135k386J8550o264j1496J0796K52
1207C126j0599J0107N923j4887J212J2462p869n624J1059j361j0146N793N317
1220D513o918J532N113o999j603Q586j946n899M227J509m863K099M085l615j914
1235b093L334j197j522L500m16l762J314K106j316j83J165j190j213J594P91j098
1251a86J46p2o81N34P94k9n87n31L60M23n1L56k14p99K19Q32K1p08L17J52j078
1272g82P92J116j335l15R62n83m17J155j11j395N26J033j120k6J414j242p36J649
1290E85k21j070R06L11j151L45J314r97p36J559m39j293J352K59j318M99O01o65
$$ plain form
1181 -6190 -13171 13801 3639 -17544 6167 15160 -12002 -8093 11357 -2069 -6517 10204 -678
1194 -678 -13088 7190 9182 -11133 -1002 11809 -6326 -8712 9838 3574 -7922 2874 3126
1207 3126 -7473 2634 8557 -6330 -5118 7344 -525 -6149 4910 3549 -6597 -804 4513
1220 4513 -2405 -873 4240 -2759 -4362 4224 2278 -3621 606 2115 -2748 -649 3436 -179 -2093
1235 -2093 1241 44 -1478 2022 1606 -2156 -842 1264 -52 -235 930 -260 -1473 121 912 -186
1251 -186 -40 -112 -793 -259 535 506 -81 -612 -252 171 120 476 262 -537 -318 514 535 -173 144 296 -782
1272 -782 10 1126 -209 -524 438 -145 -562 593 482 -913 -387 646 -474 -500 914 -328 -1064 585
1290 585 364 -706 200 511 -640 -295 1019 22 -714 845 406 -887 465 724 -594 -95 506 -159
1308a59k06Q04l21q58R01K46r96N01L68o83J50L90k00n9J03N0o9J10K9j85K88
1329B04j58k32O75l60n68R85k54q80R53K28j280L73J386j303j003K183k80k375
1347a706J901J185k840P32K394k307j033L430r75l546L498K097n291Q73N061l786
1363c13k630N393j000m735M428K109o797K146O832o891l678R423j343q696N966
1378B14M655q385J203P428p127k866J0827m124j0310J0814N528j4145J637J2750
1392H099q180o709J1451j767r949J0117L413j4932O103J4049j4908p537J8915
1405H165j677j6782J0018Q765j4164K449J1975j3037l498J8637q337j7039J8677
1418D152R031k3035J838K0127j1608j0369J6386l124j3203J5101L170k0974J0103
$$ plain form
1308 -159 -365 439 118 -740 161 407 -589 -88 280 -403 -253 137 -63 -122 -19 31 -38 72 101 -84 204
1329 204 46 -186 489 129 -439 546 292 -588 365 593 -687 -314 1072 -231 -1234 949 669 -1706
1347 -1706 195 1380 -1460 -728 1666 -641 -1674 1756 781 -2765 733 2830 -2461 -1588 3473 -313
1363 -313 -2943 2450 1450 -3285 1143 3252 -3545 -1399 5433 -1458 -5136 4287 2944 -5752 214
1378 214 4869 -3516 -2313 5115 -2012 -4878 5949 1825 -8485 2329 7857 -6288 -4651 8099
1392 8099 -81 -6790 4661 2894 -7055 3062 6475 -8457 -2354 11695 -3213 -10750 8165
1405 8165 6488 -10294 -276 8489 -5675 -3226 8749 -4288 -7786 10851 2514 -14525 4152
1418 4152 13183 -9852 -8014 12113 505 -9864 6522 3398 -9805 5296 8466 -12508 -2405
1431b405J8702k1278r885K6165k058k2736J2525J1761j7303K828J3699j5501k944
1444h430K1385j0918j9127K2779J0283k8555K038K5334j2630j3949J7205j210
1456D205j3278J4283K305k0455J1948J8394k4642r377L0913k822k7645J2854J5741
1469A2424j6323q3J1303j3016J46J9191j4816j6701K7507P097l3068M760K8623
1482A7044j3069j5871J4151Q2p259J2617n234j7672J9626J3801l0697l379L3771
1495A7911p430k7426J3139J3846j0768J456J162j2662J2274J5480k5370r392L3067
1508A5287j577l2402J0731K3229j2689r120O088m716O693J2937k0642j2268L1069
1521A2620L384l3447P924K7310j4376j5029J1766J014j87R550j5687j2831K9360
$$ plain form
1431 -2405 16297 -4981 -14866 11299 9241 -13495 -970 10791 -6512 -3684 10015 -5486 -8430
1444 -8430 12955 2037 -17090 5689 15972 -12583 -10545 14789 2159 -11790 5415 4205
1456 4205 -9073 5210 7515 -12940 -992 17402 -7240 -16617 14296 11474 -16171 -3317 12424
1469 12424 -3899 -3982 7321 -5695 -5549 13642 -1174 -17875 9632 16729 -16339 -11579 17044
1482 17044 3975 -11896 2255 2337 -4922 7695 2461 -15211 4415 18216 -12481 -15860 17911
1495 17911 10481 -16945 -3806 10040 -728 728 1890 -10772 1502 16982 -8388 -17780 15287
1508 15287 13710 -18692 -7961 15268 2579 -6541 -453 -5169 1524 14461 -6181 -18449 12620
1521 12620 16004 -17443 -9519 17791 3415 -11614 152 1166 979 10529 -5158 -17989 11371
1534A1371P137l5238M465L0745j5048j8677J7812L996j0069Q003o106j3281K3992
1547I102J0168l5836M05L6169j3021k5375K1261R022j9631N877P607j4278J1375
1560B845J3632k9351m835L8218q407l4012K0179J8966k4948q39J9651j2865m914
1573f680J7234j4701j1664L1398j051l7334J4936L0159k4455j3445K5832m549
1585E680j7918J6497K273j7622J6399Q489l0598N827L4423j8970k6206K5721J0032
1598A4027k4303O487J5032j6421k28J5525j5606n567K7069q064k9858J9065K2829
1611A9987k3514r210K0971n032j2334J3656Q3j3081J2768M627k2125O680K5317
1624A8793j5847k0684J9562J0009j7617K495J0666j1257p61J2235r638o176J7936
$$ plain form
1534 11371 18508 -16730 -12265 18480 3432 -15245 2567 6563 -3506 4497 -1609 -14890 9102
1547 9102 19270 -16566 -16161 20008 6987 -18388 2873 11895 -7736 -1859 5748 -8530 2845
1560 2845 16477 -12874 -17709 20509 12102 -21910 -1731 17235 -7713 -8552 11099 -1766 -6680
1573 -6680 10554 -4147 -15811 15587 14536 -22798 -7862 22297 -2158 -15603 10229 5680
1585 5680 -12238 4259 6532 -11090 5309 13798 -16800 -10973 23450 4480 -21726 3995 14027
1598 14027 -10276 -3789 11243 -5178 -5406 10119 -5487 -11054 16015 7951 -21907 -2842 19987
1611 19987 -3527 -12737 8234 3202 -9132 4524 4607 -8474 4294 8921 -13204 -6524 18793
1624 18793 2946 -17738 1824 11833 -5784 -3289 7377 -3880 -4641 7594 -2044 -8220 9716
1637I716l403k1761J1936J9186j6366j0335J5407j337r525J0286J178j2741P766
1650GQ273j5166P37J8833r585j6809J4710R050j4270J529Q905j0227j157J3158
1664G988o889r324J3183O10j5993Q559J3624j3970o333J3322k974p840J0505K78
1678D746j2878P044Q798j1836j28J2852q621r354J3157K590j1586M883N520j0097
1692d910J822J0826p965o113J0469j926r046R016M498j1682J181Q901o139k554
1706c622Q570m076p315Q266K556q438L822N152q417k98Q908l707n449O112j78
1721A886o191N233L764p425M22N802m568j856O589k203n717M471K467m872J803
1736c95L450n028p93N466j907l263L912k43m056K945K769l703n29L067k089j154
$$ plain form
1637 9716 6313 -15448 -3512 15674 -692 -11027 4380 3043 -6482 3804 4982 -7759 7
1650 7 8280 -6886 -6149 12684 3099 -13710 1000 10050 -4220 -2691 6214 -4013 -5170 7988
1664 7988 1099 -8225 4958 5568 -10425 -1866 11758 -2212 -8545 4777 1803 -6037 4468 4746
1678 4746 -8132 -1088 7710 -4126 -4254 8598 -23 -9377 3780 6370 -5216 -333 5187 -4910
1692 -4910 -3088 7738 -227 -6340 4129 2203 -6843 2173 6671 -5011 -3830 5071 -1068 -3622
1706 -3622 4948 872 -6443 1823 4379 -4059 -237 4915 -3502 -3800 5108 1401 -4048 2064 1886
1721 1886 -4305 928 4692 -2733 -2311 3491 -1077 -2933 3656 1453 -4264 207 2674 -2198 -395
1736 -395 3055 -1973 -2766 2700 793 -2470 1442 1199 -2857 88 2857 -846 -1375 1692 -397 -1551
$$ [...]
8191e2
##END NTUPLES=NMR FID
##END=
