##TITLE=1H_UR2810TFA
 aceton-d6
 8 sc, 
 8.11.2021
##JCAMPDX= 6.0         $$ Bruker NMR JCAMP-DX V2.0
##DATA TYPE= NMR FID
##DATA CLASS= NTUPLES
##ORIGIN= UXNMR, Bruker Analytische Messtechnik GmbH
##OWNER= root
$$ XWIN-NMR		Version 3.5
$$ Mon Nov  8 13:51:46 2021 Russian Standard Time (UT+4h)  she@DPX200
##.OBSERVE FREQUENCY= 200.1313468511
##.OBSERVE NUCLEUS= ^1H
##.DELAY= (6, 6)
##.ACQUISITION MODE= SIMULTANEOUS
##.ACQUISITION SCHEME= undefined
##.AVERAGES= 8
##.DIGITISER RES= 18
##SPECTROMETER/DATA SYSTEM= spect
##.PULSE SEQUENCE= zg30
##.SOLVENT NAME= D2O
##.SHIFT REFERENCE= (INTERNAL, D2O, 0, 15.7039)
##AUDIT TRAIL= $$ (NUMBER, WHEN, WHO, WHERE, WHAT)
$$ ##TITLE= Audit trail, XWIN-NMR		Version 3.5
$$ ##JCAMPDX= 5.01
$$ ##ORIGIN= Bruker BioSpin GmbH
$$ ##OWNER= she
$$ F:/spectra/data/she/nmr/H-F/1/audita.txt
$$ ##AUDIT TRAIL=  $$ (NUMBER, WHEN, WHO, WHERE, WHAT)
(   1,<2021-11-08 13:49:59.85 +0400>,<she>,<DPX200>,
      <created by zg, POWCHK disabled, PULCHK disabled
       configuration hash MD5:
       00 E9 B6 7A A2 85 ED C7 34 08 36 98 17 FE 4E 26
       data hash MD5: 16K
       32 F2 31 35 82 87 71 1A 23 BA 53 82 18 1E AC 22>)
$$ ##END=
$$ 
$$ hash MD5
$$ EA 60 DC 7E C1 14 25 18 80 D6 9B 14 70 B9 D0 3E
##$RELAX= 
##$RELAX= 
##$RELAX= 
##$RELAX= 
##$RELAX= 
##$RELAX= 
$$ Bruker specific parameters
$$ --------------------------
##$DU= <F:/spectra>
##$EXPNO= 1
##$NAME= <H-F>
##$PROCNO= 1
##$TYPE= <nmr>
##$USER= <she>
##$AMP= (0..31)
100 100 100 100 100 100 100 100 100 100 100 100 100 100 100 100 100 100 
100 100 100 100 100 100 100 100 100 100 100 100 100 100 
##$AQSEQ= 0
##$AQ_mod= 1
##$AUNM= <au_zg>
##$AUTOPOS= <>
##$BF1= 200.13
##$BF2= 200.13
##$BF3= 200.13
##$BF4= 200.13
##$BF5= 200.13
##$BF6= 200.13
##$BF7= 200.13
##$BF8= 200.13
##$BYTORDA= 1
##$CFDGTYP= 0
##$CFRGTYP= 5
##$CHEMSTR= <none>
##$CNST= (0..31)
1 1 145 1 1 1 1 1 1 1 1 1 1 1 1 1 1 1 1 1 1 1 1 1 1 1 1 1 1 1 1 1 
##$CPDPRG= <>
##$CPDPRG1= <>
##$CPDPRG2= <>
##$CPDPRG3= <>
##$CPDPRG4= <mlev>
##$CPDPRG5= <mlev>
##$CPDPRG6= <mlev>
##$CPDPRG7= <mlev>
##$CPDPRG8= <mlev>
##$CPDPRGB= <>
##$CPDPRGT= <>
##$D= (0..31)
0 1.2 0 0 0 0 0 0 0 0.06 0 0.03 0 0 0 0 0.0002 0 0 0 0 0 0 0 0 0 0 0 0 
0 0 0 
##$DATE= 1636364999
##$DBL= (0..7)
120 120 120 120 120 120 120 120 
##$DBP= (0..7)
150 150 150 150 150 150 150 150 
##$DBP07= 0
##$DBPNAM0= <>
##$DBPNAM1= <>
##$DBPNAM2= <>
##$DBPNAM3= <>
##$DBPNAM4= <>
##$DBPNAM5= <>
##$DBPNAM6= <>
##$DBPNAM7= <>
##$DBPOAL= (0..7)
0.5 0.5 0.5 0.5 0.5 0.5 0.5 0.5 
##$DBPOFFS= (0..7)
0 0 0 0 0 0 0 0 
##$DE= 6
##$DECBNUC= <off>
##$DECIM= 32
##$DECNUC= <off>
##$DECSTAT= 4
##$DIGMOD= 1
##$DIGTYP= 9
##$DL= (0..7)
0 120 120 120 120 120 120 120 
##$DP= (0..7)
150 150 150 150 150 150 150 150 
##$DP07= 0
##$DPNAME0= <>
##$DPNAME1= <>
##$DPNAME2= <>
##$DPNAME3= <>
##$DPNAME4= <>
##$DPNAME5= <>
##$DPNAME6= <>
##$DPNAME7= <>
##$DPOAL= (0..7)
0.5 0.5 0.5 0.5 0.5 0.5 0.5 0.5 
##$DPOFFS= (0..7)
0 0 0 0 0 0 0 0 
##$DQDMODE= 0
##$DR= 18
##$DS= 0
##$DSLIST= <SSSSSSSSSSSSSSS>
$$ [...]
##$SUBNAM2= <"">
##$SUBNAM3= <"">
##$SUBNAM4= <"">
##$SUBNAM5= <"">
##$SUBNAM6= <"">
##$SUBNAM7= <"">
##$SUBNAM8= <"">
##$SUBNAM9= <"">
##$SW= 18.0517286264689
##$SWIBOX= (0..15)
0 0 2 0 0 0 0 0 0 0 0 0 0 0 0 0 
##$SW_h= 3612.71676300578
##$TD= 16384
##$TD0= 1
##$TE= 0
##$TE2= 300
##$TE3= 300
##$TEG= 300
##$TL= (0..7)
0 120 120 120 120 120 120 120 
##$TP= (0..7)
150 150 150 150 150 150 150 150 
##$TP07= 0
##$TPNAME0= <>
##$TPNAME1= <>
##$TPNAME2= <>
##$TPNAME3= <>
##$TPNAME4= <>
##$TPNAME5= <>
##$TPNAME6= <>
##$TPNAME7= <>
##$TPOAL= (0..7)
0.5 0.5 0.5 0.5 0.5 0.5 0.5 0.5 
##$TPOFFS= (0..7)
0 0 0 0 0 0 0 0 
##$TUNHIN= 0
##$TUNHOUT= 0
##$TUNXOUT= 0
##$USERA1= <user>
##$USERA2= <user>
##$USERA3= <user>
##$USERA4= <user>
##$USERA5= <user>
##$V9= 5
##$VALIST= <valist>
##$VCLIST= <CCCCCCCCCCCCCCC>
##$VD= 0
##$VDLIST= <DDDDDDDDDDDDDDD>
##$VPLIST= <PPPPPPPPPPPPPPP>
##$VTLIST= <TTTTTTTTTTTTTTT>
##$WBST= 1024
##$WBSW= 4
##$XGAIN= (0..3)
0 0 0 0 
##$XL= 0
##$YL= 0
##$YMAX_a= 344627
##$YMIN_a= -385537
##$ZGOPTNS= <>
##$ZL1= 120
##$ZL2= 120
##$ZL3= 120
##$ZL4= 120
##$ABSF1= 10
##$ABSF2= 0
##$ABSG= 5
##$ABSL= 3
##$ALPHA= 0
##$AQORDER= 0
##$ASSFAC= 0
##$ASSFACI= 0
##$ASSFACX= 0
##$ASSWID= 0
##$AUNMP= <proc_1d>
##$AZFE= 0.1
##$AZFW= 0.1
##$BCFW= 1
##$BC_mod= 2
##$BYTORDP= 1
##$COROFFS= 0
##$CY= 11.3945322036743
##$DATMOD= 1
##$DC= 2
##$DFILT= <>
##$DTYPP= 0
##$F1P= 2.36226072786647
##$F2P= -0.459571619588291
##$FCOR= 0.5
##$FTSIZE= 0
##$FT_mod= 4
##$GAMMA= 1
##$GB= 0.15
##$INTBC= 1
##$INTSCL= 1
##$ISEN= 128
##$LB= 0.24
##$LEV0= 0
##$LPBIN= 0
##$MAXI= 10000
##$MC2= 0
##$MEAN= 0
##$ME_mod= 0
##$MI= 1.114404
##$NCOEF= 0
##$NC_proc= 0
##$NLEV= 6
##$NOISF1= 3.799351
##$NOISF2= 2.8
##$NSP= 1
##$NTH_PI= 0
##$NZP= 0
##$OFFSET= 15.70392
##$PC= 1
##$PHC0= -15310.94
##$PHC1= 9.00082
##$PH_mod= 1
##$PKNL= yes
##$PPARMOD= 0
##$PSCAL= 0
##$PSIGN= 0
##$REVERSE= no
##$SF= 200.130013532006
##$SI= 16384
##$SIGF1= 3
##$SIGF2= 2
##$SINO= 400
##$SIOLD= 16384
##$SREGLST= <1H.CDCl3>
##$SSB= 0
##$STSI= 0
##$STSR= 0
##$SW_p= 3612.71676300578
##$SYMM= 0
##$S_DEV= 0
##$TDeff= 0
##$TDoff= 0
##$TI= <>
##$TILT= no
##$TM1= 0
##$TM2= 0
##$TOPLEV= 0
##$USERP1= <user>
##$USERP2= <user>
##$USERP3= <user>
##$USERP4= <user>
##$USERP5= <user>
##$WDW= 1
##$XDIM= 8192
##$YMAX_p= 0
##$YMIN_p= 0
$$ End of Bruker specific parameters
$$ ---------------------------------
##NTUPLES= NMR FID
##VAR_NAME=  TIME,          FID/REAL,        FID/IMAG
##SYMBOL=    X,             R,               I
##VAR_TYPE=  INDEPENDENT,   DEPENDENT,       DEPENDENT
##VAR_FORM=  AFFN,          ASDF,            ASDF
##VAR_DIM=   8192,          8192,            8192
##UNITS=     SECONDS,       ARBITRARY UNITS, ARBITRARY UNITS
##FACTOR=    0.0002768,     1,               1
##FIRST=     0,             0,               0
##LAST=      2.2672688,     0,               0
##MIN=       0,             -385537,         0
##MAX=       2.2672688,     344627,          0
$$ Real data points
##PAGE= N=1
##DATA TABLE= (X++(R..R)), XYDATA
$$ plain form
0 0 0 0 0 0 0 0 0 0 0 -8 8 -8 8 -16 16 -24 24 -32 40 -48 56 -64 80 -96 112 -128 152 -173 200 -229 261 -297
32 -297 337 -382 433 -487 545 -611 686 -762 847 -943 1046 -1159 1280 -1416 1562 -1723 1898
49 1898 -2090 2302 -2537 2797 -3085 3409 -3776 4191 -4669 5223 -5877 6664 -7625 8840
63 8840 -10423 12584 -15722 20720 -29929 52568 -227449 -190802 309537 234399 147515 -231322
75 -231322 -385537 41072 344627 134901 -44332 -232444 -224671 159678 313941 -21048
85 -21048 -159592 -116680 -71119 168927 206109 -135750 -145802 11174 1046 125166 88036
96 88036 -185332 -67080 113528 18216 24576 -2128 -131584 16101 143583 -13444 -66695
107 -66695 -17252 -56689 61434 147789 -76876 -135146 28361 19775 70290 100786 -132602
$$ packed form
0@%%%%%%%%%qJ6j6J6k4L2m0M8n6P2q8J04j20J44j76K08k40K80l25L73m29M90n58
32b97O34p19Q15r20J032j156J297j448J609j790J989k205K439k696K978l285L621
49A898l988M392m839N334n882O494p185P967q860R892j1100J2541j4289J6465
63H840j9263K3007k8306L6442n0649Q2497k80017L6647N00339p5138q6884l78837
75b31322j54215M26609L03555k09726j79233j88112P773L84349J54263l34989
85b1048j38544M2912M5561K40046L7182l41859j0052J56976j0128J24120l7130
96H8036k73368J18252J80608r5312O360k6704j29456J47685J27482j57027n3251
107f6695M9443l9437J18123Q6355k24665n8270J63507q586N0515L0496k33388
$$ plain form
118 -132602 -125939 79455 50245 59664 46411 -155843 -91990 119396 72697 10176 -11704 -117862
130 -117862 -49639 125433 64791 -36953 -22311 -80266 -30108 135536 36224 -80073 -3246
141 -3246 -37777 -16732 108204 3098 -70887 14333 -22015 -7210 76653 -13760 -57738 26639
153 26639 3325 -24544 36578 5434 -39916 26743 8629 -45108 29746 17534 -35898 39582
165 39582 349 -65770 34127 30086 -23584 28316 -17458 -52355 36558 29010 -13929 12917
177 12917 -20109 -44064 31666 45658 -19014 -12718 -5391 -32718 28466 45293 -30908 -8564
189 -8564 762 -35500 37745 38806 -41309 -6118 5548 -19982 27829 19560 -26089 -4829 1606
202 1606 -9181 17545 17230 -22666 -11124 17647 -9800 -1778 24405 -17178 -10249 18508 -17359
$$ packed form
118a32602O663K05394k9210R419j3253k02254O3853K11386m6699o2521k1880j06158
130a17862O8223J75072o0642j01744J4642n7955N0158J65644r9312j16297P6827
141c246l4531K1045J24936j05106p3985Q5220l6348J4805Q3863r0413m3978Q4377
153B6639k3314k7869O1122l1144m5350O6659j8114n3737P4854j2212n3432P5480
165C9582l9233o6119R9897m041n3670N1900m5774l4897Q8913p548m2939K6846
177A2917l3026k3955P5730J3992o4672O296P327k7327O1184J6827p6201K2344
189h564R326l6262P3245J061q0115L5191J1666k5530M7811q269m5649K1260O435
202A606j0787K6726l15l9896J1542K8771k7447Q022K6183m1583O929K8757l5867
$$ plain form
215 -17359 3629 22102 -22411 1283 15032 -21210 4277 16882 -9884 -1393 1787 -8296
227 -8296 2843 11049 -2521 -7561 5099 -5979 -6552 20918 -1803 -17064 10381 -5438 -3483
240 -3483 18757 -10610 -6564 9889 -11983 4428 13913 -10303 -4888 2546 613 2782 544 292
254 292 -4381 -529 4135 -3571 5817 316 -12326 9702 3516 -10257 8442 -1737 -5754 7995
268 7995 -5312 192 6087 -7919 1891 3987 -3669 842 -1542 2864 982 -5389 4313 -900 -2329
283 -2329 5113 -4585 1627 3124 -7896 5885 2935 -7144 4281 -1569 -1148 5009 -5496 1783
297 1783 2611 -5594 4177 133 -1732 2683 -5314 3373 3352 -6348 3759 -273 -2510 4347 -4057 1743
313 1743 2750 -6758 4423 1956 -4133 3059 -3154 1005 3749 -5981 3547 1656 -5370 4278 -990
$$ packed form
215a7359K0988J8473m4513K3694J3749l6242K5487J2605k6766Q491L180j0083
227h296J1139Q206j3570n040J2660j1078n73K7470k2721j5261K7445j5819J955
240c483K2240k9367M046J6453k1872J6411R485k4216N415P434j933K169k238k52
254B92m673L852M664p706R388n501j2642K2028o186j3773J8699j0179m017J3749
268G995j3307N504N895j4006R810K096p656M511k384M406j882o371R702n213j429
283b329P442r698O212J497j1020J3781k950j0079J1425n850M21O157j0505P279
297A783Q28q205R771m044j865M415p997Q687k1r700J0107m032k237O857q404N800
313A743J007r508J1181k467o089P192o213M159K744r730R528j891p026R648n268
$$ plain form
328 -990 -644 2777 -5589 3569 2562 -5461 3958 -1140 -1940 3919 -4202 2373 2139 -6160 4285 782
344 782 -3158 3661 -3360 456 3102 -4438 3029 431 -3276 3114 -2555 1424 2477 -5686 4021
359 4021 595 -4488 5335 -2919 -1083 4975 -6123 2041 3916 -5843 3056 1033 -2888 2316 -1907
374 -1907 1110 1571 -2785 1944 -1612 326 2852 -4601 3837 836 -7424 6990 419 -5326 6482
389 6482 -4467 -2673 7072 -4597 557 4103 -6128 156 3473 -5 -175 -1181 361 -2625 1446
404 1446 5012 -4961 1210 1549 -8215 7780 4112 -9220 6223 -1635 -7748 10224 -204 -5038
418 -5038 5153 -5101 -2789 7137 699 -2852 -324 -216 -3452 2699 6878 -6108 -1643 3847 -8504
433 -8504 6160 8595 -11674 3067 2718 -10931 9969 5465 -9668 3707 -1839 -5922 8610
$$ packed form
328i90L46L421q366R158j007q023R419n098q00N859q121O575k34q299J0445l503
344G82l940O819p021L816K646p540P467k598l707O390n669L979J053q163R707
359D021l426n083R823q254J836O058j1098Q164J875r759Q899k023l921N204m223
374a907L017M61m356M729l556J938K526p453Q438l001q260J4414o571n745J1808
389F482j0949J794R745j1669N154L546j0231O284L317l478j70j006J542k986M071
404A446L566r973O171L39r764J5995l668j3332J5443p858o113J7972j0428m834
418e038J0191j0254K312R926o438l551K528J08l236O151M179j2986M465N490j2351
433h504J4664K435k0269J4741l49j3649K0900m504j5133J3375n546m083J4532
$$ plain form
446 8610 3363 -5590 -597 110 -4390 3693 9351 -6919 -5274 5751 -7368 3354 13003 -11436
460 -11436 -2617 6119 -11072 8020 11353 -12777 -233 2743 -8118 8093 8109 -8122 -3531 1534
474 1534 -3505 3444 10418 -6342 -8967 6370 -4018 414 15096 -9796 -9063 9188 -7614 3457
488 3457 14858 -12592 -5940 6673 -6404 5444 10426 -8969 -6615 3402 -1079 2443 9705
501 9705 -5432 -11574 6376 741 -2252 13934 -6628 -14099 10269 -2048 -1267 15049 -10093
514 -10093 -10636 9101 -3372 1981 11407 -8603 -9189 5205 1014 804 8241 -3832 -12459 4962
528 4962 4836 -3489 10258 -2982 -15818 8818 3427 -4528 12737 -6251 -13977 9373 1097 -1055
542 -1055 9970 -6873 -10499 5415 3589 315 5397 -2972 -11482 3288 7969 -3188 5279 -316
$$ packed form
446H610n247q953M993P07m500Q083N658j6270J645J1025j3119J0722R649k4439
460a1436Q819Q736j7191J9092L333k4130J2544K976j0861J6211J6j6231M591N065
474A534n039O949O974j6760k625J5337j0388M432J4682k4892P33J8251j6802J1071
488C457J1401k7450O652J2613j3077J1848M982j9395K354J0017m481L522P262
501I705j5137o142J7950n635k993J6186k0562p471K4368j2317P81J6316k5142
514a0093n43J9737j2473N353R426k0010n86J4394m191k10P437j2073q627J7421
528D962j26q325J3747j3240j2836K4636n391p955J7265j8988p726K3350q276k152
542a055J1025j6843l626J5914j826l274N082q369q510J4770M681j1157Q467n595
$$ plain form
556 -316 -15184 6086 8309 -5956 8083 -2487 -14568 8342 5012 -3445 7335 -4972 -10326
569 -10326 5831 4785 -803 3015 -2279 -9027 2343 8620 -2592 896 1479 -11601 3242 10201
583 10201 -5873 3252 683 -12693 6434 7319 -5204 4492 -2318 -9240 5571 5127 -1627 1081
597 1081 -2012 -5972 1721 7338 -1294 -2102 1607 -7350 942 10012 -4635 -916 2798 -9711 3789
612 3789 8479 -5638 1651 -161 -7616 4935 4917 -2596 402 -1674 -3796 1973 5348 -734 -3295
627 -3295 1220 -3508 -487 8365 -2977 -3584 3658 -6028 1545 8169 -5464 -615 1848 -5972 4056
642 4056 4766 -3869 -76 -827 -2446 2473 3179 -778 -3113 309 -498 -735 5498 -1431 -4745 3506
658 3506 -2630 -453 6951 -4355 -2374 3337 -4337 2421 4488 -4207 -51 337 -2012 2544 1603
$$ packed form
556c16j4868K1270K223j4265J4039j0570j2081K2910l330q457J0780j2307n354
569a0326J6157j046n588L818n294o748J1370O277j1212L488N83j3080J4843O959
583A0201j6074R125k569j3376J9127Q85j2523R696o810o922J4811m44o754K708
597A081l093l960P693N617q632q08L709q957Q292R070j4647L719L714j2509J3500
612C789M690j4117P289j812p455J2551j8p513K998k076k122N769L375o082k561
627c295M515m728L021Q852j1342o07P242r686P573O624j3633M849K463p820J0028
642D056P10q635L793p51j619M919P06l957k335L422q07k37O233o929l314Q251
658C506o136K177P404j1306J981N711p674O758K067q695M156L88k349M556r41
$$ plain form
673 1603 -1093 -1792 -302 856 -621 2894 -102 -4501 2708 -173 -1879 5296 -2704 -3367 3894 -2786
689 -2786 699 4304 -4213 -435 1544 -2176 2262 1214 -1751 -621 -614 1135 212 666 574 -3319 1252
706 1252 1478 -2305 3356 -872 -3808 3657 -1023 -1040 3912 -3235 -1069 2448 -2030 1560 1078 -2245
722 -2245 482 -342 471 823 -747 665 -1611 -67 2224 -2176 1271 836 -3551 2688 441 -2364
738 -2364 3070 -1753 -1503 2903 -1972 529 1555 -2370 822 219 -535 1238 -1029 538 -7 -1204
754 -1204 2053 -983 -479 1815 -2515 1045 1463 -2615 2186 -157 -2254 2523 -1123 -596 1918 -2059
770 -2059 609 752 -1392 1537 -745 -474 1175 -1587 1206 331 -1652 1807 -1169 -412 2049 -2164
786 -2164 737 1038 -2314 1902 -158 -1314 1890 -1579 111 1444 -1935 1211 40 -1305 1730
$$ packed form
673A603k696o99J490J158j477L515k996m399P209k881j706P175q000o63P261o680
689b786L485L605q517L778J979l720M438j048k965J130PJ749r23M54r2l893M571
706A252K26l783N661m228k936P465m680j7M952p147K166L517m478L590m82l323
722b245K727q24Q13L52j570J412k276J544K291m400L447m35m387O239k247k805
738b364N434m823K50M406m875K501J026l925L192o03p54J773k267J567n45j197
754a204L257l036N04K294m330L560M18m078M801k343k097M777l646N27K514l977
770b059K668J43k144K929k282K71J649k762K793q75j983L459k976P57K461m213
786b164K901L01l352M216k060j156L204l469J690J333l379L146j171j345L035
$$ plain form
801 1730 -1225 135 1272 -2030 1323 285 -1541 1850 -1100 -408 1677 -1982 970 738 -2000 1753
817 1753 -525 -845 1621 -1729 550 980 -1929 1522 -314 -1124 1751 -1406 277 1174 -1926 1388
833 1388 117 -1321 1880 -1336 -171 1434 -1869 1160 508 -1712 1730 -801 -511 1645 -1750 669
849 669 726 -1561 1472 -515 -648 1533 -1672 761 923 -1922 1671 -342 -1119 1964 -1610 161 1597
866 1597 -2185 1074 532 -1685 1583 -621 -347 1135 -1525 818 331 -1032 1428 -1076 -121 1239
882 1239 -1850 1557 454 -2191 2026 -698 -1099 2475 -1771 -380 1548 -1927 1047 872 -1434 770
898 770 -611 -66 763 -715 809 -950 -552 1627 -1545 1015 1107 -3146 1741 677 -2182 2844 -954
915 -954 -2142 2478 -1272 -227 2281 -1834 -493 612 -352 649 47 375 -1165 -801 2039 -1063
$$ packed form
801A730k955J360J137l302L353j038j826L391k950O92K085l659K952k32k738L753
817A753k278l20K466l350K279M30k909L451j836q10K875l157J683Q97l100L314
833A388j271j438L201l216J165J605l303L029o52k220L442k531K90K156l395K419
849F69N7k287L033j987j33K181l205K433J62k845L593k013p77L083l574J771J436
866A597l782L259n42k217L268k204K74J482k660K343m87j363K460k504R55J360
882A239l089L407j103k645M217k724m01L574m246J391J928l475K974j75k306K204
898G70j381N45Q29j478J524j759L98K179l172K560R2m253M887j064k859N026l798
915i54j188M620l750J045K508m115J341J105r64J001o02L28j540L64K840l102
$$ plain form
931 -1063 424 1748 -3654 1056 2215 -2943 2641 584 -4172 2412 408 -1547 2923 -1139 -2274
946 -2274 1283 103 186 935 -22 -1953 -839 2514 -553 -167 2101 -3964 -361 3969 -2652 1471
962 1471 1987 -5559 1471 2894 -2455 2656 -31 -4211 1460 1723 -462 1138 -33 -2892 -797 3457
978 3457 56 -1204 2096 -3784 -1674 5596 -1803 -525 2966 -5868 58 5447 -2786 934 1431
993 1431 -5298 738 3706 -731 254 206 -3215 -902 4174 692 -2075 1804 -2984 -2779 6474 -246
1009 -246 -2888 3414 -4672 -2031 7135 -1722 -1426 2511 -5207 -505 5579 -705 -1078 630 -3280 -1292
1025 -1292 4869 1462 -3245 967 -1865 -3558 6548 1739 -4925 2630 -2876 -3550 7975 64 -4027
1040 -4027 2648 -4068 -1857 6935 123 -2924 508 -2480 -1465 5023 2338 -4002 -405 -299 -3329
$$ packed form
931a063J487J324n402M710J159n158N584k057m756O584k004j955M470m062j135
946b274L557j180Q3P49r57j931J114L353l067L86K268o065L603M330o621M123
962A471N16p546P030J423n349N111k687m180N671K63k185J600j171k859K095M254
978C457l401j260L300n880K110P270p399J278L491q834N926N389q233L720M97
993A431o729O036K968m437R85m8l421K313N076l482k767L879m788K05R253o720
1009b46k642O302q086K641R166q857K96L937p718M702O084o284l73J708l910J988
1025a292O161l407m707M212k832j693J0106m809o664P555n506o74J1525p911m091
1040d027O675o716K211Q792o812l047L432k988J015O488k685o340L597J06l030
$$ plain form
1055 -3329 5655 3350 -6134 1214 -385 -4371 7254 2187 -6098 1887 -1699 -2872 6841 1154 -4439
1070 -4439 428 -1339 -1554 4776 2650 -4459 -1405 922 -2628 4151 4441 -6335 -710 1843 -4136
1085 -4136 5485 3781 -7005 714 610 -3406 5991 2308 -5495 -64 104 -1556 4005 2715 -4170
1100 -4170 -2266 1851 -1478 2259 4715 -5370 -2541 3384 -3061 3070 4893 -6706 -1030 2653
1114 2653 -3154 4050 3175 -5575 -893 1370 -1164 2968 2424 -3784 -2544 2205 -85 857 3904 -3996
1130 -3996 -3719 4148 -1239 627 4927 -5367 -2586 4065 -2172 1864 3546 -5195 -1384 2488 -940
1145 -940 1742 2124 -3149 -2454 2136 786 -361 2689 -2145 -4013 3583 455 -1290 4048 -3309 -3492
1161 -3492 4351 -1020 -177 3539 -3837 -1962 2947 -446 630 1680 -2228 -1920 1568 1365 -560 1234
$$ packed form
1055c329Q984k305r484P348j599l986J1625n067q285P985l586j173R713n687n593
1070d439M867j767k15O330k126p109L054K327l550O779K90j0776N625K553n979
1085d136R621j704j0786P719j04m016R397l683p803N431J68j660N561j290o885
1100d170J904M117l329L737K456j0085K829N925o445O131J823j1599N676L683
1114B653n807P204q75q750M682K263k534M132n44o208J240M749k290R42L047p900
1130c996K77P867n387J866M300j0294K781O651o237M036J682q741L811L872l428
1145i40K682L82n273O95M590j350j147L050m834j868P596l128j745N338p357j83
1161c492P843n371Q43L716p376J875M909l393J076J050l908L08L488k03j925J794
$$ plain form
1177 1234 -673 -3537 2447 1807 -2081 2700 -1234 -3952 3631 397 -1520 2929 -2424 -2288 2846
1192 2846 -165 -57 1298 -1752 -1449 1176 1298 -496 170 103 -2487 1080 2362 -2040 974 371 -3385
1209 -3385 2430 1376 -2202 2046 -975 -2254 2560 94 -648 1093 -1079 -719 780 771 -144 -591 486
1226 486 -1011 -85 2092 -1397 -292 1291 -2428 993 1826 -2234 1054 291 -2043 1700 268 -909
1242 -909 1014 -887 -350 671 -5 295 -539 177 -26 -754 1403 -352 -1025 1461 -1223 -246 1845
1259 1845 -1558 242 870 -1733 1124 524 -1152 958 -573 -367 818 -446 344 -211 -370 680
1275 680 -739 505 538 -1383 965 -93 -863 1441 -848 -413 1182 -1265 445 735 -1243 734
1291 734 -166 -424 957 -782 184 428 -900 838 -222 -367 899 -940 425 693 -1229 889 -47
$$ packed form
1177A234j907k864N984o40l888M781l934k718P583l234j917M449n353J36N134
1192B846l011J08J355l050L03K625J22j794O66o7k590L567J282m402L014o03l756
1209c385N815j054l578M248l021j279M814k466p42J741k172L60J499rr15m47J077
1226D86j497R26K177l489J105J583l719L421Q33m060L288p63k334L743j432j177
1242i09J923j901N37J021o76L00q34P16k03p28K157j755o73K486k684R77K091
1259A845l403J800O28k603K857o00j676K110j531K06J185j264P90n55j59J050
1275F80j419J244L3j921K348j058p70K304k289M35J595k447J710K90j978J977
1291G34r00k58J381j739R66K44j328J738j060j45J266j839J365K68j922K118r36
$$ plain form
1308 -47 -758 1117 -711 -107 835 -1100 613 302 -869 859 -441 -218 831 -980 420 373 -934
1325 -934 883 -411 -340 872 -1007 360 581 -1053 777 -165 -586 967 -810 88 724 -1055 595
1342 595 162 -631 809 -683 20 716 -1073 563 166 -696 866 -577 -77 808 -1125 545 492 -1065
1360 -1065 763 -273 -412 931 -881 165 571 -973 570 25 -396 514 -701 304 445 -844
1376 -844 745 -221 -556 916 -797 140 839 -1384 629 482 -972 912 -298 -562 823 -605 153
1393 153 530 -599 169 -168 244 468 -786 595 -64 -909 1122 -432 -293 1061 -1515 225 1263
1410 1263 -1350 600 461 -1219 636 122 -305 695 -559 -282 181 169 282 -488 517 -243 -1093 1395
1428 1395 82 -959 1240 -1080 -528 1807 -1109 95 1170 -1808 183 1270 -612 274 -44 -752
$$ packed form
1308d7p11J875j828O04R42j935J713l11j171J728j300K23J049j811J400m7j307
1325i34J817j294P1J212j879J367K21j634J830r42m21J553j777Q98O36j779J650
1342E95m33p93J440j492P03O96j789J636l97q62J562j443N00Q85j933J670n3j557
1360a065J828j036j39J343j812J046M06j544J543n45m21R10j215J005J41j289
1376h44J589r66l35J472j713R37O99k223K013j47j454J884j210k64J385j428P58
1393A53L77j129P68l37M12K24j254J381o59q45K031j554J39J354k576J740J038
1410A263k613J950j39j680J855n14m27J000j254K77M63j2J13p70J005p60q50K488
1428A395j313j041K199k320N52K335k916J204J075k978J991J087j882Q86l18p08
$$ plain form
1444 -752 33 445 339 -441 140 -319 -1242 1618 551 -1558 1151 -676 -1374 2231 -348 -798 1318
1461 1318 -1807 -426 2176 -624 -473 497 -939 -293 1058 634 -568 -172 -213 -1022 1656 969 -2020
1478 -2020 995 18 -1995 2439 723 -1930 1137 -991 -1029 2525 -260 -1157 854 -1002 -756 1643
1494 1643 823 -1216 -453 182 -926 1163 1484 -1972 71 469 -2064 2197 1639 -2759 628 95 -1649
1511 -1649 2424 723 -1841 500 -603 -954 2015 1088 -1647 -714 616 -751 844 2032 -1930 -952
1527 -952 1044 -1640 1671 2221 -3090 -149 1188 -1941 1940 1657 -2413 -196 97 -800 1878 1064
1543 1064 -1909 -802 758 -627 632 2207 -1781 -1834 1564 -682 669 2366 -2601 -978 1713
1558 1713 -1541 1276 2284 -2690 -922 1154 -560 1200 1217 -1686 -1048 762 -60 451 1801 -1535
$$ packed form
1444g52P85M12j06p80N81m59r23K860j067k109K709j827o98L605k579m50K116
1461A318l125J381K602k800J51R70j436O46J351m24j202L96m1q09K678o87k989
1478b020L015r77k013M434j716k653L067k128l8L554k785q97K011j856K46K399
1494A643q20k039P63O35j108K089L21l456K043L98k533M261n58m398L387n33j744
1511a649M073j701k564K341j103l51K969r27k735R33J330j367J595J188l962R78
1527i52J996k684L311N50n311K941J337l129L881k83m070K217K93q97K678q14
1543A064k973J107J560j385J259J575l988n3L398k246J351J697m967J623K691
1558A713l254K817J008m974J768K076j714J760J7k903O38J810q22N11J350l336
$$ plain form
1574 -1535 -2289 1796 101 -359 2282 -1762 -1875 1867 -778 508 2338 -2477 -1353 1747 -456 475
1590 475 1403 -1370 -1387 729 460 254 1222 -1024 -2077 1610 676 -894 2016 -847 -2563 1745 345
1607 345 -351 1796 -1687 -1534 1788 -164 -20 1373 -1183 -1530 766 889 -83 365 -412 -1666 842
1624 842 1071 -870 1179 -244 -2504 1471 1119 -1131 1214 -639 -1645 1441 212 -343 1077 -924
1640 -924 -1272 913 922 -272 -5 105 -1091 211 1280 -564 277 190 -1901 961 1394 -1404 653 217
1658 217 -1650 906 732 -437 607 -644 -857 854 493 -331 -28 170 -745 -186 1273 -190 -538
1675 -538 384 -969 286 1213 -1031 298 575 -1479 582 975 -654 172 -177 -477 615 163 -113
1692 -113 65 -98 -317 -88 923 -71 -808 550 -208 -318 952 -566 -169 578 -1020 385 950 -888
$$ packed form
1574a535p54M085j695m60K641m044j13L742k645J286J830m815J124L100k203R31
1590D75R28k773j7K116k69k06R68k246j053L687r34j570K910k863j716M308j400
1607C45o96K147l483J53L322j952J44J393k556l47K296J23r72M48p77j254K508
1624H42K29j941K049j423k260L975l52k250K345j853j006L086j229n55J420k001
1640i24l48K185Rj194K67J10j196J302J069j844Q41q7k091K862M33k798K057m36
1658B17j867K556j74j169J044j251k13J711l61q24L03J98r15N59J459j463l48
1675e38R22j353J255R27k244J329K77k054K061L93j629Q26l49l00J092m52k76
1692a13J78j63k19K29J011r94p37J358p58j10J270j518L97P47j598J405N65j838
$$ plain form
1710 -888 45 180 -400 311 -27 -21 113 -350 -7 157 302 73 -620 431 108 -591 712 66 -519 434
1730 434 -376 70 634 -694 88 486 -561 182 232 -122 71 -349 156 199 -229 120 -153 37 170 -515
1750 -515 442 186 -734 386 46 -215 412 -419 44 375 -547 180 328 -371 147 -168 48 263 -418 223
1770 223 182 -248 237 -139 152 209 -571 283 239 -496 290 -40 -166 250 -450 159 322 -530 199 189 -177
1791 -177 208 -313 142 209 -451 205 95 -260 199 -208 145 255 -517 272 208 -383 260 -95 19 257 -433
1812 -433 217 258 -453 224 14 -103 262 -318 200 250 -438 231 94 -103 254 -326 176 224 -454 260 44
1833 44 -263 226 -255 43 222 -478 210 154 -384 228 -90 -7 188 -354 227 183 -387 237 -21 -65 190 -311
1855 -311 234 214 -446 318 16 -167 276 -264 117 259 -387 161 147 -191 178 -134 49 136 -414 141 100
$$ packed form
1710h88R33J35n80P11l38OJ34m63L43J64J45k29o93J051l23o99J303o46n85R53
1730D34q10M46N64j328P82L98j047P43N0l54J93m20N05M3m28L49k73J90J33o85
1750e15R57k56r20J120l40k61O27q31M63L31r22P27J48o99N18l15K16K15o81O41
1770B23m1m30M85l76K91N7p80Q54m4p35P86l30j26M16p00O09J63q52P29j0l66
1791a77L85n21M55O7o60O56j10l55M59m07L53J10p72P89o4n91O43l55J14K38o90
1812d33O50M1p11O77k10j17L65n80N18N0o88O69j37j97L57n80N02M8o78P14k16
1833D4l07M89m81K98J79p00O88n6n38O12l18Q3J95n42N81m4n70O24k58m4K55n01
1855c11N45k0o60P64l02j83M43n40L81J42o46N48j4l38L69l12J83Q7n50N55m1
$$ plain form
1876 100 -232 232 -202 -37 197 -417 275 149 -426 264 -22 -152 305 -285 73 284 -337 175 177 -69 56
1897 56 -158 142 78 -252 298 -36 -169 288 -299 142 250 -557 276 154 -411 358 12 -307 269 -198 19
1918 19 269 -157 -76 -43 6 -28 -24 287 -208 -306 386 -266 128 410 -642 116 417 -591 391 336 -625 190
1940 190 83 -200 456 -42 -350 70 86 -36 147 350 -408 -441 572 -101 -111 565 -668 -281 688 -498
1960 -498 239 567 -993 -38 561 -413 330 270 -691 -184 335 -9 101 401 -620 -538 751 -56 -274 872
1980 872 -731 -721 1042 -216 -64 894 -1062 -399 987 -320 150 660 -858 -496 758 117 -39 518
1998 518 -627 -877 918 232 -507 808 -679 -1279 1242 222 -551 952 -932 -1067 1298 96 -281
2015 -281 884 -928 -967 1096 483 -344 476 -501 -1290 1021 871 -702 637 -403 -1553 1387 873
$$ packed form
1876A00l32M64m34J65K34o14O92j26n75O90k86j30M57n90L58K11o21N12Kk46J25
1897E6k14L00o4l30N50l34j33M57n87M41J08q07Q33j22n65P69l46l19N76m67K17
1918A9K50m26Q1L3M9l4ML11m95r8O92o52L94K82j052P58L01j008R82n5r61Q15
1940A90j07k83O56m98l08M20J6j22J83K03p58l3J013o73j0O76j233L87R69j186
1960d98P37L28j560R55N99r74P43o0r61N07N19l44J10L00j021Q2J289q07k18J146
1980H72j603J0J763j258J52R58j956O63J386j307M70N10j518L62J254o41j56N57
1998E18j145k50J795o86p39J315j487o00K521j020p73J503j884j35K365j202l77
2015b81J165j812l9K063o13q27Q20r77p89K311j50j573J339j040j150K940n14
$$ plain form
2032 873 -1068 838 -516 -1714 1506 753 -816 690 -634 -1435 1292 899 -768 302 -316 -1495
2048 -1495 1062 1361 -990 157 -21 -1792 1218 1613 -1210 319 -14 -1893 1341 1550 -1110 302
2064 302 -169 -1632 1217 1561 -971 -54 77 -1581 788 1970 -968 -506 393 -1674 689 2214 -1181
2081 -1181 -336 437 -1874 854 2205 -1317 -347 264 -1610 783 2030 -937 -729 303 -1336 425
2097 425 2197 -835 -1046 674 -1261 210 2529 -971 -1223 900 -1407 246 2493 -1086 -1094 686
2113 686 -1157 297 2196 -743 -1238 552 -795 -38 2129 -452 -1642 679 -547 -383 2313 -387
2129 -387 -1805 896 -578 -375 2399 -604 -1667 760 -571 -232 2045 -385 -1640 545 -156 -336
2145 -336 1757 -32 -1816 533 143 -623 1867 101 -2055 658 179 -711 1875 26 -1932 620
$$ packed form
2032H73j941J906j354j198L220p53j569J506j324q01K727l93j667J070o18j179
2048a495K557K99k351J147j78j771L010L95k823J529l33j879L234K09k660J412
2064C02m71j463K849L44k532R17J31j658K369J182k938M62Q99k067K363J525l395
2081a181Q45P73k311K728J351l522R70O11j874K393J247k967K08J032j639J761
2097D25J772l032k11J720j935J471K319l500k52K123k307J653K247l579qJ780
2113F86j843J454J899k939m95J790j347P57K167k581j190K321j226J64K696k700
2129c87j418K701j474K03K774l003j063K427j331L39K277k430j255K185p01j80
2145c36K093j789j784K349l90p66K490j766k156K713m79q90K586j849j958K552
$$ plain form
2161 620 127 -531 1552 37 -1701 311 317 -520 1228 341 -1833 143 704 -684 1138 551 -1934
2178 -1934 161 789 -764 1084 426 -1849 242 702 -579 965 326 -1480 37 719 -337 557
2194 557 582 -1346 -256 997 -407 380 775 -1424 -177 1053 -570 378 680 -1398 -51 926 -496
2211 -496 343 449 -1119 -160 687 -249 88 472 -785 -390 881 -195 -110 705 -837 -507 992 -264
2229 -264 -156 713 -813 -367 876 -252 44 391 -662 -195 626 -71 -110 368 -280 -454 576 153 -391
2248 -391 471 -264 -573 708 27 -335 501 -420 -384 653 -42 -246 373 -354 -246 412 79 -168 125 -5
2268 -5 -272 257 294 -355 170 31 -460 396 156 -410 303 -34 -380 460 6 -197 188 -90 -118 179 -3
2289 -3 -89 -19 38 -78 22 215 -203 -51 204 -249 45 244 -295 90 116 -264 183 -1 -167 187 -50 -123
$$ packed form
2161F20m93o58K083j515j738K012Oq37J748q87k174J976N61j388J822n87k485
2178a934K095O28j553J848o58k275K091M60j281J544o39j806J517O82j056Q94
2194E57K5j928J090J253j404P87L95k199J247J230j623R48L02k078J347R77j422
2211d96Q39J06j568R59Q47r36L37L84j257L95J271j076Q5Q15j542L30J499j256
2229b64J08Q69j526M46J243j128K96L47j053M67Q21o97l9M78o48j74J030m23n44
2248c91Q62p35l09J281o81l62Q36r21L6J037o95k04O19p27J08O58l33k47K93j30
2268ek67N29L7o49N25j39m91Q56k40n66P13l37l46Q40m54k03L85k78k8K97j82
2289cq6P0N7j16J00J93m18J52K55m53K94J99n39L85K6l80M47j84j66L54k37p3
$$ plain form
2311 -123 78 10 -38 -50 23 20 -105 170 21 -186 169 10 -97 180 -138 -47 141 -217 118 157 -229 130 6
2334 6 -36 56 -74 32 -27 -62 139 -104 -36 8 -191 113 2 -202 177 -27 -125 211 -121 -71 96 -126 90
2357 90 28 -100 73 0 -66 129 -9 81 -84 25 158 -110 95 95 -209 149 -5 -155 230 -111 -114 214 -138
2380 -138 -3 155 -166 -19 82 -47 58 -30 -43 -78 -30 116 -107 82 145 -266 191 34 -234 376 -27 -292
2402 -292 286 -47 -128 242 -109 -150 168 -19 -13 197 -39 -146 71 109 -130 134 177 -396 59 216 -306 229
2424 229 55 -457 232 121 -277 301 -107 -405 291 72 -138 285 64 -334 129 236 -123 142 130 -449
2444 -449 28 398 -273 219 208 -673 193 352 -360 320 55 -619 264 277 -174 187 28 -477 26 390 -184
2465 -184 33 164 -519 -54 587 -278 -35 309 -742 46 607 -411 117 217 -711 168 521 -288 144
$$ packed form
2311a23K01o8m8j2P3lj25K75j49k07L55j59j07K77l18R1J88l58L35L9l86L59j24
2334Fm2R2j30J06n9l5K01k43O8M4j99L04j11k04L79k04r8L36l32N0J67k22K16
2357I0o2j28J73p3o6J95j38R0j65J09J33k68K05%l04L58j54j50L85l41lL28l52
2380a38J35J58l21J47J01j29J05q8j3l5M8J46k23J89O3m11M57j57k68O10m03k65
2402b92N78l33q1L70l51m1L18j87OK10k36j07K17L8k39K64M3n73M55J57n22N35
2424B29j74n12O89j11l98N78m08k98O96k19k10M23k21l98M63J07l59K65j2n79
2444d49M77L70o71M92j1q81Q66J59p12O80k65o74Q83J3m51L61j59n05N03L64n74
2465a84K17J31o83M65O41q65K43L44j051P88N61j018N28J00r28Q79L53q09M32
$$ plain form
2484 144 126 -624 -23 576 -129 -63 222 -562 -161 789 -81 -167 419 -683 -80 849 -251 -86 346 -762
2504 -762 -19 839 -235 -72 196 -570 -96 737 -91 -245 158 -456 -286 867 4 -403 360 -513 -339
2523 -339 967 -93 -446 342 -575 -196 915 -166 -347 263 -468 -124 780 6 -440 146 -312 -258 836
2542 836 126 -699 250 -242 -381 944 15 -667 349 -356 -326 989 -92 -603 218 -285 -207 767 15
2561 15 -588 99 -150 -265 740 251 -750 140 57 -348 874 180 -836 288 -45 -378 918 106 -762
2580 -762 284 -107 -173 735 113 -722 69 119 -203 621 197 -818 -14 262 -358 661 259 -980 80
2599 80 187 -349 750 135 -903 148 188 -196 636 77 -810 109 189 -108 516 179 -763 -65 491 -242
2619 -242 377 348 -933 65 502 -388 513 201 -968 142 351 -257 468 126 -743 72 384 -152 277
$$ packed form
2484A44j8p50O01N99p05O6K85p84M01R50q70q6N86j102O03R29j100J65M32j108
2504g62P43Q58j074J63K68p66M74Q33q28j54M03o14J70J153q63m07P63q73J74
2523c39J306j060l53P88r17L79J111j081j81O10p31L44R04p74m46N86m58N4J094
2542H36p10q25R49m92j39J325r29o82J016p05L0J315j081n11Q21n03P8R74p52
2561A5o03O87k49j15J005m89j001Q90q3m05J222o94j016J124l33l33J296q12q68
2580g62J046l91o6R08o22q35P91N0l22Q24m24j015Q04K76o20J019m02j239J060
2599H0J07n36J099o15j038J051M0l84Q32n59q87R19Q0k97O24l37r42O98N56p33
2619b42O19k9j281R98M37q90R01l12j169J110K09o08P25l42q69Q15L12n36M29
$$ plain form
2638 277 191 -703 -129 517 -153 149 238 -776 -60 654 -299 235 291 -794 69 510 -264 300 138 -710
2658 -710 62 481 -105 115 106 -536 -74 577 -82 -41 209 -622 -141 673 -173 -37 334 -712 -15 624 -309
2679 -309 59 145 -576 67 490 -118 -13 119 -418 -57 523 -58 -196 221 -374 -192 648 -71 -229 349
2699 349 -450 -136 687 -174 -128 277 -407 -8 531 -139 -63 128 -240 -141 448 25 -244 173 -182 -253 473
2720 473 30 -348 270 -206 -249 493 -116 -266 216 -296 -91 447 -127 -215 44 -146 -51 290 91 -242 68
2741 68 34 -149 356 153 -396 151 -13 -319 420 35 -328 202 -93 -129 382 -67 -188 96 -53 -7 188
2762 188 20 -273 -22 115 -114 100 200 -329 64 82 -233 226 73 -326 173 11 -173 207 -4 -168
2782 -168 63 -55 -33 83 -14 -69 -35 133 -22 40 149 -173 -41 179 -201 29 146 -266 54 124 -166 108
$$ packed form
2638B77q6q94N74O46o70L02Q9j014P16P14r53N34N6j085Q63M41p74N64j62q48
2658g10P72M19n86K20ro42M62O51o59M1K50q31M81Q14q46J36L71j046O97O39r33
2679c09L68Q6p21O43M23o08J05J32n37L61N80n81j38M17n95J82Q40p19j58N78
2699C49p99L14Q23q61M6M05o84L99N39o70P6J91l68R9N89m23k69M17l55p1P26
2720D73m43l78O18m76m3P42o09j50M82n12K05N38n74q8K59j90R5L41j99l33L10
2741F8l4j83N05k03n49N47j64l06P39l85l63N30k95l6N11m49j21K84j49M6J95
2762A88j68k93K51J37k29K14J00n29L93J8l15M59j53l99M99j62j84L80k11j64
2782a68K31j18K2J16r7n5L4J68j55O2J09l22J32K20l80K30J17m12L20P0k90K74
$$ plain form
2804 108 0 -160 27 37 -17 52 -49 -55 -62 7 58 -93 122 -32 -88 196 -72 -104 197 -136 -24 157 -45 39
2828 39 50 -103 44 0 -31 27 -17 18 -68 -19 52 -148 40 81 -119 122 8 -156 120 -53 -106 202 -147 46
2852 46 73 -159 -38 19 -70 33 -37 -25 -22 -89 -7 -103 34 110 -104 61 1 -141 168 -29 -109 126 -44 -59 202
2877 202 -114 -17 73 -58 54 52 -2 -21 13 52 -53 -1 148 -138 -10 78 -188 129 115 -231 127 -97 -211 184
2901 184 13 -95 167 -71 -111 196 17 -40 26 -29 -111 39 166 -106 3 108 -268 137 186 -290 123 61
2923 61 -346 291 173 -264 137 -31 -226 193 104 -167 43 -43 -185 112 299 -216 -87 200 -390 67 427
2944 427 -298 -51 174 -427 248 447 -420 88 152 -398 294 328 -313 -67 114 -284 126 501 -237 -207 264
2965 264 -320 -21 653 -401 -267 324 -541 128 660 -480 -244 242 -507 72 689 -362 -307 235 -369
$$ packed form
2804A08j08j60J87J0n4O9j01opO9N1j51K15j54n6K84k68l2L01l33J12J81k02Q4
2828C9J1j53J47m4l1N8m4L5q6M9P1k00J88M1k00K41j14j64K76j73n3L08l49J93
2852D6K7k32J21N7q9J03p0J2Lo7Q2r6J37P6k14J65o0j42L09j97q0K35j70j5K61
2877B02l16R7R0j31J12kn4j9L4L9j05N2J49k86J28Q8k66L17j4l46L58k24j14L95
2901A84j71j08K62k38m0L07j79n7O6n5q2J50J27k72J09J05l76M05M9m76M13o2
2923F1m07O37j18m37M01j68j95M19q9k71K10q6j42K97J87n15J29K87n90M57L60
2944D27p25K47K25o01O75J99q67N08O4n50O92L4o41K46J81l98M10L75p38L0M71
2965B64n84K99O74j054J34N91q65O69N32j140K36M86p49N79O17j051N5N42o04
$$ plain form
2984 -369 15 675 -306 -434 298 -262 -108 873 -337 -616 487 -350 -95 997 -418 -590 438 -381
3002 -381 -5 899 -348 -579 317 -164 -50 834 -200 -835 296 -9 -243 906 -161 -954 461 -92
3020 -92 -307 1079 -277 -1041 458 -13 -240 954 -221 -1006 369 85 -230 855 -18 -1032 301
3037 301 287 -402 887 50 -1240 334 375 -456 968 57 -1286 388 352 -432 904 45 -1220 242
3055 242 474 -256 754 139 -1250 108 642 -417 598 353 -1395 49 808 -436 603 340 -1484
3072 -1484 142 724 -420 669 371 -1415 -22 809 -241 391 372 -1217 -155 904 -185 297 496
3089 496 -1267 -187 1126 -329 197 549 -1388 -210 1127 -305 231 506 -1226 -241 1042 -202
3105 -202 44 409 -1046 -415 1081 -108 -154 545 -1050 -434 1268 -122 -249 630 -1090 -505 1222 -84
$$ packed form
2984c69L84O60r81j28P32n60J54R81j210k79J103q37K55J092j415j72J028q19
3002c81L76R04j247k31Q96m81J14Q84j034o35J131l05k34J149j067p93J415n53
3020i2k15J386j356p64J499m71k27J194j175p85J375k84l15J085q73j014J333
3037C01j4o89J289q37j290J574M1q31J424r11j343J674l6p84J336q59j265J462
3055B42K32p30J010o15j389J358N34j059J015k45j748J444P59j244J039k63j824
3072a484J626N82j144J089k98j786J393Q31j050O32j9j589J062J059j089M82J99
3089D96j763J080J313j455N26L52j937J178J337j432N36K75j732R85J283j244
3105b02K46L65j455O31J496j189m6O99j595O16J702j390j27Q79j720N85J727j306
$$ plain form
3123 -84 -184 524 -947 -408 1165 -29 -272 426 -762 -606 1085 204 -454 430 -636 -685 1176 142
3141 142 -565 538 -676 -655 1190 153 -579 447 -583 -617 1016 242 -459 297 -422 -622 902 393
3159 393 -593 204 -153 -752 946 427 -668 319 -241 -727 994 359 -707 285 -203 -610 818 414
3177 414 -551 115 -86 -438 690 478 -669 23 74 -586 558 617 -707 30 107 -556 635 484 -629
3196 -629 164 28 -531 571 471 -577 0 104 -392 336 500 -409 -123 257 -345 282 589 -586 -224
3215 -224 316 -419 234 569 -564 -148 179 -391 334 407 -442 -163 198 -200 135 378 -308 -275 229 -162
3235 -162 45 425 -346 -332 339 -195 16 409 -385 -197 268 -191 134 322 -297 -113 178 -77 50 299
3255 299 -148 -258 192 68 -168 241 -80 -278 280 -16 -192 310 -178 -276 309 -86 -74 200 -147 -189 126
$$ packed form
3123h4j00P08j471N39J573j194k43O98j188J56J691q81o58Q84j066m9J861j034
3141A42p07J103j214K1J845j037p32J026j030l4J633p74p01P56p19k00J524n09
3159C93r86P97l57n99J698n19j095R87n60m86J721o35j066R92m88m07J428m04
3177D14r65O66k01l52J128k12j147O92N1o60J144N9j324P37P7o63J191j51j113
3196f29P93j36n59J102j00j048N77J04m96P28J64r09K86L80o02O27L07j175L62
3215b24N40p35O53L35j133M16L27n70P25P3q49K79L61l98L35K43o86L3N04l91
3235a62K07L80p71J4O71n34K11L93p94J88M65m59L25J88o19J84K91k55J27K49
3255B99m47j10M50j24k36M09l21j98N58k96j76N02m88r8N85l95J2K74l47m2L15
$$ plain form
3276 126 -46 2 104 -74 -172 103 124 -161 85 57 -251 160 104 -110 181 -28 -199 151 39 -84 202 -27
3298 -27 -96 71 10 -17 21 -15 -70 25 88 -99 -16 122 -100 27 189 -106 8 73 -202 95 -18 -121 126 -24
3322 -24 -87 44 70 -20 -51 32 58 -79 66 106 -37 70 -71 8 129 -83 -35 158 -130 28 73 -117 91 3
3346 3 -71 21 24 -27 -10 9 0 -56 34 58 -105 84 -16 -71 122 -90 -95 149 -85 -82 84 -74 37 42 -126 67 -1
3373 -1 -94 45 46 0 -15 38 28 -68 89 54 -100 106 31 -99 144 -5 -58 144 -70 -47 166 -104 -35 91 -67
3398 -67 56 13 -65 -62 61 -23 -34 17 13 -164 10 46 -105 121 -13 -135 57 -43 -105 185 -10 -125 160 -83
3422 -83 25 150 -19 -81 32 -1 -23 117 9 -223 -4 102 -130 157 59 -191 79 2 -205 235 26 -269
3444 -269 147 -47 -125 209 -8 -190 82 -35 -69 183 70 -219 66 102 -100 210 130 -292 103 113 -207 214
$$ packed form
3276A26j72M8J02j78r8K75K1k85K46k8l08M11n6k14K91k09j71L50j12j23K86k29
3298b7o9J67o1k7L8l6n5R5O3j87Q3J38k22J27J62k95J14O5k75K97j13j03K47j50
3322b4o3J31K6r0l1Q3K6j37J45M0j43J07j41P9J21k12M8J93k88J58M5j90K08q8
3346Cp4R2Ln1J7J9rn6R0K4j63J89j00n5J93k12nK44k34LJ66j58J11Nj68J93o8
3373ar3J39Jm6j5N3j0r6J57l5j54K06p5j30K43j49n3K02k14K3K13k70O9J26j58
3398f7J23m3p8LJ23q4j1N1mj77J74L6j51K26j34j22J92j00o2K90j95j15K85k43
3422h3J08J25j69o2J13l3k2J40j08k32K19J06k32K87r8k50K70p7k07M40k09k95
3444b69M16j94p8L34k17j82K72j17l4K52j13k89K85L6k02L10q0m22L95J0l20M21
$$ plain form
3466 214 107 -357 150 165 -203 332 74 -296 29 116 -106 203 164 -336 -68 167 -149 151 157 -363 -82 246
3488 246 -197 165 224 -395 25 225 -212 236 146 -435 -33 201 -114 155 214 -372 -130 266 -137 132 281
3509 281 -462 -163 365 -161 86 303 -521 -104 365 -179 65 269 -436 -172 315 -140 42 248 -381 -211
3529 -211 354 -23 -57 253 -364 -312 462 -72 -48 332 -411 -265 495 -34 -91 329 -415 -297 486 3 -121
3550 -121 355 -359 -352 461 127 -81 297 -332 -415 491 134 -194 349 -327 -414 572 123 -237 280 -377 -402 488
3572 488 125 -204 176 -326 -351 463 247 -256 126 -181 -479 473 337 -308 251 -139 -490 516 234 -324
3592 -324 220 -186 -471 503 289 -333 145 -126 -404 447 349 -351 100 -44 -436 427 422 -391 3 -8 -499
3613 -499 371 407 -379 55 -54 -462 367 366 -331 16 -56 -357 320 381 -319 -34 65 -416 249 472 -333 -89
$$ packed form
3466B14j07m64N07J5l68N35k58l70L25Q7k22L09l9n00K68K35l16L00On20K81L28
3488B46m43L62N9o19M20K00m37M48r0n81M02K34l15K69N9n86K42L96m03K69J49
3509B81p43K99N28n26K47K17q24M17M69n44K44K04p05K64M87m55J82K06o29J70
3529b11N65l77l4L10o17N2P74n34K4L80p43J46P60n29n7M20p44J18P83m83j24
3550a21M76p14PQ13l34k08L78o29q3R06l57l28N43o76q7R86m49l60N17o57k5Q90
3572D88l63l29L80n02k5Q14k16n03L82l07k98R52j36o45N59l90l51J006k82n58
3592c24N44m06k85R74k14o22M78k71k78Q51r8p00M51j44l92Q63nq13L94j1m91
3613d99Q70L6p86M34j09m08Q29jo97L47p2l01O77O1p00K85R9m81O65K23q05K44
$$ plain form
3635 -89 126 -351 277 458 -374 -64 130 -361 211 459 -366 -138 156 -262 191 424 -296 -156 138 -237
3655 -237 41 491 -261 -330 186 -222 51 452 -302 -274 256 -241 76 455 -273 -196 164 -146 84 374 -191
3676 -191 -257 165 -146 34 340 -150 -294 246 -65 -15 397 -163 -353 181 -59 -54 317 -162 -245 202 -80 -43
3698 -43 297 -107 -239 144 4 -69 267 -10 -300 139 56 -121 277 -44 -345 161 78 -99 294 -116 -276
3719 -276 149 13 -98 268 -65 -233 108 51 -85 122 6 -264 84 111 -106 107 8 -320 128 121 -173 126
3741 126 -64 -244 89 123 -86 109 13 -141 55 55 -30 88 -24 -182 52 131 -93 74 38 -119 48 149
3763 149 -74 60 34 -129 68 115 -78 46 -2 -119 7 43 -1 -6 30 -81 -33 89 2 -90 79 -117 -31 125
3787 125 -97 1 76 -145 -8 102 -98 2 9 -59 17 68 16 25 64 0 27 57 5 -46 105 -37 -12 145 -15 -35
$$ packed form
3635h9K15m77O28J81q32L10J94m91N72K48q25K28K94m18M53K33p20J40K94l75
3655b37K78M50p52o9N16m08K73M01p54K8N30m97L17L79p28P7L60l10K30K90n65
3676a91o6M22l11J80L06m90j44N40l11N0M12n60j90N34k40NL71m79q3M47k82L7
3698d3L40m04j32L83j40p3L36k77k90M39q3j77L98l21l01N06q3j77L93m10j60
3719b76M25j36j11L66l33j68L41n7j36K07j16k70L48K7k17K13r9l28M48pk94K99
3741A26j90j80L33L4k09J95r6j54J96%q5J18j12j58K34P9k24J67l6j57J67J01
3763A49k23J34k6j63J97M7j93J24m8j17J26L6m4nL6j11M8J22q7r2J69j96Q6J56
3787A25k22R8P5k21J37J10k00J00Po8P6N1n2RL9o4K7L0n2n1J51j42K5J57j60k0
$$ plain form
3813 -35 69 3 -76 68 -24 -46 1 -6 -12 20 -16 -39 -60 23 -62 11 11 -107 -23 -4 -107 47 32 -41 111 -6 -19 90
3841 90 34 -42 68 -61 -5 71 -35 22 -8 -20 61 -34 -3 -36 -26 36 -119 -24 56 -118 43 -36 -82 58 -20 -125
3867 -125 31 -53 -34 -29 -72 -20 3 -7 -18 -44 -13 6 -13 97 -93 -17 98 -38 -26 7 -83 35 1 -30 35 0 -60
3894 -60 43 78 -22 61 26 -23 3 17 0 -2 25 16 -56 61 -59 -33 56 -85 -45 12 -41 61 12 -90 9 -15 -23 -8
3922 -8 15 30 22 12 8 45 26 -54 -30 49 -38 -45 80 -107 40 99 -97 43 75 -155 -9 56 -35 22 59 -39 -44 24 -24
3951 -24 -6 17 -38 -79 40 -53 -41 72 -79 -85 170 -33 -7 126 -104 -23 34 -22 -1 53 -66 6 118 -1 -18 38
3977 38 -82 -66 145 -19 -51 103 -110 -83 173 -28 -50 80 -117 -54 159 -25 -25 83 -138 -22 134 16 -10
4000 -10 94 -50 -113 97 105 -97 83 -44 -173 203 16 -124 95 -46 -106 195 41 -80 98 -60 -21 151
$$ packed form
3813c5J04o6p9J44r2k2M7poL2l6k3k1Q3q5P3%j18Q4J9j03J54j5p3J52j17j3J09
3841I0n6p6J10j29N6P6j06N7l0j2Q1r5L1l3J0O2j55R5Q0j74J61p9m6J40p8j05
3867a25J56q4J9Nm3N2K3j0j1k6L1J9j9J10j90P6J15j36J2L3r0J18l4l1O5l5o0
3894f0J03L5j00Q3l5m9K6J4j7kK7rp2J17j20K6Q9j41M0N7n3J02m9j02R9k4qJ5
3922hK3J5qj0mL7j9q0K4P9q7pJ25j87J47N9j96J40L2k30J46O5r1N7L7r8nO8m8
3951b4J8K3n5m1J19r3J2J13j51oK55k03K6J33k30Q1N7n6K1N4j19P2J12j19j7N6
3977C8j20J6K11j64l2J54k13K7K56k01k2J30j97O3K13j84%J08k21J16J56j18k6
4000a0J04j44o3K10Qk02J80j27j29L76j87j40K19j41o0L01j54j21J78j58L9J72
$$ plain form
4022 151 61 -21 49 -87 -87 162 80 -94 45 -6 -141 97 34 -120 -14 -51 -169 186 -9 -134 75 -84 -100
4045 -100 162 -5 -144 -12 -69 -88 159 103 -113 -10 -30 -80 129 120 -188 50 3 -109 249 89 -250 65 -21
4068 -21 -83 205 68 -141 18 -30 -91 115 121 -186 -69 33 -99 93 105 -268 -63 72 -151 174 126 -296 4
4091 4 45 -152 225 78 -237 -11 58 -18 145 160 -175 -62 55 -27 149 184 -164 -80 176 -69 120 176 -227
4114 -227 -53 108 -166 103 115 -229 -11 90 -110 87 91 -176 -94 124 -70 77 150 -230 -123 140 -23 33
4136 33 202 -233 -91 192 -19 43 157 -242 -100 213 -7 80 133 -172 -67 182 -29 53 171 -181 -146 252
4158 252 16 -85 120 -203 -150 210 -49 -28 174 -184 -159 148 -17 10 112 -140 -132 161 21 -39 69 -105
4180 -105 -128 208 98 -69 148 -98 -140 205 44 -86 204 -103 -175 164 60 -72 86 -103 -112 195 80 -100
$$ packed form
4022A51r0q2P0j36%K49q2j74J39n1j35K38o3j54J06l7j18L55j95j25K09j59j6
4045a00K62j67j39J32n7j9K47n6k16J03k0n0K09rl08K38m7j12L58j60l39L15q6
4068b1o2K88j37k09J59m8o1K06Ol07J17J02j32J92J2l73K05J35k23L25m8m22L00
4091DM1j97L77j47l15K26O9p6J63J5l35J13J17q2J76L5l48Q4K56k45J89N6m03
4114b27J74J61k74K69J2l44K18J01k00J97Mk67Q2K18j94J47P3l80J07K63j63N6
4136C3J69m35J42K83k11O2J14l99J42L13k20Q7N3l05J05K49k11Q2J18l52L5L98
4158B52k36j01K05l23N3L60k59K1K02l58K5L07j65K7J02k52QK93j40o0J08j74
4180a05k3L36j10j67K17k46m2L45j61j30K90l07p2L39j04j32J58j89rL07j15j80
$$ plain form
4202 -100 7 -35 -208 74 69 -124 122 -22 -169 157 174 -98 53 -67 -235 207 139 -63 112 -30 -167 145
4224 145 93 -63 43 5 -113 52 146 -110 8 76 -139 95 139 -101 115 -7 -161 83 93 -106 7 -98
4246 -98 -152 17 87 -78 -89 -40 -111 -10 132 -100 -36 99 -118 49 99 -108 -35 63 -81 104 80 -92 20 31
4270 31 1 53 69 -61 -36 18 -9 -16 147 -39 -77 148 -64 -26 118 -57 -57 27 -58 25 76 -45 -39 57 -1 -9 32 -22
4298 -22 -80 41 28 -53 90 -4 -86 79 27 -39 98 -12 -60 71 0 -22 108 -6 -48 32 -58 41 67 48 -13 -25
4324 -25 -19 -64 -54 54 -17 -17 39 -44 48 33 -133 38 58 -19 57 -26 -15 47 16 4 2 45 -28 40 33 35 -24 89 10 -34 32
4355 32 -74 21 117 -32 19 22 -38 20 32 -64 4 23 -15 17 -27 -23 -79 2 -24 -2 34 -31 -53 66 -58 -25 45 -40 -3
4384 -3 46 -50 -24 17 -24 -1 -19 -3 -19 9 4 23 41 5 -54 37 37 -60 33 -25 -16 92 3 -33 90 -40 -41 47 7 32 41 -67
$$ packed form
4202a00J07m2j73K82nj93K46j44j47L26J7k72J51j20j68M42o8k02J75j42j37L12
4224A45n2j56J06l8j18J65R4k56J18O8k15K34M4k40K16j22j54K44J0j99J13j05
4246i8n4J69P0j65j1M9p1J01J42k32O4J35k17J67N0k07P3R8j44J85k4j72J12J1
4270C1l0N2J6j30K5N4k7pJ63j86l8K25k12L8J44j75%Q4q5Q3N1j21OR6n8qM1n4
4298b2n8J21j3q1J43r4q2J65n2o6J37j10m8J31p1k2J30j14m2Q0r0R9K6j9o1j2
4324b5Om5J0J08p1%N6q3R2j5j66J71K0p7P6q3J1O2l1j2kM3p3O8pKn9J13p9m4O6
4355C2j06R5R6j49N1Lo0N8J2r6O8J9l8L2m4Mn6Q1k6K2L6o5k2J19j24L3P0q5L7
4384cM9r6K6M1m1K3j8J6j6K8nJ9J8l6n9R1%r7R3n8RJ08q9l6J23j30jQ8m0K5Rj08
$$ plain form
4416 -67 7 27 12 -4 -6 1 -52 64 -5 -64 38 -16 -81 31 6 -73 36 -13 -101 154 21 -40 27 -36 -43 17 25 -19 -1
4445 -1 -51 -22 34 50 -39 57 -6 -47 52 42 -96 59 -26 -92 80 -36 -80 34 6 -102 93 1 -53 12 -95 -51 63
4472 63 65 -56 -15 51 -107 73 54 -93 19 21 -87 143 85 -69 73 -22 -86 129 108 -76 -34 -21 -35 72 99
4497 99 -70 -19 95 -91 43 140 -146 6 65 -107 51 161 -158 3 -11 -134 90 83 -77 -61 39 -47 47
4520 47 135 -41 -57 62 -66 97 173 -49 -95 97 -82 46 199 -130 -29 85 -86 38 147 -128 -99 64
4542 64 -56 44 186 -56 -154 123 -50 -29 182 -58 -181 113 -102 -13 242 -88 -122 74 -14 -7 116 -68 -156
4565 -156 93 -24 1 173 -20 -130 65 9 -71 207 -9 -184 68 10 -66 195 -27 -195 48 10 9 120 -73
4588 -73 -140 41 61 -67 86 29 -179 -10 55 -122 88 89 -267 11 76 -43 98 28 -204 73 62 -22 107 14
$$ packed form
4416f7P4K0j5j6kPn3J16o9n9J02n4o5J12k5p9J09m9q8K55j33o1O7o3pO0Qm4J8
4445an0K9N6J6q9R6o3m1R9j0j38J55q5o6J72j16m4J14k8j08J95r2n4O5j07M4J14
4472F3Kj21M1O6j58J80j9j47J12Kj08K30n8j54J42r5o4K15k1j84M2J3j4J07K7
4497I9j69N1J14j86J34R7k86J52N9j72J58J10l19J61j4j23K24pj60J6J00q6R4
4520D7Q8j76j6J19j28J63P6k22m6J92j79J28J53l29J01J14j71J24J09k75K9J63
4542F4j20J00J42k42r8K77j73K1K11k40j23K94k15Q9K55l30l4J96q8PJ23j84q8
4565a56K49j17K5J72j93j10J95n6q0K78k16j75K52n8p6K61k22j68K43l8jJ11j93
4588g3o7J81K0j28J53n7k08J69O5j77K10Jl56K78O5j19J41p0k32K77j1q4J29r3
$$ plain form
4612 14 -170 58 108 -33 75 50 -160 -60 153 -63 28 111 -195 -58 104 -81 -3 28 -222 -19 105 -19
4634 -19 22 53 -102 4 43 27 -9 20 -129 -1 143 -17 -10 94 -99 -56 158 -31 -5 101 -111 -50 99 -51
4658 -51 19 29 -41 -58 63 25 -13 26 -25 -92 113 44 -9 54 -91 -82 56 -23 -69 48 -37 -84 93 25 -30 7 2 -25
4686 -25 85 6 -22 -4 -16 -35 16 115 -27 41 74 -87 77 72 -48 21 -6 -66 101 -16 -17 2 -23 2 26 -6 -58 -31
4714 -31 9 -50 -63 49 -64 -19 1 -86 -34 26 -96 -51 -20 -42 34 60 1 37 22 -8 18 55 27 -4 21 29 -46 54 22
4743 22 -39 47 -39 -64 42 60 -22 -16 -45 17 28 11 -3 -21 -18 16 10 20 11 -57 -20 -14 -33 7 -12 27 -23 -22 51 27 37 27 26
4776 26 -30 73 -10 29 -20 -30 -6 20 22 46 -37 33 3 22 49 -5 -7 20 -13 -60 38 -67 -12 8 -8 -9 -3 16 -24 -1 46
4807 46 -24 34 49 -64 -27 2 -13 16 -27 -3 12 45 -49 65 -1 -30 -24 -2 21 -34 -20 75 -58 0 51 -10 72 -52 11
$$ packed form
4612A4j84K28N0j41J08k5k10J00K13k16R1Q3l06J37J62j85P8L1k50K03J24j24
4634a9M1L1j55J06L9j6l6K9j49J28J44j60PJ04j93M3K14j89K6J06k12O1J49j50
4658e1P0J0p0j7J21l8l8L9n1o7K05o9n3O3j45RJ38p9m6J17q5m7J77o8n5L7nk7
4686b5J10p9k8J8j2j9N1R9j42O8L3j61J64nj20O9k7o0J67j17jJ9k5K5K4l2n2K7
4714c1M0n9j3J12j13M5K0q7N2O0j22M5L1k2P6K6n9L6j5l0K6L7k8l1K5Qp5J00l2
4743B2o1Q6q6k5J06J8q2Ok9O2J1j7j4j8LL4oJ0ro8L7Oj9M0j9L9n0JP3k4J0j0j
4776B6n6J03q3L9m9j0K4K6KK4q3P0l0J9K7n4kK7l3m7R8j05N5K0j6jOJ9m0K3M7
4807D6p0N8J5j13L7K9j5K9m3K4J5L3r4J14o6k9OK2K3n5J4R5j33N8N1o1Q2j24O3
$$ plain form
4836 11 34 22 5 47 -87 -26 10 -10 -20 -43 -55 69 14 14 -23 2 11 1 37 1 8 27 -9 -5 54 -9 59 54 -16 -60 51
4867 51 17 -3 16 45 -4 0 -22 -33 -18 -30 -55 23 -24 -13 29 -20 -30 74 -52 -55 61 -14 11 4 20 9 -22 -32 0 -30
4897 -30 -44 -27 29 2 1 -5 60 -60 75 53 -2 14 66 -9 42 14 -53 51 30 40 -23 1 -34 27 -20 -61 -11 -1 -20 -50
4927 -50 -30 -95 -27 56 10 -18 20 -71 26 38 -75 36 56 -33 55 8 -30 11 -21 -21 15 48 -16 40 63 -56 29 63 -30
4956 -30 -25 -13 -53 20 2 -17 44 22 -64 24 3 -34 -5 -15 -18 -4 18 -7 54 25 -39 -44 34 -38 -58 29 -45 -51 127 -39 -24
4987 -24 55 -115 -5 93 -6 60 -8 -52 -28 67 34 -19 58 -48 -76 78 6 -87 69 -44 -30 64 -42 -97 74 -92
5013 -92 -106 93 8 -87 24 -82 -66 94 54 -41 72 -51 -84 118 73 -143 60 -23 -136 177 70 -42 47 -35
5037 -35 -94 159 39 -40 40 -4 -74 107 66 -103 14 -16 -135 44 99 -176 83 17 -131 92 89 -138 6 -78
$$ packed form
4836A1K3j2j7M2j34O1L6k0j0k3j2J24n5%l7K5Rj0L6l6PJ9l6MN9o3O8np0m4J11
4867E1l4k0J9K9m9Mk2j1J5j2k5P8m7J1M2m9j0J04j26lJ16p5K5pJ6j1l1j0L2l0
4897c0j4J7N6k7joO5j20J35k2n5J6N2p5N1k8o7J04k1J0o3K4l5O1m7m1N0J0j9l0
4927e0K0o5O8Q3m6k8L8r1R7J2j13J11K0q9Q8m7l8M1l2%L6L3o4N6K3j19Q5L4r3
4956c0NJ2m0P3j8j9O1k2q6Q8k1l7K9j0lJ4K2k5O1k9o4nP8p2k0Q7p4oJ78j66J5
4987b4P9j70J10R8r9O6o8m4K4R5l3n3P7j06k8J54p2r3J56j13J4R4j06n5J71j66
5013i2j4J99q5r5J11j06J6J60m0r5J13j23l3K02m5k16K03q3j13L13j07j12Q9q2
5037c5n9K53j20p9Q0m4p0J81m1j69J17l0j19J79N5k75K59o6j48K23lk27J44q4
$$ plain form
5061 -78 -171 155 69 -118 -27 -60 -147 95 126 -121 38 6 -73 121 163 -98 10 54 -96 115 162 -126 -8 25
5085 25 -145 132 173 -147 23 -2 -160 119 150 -143 -103 54 -85 8 179 -113 -69 71 -110 34 179 -141
5107 -141 -94 90 -59 70 223 -126 -56 109 -90 37 181 -65 -82 88 -57 -18 216 -61 -127 92 -23 7
5129 7 195 -85 -163 82 -93 -4 176 -106 -163 58 -51 -25 186 -103 -124 60 -24 7 116 -96 -196 54 27
5152 27 -64 184 -36 -182 94 41 -38 231 -27 -207 112 0 -16 195 -37 -209 66 22 -32 134 64 -207 24
5175 24 85 -99 124 -34 -232 66 16 -115 95 -21 -194 41 144 -93 106 34 -131 63 64 -19 99 62 -151
5198 -151 17 98 -56 45 67 -160 33 104 -39 53 23 -150 85 139 -81 27 72 -101 -45 101 -58 -71 62
5221 62 -151 30 130 -20 -88 74 -122 -46 108 -88 -30 57 -134 42 161 -3 -26 107 -102 34 193 -46
$$ packed form
5061g8r3L26q6j87R1l3q7K42L1k47J59l2p9J94M2k61J08M4j50K11M7k88J18L3
5085B5j70K77M1l20J70k5j58K79L1k93M0J57j39R3J71k92M4J40j81J44J45l20
5107a41M7J84j49J29J53l49P0J65j99J27J44k46j7J70j45L9K34k77o6K19j15L0
5129GJ88k80p8K45j75Q9J80k82n7K21j09K6K11k89k1J84q4L1J09k12j00K50k7
5152B7r1K48k20j46K76n3p9K69k58j80L19j12j6K11k32j72K75m4n4J66p0k71K31
5175B4O1j84K23j58j98K98n0j31K10j16j73K35J03k37J99p2j65J94Jq3J18l7k13
5198a51J68Q1j54J01K2k27J93P1j43R2l0j73K35N4k20J08M5j73N6J46j59j3J33
5221F2k13J81J00j50o8J62j96P6J54j96N8Q7j91J76J19j64k3J33k09J36J59k39
$$ plain form
5243 -46 -72 98 -35 -36 127 19 1 112 -40 -62 154 -4 -22 53 -96 -72 120 7 -68 28 -17 -34 86 37 -102
5268 -102 -12 6 -19 106 -8 -50 38 -9 -68 113 46 -30 -2 -50 -32 64 -6 -34 99 -36 -20 73 57 -48 1 19 -59
5295 -59 46 60 -104 -46 58 -81 30 35 -112 3 22 -92 46 -30 -52 0 -18 5 -18 1 -35 -48 45 -31 -15 44
5321 44 -31 -44 106 -36 7 103 -92 14 59 -49 -23 -10 3 49 15 -53 49 6 -38 -13 31 -9 -36 32 -18 -16 81 -76
5349 -76 -48 56 -71 15 9 -19 17 52 -36 57 47 -28 -8 14 -5 35 25 22 4 31 17 -36 84 -14 -22 64 -18 7 94 -15
5379 -15 8 89 9 -10 3 -30 10 19 40 -2 -76 43 -82 -6 -2 -18 55 29 -29 39 -20 -72 55 -17 -32 23 -7 37 69 -10
5409 -10 -40 -37 27 -3 35 -3 -7 11 20 -68 -12 1 -47 54 7 -29 10 8 9 66 -14 6 -13 19 -96 -12 28 -33 -37 -27 -34 3 -1
5442 -1 -22 66 17 -42 2 20 -52 37 25 -69 100 58 -61 57 6 -9 58 34 41 74 13 0 22 88 5 26 25 -114 11
$$ packed form
5243d6k6J70j33jJ63j08j8J11j52k2K16j58j8P5j49K4J92j13p5R6m5j7J20m9j39
5268a02R0J8k5J25j14m2Q8m7n9J81o7p6K8m8J8R6p0k8J33j35J6R3j6j05M9J8p8
5295e9J05J4j64N8J04j39J11Nj47J15J9j14J38p6k2N2j8K3k3J9l6j3R3p6J6N9
5321D4p5j3J50j42M3R6j95J06M5j08K6J3J3M6l4o8J02m3m4K5M4m0k7O8n0KR7j57
5349g6K8J04j27Q6ok8L6L5q8R3j0p5K0K2j9M0j0lj8K7j4n3J20r8qQ6q2K5Q7j09
5379a5K3Q1q0j9J3l3M0RK1m2p4J19j25P6Mj6P3k6n8O8n9n2J27p2j5N5l0M4L2p9
5409a0l0LO4l0L8l8mJ8Rq8N6J3m8J01m7l6L9kJN7q0K0j9L2j15Q4M0o1mJ0pL7m
5442ak1Q8m9n9M4J8p2Q9j2r4J69m2j19J18n1j5O7k4PL3o1j3K2O6q3K1jj39J25
$$ plain form
5471 11 45 -50 23 -9 -128 12 45 -95 -35 1 -108 0 67 -21 21 -23 -15 -13 39 46 -22 18 -81 11 120 -85 30 -23
5499 -23 -95 5 87 -33 -9 36 -68 13 58 -36 -56 16 -20 11 33 43 -31 -40 -24 -20 95 -52 -36 69 -64 -12 133
5526 133 -95 -26 38 -98 -16 107 -80 -6 61 -67 10 69 -22 -76 58 -23 -21 64 -24 -117 71 -9 -27 143 9 -91
5552 -91 64 4 -10 98 -54 -24 -19 -58 -8 71 21 -91 43 -31 -32 73 29 -111 29 26 -100 113 37 -117 55 -47
5578 -47 -40 118 -48 -89 52 34 -13 97 8 -33 47 50 -54 102 -20 -113 12 65 -94 46 44 -156 31 41 -71
5603 -71 110 -12 -163 50 4 -55 72 49 -99 4 14 -15 99 94 -128 50 111 -43 69 78 -155 8 120 -79
5627 -79 115 58 -114 65 59 -7 10 25 -164 2 90 7 25 28 -136 -22 140 -48 6 57 -150 -17 105 -37 35
5652 35 57 -112 -41 103 -36 44 19 -86 4 71 5 59 65 -78 -24 120 15 -41 71 -47 -22 111 -59 32 74
$$ packed form
5471A1L4r5P3l2j19J40L3j40O0L6j09J08O7q8M2m4QKN2Po8M0r9R2J09k05J15n3
5499b3p2J00Q2j20K4M5j04Q1M5r4k0P2l6L1K2J0p4rJ6MJ15j47J6J05j33N2J45
5526A33k28O9O4j36Q2J23j87P4O7j28P7N9r1n4J34q1KQ5q8r3J88q0j8J70j34j00
5552i1J55o0j4J08j52L0Nl9N0P9n0j12J34p4jJ05m4j40J40lj26K13p6j54J72j02
5578d7PJ58j66m1J41j8m7J10q9m1Q0Lj04J56j22r3J25N3j59J40kk00J87J0j12
5603g1J81j22j51K13m6n9J27k3j48J03J0k9J14nk22J78O1j54J12Rk33J63J12j99
5627g9J94n7j72J79oo6J7J5j89J66Q8q3J8Lj64J14J62j88N4N1k07J33J22j42P2
5652C5K2j69P1J44j39Q0k5j05R0O7o6N4Oj43N4J44j05n6J12j18K5J33j70R1M2
$$ plain form
5677 74 -87 -4 59 -26 23 39 -118 -5 51 -20 -15 -18 -65 -26 55 9 -81 32 -40 -22 83 36 -71 78 -31 -6 113
5704 113 -27 -30 29 -63 -46 137 60 -68 -18 3 -7 131 41 -148 -7 -28 -46 106 40 -65 49 35 -23 92 4
5729 4 -82 37 -25 -58 47 38 -88 -21 -68 23 5 14 -51 -25 12 -24 53 5 -70 48 18 -60 88 61 -62 11 35 -14 23
5758 23 6 -67 24 -1 19 30 35 10 -72 29 -67 35 39 -61 8 26 -74 41 23 -120 2 11 -45 26 -20 -34 18 9 -13
5787 -13 17 8 -46 -53 27 -87 0 23 -87 -3 58 -34 -11 22 -56 9 46 -68 51 70 -7 -21 48 -10 -45 -25 -30 -57 27 13
5817 13 -43 23 -25 -67 37 -50 -53 48 -74 -60 47 -17 -19 13 -11 -24 -19 -26 -4 45 32 -11 26 14 10 53 -53 -5 47 -25
5847 -25 -69 0 -2 -44 72 29 -8 -31 -63 20 28 -4 -3 18 -5 -19 -40 31 -71 -27 -24 5 8 36 -9 -6 9 -97 21 -49 -1
5878 -1 46 -17 -27 17 23 -59 -61 46 -15 -48 18 9 16 29 -56 10 14 -62 0 -19 -59 -33 -1 -36 -14 -29 3 -31 -7 -44 3 -32 -21
$$ packed form
5677G4j61Q3O3q5M9J6j57J13N6p1Nlm7L9Q1m6r0J13p2J8J05m7j07J49j09K5J19
5704A13j40lN9r2J7J83p7j28N0K1j0J38r0j89J41k1j8J52o6j05J14j4n8J15q8
5729Dq6J19o2l3J05rj26O7m7R1j8Ro5K6L7l6P7m8p5J18l0p8J48k7j23P3K4m9L7
5758B3j7p3R1k5K0J1Nk5q2J01r6J02Mj00O9J8j00J15j8j43J22Rn6P1m6j4N2rk2
5787a3L0rn4pQ0j14Q7K3j10Q4O1r2K3L3p8O5L7j14J19J9p7j4O9n8l5K0nk7Q4j4
5817A3n6O6m8m2J04q7lJ01j22J4J07o4kL2k4j3NpK2M9j3m3L7j2mM3j06M8N2p2
5847b5m4O9km2J16m3l7k3l2Q3Ql2JK1k3j4k1P1j02M4LK9LK8m5LJ5j06J18p0M8
5878aM7o3j0M4Oq2kJ07o1l3O6rPJ3q5O6Mp6O2j9m0K6L2l5K2j5L2l4K4l7M7l5J1
$$ plain form
5911 -21 16 16 9 -44 13 27 -7 64 -13 -55 33 1 18 66 -25 4 39 -38 4 22 44 -9 -3 15 4 -53 31 -75 42 -33 -25
5942 -25 21 -33 -17 64 -42 -15 7 -29 56 64 -59 -11 19 9 -20 -34 -38 -7 29 15 15 54 2 -36 30 -5 -46 35 41 -48 32
5973 32 -42 23 43 -85 9 65 -72 33 36 -54 -48 17 -7 -19 69 -29 -32 -8 -8 -64 40 -28 -48 15 -55 -5 72 -87 -15 29
6003 29 -37 5 53 -26 -65 11 -11 -30 20 -45 -36 31 43 -11 92 47 -117 16 33 -57 43 -29 -74 68 17 -56 71 -110
6031 -110 -65 -26 0 -50 5 -7 -80 25 48 -48 46 30 -63 44 83 -46 18 54 -131 60 13 -70 80 -20 -28 60 17
6058 17 -36 33 -15 -95 45 17 -34 7 31 -129 17 106 -83 9 32 -156 45 101 -97 16 -40 -55 61 84 -45
6083 -45 24 30 -88 3 97 5 -26 64 -91 -32 143 -33 18 81 -111 -36 116 -71 16 16 -144 -3 58 -78 -21 16
6109 16 -85 49 42 -50 -101 35 -52 -44 84 -57 -81 63 -107 7 140 -35 -72 68 -96 -20 131 9 -15 6
$$ packed form
5911b1L7%pn3N7J4l4P1p7m2Q8l2J7M8r1K9L5p7M2J8K2n3OJ8j1n7Q4j06J17p5Q
5942b5M6n4J6Q1j06K7K2l6Q5Qj23M8L0j0k9j4mL1L6j4%L9n2l8O6l5m1Q1Oq9Q0
5973C2p4O5K0j28R4N6j37J05Lr0OO5k4j2Q8r8lK4%n6J04o8k0O3p0N0P7j59P2M4
6003B9o6M2M8p9l9P6k2j9N0o5RO7J2n4J03m5j64J33J7r0J00p2m5J42n1p3J27j81
6031a10M5L9K6n0N5j2p3J05K3r6R4j6r3J07L9j29O4L6j85J91m7q3J50j00qQ8m3
6058A7n3O9m8q0J40k8n1M1K4j60J46Q9j89R2K3j88K01N6j98J13n6j5J16K3j29
6083d5O9Oj18R1R4r2l1R0j55N9J75j76N1O3j92P5J52j87Q7%j60J41O1j36N7L7
6109A6j01J34pr2n1J36q7QJ28j41k4J44j70J14J33j75l7J40j64P6J51j22k4K1
$$ plain form
6133 6 -32 -28 90 61 -47 36 -23 -27 166 -24 -15 61 -81 -61 135 -9 -67 12 -56 -37 133 -8 -52 24 -30 -20 40 -24
6161 -24 -86 11 1 -50 78 -2 -107 47 -12 -85 123 18 -93 55 34 -16 141 28 -87 11 30 -20 128 28
6185 28 -122 21 -12 -20 42 52 -81 -18 26 -85 86 37 -129 11 -23 -70 79 40 -71 -6 -42 -58 17 59 -32 -4
6211 -4 96 -12 -12 51 -107 -36 58 -33 116 86 -77 24 41 -61 59 7 -90 10 -27 -53 37 51 -93 -10 24 -44
6237 -44 -26 89 -40 -24 30 -57 -2 40 -60 24 -9 -51 -6 45 -59 -7 37 -16 82 65 -46 -23 54 96 -6 44 -27
6264 -27 -80 69 18 -24 71 -43 -40 125 -3 -32 66 -66 10 33 -24 -29 11 5 -54 8 13 -41 15 34 -52 57 10 -58 -25
6293 -25 -24 -66 40 3 -39 43 -25 24 75 28 -16 39 -8 -9 40 48 -32 -38 -4 -12 5 62 -6 8 7 -86 40 27 -83 27 -35
6324 -35 -14 40 -52 -38 11 -63 2 -39 19 -18 0 19 -28 3 38 -25 17 20 -22 40 47 -5 31 36 -26 71 28 4 57 56 -22 2
$$ packed form
6133Fl8MJ18k9j08Q3n9mJ93j90RP6j42K0J96j44n8P9o8J9J70j41m4P6n4J0O0o4
6161b4o2R7j0n1J28q0j05J54n9p3K08j05j11J48k1n0J57j13j15R8J9n0J48j00
6185B8j50J43l3qO2J0j33O3M4j11J71m9j66J40l4m7J49l9j11O5l6j6P5M2r1K8
6211dJ00j08%O3j58P1R4r1J49l0j63J01J7j02J20n2r7J00l7k6R0J4j44Q3L4o8
6237d4J8J15j29J6N4q7N5M2j00Q4l3m2M5N1j04N2M4n3R8j7j11K3P7M2j02N0p1
6264b7n3J49n1m2R5j14LJ65j28k9R8j32P6K3n7nM0on9O2Nn4N6J9q6J09m7o8L3
6293b5Jm2J06l7m2Q2o8M9N1m7m4N5m7jM9Qq0oL4qJ7N7o8J4jr3J26j3j10J10o2
6324c5K1N4r2J4M9p4O5m1N8l7J8J9m7L1L5o3M2Lm2O2Pn2L6No2R7m3k4N3jp8K4
$$ plain form
6356 2 -3 22 -23 20 -35 -28 -43 -57 -80 90 -59 3 3 -23 -46 -48 -8 -20 -20 -2 -11 23 40 -44 -19 -25 -3 3 89 -15 53 44 -11 68
6390 68 -5 -1 84 -27 11 58 -16 -26 12 12 -24 1 2 -22 22 26 -18 42 40 -33 -57 -38 -48 1 -25 -36 26 -10 -50 15 -91 28
6422 28 57 -41 -19 -34 9 34 14 28 -23 42 43 -76 7 59 5 74 31 -42 16 39 -39 30 -13 -33 28 -16 -16 -4 -39 -99 3
6453 3 25 -32 -28 30 -33 -60 34 -57 19 -14 -52 78 23 -64 37 3 -47 17 38 -29 131 2 -34 -39 14 -41 17 -28 -27 -29 87
6484 87 -27 -24 39 -91 -9 27 -18 34 32 -27 4 -13 -20 -14 -36 -55 37 -4 13 -2 -53 -43 -20 92 42 -26 55 -37 14 97 -5
6515 -5 -36 58 -49 12 52 -10 27 46 -75 -50 10 1 46 26 -86 -15 105 -35 -73 11 -83 -42 55 -37 -34 57 -81 -50 82
6544 82 -24 -65 19 -117 -50 65 3 -23 43 -108 -39 66 38 -26 145 -94 -95 79 18 -68 72 -31 -141 124 -46
6569 -46 -16 46 -5 -53 67 54 -102 11 -13 -39 40 12 -96 33 51 -132 136 25 -83 57 -22 -105 69 99 -54
$$ packed form
6356BnK5m5M3n5Pj5j4k3J70j49O2%k6k3kM0j2%J8rL4J7q4K5oK2OQ6j04O8rn5P9
6390F8p3MQ5j11L8M7p4j0L8%l6K5Jk4M4Mm4O0kp3k4J9j0M9k6j1O2l6m0O5j06J19
6422B8K9r8K2j5M3K5k0J4n1O5Jj19Q3N2n4O9m3p3N8K3p8O9m3k0O1m4%J2l5o0J02
6453CK2n7MN8o3k7R4r1P6l3l8J30n5q7J01l4n0O4K1o7J60j29l6nN3n5N8m5JkJ16
6484H7j14LO3j30Q2L6m5N2kn9L1j7pOk2j9R2m1J7j5n1J0K3J12n0o8Q1r2N1Q3j02
6515el1R4j07O1M0o2L7J9j21K5O0rM5k0j12P1J20j40l8Q4r4M1R7r2LR1j38L1J32
6544H2j06m1Q4j36O7J15o2k6O6j51O9J05k8o4J71k39jJ74o1q6J40j03j10K65j70
6569d6L0O2n1m8J20j3j56J13k4k6P9k8j08J29J8j83K68j11j08J40p9q3J74L0j53
$$ plain form
6594 -54 58 18 -40 112 -11 -41 41 -20 -49 61 42 -80 -42 27 -48 58 43 -87 60 11 -61 33 99 -78 28
6619 28 -16 -55 65 21 -69 -53 15 -39 23 98 -49 31 26 -125 9 84 -52 24 49 -30 71 90 -53 -60 -3 -63 32 91
6647 91 -78 -20 29 -22 58 32 -3 -57 21 -49 -33 45 -71 -77 -11 -21 -13 106 -83 -34 25 -26 43 60 -70 -56 7 13 12 51
6677 51 -5 -46 11 -26 -10 119 -22 -83 83 -10 -24 88 -24 -36 79 30 -19 40 -54 -91 39 -7 -7 3 -9 -85 -22
6704 -22 16 -15 -5 41 -86 -42 37 -73 21 -24 -19 40 10 4 25 -49 -80 48 29 29 32 35 -41 -13 57 -52 -26 4 -42 -9 -73
6735 -73 33 10 -20 -71 16 67 -25 30 -35 -93 21 26 -38 12 -6 -53 -17 19 -36 56 -18 -32 -17 21 -46 -3 -9 -29 -19 56
6765 56 -42 27 22 -44 7 6 8 60 40 -60 15 56 39 -32 -4 -6 -1 80 -59 -25 34 -54 -12 7 -43 -58 -40 -4 -11 -50 -35 -15
6797 -15 -25 -39 -30 29 35 42 55 95 -10 32 35 -7 65 -3 25 37 44 -15 -32 7 -4 35 -36 -60 -41 -1 -25 21 -11 44 7 -21
$$ packed form
6594e4J12m0n8J52j23l0Q2o1k9J10j9j22L8O9p5J06j5j30J47m9p2R4O6j77J06
6619B8m4l9J20m4r0J6O8n4O2P5j47Q0nj51J34P5j36P6K5p9J01J9j43pN7o0R5N9
6647I1j69N8M9n1Q0k6l5n4P8p0J6P8j16oO6j0QJ19j89M9N9n1O9J7j30J4O3OjL9
6677E1n6m1N7l7J6J29j41o1J66r3j4J12j12j2J15m9m9N9r4l7J30m6%J0j2p6O3
6704b2L8l1J0M6j27M4P9j10R4m5NN9l0oK1p4l1J28j9%LLp6K8P0j09K6L0m6L3o4
6735g3J06k3l0n1Q7N1r2N5o5n8J14No4N0j8m7L6L6n5R2p4j4J5L8o7M3ok0J0P5
6765E6r8O9no6N1jKN2k0j00P5M1j7p1K8kNQ1j39L4N9q8M2J9n0j5J8L6pl9J5K0
6797a5j0j4RN9OPJ3M0j05M2Lm2P2o8K8J2Pn9j7L9j1L9p1k4J9M0k4M6l2N5l7k8
$$ plain form
6829 -21 -30 45 -17 -15 -33 -14 -21 58 -19 -11 -26 -19 4 -26 36 -21 11 -26 -13 1 7 34 -57 21 41 -21 -23 -47 15 27 -5 -9 -19 -35
6863 -35 13 42 15 -13 -36 -11 -2 18 -45 5 -39 -22 -53 17 -105 -30 3 27 3 -10 -30 -1 24 7 -38 67 23 28 -19 -61
6893 -61 41 -12 17 -22 59 48 4 81 3 -8 61 -2 -19 -2 -18 17 39 -22 21 48 33 -36 12 33 -23 33 27 3 5 -62 -59
6924 -59 -49 -4 -31 20 39 5 -53 -15 -61 48 -36 -36 -35 -44 3 26 -11 -1 -2 22 -22 12 1 -9 6 34 4 31 43 -39 26 10
6956 10 -40 8 -35 -11 -12 4 -17 -18 -10 -41 -21 -58 -7 27 2 -7 -5 18 -40 -27 80 -7 6 21 21 41 67 -5 -21 -53 -42 35 -22
6989 -22 41 64 -3 -6 5 18 -9 -3 32 -32 37 -13 -8 -24 -12 -32 37 1 25 -23 -18 -48 36 16 -38 -28 5 18 26 -19 -36 20 8
7022 8 13 49 3 47 10 -42 -23 37 21 -32 -3 -20 2 29 -9 -5 6 -15 7 0 -7 34 40 -16 59 18 27 -33 -12 -8 -48 -41 26 2 7
7057 7 -10 -15 8 63 -10 3 -9 11 56 -65 -49 -32 -38 -2 77 28 -27 8 31 13 46 1 -43 14 26 -30 -8 -10 -48 -21 14 -57
$$ packed form
6829b1rP5o2Kj8J9pP9p7Qj5PK3l0O2n7L2l7J3J4OK7r1P8K0o2kk4O2J2l2mj0j6
6863c5M8K9k7k8k3K5RK0o3N0m4J7l1P0j22P5L3K4k4j3k0K9K5j7m5J05m4Nm7m2
6893f1J02n3K9l9Q1j1m4P7p8j1O9o3j7J7j6L5K2o1M3K7j5o9M8K1n6N6ok4Ko7L
6924e9J0M5k7N1J9l4n8L8m6J09q4%JrM7K3l7J0jK4m4L4j1j0J5K8l0K7J2q2O5j6
6956A0n0M8m3K4jJ6k1jQl1K0l7N1L4k5rKK3n8J3J07q7J3J5%K0K6p2j6l2J1P7n7
6989b2O3K3o7lJ1J3k7OL5o4O9n0Nj6J2k0O9l6K4m8Nl0Q4k0n4J0L3J3Qm5j7N6j2
7022HNL6m6M4l7n2J9O0j6n3K9j7K2K7l8MJ1k1K2ppM1On6P5m1Ro0K1Mm0PO7k4N
7057Gj7nK3N5p3J3j2K0M5j21J6J7oL6P9m9n5L5K3j8L3m5m4N7J2n6K2kl8K7L5p1
$$ plain form
7089 -57 6 -29 -52 -11 -5 -17 10 31 -27 15 -31 6 14 70 -20 20 4 37 29 7 13 31 4 -26 29 29 -17 -8 26 2 3 -9 -77 -28
7123 -28 2 27 13 29 -44 14 -6 -2 2 66 -36 -4 -17 22 15 -25 -46 -70 40 -38 -7 -42 18 -2 34 -31 39 41 -20 -49 30
7154 30 55 43 -3 28 -21 57 34 9 62 36 -39 40 -9 -47 -4 0 -37 20 -1 9 31 4 -18 -12 -28 -48 7 51 -59 -59 10
7185 10 0 -27 -7 -49 36 -5 21 -36 43 -25 57 -4 1 10 -22 -26 4 52 -1 43 -3 -8 -27 -3 -42 33 -4 -18 -17 -23 -30 -22 -60 -30
7219 -30 30 25 -12 16 37 -42 7 4 -6 36 19 -33 -2 9 -10 23 22 -45 -9 52 30 -7 13 40 0 -16 -5 37 23 -82 67
7250 67 8 4 -47 25 -12 1 -8 -14 -45 13 -21 40 4 -44 -14 9 -5 -6 75 -13 -1 -9 5 8 52 43 29 38 -10 2 50 16 -17 5
7284 5 -26 29 42 15 33 8 13 -8 38 76 -38 -25 -13 10 54 2 -16 -4 16 17 9 3 -70 -11 -28 -13 -9 28 -94 -16 14 8 12
7317 12 39 40 37 32 11 -3 -15 -38 10 78 27 0 16 -21 22 12 25 15 -2 -22 -71 -35 -28 -9 -19 -24 -55 -16 -3 7 9 -22 15
$$ packed form
7089e7O3l5k3M1Oj2K7K1n8M2m6L7QN6r0M0j6L3qk2OJ8k7l0N5%m6RL4k4Jj2o8M9
7123b8L0K5j4J6p3N8k0MMO4j02L2j3L9pm0k1k4J10p8L1l5O0k0L6o5P0Ko1k9P9
7154C0K5j2m6L1m9P8k3k5N3k6p5P9m9l8M3Ml7N7k1J0K2k7k2Oj6k0N5M4j10%O9
7185A0j0k7K0m2Q5m1K6n7P9o8Q2o1NRl2mL0M8n3M4m6nj9K4l9P5l7j4JopQl8L0
7219c0O0nl7K8K1p9M9lj0M2j7n2L1J1j9L3jo7L6O1k2l7K0K7m0j6J1M2j4j05J49
7250F7n9mn1P2l7J3rol1N8l4O1l6m8L0K3j4jQ1q8J2qJ4LM4rj4Rm8J2M8l4l3K2
7284El1N5J3k7J8k5Nk1M6L8j14J3J2K3M4n2j8J2K0Jqop3N9j7J5ML7j22P8L0oM
7317A2K7Jlnk1j4j2k3M8O8n1k7J6l7M3j0J3j0j7k0m9L6PJ9j0nl1L9J3J0Kl1L7
$$ plain form
7350 15 -14 -4 -3 -15 48 35 -29 2 -45 4 -55 0 -55 41 -13 41 23 27 67 -91 38 -1 -19 -15 44 10 -78 -3 18 3 -61
7381 -61 12 -50 -2 -7 30 -38 -10 5 -21 4 19 -15 -79 -60 -26 -34 -38 37 -33 6 15 -9 2 21 14 11 -44 -2 2 12 31 -47 37 63
7415 63 -11 17 -10 -2 49 11 -35 25 -19 -77 -6 -22 -40 -29 25 -52 -31 -58 29 -10 7 25 -37 36 -23 -29 -2 11 10 4 -32 30
7447 30 -14 -30 -17 -7 -22 -60 11 19 -25 3 -15 -64 52 -26 19 -21 -40 9 3 -2 -81 1 23 -30 41 -74 2 0 6 26 5 1
7479 1 8 -6 -27 -61 21 -34 12 26 51 -44 -2 45 22 7 -32 4 -19 6 38 11 5 -23 38 3 -24 15 -24 -22 -26 1 -28 70 -35
7512 -35 -38 6 -20 -31 -16 -51 -44 8 -35 5 -1 -22 -16 23 -2 46 14 52 5 -7 61 -10 -14 35 -43 32 -22 -22 10 4 -70 35 -12
7545 -12 -8 -8 -55 14 39 -10 -61 1 49 -10 -89 -22 -89 -5 21 -20 0 -1 5 0 36 19 12 -15 -6 14 13 3 23 41 22 34 -34 -17
7579 -17 -7 -9 -26 -13 11 5 -10 3 19 55 -65 39 -75 8 15 -15 23 -42 4 0 -24 7 -78 -15 -6 -4 -8 -4 4 -54 11 -26 -14
$$ packed form
7350A5k9J0Jj2O3j3o4L1m7M9n9N5n5R6n4N4j8MM0j58J29l9j8MN9l4q8P5K1j5o4
7381f1P3o2M8nL7o8K8J5k6K5J5l4o4J9L4qmP5p0L9Rk4J1J9pln5M2MJ0J9p8Q4K6
7415F3p4K8k7QN1l8m6O0m4n8P1j6j8J1N4p7K1k7Q7l9J7J8o2P3n9oK7J3jol6O2
7447C0m4j6J3J0j5l8P1Qm4K8j8m9J16p8M5m0j9M9onp9Q2K2n3P1j15P6kOK0k1m
7479APj4k1l4Q2n5M6J4K5r5M2M7k3j5l9L6k3K5L2k7ok8O1l5k7L9l9KmK7k9R8j05
7512c5lM4k6j1J5l5PN2m3M0ok1OL9k5M8l2L8m7j2O8p1mM9p8P5n4%L2op4J05m7
7545a2M%m7O9K5m9n1O2M8n9p9O7o7Q4K6m1K0jOnL6j7pk7RK0jj0K0J8j9J2o8J7
7579a7J0kj7J3K4oj5J3J6L6j20J04j14Q3Pl0L8o5M6mk4L1q5O3RKmMQn8O5l7J2
$$ plain form
7612 -14 -17 -16 5 20 56 23 -48 27 52 5 15 24 11 15 5 51 -19 -38 -32 -1 -40 -2 -28 -41 -56 7 4 -23 -18 -9 7 -46 -64 -36
7646 -36 32 -33 -5 -13 7 -67 8 -27 35 30 -22 38 13 -7 21 2 -12 44 -35 25 -4 -17 -33 -33 14 4 4 2 9 -29 16 13 -27 -58
7680 -58 4 -7 -3 17 -25 -13 -26 -62 -25 -27 5 53 50 22 -16 31 -12 -55 -6 66 21 0 10 -5 -26 1 -12 76 -48 -4 0 -9
7712 -9 7 -6 36 -6 19 4 7 -12 21 -19 -9 -27 -44 -1 8 -12 26 4 -16 42 11 21 -16 5 33 -16 22 -38 21 3 -61 23
7744 23 16 6 28 -50 -11 12 -9 -13 41 16 43 -7 -2 -8 -6 -20 -45 -19 20 -46 -8 26 -19 9 -3 10 1 -2 -48 -37 -45 -2 -10 5 48
7779 48 -39 -30 -25 -7 15 -33 10 51 -5 3 -59 34 39 15 -2 -14 24 -21 -10 -9 8 -37 41 -39 -23 29 2 -33 -24 9 -27 -21 -53 6
7813 6 37 -7 22 26 -38 1 -8 35 -20 -11 32 10 -37 25 -42 46 -15 -40 21 69 25 60 35 -4 17 -28 -19 -20 -24 22 1 -35 -21 7
7847 7 -17 -8 -11 -47 -20 7 2 -17 7 20 -53 46 36 6 12 18 16 7 12 22 5 -12 11 22 40 -9 -27 -5 36 -13 19 -8 40 23 21
$$ packed form
7612a4lJK1J5L6l3p1P5K5m7J0Rj3Mj0M6p0j9OL1l9L8k6j3j5O3lk7NRJ6n3j8K8
7646c6O8o5K8qK0p4P5l5O2nn2O0k5k0K8j9j4N6p9O0k9j3j6%M7j0%kPl8M5lm0l1
7680e8O2j1MK0m2J2j3l6L7kL2M8lk8l8M7m3m3M9P2m5k1J0j5k1K7j3Q8j24M4Mr
7712iJ6j3M2m2K5j5Lj9L3m0J0j8j7M3Rk0L8k2k0N8l1J0l7K1K8m9L8o0N9j8o4Q4
7744B3pj0K2p8L9K3k1mN4k5K7n0NoKj4k5K6L9o6L8L4m5K8j2J3rlm6J1qM3qJ5M3
7779D8q7RNJ8K2m8M3M1n6Qo2R3Nk4j7j2L8m5J1JJ7m5P8q0J6N2k7l5RL3l6Ol2N9
7813FL1m4K9Mo4L9rM3n5RM3k2m7O2o7Q8o1k5O1M8m4L5k5l9K1m5RjmM6k1l6J4K8
7847Gk4Rll6K7K7nj9K4J3p3R9j0l0OOkrNJ0j7j7K3J1J8m9j8K2M1m9L2k7M8j7k
$$ plain form
7882 21 -50 21 -5 -20 -40 27 -19 -62 -19 -34 -51 -14 -49 18 -40 -43 1 14 0 -20 -66 -39 23 -54 24 -14 -19 -21 29 5 -4 39
7914 39 -22 15 51 14 -23 35 -5 35 -31 -25 -25 28 -20 -40 37 -50 -53 24 -49 -8 56 -45 -30 -23 8 -86 3 40 -33 27 30 22 17
7947 17 35 -35 -27 -8 34 20 -58 -8 33 -32 4 -2 13 40 7 13 -42 -20 -35 8 10 22 -9 -34 -37 7 -35 -5 -32 -20 1 -82 -57
7980 -57 10 -60 5 -13 3 -11 -49 11 -16 -59 -25 -24 52 15 -19 5 2 20 31 5 -28 1 27 10 84 -6 16 51 -71 38
8010 38 -30 9 -17 38 41 -27 72 1 -45 -16 -24 -15 25 -57 10 -19 -34 -13 -19 -4 -43 22 22 -27 9 9 7 41 -17 -35 -29 45 41 44 15
8045 15 3 32 -14 -1 9 -22 -17 -1 -23 -3 22 20 -44 -9 12 -15 -16 12 -21 -37 -25 2 0 1 -36 14 53 17 -31 -27 25 39 -28
8078 -28 0 13 8 -43 20 12 -11 13 25 -3 -6 8 -45 24 -19 -36 -32 10 -61 2 -24 -2 -15 7 -10 1 -2 -25 -55 -30 -36 -28 10 -2
8112 -2 -26 20 -45 -29 21 -26 32 9 0 -9 25 2 26 -30 19 -10 41 8 51 -28 0 8 70 -15 -11 50 -32 0 -26 14 -47 42 0
$$ packed form
7882B1p1P1k6j5k0O7m6m3M3j5j7L7l5O7n8lM4J3j4k0m6K7O2p7P8l8nkN0k4rM3
7914C9o1L7L6l7l7N8m0M0o6O%N3m8k0P7q7lP7p3M1O4j01J5PL1r4Q9L7p3O0Lqn
7947A7J8p0QJ9M2j4p8N0M1o5L6oJ5K7l3On5K2j5M3KJ2l1k5lM4m2L0k7J2K1q3K5
7980e7O7p0O5j8J6j4l8O0k7m3L4JP6l7l4K4lJ8J1k6l3K9K6j7P4r0K2L5j22J09
8010C8o8L9k6N5Lo8R9p1m6K9qRM0q2O7k9j5K1oJ5l9O5%m9L6%kL4n8j8OP4mLk9
8045A5j2K9m6J3J0l1NJ6k2K0K5ko4L5K1k7jK8l3j6J2K7kJl7N0L9l6m8MN2J4o7
8078b8K8J3nn1O3qk3K4J2k8lJ4n3O9m3j7MM2p1O3k6K2j3K2j7J1lk3l0K5oQL8j2
8112bk4M6o5J6N0m7N8k3rrL4k3K4n6M9k9N1l3M3p9K8QO2q5MO1q2L2k6M0o1Q9m2
$$ plain form
8145 0 -3 42 -24 -53 -36 -54 -10 -26 -69 -8 -56 -62 -11 -19 55 -4 52 -62 -41 -11 -10 9 40 28 14 56 -7 3 3 -20 9 5 3 -37
8179 -37 7 -15 -65 24 -53 15 1 -44 -20 26 5 -77
$$ packed form
8145@lM5o6k9J7j8M4j6m3O1m8oN1qP4n9N6j14K1L0JJ9L1j2j4M2o3J0%k3K9mkm0
8179c7M4k2n0Q9p7O8j4m5K4M6k1q2
8191g7
$$ Imaginary data points
##PAGE= N=2
##DATA TABLE= (X++(I..I)), XYDATA
$$ plain form
0 0 0 0 0 0 0 0 0 0 0 0 0 0 0 0 0 0 0 0 0 4 -8 8 -8 8 -8 8 -13 14 -16 20 -21 22 -28 29 -35 39 -43 49 -53 60 -67
41 -67 74 -82 90 -99 109 -120 133 -147 161 -176 194 -216 238 -265 293 -327 366 -412 466 -534 618
62 618 -728 871 -1077 1379 -1872 2772 -4778 14570 -113165 -289328 58504 322888 28126
75 28126 -149715 -133842 -91046 193049 244287 -135986 -236974 -19939 79456 181050 124095
86 124095 -233919 -231918 122130 168543 100563 -2292 -270993 -129559 235988 147459 -8441
97 -8441 -75787 -220773 -24008 260696 97660 -97390 -107818 -119604 49946 225173 25487
108 25487 -155998 -58739 -22760 44850 168702 -21696 -166033 5279 29603 22148 104931
119 104931 -59020 -118928 65762 28258 -22223 56902 -38731 -66526 70261 22955 -56196
$$ packed form
0@%%%%%%%%%%%%%%%%%%%Mj2J6j6J6j6J6k1K7l0L6m1M3n0N7o4P4q2R2j02J13j27
41f7J41j56J72j89K08k29K53k80L08l37L70m10M54n03N58o20O93p78Q78j000J152
62F18j346J599j948K456l251M644p550J9348j27735j76163L47832K64384k94762
75B8126j77841J5873M2796K84095N1238l80273j00988K17035R9395J01594n6955
86A24095l58014K001L54048M6413o7980j02855k68701J41434L65547q8529j55900
97h441o7346j44986J96765K84704j63036j95050j0428j1786J69550J75227j99686
108B5487j81485R7259L5979O7610J23852j90398j44337J71312K4324p455Q2783
119A04931j63951n9908J84690l7504n0481P9125r5633k7795J36787m7306p9151
$$ plain form
130 -56196 18112 6179 -24489 58052 -2438 -91364 34616 52768 -30199 37291 -17314 -97397
142 -97397 55626 71299 -29029 9368 -42712 -68103 80601 65415 -42375 -17149 -30009
153 -30009 -38400 69977 66084 -51569 -42335 -5270 -16301 61463 53141 -73298 -30718 22001
165 22001 -20493 51219 40912 -74853 -17735 26749 -11620 38064 16762 -56781 -2613 25764
177 25764 -13289 14917 21001 -35773 -12615 31068 -12180 -5102 28184 -25301 -8857 29247
189 29247 -30046 557 40827 -28980 -9162 22373 -27242 4838 31742 -15307 -8570 2585
201 2585 -16125 10665 27795 -11936 -21458 8415 -3624 -3094 30974 -7495 -30697 12842 -1523
214 -1523 931 29502 -21072 -21631 19837 -6631 2809 21200 -17238 -14510 9430 2700 4270 5495
$$ packed form
130e6196P4308j1933l0668Q2541o0490q8926J25980J8152q2967O7490n4605q0083
142i7397J53023J5673j00328L8397n2080k5391J48704j5186j07790K5226j2860
153c0009q391J08377l893j17653R234L7065j1031P7764q322j26439M2580N2719
165B2001m2494P1712j0307j15765N7118M4484l8369M9684k1302p3543N4168K8377
177B5764l9053K8206O084n6774K3158M3683m3248P078L3286n3485J6444L8104
189B9247n9293L0603M0270o9807J9818L1535m9615L2080K6904m7049O737J1155
201B585j8710K6790J7130l9731r522K9873j2039N30L4068l8469k3202M3539j4365
214a523K454K8571n0574n59M1468k6468R440J8391l8438K728K3940o730J570J225
$$ plain form
228 5495 -8910 -10644 8985 6721 -8499 8646 477 -18942 12778 8015 -13040 10781 -3780
241 -3780 -11061 15786 -5649 -7247 13915 -6712 -5961 7436 -1652 -1512 673 1705 -323 -3125
255 -3125 2434 -2457 2313 5814 -10921 2363 7999 -10856 5882 5759 -10893 4605 -187 -3210
269 -3210 9284 -5790 -4195 5997 -3313 1078 1496 -991 1065 -5039 3383 3985 -5273 2791 -1945
284 -1945 -1829 6767 -5694 337 5757 -7965 2493 3813 -4598 3878 -2958 -1564 6161 -5147
298 -5147 378 2934 -3985 3440 -1925 -831 5021 -6234 1030 4305 -4671 2961 -1303 -1948 5375
313 5375 -5220 485 4900 -5641 2025 944 -2264 4368 -4631 -148 5290 -5721 1794 2204 -3623
328 -3623 3526 -3013 -215 5044 -5827 1491 2907 -4219 3552 -1771 -1229 4724 -5367 1229 4102
$$ packed form
228E495j4405j734J9629k264j5220J7145q169j9419L1720m763k1055K3821j4561
241c780p281K6847k1435j598K1162k0627P51J3397r088J40K185J032k028k802
255c125N559m891M770L501j6735J3284N636j8855J6738j23j6652J5498m792l023
269c210J2494j5074J595J0192r310M391M18k487K056o104Q422O02r258Q064m736
284a945J16Q596j2461O031N420j3722J0458J320q411Q476o836J394P725j1308
298e147N525K556o919P425n365J094N852j1255P264L275q976P632m264o45P323
313E375j0595N705M415j0541P666j081l208O632q999M483N438j1011P515M10n827
328c623P149o539K798N259j0871P318J416p126P771n323N42N953j0091O596K873
$$ plain form
343 4102 -5010 2576 -103 -2475 4242 -3411 120 3438 -4275 2035 166 -1739 3914 -4345 720
358 720 4023 -5655 3355 1125 -4448 5234 -3265 -1986 6553 -5004 -242 3994 -4188 1563 475
373 475 -1097 2587 -2886 467 1048 -1564 3283 -3089 -17 3996 -6838 3537 4878 -7825 4018
388 4018 573 -5828 7386 -1556 -3929 5477 -4353 -1772 5439 -794 -1255 -941 140 -262 2 4716
404 4716 -3544 -2775 4471 -5614 3109 7719 -10250 1321 4693 -8671 7438 4232 -9234 3741
418 3741 -581 -4482 7457 1400 -5166 -528 1022 -1026 1227 5766 -4619 -5507 6163 -3763 727
433 727 10432 -10523 -3410 8792 -8553 4461 9616 -11959 -440 4376 -5774 6590 4805
446 4805 -8010 -2091 2684 -1497 1918 7343 -5494 -8884 7296 -742 -1996 12011 -8545 -9467
$$ packed form
343D102r112P586k679k372O717p653L531L318p713O310j869j905N653q259N065
358G20L303r678R010k230n573R682q499J279Q539j1557M762M236q182N751j088
373D75j572L684n473L353N81k612M847o372L072M013j0834J0375J341j2703J1843
388D018l445o401J3214q942k373R406r830K581P211o233m61L14J081m02K64M714
404D716q260P69P246j0085Q723M610j7969J1571L372j3364J6109l206j3466J2975
418C741m322l901J1939o057o566M638J550k048K253M539j0385q88J1670r926M490
433G27R705k0955P113J2202j7345J3014N155k1575J1519M816j0150J2364j785
446D805j2815N919M775m181L415N425j2837l390J6180q038j254J4007k0556r22
$$ plain form
460 -9467 10659 -5158 965 13245 -12524 -6350 8921 -4978 3648 8969 -9504 -6150 4944
473 4944 281 1272 7320 -5095 -11291 7031 3456 -3879 11062 -5603 -14460 11375 802 -3568
487 -3568 13384 -9555 -11881 11419 -813 -207 9721 -8745 -9281 6818 3080 -48 5605 -4183
501 -4183 -12111 6253 7641 -5195 7380 -1954 -16504 9944 7091 -7087 10341 -5211 -14985
514 -14985 11523 3787 -3871 8807 -6607 -11399 7866 5559 -2004 3790 -2658 -11506 4523 10259
528 10259 -4757 2720 768 -15323 6720 11458 -8108 5597 -900 -15725 9437 8406 -6166
541 -6166 5512 -3871 -11548 7278 7608 -2526 876 -2207 -9188 3145 11277 -3428 -2061 1960
555 1960 -11726 3390 13886 -7221 -145 2242 -13572 6577 11236 -7161 1908 -1160 -10252
$$ packed form
460i467K0126j5817O123J2280k5769O174J5271j3899Q626N321j8473L354J1094
473D944m663R91O048j2415o196J8322l575p335J4941j6665q857K5835j0573m370
487c568J6952k2939k326K3300j2232O06R928j8466n36J6099l738l128N653r788
501d183p928J8364J388j2836J2575r334j4550K6448k853j4178J7428j5552r774
514a4985K6508p736p658J2678j5414m792J9265k307p563N794o448q848J6029N736
528A0259j5016P477j952j6091K2043M738j9566J3705o497j4825K5162j031j4572
541f166J1678r383p677J8826L30j0134L402l083o981J2333Q132j4705J367M021
555A960j3686J5116J0496k1107P076K387j5814K0149M659j8397R069l068r092
$$ plain form
568 -10252 6573 8168 -3516 -883 -1320 -6489 2469 9979 -2349 -4865 2416 -7031 668 12948
582 12948 -5334 -4097 4183 -9558 3347 11769 -7160 -1189 1621 -8192 5030 7962 -4106
595 -4106 -1966 -653 -3756 2235 7323 -1244 -5731 1599 -2660 -838 10236 -3081 -6622 4656
609 4656 -5262 431 10741 -5799 -3713 3320 -5792 3324 7112 -4527 -2169 123 -2321 2315
623 2315 4756 -1094 -4971 805 237 -1268 6831 -1168 -7275 4068 -1419 -1524 8584 -4255 -5169
638 -5169 4630 -3565 1457 6355 -4931 -2365 1509 -1562 2211 2889 -1707 -3412 270 1721 -688
653 -688 3258 30 -6231 2909 1337 -2646 5885 -2329 -5653 4750 -1418 -519 5347 -4199 -2292
668 -2292 2624 -1488 1720 1894 -2233 -1597 114 1664 -18 869 678 -4347 1496 2882 -2949 3290
$$ packed form
568a0252J6825J595j1684K633m37n169Q958P510j2328k516P281r447P699J2280
582A2948j8282J237Q280j3741J2905Q422j8929N971K810r813J3222K932j2068
595d106K140J313l103N991N088q567m487P330m259J822J1074j3317l541J1278
609D656r918N693J0310j6540K086P033r112R116L788j1639K358K292k444M636
623B315K441n850l877N776n68j505Q099p999o107J1343n487j05J0108j2839r14
638e169R799q195N022M898j1286K566L874l071L773O78m596j705L682J451k409
653f88L946l228o261R140j572l983Q531q214l324J0403o168Q99N866r546J907
668b292M916m112L208J74m127O36J711J550j682Q87j91n025N843J386n831O239
$$ plain form
684 3290 -268 -5390 4115 254 -2126 4540 -3134 -2649 3585 -1452 657 1936 -2550 -631 463
699 463 937 703 -611 481 -2229 89 3175 -2234 1011 1130 -4469 2818 1704 -3040 3182 -1416
715 -1416 -2979 3661 -954 -445 2038 -2475 -27 965 -234 1035 -941 -51 -240 -791 2482 -1187
731 -1187 -820 2059 -3024 1065 2546 -3169 1770 321 -2901 3064 -457 -1384 2347 -2006 -246 1598
747 1598 -1206 917 -455 -613 968 -1314 1290 273 -1731 1861 -1294 -632 2584 -2429 444 1619
763 1619 -2795 1801 663 -1988 2100 -1144 -872 1911 -1475 648 445 -1390 1395 -838 -75 1398
779 1398 -1907 1017 397 -1589 2145 -1075 -873 2152 -2066 567 1454 -2207 1489 -196 -1246 2106
795 2106 -1441 -92 1319 -1833 1207 76 -1222 1701 -1457 -26 1590 -1965 1131 355 -1559
$$ packed form
684C290l558n122R505l861k380O666p674M85O234n037K109J279m486J919J094
699D63M74k34j314J092k710K318L086n409L245J19n599P287j114m744O222m598
715a416j563O640m615N09K483m513K448R92j199J269j976Q90j89n51L273l669
731a187L67K879n083M089J481n715M939j449l222N965l521r27L731m353J760J844
747A598k804K123j372j58J581k282K604j017k004L592l155O62L216n013K873J175
763A619m414M596j138k651M088l244K72K783l386K123k03j835K785k233P63J473
779A398l305K924o20j986L734l220K02L025m218K633Q87l661L696j685j050L352
795B106l547J349J411l152L040j131j298K923l158J431J616l555L096p76j914
$$ plain form
810 -1559 1894 -1104 -490 1785 -1984 690 939 -1827 1594 -607 -801 1839 -1691 402 1025 -1853
826 -1853 1438 -181 -1028 1769 -1535 144 1375 -1870 1245 34 -1384 1934 -1143 -315 1602 -1970
842 -1970 851 585 -1587 1680 -823 -629 1741 -1532 554 706 -1479 1459 -687 -613 1743 -1803
858 -1803 456 1087 -1940 1557 -312 -1308 2117 -1539 -238 1766 -1938 811 610 -1412 1341 -859
874 -859 -247 1294 -1350 752 -2 -1153 1625 -1158 -23 1571 -2421 973 997 -2120 2041 -484
890 -484 -1804 2191 -1182 -316 1783 -1597 102 475 -665 1114 -573 39 99 -1067 1743 -584 -622
907 -622 1867 -2534 292 2462 -2579 1388 852 -3139 2236 430 -1603 2319 -1164 -1475 1574 -188
923 -188 221 186 -315 -433 -888 1840 3 -1202 1830 -2336 -633 3661 -2474 204 2137 -4192 1282
$$ packed form
810a559L453k998O14K275l769K674K49k766L421k201j94K640l530K093O23k878
826a853L291j619q47K797l304J679J231l245L115j211j418L318l077Q28J917l572
842a970K821k66k172L267k503J94K370l273K086J52k185K938k146P4K356l546
858a803K259O31l027L497j869r96L425l656J301K004l704K749k01k022K753k200
874h59O12J541k644K102p54j151K778k783J135J594l992L394K4l117M161k525
890d84j320L995l373Q66K099l380J699L73j140J779j687O12O0j166K810k327l8
907f22K489m401K826K170n041L967n36l991N375j806k033L922l483l11L049j762
923a88M09l5n01j18m55K728j837j205L032m166J703M294o135K678J933o329N474
$$ plain form
940 1282 2642 -2457 1665 100 -3012 1652 1140 -517 530 -353 -1393 -549 2507 424 -1848 1653
956 1653 -2029 -1767 4883 -1319 -1635 2968 -4210 -255 5015 -2543 49 1394 -4098 1106 3267 -1105
972 -1105 -213 -26 -2141 -373 3467 777 -2846 1081 -1191 -2434 5491 56 -3756 2934 -3099 -1788
988 -1788 6720 -1837 -2491 2526 -3802 -133 5089 -993 -1776 302 -1958 -468 3859 1115 -3546 410
1004 410 -238 -2794 5364 1700 -5591 2228 -974 -3370 7079 95 -5000 2677 -2416 -1683 6369
1019 6369 -292 -3601 695 -1401 -892 4422 1641 -4493 -578 975 -2597 4677 3208 -6804 535
1034 535 1395 -3763 6418 2142 -7132 1743 -187 -2570 6544 919 -5532 358 57 -960 4179
1049 4179 2135 -4993 -1779 2209 -1553 3177 4068 -6839 -1469 3605 -3311 4350 3882 -7853 12
$$ packed form
940A282J360n099M122j565l112M664n12j657J047q83j040Q44L056k083k272L501
956A653l682K62O650o202l16M603p178L955N270p558K592J345n492N204K161m372
972a105Q92J87k115J768L840k690l623L927k272j243P925n435l812O690o033J311
988a788Q508q557o54N017o328L669N222o082p83K078k260J490M327k744m661L956
1004D10o48k556Q158l664p291P819l202k396J0449o984n095P677n093P33Q052
1019F369o661l309M296k096N09N314k781o134L915J553l572P274j469j0012P339
1034E35Q60n158J0181m276r274Q875j930k383R114n625o451N890l01j017N139
1049D179k044p128L214L988l762M730Q91j0907N370N074o916P661m68j1735P865
$$ plain form
1064 12 2516 -2848 5161 2142 -6477 -275 1552 -950 3564 2166 -5046 -2429 3074 -502 1631
1079 1631 4115 -5934 -3178 4938 -2037 1990 4778 -7399 -1744 4447 -2527 3267 3218 -6618 -1112
1094 -1112 3026 -785 2435 2231 -4516 -2883 3294 648 126 3497 -4195 -4341 5135 -272 -328 4686
1110 4686 -5729 -3452 5543 -1364 927 3686 -5718 -2109 3893 -299 1115 1850 -3810 -2753 3177
1125 3177 1592 -759 2252 -2519 -4526 4646 1548 -2176 3700 -3424 -4442 5621 120 -1219 3508
1140 3508 -4279 -2733 4394 89 -240 1621 -2878 -2500 2846 1974 -1277 897 -863 -3943 3208 2786
1156 2786 -2952 2163 -1083 -4594 4558 1397 -2643 2871 -2271 -3097 3959 590 -1129 1224 -1867
1171 -1867 -1836 2052 1893 -1055 -230 22 -2723 1597 3261 -2730 398 691 -3953 2885 2537 -3155 1625
$$ packed form
1064A2K504n364Q009l019q619O202J827k502M514j398p212K617N503l576K133
1079A631K484j0049K756Q116o975M027K788j2177N655O191o974N794m9r836N506
1094a112M138l811L220k04o747J633O177k646n22L371p692j46R476n407n6N014
1110D686j0415K277Q995o907K291K759r404L609O002m192J414P35n660J057N930
1125C177j585k351L011m771k007R172l098l724N876p124j018J0063n501j339M727
1140C508p787J546P127m305l29J861m499L78N346q72l251K174j760l080P151m22
1156B786n738N115l246l511R152l161m040N514n142q26P056l369j719K353l091
1171a867L1L888j59k948Q25K52k745M320J664n991L128K93m644O838l48n692M780
$$ plain form
1188 1625 -630 -3104 3230 1057 -1631 968 -1120 -1388 1619 1373 -772 -782 369 -1390 384 2929
1204 2929 -1824 -884 1591 -2688 1188 2847 -2841 613 706 -2651 2261 1232 -1897 762 -422 -948
1220 -948 1180 616 -313 -832 218 -95 -500 1846 -630 -1504 1696 -1235 -298 2605 -1916 -408 1549
1237 1549 -1964 997 1292 -1629 672 -130 -791 1029 64 -141 -240 -267 468 -670 827 414 -1582 1059
1255 1059 -9 -1070 1927 -799 -1012 1572 -1305 194 1392 -1457 404 309 -888 1005 -166 -227
1271 -227 227 -637 652 -162 -246 887 -1139 238 857 -1218 980 37 -1180 1380 -590 -438 1304
1288 1304 -1144 133 676 -879 814 -195 -497 796 -828 243 450 -868 769 -360 -414 1094
1304 1094 -1009 155 813 -1111 769 87 -845 1076 -676 -187 886 -1043 385 237 -722 894
$$ packed form
1188A625k255k474O334k173k688K599k088k68L007k46k145j0J151j759J774K545
1204B929m753R40K475m279L876J659n688L454R3l357M912j029l129K659j184n26
1220i48K128n64r29n19J050l13m05K346k476q74L200k931R37K903m521J508J957
1237A549l513K961K95k921K301q02o61J820r65k05r9k7P35j138J497m13j996K641
1255A059j068j061K997k726k13K584k877J499J198k849J861r5j197J893j171o1
1271b27M54q64J289q14q4J133k026J377O19k075K198r43j217K560j970J52J742
1288A304k448J277N43j555J693j009l02J293j624J071K07j318J637j129n4J508
1304A094k103J164O58j924J880o82r32J921j752M89J073j929J428j48r59J616
$$ plain form
1320 894 -476 -258 912 -908 364 404 -884 892 -413 -359 1101 -993 151 553 -914 788 -173
1337 -173 -655 1031 -805 -21 752 -943 522 -72 -507 970 -677 -101 808 -887 501 100 -727
1354 -727 1024 -701 -210 1047 -1068 302 449 -859 810 -257 -510 1009 -804 49 642 -625
1370 -625 461 -199 -203 811 -745 163 448 -850 810 -120 -568 1102 -978 -135 1207 -1022 313
1387 313 408 -1058 853 -93 -385 789 -609 -103 305 -113 517 -565 1 522 -952 729 323 -995
1405 -995 1005 -655 -589 1711 -1023 -361 1121 -1227 207 821 -721 457 -210 -494 533 118 203
1422 203 -354 0 345 -1018 858 766 -1505 781 -33 -1159 1806 -384 -1066 1446 -1200 -518 1819
1439 1819 -580 -427 352 -714 142 631 186 -415 -251 89 -802 1032 1146 -1900 337 626 -1570 1723
$$ packed form
1320H94j370K18J170j820J272M0j288J776j305N4J460k094J144M02j467J702r61
1337a73m82J686j836P84P73j695J465n94m35J477j647N76R09j695J388m01q27
1354g27J751j725M91J257k115J370J47j308J669j067k53J519j813Q53N93j267
1370f25J086o60mJ014j556R08K85j298J660r30m48J670k080Q43J342k229J335
1387C13R5j466J911r46k92J174j398N06M08m18O30j082N66N21j474J681m06j318
1405i95K000j660O6K300k734O62J482k348J434O14j542J178o67k84J027m15Q5
1422B03n57L54L45j363J876r2k271K286q14j126K965k190o82K512k646O82K337
1439A819k399J53P79j066Q56M89m45o01J64L40q91J834J14l046K237K89k196L293
$$ plain form
1457 1723 635 -1898 1079 -549 -995 2387 -210 -1456 694 -451 -331 1123 414 -820 -611 303
1473 303 -433 915 1231 -2089 -129 1264 -1727 1515 1652 -2681 372 557 -1324 2151 442 -2134
1489 -2134 694 -17 -778 1601 786 -1538 -792 705 -140 507 1449 -1811 -937 1547 -1280 915 2217
1506 2217 -2945 -557 1688 -1447 1401 1338 -2457 1 694 -791 1541 1012 -1971 -968 1253 69
1522 69 120 1546 -1496 -1766 1780 -344 229 2285 -2752 -1385 2529 -1097 514 2069 -2617 -945
1538 -945 1453 -386 1024 968 -2109 -968 1409 172 -72 1480 -1265 -2417 1913 733 -663 1816
1554 1816 -1871 -2105 2604 -392 -309 2282 -2370 -1776 2222 86 126 966 -1684 -1196 1316 623 -218
1571 -218 1009 -983 -2385 1815 1478 -1245 1315 -813 -2504 2130 642 -879 1856 -1746 -2132 2436
$$ packed form
1457A723j088k533K977j628m46L382k597j246K150j145J20J454p09j234K09R14
1473C03p36J348L16l320J960J393k991L242J37m333L053J85j881L475j709k576
1489b134K828p11p61K379q15k324P46J497q45O47R42l260Q74K484k827K195J302
1506B217n162K388K245l135K848o3l795K458O93j485K332n29k983J003K221j184
1522F9N1J426l042k70L546k124N73K056n037J367L914l626J611J555m686J672
1538i45K398j839J410n6l077J141K377j237k44J552k745j152M330j180j396K479
1554A816l687k34M709k996Q3K591m652N94L998k136M0Q40k650M88K512o93q41
1571b18J227j992j402M200l37k723K560k128j691M634j488j521K735l602l86M568
$$ plain form
1587 2436 471 -646 1045 -1140 -1498 1208 1090 -172 328 -693 -1880 1402 1703 -1450 730 113
1603 113 -2657 1554 1702 -1356 918 -751 -2028 2164 731 -979 932 -791 -1566 1154 1373 -403
1619 -403 -308 -186 -1132 648 1655 -977 1 472 -2128 983 2123 -1521 75 269 -1768 1288 1011
1636 1011 -1041 605 -426 -1317 1065 1167 -654 -515 150 -625 23 1424 -436 -627 548 -1243 368
1653 368 1912 -1388 -393 876 -1388 514 1373 -891 63 -146 -809 909 700 -621 -302 156 -354
1670 -354 -208 1154 52 -1085 411 -269 -154 1368 -789 -633 1020 -1124 54 1422 -828 -379
1686 -379 244 -438 540 369 -422 -57 -93 -149 41 611 77 -1019 313 365 -491 717 -143 -753 688 -485
1706 -485 -144 1134 -751 -529 617 -361 135 289 -261 56 -192 -54 294 99 11 -507 161 502 -594
$$ packed form
1587B436j965j117J691k185l58K706j18j262N00j021j187L282L01l153K180o17
1603A13k770M211J48l058K274j669j277M192j433j710J911j723p75K720K19j776
1619d03R5J22r46J780J007k632R78M71k600L111J140l644J596J94k037L056k77
1636A011k052J646j031q91K382J02j821J39O65p75O48J401j860j91J175j791J611
1653C68J544l300R95J269k264J902Q59k264R54k09o63J718k09j321L19M58n10
1670c54J46J362j102j137J496o80J15J522k157J56J653k144J178J368k250M49
1686c79O23o82R78j71p91L65l6n6J90N70n34j096J332N2q56J208q60o10J441j173
1706d85L41J278j885K22J146r78M96J54n50L17k48J38L48j95q8n18O68L41j096
$$ plain form
1725 -594 380 405 -776 277 34 -279 691 -478 -284 711 -425 -27 434 -192 63 -177 -6 400 -291
1744 -291 42 47 -113 305 -338 119 513 -625 142 467 -439 278 -101 -295 579 -407 -102 552 -347 -73
1764 -73 135 -94 284 -352 -85 338 -395 128 75 -173 307 -441 -14 499 -488 91 257 -324 264 -143 -103
1785 -103 485 -462 -13 372 -257 158 -91 -88 340 -394 68 377 -377 100 24 -146 352 -395 -34 414 -338
1806 -338 130 128 -210 265 -255 -60 447 -422 53 235 -312 189 -125 -66 380 -422 -6 316 -292 153 -101
1827 -101 -50 342 -396 38 365 -339 72 29 -164 299 -309 -25 384 -383 55 175 -151 228 -250 -8 334
1848 334 -389 41 199 -206 144 -162 -50 352 -366 86 335 -314 180 -49 -156 341 -315 6 289 -282
1868 -282 88 46 -176 226 -309 18 276 -255 154 19 -167 274 -251 -5 359 -455 95 258 -258 230
$$ packed form
1725e94R74K5j181J053k43l13R70j169J94R95j136L98M61o26K55k40J71M06o91
1744b91L33Nj60M18o43M57L94j138P67L25r06P17l79j94Q74r86L05O54q99K74
1764g3K08k29L78o36K67M23p33N23n3k48M80p48M27N13r87N79J66n81N88m07M0
1785a03N88r47M49L85o29M15k49LM28p34M62L09p54M77p6j70M98p47L61M48p52
1806c38M68kl38M75n20J95N07q69M75J82n47N01l14N9M46q02M16L22o08M45k54
1827a01N1L92p38M34L27p04M11m3j93M63o08K84M09p67M38J20l26L79m78K42L42
1848C34p23M30J58m05L50l06J12M02p18M52K49o49M94k29j07M97o56L21K83n71
1868b82L70m2k22M02n35L27K58n31M09j35j86M41n25K46L64q14N50J63n16M88
$$ plain form
1888 230 -66 -185 343 -276 -44 286 -202 18 -25 -48 174 -300 94 76 -301 269 -65 -118 338 -462 -51
1909 -51 449 -473 118 217 -411 189 -31 -220 346 -146 -189 115 10 40 -55 132 -49 -380 338 128 -221 426
1931 426 -425 -182 587 -382 49 486 -684 -65 438 -273 255 122 -441 80 224 -24 34 210 -246 -475
1951 -475 541 216 -412 412 -313 -567 848 -140 -196 641 -797 -327 880 -271 -123 393 -588 -251 563
1970 563 158 -124 183 -358 -557 706 375 -592 487 -250 -906 1006 230 -603 660 -559 -753 1195
1988 1195 49 -463 633 -629 -658 914 358 -386 176 -333 -742 824 751 -783 255 -113 -1195 1094
2006 1094 921 -1109 451 -211 -1238 1314 644 -919 439 -419 -1040 1149 807 -816 -10 -55 -967
2023 -967 819 1201 -943 -155 146 -1295 989 1464 -1316 -45 308 -1502 1217 1357 -1316 -37 91
$$ packed form
1888B30k96j19N28o19K32L30m88K20m3k3K22m74L94j8l77N70l34n3M56q00M11
1909e1N00r22N91R9o28O00k20j89N66m92m3L04j05L0r5J87j81l31P18k10l49O47
1931D26q51K43P69r69M31M37j170O19N03p11N28j33n63N21J44k48N8J76m56k29
1951d75J016l25o28Q24p25k54J415r88n6Q37j438M70J207j151J48N16r81L37Q14
1970E63m05k82L07n41j99J263l31r67J079p37o56J912p76q33J263j219j94J948
1988A195j146n12J096j262k9J572n56p44N62n09m09J566p3j534J038l68j082K289
2006A094j73k030J560o62j027K552o70j563J358q58o21K189l42j623Q06m5r12
2023i67J786L82k144P88L01j441K284M75k780J271L53j810K719J40k673J279J28
$$ plain form
2040 91 -1203 1110 1310 -1149 -294 191 -975 814 1712 -1113 -736 546 -1117 670 1961 -1389 -714
2057 -714 731 -1319 807 2013 -1472 -739 526 -1129 786 1804 -1188 -903 523 -824 435 2024
2073 2024 -944 -1331 763 -725 132 2282 -1087 -1501 976 -856 210 2350 -1218 -1445 929 -734
2089 -734 225 2045 -943 -1524 747 -318 68 2011 -685 -1860 797 -58 -288 2187 -587 -2165
2105 -2165 1045 -120 -306 2226 -743 -2033 1025 -42 -159 1937 -681 -1934 774 225 -261 1695
2121 1695 -203 -2161 658 694 -608 1652 19 -2412 723 670 -733 1704 -122 -2293 804 646
2137 646 -651 1533 -93 -2115 460 865 -496 1071 233 -2026 215 1121 -642 958 483 -2181
2153 -2181 332 1322 -893 1028 473 -2252 410 1134 -662 860 257 -1877 217 1123 -434 517
$$ packed form
2040I1j294K313K00k459Q55M85j166J789Q98k825L77J282j663J787J291l350O75
2057g14J445k050K126J206l485P33J265j655J915J018k992K85J426j347J259J589
2073B024k968l87K094j488Q57K150l369m14K477j832J066K140l568k27K374j663
2089g34R59J820k988n81K271j065L86J943k696j175K657q55k30K475k774j578
2105b165L210j165j86K532k969j290L058j067j17K096k618j253K708n49m86J956
2121A695j898j958K819L6j302K260j633k431L135n3j403K437j826k171L097j58
2137F46j297K184j626k022K575M05j361J567q38k259K241R06j763J600m75k664
2153b181K513R90k215J921n55k725K662P24j796J522o03k134K094R06j557R51
$$ plain form
2169 517 443 -1717 -131 1411 -439 227 703 -1740 -230 1575 -552 233 742 -1748 -116 1405 -497
2186 -497 195 498 -1439 -108 1269 -255 -45 511 -1043 -469 1299 -38 -356 692 -1022 -545 1421
2203 1421 -234 -398 760 -1095 -445 1359 -228 -311 546 -852 -359 1064 -55 -310 327 -519 -491 951
2221 951 188 -599 478 -403 -714 1059 63 -658 619 -431 -592 975 -40 -445 394 -458 -381 650
2239 650 72 -379 173 -166 -426 479 318 -557 164 87 -554 565 294 -621 274 -21 -508 647 140 -509
2259 -509 258 -142 -317 411 158 -301 14 75 -167 218 271 -296 -122 243 -323 196 395 -467 73 249 -405
2280 -405 306 209 -359 131 28 -199 151 90 -147 0 35 -32 -69 217 -126 -140 200 -134 -69 324 -217 -112
2302 -112 248 -192 72 117 -218 103 -22 -148 165 -28 -25 13 7 48 -125 122 102 -193 56 63 -170 184 -56
$$ packed form
2169E17p4k160J586J542j850O66M76k443J510J805k127P85N09k490J632J521j902
2186d97O92L03j937J331J377j524K10N56j554N74J768j337l18J048j714M77J966
2203A421j655j64J158j855O50J804j587q3Q57j398M93J423j119k55O37q46K8J442
2221I51p63p87J077q81l11J773r96p21J277j050j61J567j015m05Q39q52P7J031
2239F50n78m51N52l39k60R05j61q75P21p7o41J119k71r15Q95k95m87J155n07o49
2259e09P67m00j75P28k53m59L15O1k42L85N3n67J74L65n66N19J99q62N40J76o54
2280d05P11r7n68M90j03k27L50o1k37J47L5o7l7K86l43j4L40l34O5L93n41J05
2302a12L60m40K64M5l35L21j25j26L13j93LL8oM1j73K47k0k95K49Pk33L54k40
$$ plain form
2325 -56 -139 238 -127 8 197 -206 -12 79 -118 88 10 -48 22 -104 52 -18 -26 96 -109 34 104 -181 116
2348 116 30 -161 194 30 -137 193 -88 -33 103 -98 32 52 -26 83 -37 -44 36 -64 65 -39 -29 122 -129
2371 -129 32 158 -154 150 43 -213 192 -23 -83 198 -84 -123 158 -67 -32 19 -31 -19 -41 100 -70 -49 101
2394 101 -180 64 214 -249 102 64 -371 159 173 -243 198 -27 -298 122 31 -65 124 -28 -183 74 156 -101
2416 -101 -38 120 -256 -23 309 -256 25 249 -402 100 340 -279 152 112 -417 198 281 -155 107 24 -320
2437 -320 98 318 -157 -64 112 -287 -79 459 -201 -161 295 -473 27 659 -340 -38 292 -534 74 533 -202
2458 -202 38 143 -410 42 510 -135 -183 155 -313 -165 658 -79 -395 344 -439 -221 805 -216 -283 371
2478 371 -492 -43 748 -184 -216 201 -421 -71 617 -53 -362 205 -196 -205 733 25 -549 307 -236 -301 868
$$ packed form
2325e6q3L77l65J35J89m03J94R1j97K06p8n8P0j26J56p0qJ22k05J43P0k85K97
2348A16q6j91L55j64j67L30k81N5J36k01J30K0p8J09j20pQ0j00J29j04J0J51k51
2371a29J61J26l12L04j07k56M05k15o0K81k82l9K81k25L5N1n0J2k2J41j70K1J50
2394A01k81K44J50m63L51l8m35N30J4m16M41k25k71M20r1r6J89j52j55K57Q2k57
2416a01O3J58l76K33L32n65K81K24o51N02K40o19M31m0n29O15Q3m36K62q3l44
2437c20M18K20m75R3J76l99K08N38o60M0M56p68N00O32r99L02L30q26O08M59p35
2458b02K40J05n53M52M68o45m8L38m68J48Q23p37l16P39p83K18J026j021o7O54
2478C71q63M49P91r32l2M17o22L50O88o70l09N67m01rR38p08n74Q56n43o5J169
$$ plain form
2499 868 -83 -581 354 -428 -202 893 -90 -435 243 -276 -92 753 66 -513 89 -142 -261 701 211 -778
2519 -778 211 -2 -371 911 153 -855 318 -33 -383 847 -11 -736 264 -144 -222 746 71 -657 86
2538 86 109 -227 591 248 -854 64 252 -340 671 228 -954 243 175 -386 781 202 -980 184 164
2557 164 -267 699 100 -794 -4 295 -190 498 250 -821 -80 431 -300 586 319 -1013 43 482 -385
2576 -385 593 296 -1004 139 423 -251 489 163 -856 -11 441 -112 332 229 -812 -139 630 -211 236
2595 236 378 -934 -53 654 -297 291 289 -945 3 592 -194 339 185 -861 44 606 -106 140 159 -665
2615 -665 -152 684 -71 -66 355 -727 -173 822 -230 -17 326 -853 -46 778 -222 60 244 -681 -38
2634 -38 640 -68 -45 131 -529 -185 737 -47 -257 343 -561 -313 852 -97 -309 358 -582 -129 760 -167
$$ packed form
2499H68r51m98R35p82K26J095r83l45O78n19J84Q45o87n79O02k31j19R62m90r89
2519g78R89k13l69J282p58j008J173l51l50J230q58p25J000m08p8R68o75p28P43
2538H6K3l36Q18l43j102R18J88n92J011m43j182J197o8n61J167n79j182J164k0
2557A64m31R66n99q94P90K99m85O88k48j071P41N11p31Q86k67j332J056M39q67
2576c85R78k97j300J143K84o74P40l26j019Q45M52n53M44j03j041O73P69q41M47
2595B36J42j312Q81P07r51N88kj234R48N89p86N33j54j046R05N62p12K46J9q24
2615f65N13Q36p55NM21j082N54R95j052K13L43j179Q07Q24j000K82J84r25O43
2634c8O78p08K3J76o60L44R22p84k10O00r04K48J165r49k12O67r40M53Q89r27
$$ plain form
2654 -167 -141 265 -565 -39 680 -123 -193 134 -425 -87 616 31 -357 171 -261 -223 794 -18 -417 333 -363
2675 -363 -190 765 -167 -359 282 -396 -111 600 -111 -287 142 -195 -75 519 68 -417 120 -96 -242 569
2695 569 10 -553 236 -115 -273 633 -68 -423 284 -179 -173 553 -50 -315 98 -90 -168 379 60 -373 39
2716 39 71 -221 346 137 -475 153 123 -301 454 66 -482 233 -1 -214 447 3 -350 119 -2 -134 224
2737 224 55 -310 -50 151 -138 119 204 -401 24 224 -265 239 115 -466 185 131 -226 222 0 -325 97
2758 97 47 -116 81 81 -146 -20 177 -59 -27 166 -247 -76 326 -140 47 194 -223 49 149 -208 133 72
2780 72 -198 103 53 -59 123 11 -18 -58 86 59 -108 109 -57 -133 221 -105 -82 232 -175 -9 224 -124
2802 -124 6 119 -161 37 60 -21 59 -20 10 -38 27 87 -19 108 52 -167 124 18 -192 162 -50 -126 200
$$ packed form
2654a67K6M06q30N26P19q03p0L27n59L38P03n85l88N28m32L8J017q12l99P50o96
2675c63J73R55r32j92O41o78K85P11p11j76M29l37J20N94m51m85N37k16j46Q11
2695E69n59n63P89l51j58R06p01l55P07m63OP26o03k65M13j88p8N47l19m33M12
2716C9L2k92N67k09o12O28l0m24P55l88n48P15k34k13O61m44l53M69j21j32L58
2737B24j69l65K60K01k89K57Q5o05M25K00m89N04j24n81O51n4l57M48k22l25M22
2758I7n0j63J97%k27J26J97k36L2J93m13J71M02m66J87J47m17K72J00l57L41o1
2780G2k70L01n0j12J82j12k9m0J44k7j67K17j66p6L54l26K3L14m07J66K33l48
2802a24J30J13k80J98K3q1Q0p9L0m8O5O0j06J27n6k19K91j06k10L54k12p6L26
$$ plain form
2825 200 -131 -44 138 -151 65 103 -76 45 -68 16 -37 -65 117 -64 -57 121 -65 49 49 -156 74 36 -130
2848 -130 129 -36 -42 129 -66 -41 40 -65 31 9 -23 27 -56 68 -18 -23 54 -14 19 126 -55 64 139 -191 18
2873 18 38 -158 165 33 -190 101 -59 -14 97 -62 -54 2 -9 -45 -12 145 -62 -50 90 -169 -9 214 -207
2896 -207 54 148 -211 180 132 -245 65 10 -196 122 100 -99 -23 24 -53 -14 200 -96 -109 158 -153 45 283
2919 283 -206 -107 240 -267 117 375 -282 -62 116 -239 190 248 -182 -73 14 -113 85 280 -145 -259 252
2940 252 -105 -79 461 -257 -309 315 -246 -14 548 -366 -223 260 -259 65 419 -384 -244 246 -115 31 375
2961 375 -234 -475 250 -120 -144 610 -222 -512 439 -116 -209 645 -313 -519 397 -150 -90 584 -305 -542 328
2982 328 -20 -74 509 -181 -636 304 145 -186 664 -82 -870 448 191 -307 750 -165 -862 485 155
$$ packed form
2825B00l31Q7J82k89K16L8j79J21j13Q4n3k8J82j81PJ78j86J14%k05K30l8j66
2848a30K59j65oJ71j95K5Q1j05R6k2l2N0q3J24q6nP7o8L3J07j81J19P5l30K09
2873A8K0j96L23j32k23K91j60M5J11j59QN6j1l6L3J57k07J2J40k59J60K23m21
2896b07K61R4l59L91m8l77L10n5k06L18k2j99P6M7p7L9K14k96j3K67l11J98K38
2919B83m89R9L47n07L84K58o57K20J78l55M29N8m30J09Q7j27J98J95m25j14N11
2940B52l57K6N40p18n2O24n61K32N62r14J43M83n19L24L54q03J40M90l61J46L44
2961C75o09k41P25l70k4P54q32k90R51n55r3Q54r58k06R16n47O0O74q89k37Q70
2982C28l48n4N83o90m55R40j59l31Q50p46p88J318k57m98J057r15o97J347l30
$$ plain form
3001 155 -186 683 -239 -808 432 205 -262 612 -50 -988 314 436 -325 547 70 -1130 344 552 -415
3020 -415 624 40 -1182 444 521 -446 630 4 -1111 290 591 -297 384 88 -1107 164 778 -391
3038 -391 310 307 -1220 136 985 -409 363 302 -1306 155 942 -432 327 286 -1226 138 934 -271
3056 -271 185 252 -1136 -33 1106 -261 -36 473 -1134 -232 1271 -322 -78 486 -1170 -71 1274
3073 1274 -339 -46 437 -1146 -137 1235 -198 -195 346 -992 -274 1236 -22 -410 437 -933 -409
3090 -409 1449 -86 -562 521 -921 -390 1421 -85 -495 444 -835 -355 1302 19 -510 354 -660
3107 -660 -473 1233 235 -681 305 -540 -637 1300 214 -874 438 -499 -648 1386 143 -802 347 -522
3125 -522 -573 1258 204 -762 221 -327 -570 1104 442 -919 104 -110 -632 1042 509 -979 181 -59
$$ packed form
3001A55l41Q69r22n69J240k27m67Q74o62r38J302J22p61Q72m77j200J474K08r67
3020d15J039n84j222J626P7r67J076o26j115J401L01q88O81k96j195J271O14j169
3038c91P01lj527J356Q49j394P72o1j608J461P87j374P59m1j512J364P96j205
3056b71M56O7j388J103J139j367K25N09j607R02J503j593K44N64j656J099J345
3073A274j613K93M83j583J009J372j433LN41j338P18J510j258l88Q47j370N24
3090d09J858j535m76J083j442N31J811j506m10R39j279M80J657j283n29Q64j014
3107f60J87J706r98r16R86q45r7J937j086j088J312r37j49K034j243r45J149q69
3125e22n1J831j054r66R83n48k43J674o62j361J023k14n22J674n33j488J160k40
$$ plain form
3143 -59 -669 1057 451 -1010 198 -40 -597 973 458 -862 23 -39 -446 810 524 -903 -103 227
3161 227 -568 651 705 -926 -125 335 -572 705 601 -934 -16 240 -494 606 485 -839 -120 270
3179 270 -290 449 584 -776 -317 412 -279 253 694 -723 -337 517 -350 328 637 -773 -240 429 -384
3198 -384 354 566 -617 -289 347 -183 171 520 -470 -320 390 -98 76 513 -522 -396 568 -157 -69 583
3218 583 -438 -328 431 -152 79 448 -409 -323 304 -40 7 308 -272 -412 282 64 -131 325 -219 -452
3238 -452 393 74 -232 427 -188 -378 361 45 -95 325 -271 -266 281 -6 -45 182 -100 -264 234 208 -143
3259 -143 25 14 -299 212 161 -255 223 1 -361 259 89 -204 175 -39 -173 138 78 -106 115 -32 -97
3280 -97 61 171 -78 -54 125 -141 21 183 -185 91 46 -265 91 104 -170 78 41 -103 95 66 -36 23
$$ packed form
3143e9o10J726o06j461J208k38n57J570n15j320Q85o2m07J256k86j427Q00L30
3161B27p95J219N4j631Q01M60r07J277j04j535R18K56p34J100j21j324P19L90
3179B70n60P39J35j360M59P29o91N32M41j417L86Q54q67O78L09j410N33O69q13
3198c84P38K12j183L28O36n30L54L49r90J50P10m88J74M37j035J26R64p25Q8O52
3218E83j021J10P59n83K31L69q57Q6O27l44M7L01n80j40O94k18j95M56n44k33
3238d52Q45l19l06O59o15j90P39l16j40M20n96NN47k87l9K27k82j64M98k6l51
3259a43J68j1l13N11n1m16M78k22l62O20j70k93L79k14j34L11o0j84K21j47o5
3280i7J58J10k49K4J79k66J62J62l68K76m5l11L56J3k74K48l7j44J98k9j02N9
$$ plain form
3302 23 -24 -29 61 90 -76 -83 87 -91 -76 169 -67 -146 134 -156 54 113 -128 74 101 -149 48 38 -85 23
3326 23 28 43 -87 12 32 -20 15 -11 -105 136 -32 -166 133 -19 -109 123 -74 -20 73 -59 1 89 -44 29 -1 49
3352 49 -33 -23 94 -59 12 51 -102 36 48 -105 77 -20 -94 118 28 -61 94 -46 3 35 -112 16 57 -20 -16
3377 -16 14 71 -66 -31 119 -76 -35 17 -140 130 10 -157 153 -29 -103 140 -1 -102 42 -82 3 93 11
3400 11 -19 -26 13 -58 63 77 -105 -18 123 -116 61 64 -193 64 103 -124 177 47 -233 28 14 -43 140 20
3424 20 -117 39 73 -70 58 91 -200 -11 141 -64 35 133 -238 -6 131 -167 167 60 -297 84 190 -160
3446 -160 139 73 -230 34 121 -7 83 48 -224 -72 189 -96 7 154 -259 -84 274 -153 30 226 -399
3467 -399 13 255 -151 127 153 -304 -45 281 -86 28 104 -296 -101 264 -36 -36 188 -302 -155 313 -64
$$ packed form
3302B3m7nR0K9j66pJ70j78J5K45k36p9K80k90K10N9k41K02K7k50J97j0j23J08
3326B3NJ5j30R9K0n2L5k6r4K41j68j34K99j52r0K32j97N4R3j32O0Q8j33P3l0N0
3352D9q2J0J17j53P1L9j53J38J2j53J82r7p4K12r0q9J55j40M9L2j47J28M1p7M
3377a6L0N7j37L5J50j95M1N2j57K70j20j67L10j82p4K43j41j01J44j24Q5R0q2
3400A1l0pL9p1J21J4j82Q7J41k39J77Lk57K57L9k27L01j30k80K61j4n7J83j20
3424B0j37J56L4j43J28L3k91J89J52k05R9R8l71K32J37k98L34j07l57L81J06l50
3446a60K99o6l03K64Q7j28R0l5k72J52K61k85J03J47m13J75L58m27J83J96o25
3467c99M12K42m06K78K6m57K59L26l67J14P6m00J95L65l00%K24m90J47M68l77
$$ plain form
3488 -64 -34 241 -348 -141 395 -144 -7 239 -319 -76 386 -43 -14 211 -250 -224 364 38 -96 197 -252
3509 -252 -282 507 -39 -236 224 -316 -260 457 -15 -149 272 -314 -185 444 -19 -163 229 -244 -283 453 157
3530 157 -241 223 -239 -304 530 150 -355 257 -190 -370 533 164 -351 242 -210 -310 579 147 -277 173
$$ packed form
3488f4L0K75n89K07N36n39J37K46n58K43M62m29K9K25m61K6N88l26j34K93m49
3509b52l0P89n46j97M60n40N6P17m72j34M21n86J29O29m63j44L92m73l9P36k96
3530A57l98M64m62o5Q34l80n05O12m47j80R03l69n15N93m52j00Q89m32m24M50
$$ [...]
8191c4
##END NTUPLES=NMR FID
##END=
