##TITLE=1H_TG-2110-A
 CDCl3, 8 sc, 
 5.6.2020
##JCAMPDX= 6.0         $$ Bruker NMR JCAMP-DX V2.0
##DATA TYPE= NMR FID
##DATA CLASS= NTUPLES
##ORIGIN= UXNMR, Bruker Analytische Messtechnik GmbH
##OWNER= root
$$ XWIN-NMR		Version 3.5
$$ Fri Jun  5 11:01:31 2020 Russian Standard Time (UT+4h)  she@DPX200
##.OBSERVE FREQUENCY= 200.1315
##.OBSERVE NUCLEUS= ^1H
##.DELAY= (6, 6)
##.ACQUISITION MODE= SIMULTANEOUS
##.ACQUISITION SCHEME= undefined
##.AVERAGES= 8
##.DIGITISER RES= 18
##SPECTROMETER/DATA SYSTEM= spect
##.PULSE SEQUENCE= zg30
##.SOLVENT NAME= D2O
##.SHIFT REFERENCE= (INTERNAL, D2O, 0, 15.7039)
##AUDIT TRAIL= $$ (NUMBER, WHEN, WHO, WHERE, WHAT)
$$ ##TITLE= Audit trail, XWIN-NMR		Version 3.5
$$ ##JCAMPDX= 5.01
$$ ##ORIGIN= Bruker BioSpin GmbH
$$ ##OWNER= she
$$ F:/spectra/data/she/nmr/H-F/1/audita.txt
$$ ##AUDIT TRAIL=  $$ (NUMBER, WHEN, WHO, WHERE, WHAT)
(   1,<2020-06-05 11:00:20.68 +0400>,<she>,<DPX200>,
      <created by zg, POWCHK disabled, PULCHK disabled
       configuration hash MD5:
       00 E9 B6 7A A2 85 ED C7 34 08 36 98 17 FE 4E 26
       data hash MD5: 16K
       60 74 40 B3 50 32 D3 D6 78 63 33 9C 83 3E B6 9E>)
$$ ##END=
$$ 
$$ hash MD5
$$ F6 5F A7 7C 0B 7D E0 E9 EC 11 B4 8D 49 C5 09 E2
##$RELAX= 
##$RELAX= 
##$RELAX= 
##$RELAX= 
##$RELAX= 
##$RELAX= 
$$ Bruker specific parameters
$$ --------------------------
##$DU= <F:/spectra>
##$EXPNO= 1
##$NAME= <H-F>
##$PROCNO= 1
##$TYPE= <nmr>
##$USER= <she>
##$AMP= (0..31)
100 100 100 100 100 100 100 100 100 100 100 100 100 100 100 100 100 100 
100 100 100 100 100 100 100 100 100 100 100 100 100 100 
##$AQSEQ= 0
##$AQ_mod= 1
##$AUNM= <au_zg>
##$AUTOPOS= <>
##$BF1= 200.13
##$BF2= 200.13
##$BF3= 200.13
##$BF4= 200.13
##$BF5= 200.13
##$BF6= 200.13
##$BF7= 200.13
##$BF8= 200.13
##$BYTORDA= 1
##$CFDGTYP= 0
##$CFRGTYP= 5
##$CHEMSTR= <none>
##$CNST= (0..31)
1 1 145 1 1 1 1 1 1 1 1 1 1 1 1 1 1 1 1 1 1 1 1 1 1 1 1 1 1 1 1 1 
##$CPDPRG= <>
##$CPDPRG1= <>
##$CPDPRG2= <>
##$CPDPRG3= <>
##$CPDPRG4= <mlev>
##$CPDPRG5= <mlev>
##$CPDPRG6= <mlev>
##$CPDPRG7= <mlev>
##$CPDPRG8= <mlev>
##$CPDPRGB= <>
##$CPDPRGT= <>
##$D= (0..31)
0 1.2 0 0 0 0 0 0 0 0.06 0 0.03 0 0 0 0 0.0002 0 0 0 0 0 0 0 0 0 0 0 0 
0 0 0 
##$DATE= 1591340420
##$DBL= (0..7)
120 120 120 120 120 120 120 120 
##$DBP= (0..7)
150 150 150 150 150 150 150 150 
##$DBP07= 0
##$DBPNAM0= <>
##$DBPNAM1= <>
##$DBPNAM2= <>
##$DBPNAM3= <>
##$DBPNAM4= <>
##$DBPNAM5= <>
##$DBPNAM6= <>
##$DBPNAM7= <>
##$DBPOAL= (0..7)
0.5 0.5 0.5 0.5 0.5 0.5 0.5 0.5 
##$DBPOFFS= (0..7)
0 0 0 0 0 0 0 0 
##$DE= 6
##$DECBNUC= <off>
##$DECIM= 24
##$DECNUC= <off>
##$DECSTAT= 4
##$DIGMOD= 1
##$DIGTYP= 9
##$DL= (0..7)
0 120 120 120 120 120 120 120 
##$DP= (0..7)
150 150 150 150 150 150 150 150 
##$DP07= 0
##$DPNAME0= <>
##$DPNAME1= <>
##$DPNAME2= <>
##$DPNAME3= <>
##$DPNAME4= <>
##$DPNAME5= <>
##$DPNAME6= <>
##$DPNAME7= <>
##$DPOAL= (0..7)
0.5 0.5 0.5 0.5 0.5 0.5 0.5 0.5 
##$DPOFFS= (0..7)
0 0 0 0 0 0 0 0 
##$DQDMODE= 0
##$DR= 18
##$DS= 0
##$DSLIST= <SSSSSSSSSSSSSSS>
##$DSPFIRM= 0
$$ [...]
##$SUBNAM2= <"">
##$SUBNAM3= <"">
##$SUBNAM4= <"">
##$SUBNAM5= <"">
##$SUBNAM6= <"">
##$SUBNAM7= <"">
##$SUBNAM8= <"">
##$SUBNAM9= <"">
##$SW= 24.9337058887773
##$SWIBOX= (0..15)
0 0 2 0 0 0 0 0 0 0 0 0 0 0 0 0 
##$SW_h= 4990.01996007984
##$TD= 16384
##$TD0= 1
##$TE= 0
##$TE2= 300
##$TE3= 300
##$TEG= 300
##$TL= (0..7)
0 120 120 120 120 120 120 120 
##$TP= (0..7)
150 150 150 150 150 150 150 150 
##$TP07= 0
##$TPNAME0= <>
##$TPNAME1= <>
##$TPNAME2= <>
##$TPNAME3= <>
##$TPNAME4= <>
##$TPNAME5= <>
##$TPNAME6= <>
##$TPNAME7= <>
##$TPOAL= (0..7)
0.5 0.5 0.5 0.5 0.5 0.5 0.5 0.5 
##$TPOFFS= (0..7)
0 0 0 0 0 0 0 0 
##$TUNHIN= 0
##$TUNHOUT= 0
##$TUNXOUT= 0
##$USERA1= <user>
##$USERA2= <user>
##$USERA3= <user>
##$USERA4= <user>
##$USERA5= <user>
##$V9= 5
##$VALIST= <valist>
##$VCLIST= <CCCCCCCCCCCCCCC>
##$VD= 0
##$VDLIST= <DDDDDDDDDDDDDDD>
##$VPLIST= <PPPPPPPPPPPPPPP>
##$VTLIST= <TTTTTTTTTTTTTTT>
##$WBST= 1024
##$WBSW= 4
##$XGAIN= (0..3)
0 0 0 0 
##$XL= 0
##$YL= 0
##$YMAX_a= 659179
##$YMIN_a= -412116
##$ZGOPTNS= <>
##$ZL1= 120
##$ZL2= 120
##$ZL3= 120
##$ZL4= 120
##$ABSF1= 10
##$ABSF2= 0
##$ABSG= 5
##$ABSL= 3
##$ALPHA= 0
##$AQORDER= 0
##$ASSFAC= 0
##$ASSFACI= 0
##$ASSFACX= 0
##$ASSWID= 0
##$AUNMP= <proc_1d>
##$AZFE= 0.1
##$AZFW= 0.1
##$BCFW= 1
##$BC_mod= 2
##$BYTORDP= 1
##$COROFFS= 0
##$CY= 11.3945322036743
##$DATMOD= 1
##$DC= 2
##$DFILT= <>
##$DTYPP= 0
##$F1P= 16.9975609425685
##$F2P= -3.02152046262296
##$FCOR= 0.5
##$FTSIZE= 0
##$FT_mod= 4
##$GAMMA= 1
##$GB= 0.15
##$INTBC= 1
##$INTSCL= 1
##$ISEN= 128
##$LB= 0.24
##$LEV0= 0
##$LPBIN= 0
##$MAXI= 10000
##$MC2= 0
##$MEAN= 0
##$ME_mod= 0
##$MI= 1.114404
##$NCOEF= 0
##$NC_proc= 0
##$NLEV= 6
##$NOISF1= 3.799351
##$NOISF2= 2.8
##$NSP= 1
##$NTH_PI= 0
##$NZP= 0
##$OFFSET= 15.70392
##$PC= 1
##$PHC0= -9792.26
##$PHC1= 10.60082
##$PH_mod= 1
##$PKNL= yes
##$PPARMOD= 0
##$PSCAL= 0
##$PSIGN= 0
##$REVERSE= no
##$SF= 200.130013532006
##$SI= 16384
##$SIGF1= 3
##$SIGF2= 2
##$SINO= 400
##$SIOLD= 16384
##$SREGLST= <1H.CDCl3>
##$SSB= 0
##$STSI= 0
##$STSR= 0
##$SW_p= 3612.71676300578
##$SYMM= 0
##$S_DEV= 0
##$TDeff= 0
##$TDoff= 0
##$TI= <>
##$TILT= no
##$TM1= 0
##$TM2= 0
##$TOPLEV= 0
##$USERP1= <user>
##$USERP2= <user>
##$USERP3= <user>
##$USERP4= <user>
##$USERP5= <user>
##$WDW= 1
##$XDIM= 8192
##$YMAX_p= 0
##$YMIN_p= 0
$$ End of Bruker specific parameters
$$ ---------------------------------
##NTUPLES= NMR FID
##VAR_NAME=  TIME,          FID/REAL,        FID/IMAG
##SYMBOL=    X,             R,               I
##VAR_TYPE=  INDEPENDENT,   DEPENDENT,       DEPENDENT
##VAR_FORM=  AFFN,          ASDF,            ASDF
##VAR_DIM=   8192,          8192,            8192
##UNITS=     SECONDS,       ARBITRARY UNITS, ARBITRARY UNITS
##FACTOR=    0.0002004,     1,               1
##FIRST=     0,             0,               0
##LAST=      1.6414764,     0,               0
##MIN=       0,             -412116,         0
##MAX=       1.6414764,     659179,          0
$$ Real data points
##PAGE= N=1
##DATA TABLE= (X++(R..R)), XYDATA
$$ [...]
2818a765J051J504o25M75J276k329r18J874N00j104j51M67j135J525K183k419
$$ -1765 -714 790 165 640 1916 -413 -1331 543 1043 -61 -212 255 -880 645 2828 409
2834D09k749K179J734j058l94N54j525Q68J130j238j791J826J198q67J76k18k253
$$ 409 -2340 -161 1573 515 121 675 -850 18 1148 -90 -1881 -55 1143 276 452 234 -2019
2851b019k34K695O39j631J034l37j371N68R19j740Q47J854j58k151j43M01j203
$$ -2019 -2253 442 1081 -550 484 147 -1224 -656 263 -1477 -630 1224 1066 -1085 -1228 -827 -2030
2868b030J759K901k015j712R00m90j094J228O28N5J012N81k482k058R12J876K33
$$ -2030 -271 2630 615 -1097 -197 -687 -1781 -553 75 130 1142 1723 -759 -2817 -1905 -29 204
2885B04J333J83k463k023J582K76O12J192j18j945J067J00k064q89K640J843p24
$$ 204 1537 1720 -743 -2766 -1184 -908 -296 896 778 -1167 -100 0 -2064 -2953 -313 1530 806
2902H06k39j432j808J082K046j66j090J667m23j905J213M15j959J498K412n02
$$ 806 567 -865 -2673 -1591 455 289 -801 866 443 -1462 -249 166 -1793 -295 2117 1615
2918A615j891l95J63o03K287R13j619j535K129O4j230R4M53j156J221J236j586
$$ 1615 -276 -671 -508 -1111 1176 2089 470 -1065 1064 1128 -102 -8 445 -711 510 1746 160
2935A60j214J061L69l2P31kj391J072K122k228j401P17N9l5K056o04j105j023
$$ 160 -1054 7 376 344 1075 1073 -318 754 2876 648 -753 -36 23 -12 2044 1440 335 -688
2953f88J347l68m59O91J32k32J243K32k592j237K124J105K45P5j027j729O41R32
$$ -688 659 291 -168 523 655 423 1666 1898 -694 -1931 193 1298 1543 1618 591 -1138 -497 435
2971D35n04m67K266K63k424N83m14j564N49L249j29j860m59j116k72J593J436
$$ 435 -69 -536 1730 1993 -431 152 -262 -1826 -1277 1972 1843 -17 -476 -1592 -1864 -271 1165
2988A165j975O20P65n74j765M60O72j17J010J540k030j654N09p61J382J334k07
$$ 1165 -810 -190 575 1 -1764 -1304 -632 -749 261 1801 -229 -1883 -1374 -2135 -753 581 374
3005C74j479N78R73j230j375J215J217m67P12q00k139O60J933k42m78J128j527
$$ 374 -1105 -527 446 -784 -2159 -944 273 -194 518 -282 -2421 -1761 172 -70 -548 580 -947
3022i47o79J606M96k086m47K685Q29j944M21p47q23J889J784j777j452J086J02
$$ -947 -1626 -20 476 -1610 -2057 628 1457 -487 -66 -813 -1636 253 2037 260 -1192 -106 -4
3039dn81J086K00j310J38J498q6j704Q79k43M63J193m98j608J23J521m36j339
$$ -4 -585 501 701 -609 -471 1027 941 -763 116 -127 336 1529 1031 -577 -454 1067 631 -708
3057g08J447j28j194J199K96q27j59O87r7k63J069j143j292J166J388j241j145
$$ -708 739 611 -583 616 912 85 -74 613 516 253 1322 179 -1113 53 1441 200 -945
3074i45K195r46n38J267L1j098K43J073j220J20J152j301j539K353J256k491o70
$$ -945 1250 304 -234 1033 1064 -34 209 1282 62 182 1334 33 -1506 847 2103 -388 -1058
3091a058J367L93K09l31p41j069K106J211k098r57J163J85n52Q03o13p53J061
$$ -1058 309 702 911 580 -161 -1230 876 2087 -11 -968 195 380 -172 631 18 -735 326
3108C26O90j182o5L18l51L5J374l05j717NJ778o55j417J313no22J178p43j548
$$ 326 1016 -166 -231 87 -264 -229 1145 840 -877 -872 906 251 -1166 147 142 -480 698 -45 -1593
3127a593m8K069p42r16J024K15j355O4J226j386O53J532m76j548K55L90q29N21
$$ -1593 -1641 428 -314 -1230 -206 9 -1346 -1282 -56 -1442 -789 743 267 -1281 -1026 -636 -1465 -944
3145i44Q36q95J057J075k609j318J540K007r34O1Q68j602m81J213n10n27K270
$$ -944 -108 -1003 54 1129 -1480 -2798 -1258 749 -185 -124 744 -858 -1339 -126 -636 -1163 1107
3162A107M54j751o63R4q90M56K494J38j596l59M25j019P30J067M7N3P36q92k844
$$ 1107 1561 -190 -853 -759 -1649 -1193 1301 1439 -157 -516 -91 -1110 -380 687 734 787 1523 631 -2213
3181b213J093K233q2l85R72l69j627L53K66o93J894O19p72j171L11k88q16K043
$$ -2213 -1120 1113 1031 646 1618 1249 -378 -25 241 -452 1442 2061 1289 118 429 141 -675 1368
3199A368N10j242J73N54j246o63J502l33o7J054N6k935O62J852m89j261R94K21
$$ 1368 1878 636 809 1363 117 -546 956 623 556 1610 1666 -1269 -607 1245 756 -505 489 710
3217G10r6L17o39j204Q22J206M6j725K71J42q5R36K83j530o17J829k7j203k91
$$ 710 614 931 292 -912 -90 1116 1162 -563 -292 -150 -235 701 984 -546 -1163 666 639 -564 -855
3236h55M79m05J010K9j451p66L294m42j783m56L30Q64K42P41j059o68R67l88r31
$$ -855 -376 -781 229 258 -1193 -1959 1335 893 -890 -1346 -1016 -152 90 831 -228 -896 71 -317 -1248
3255a248P31P14k08M39O4j120j172J824R90j090N54K14m03j579R23j58O3J281
$$ -1248 -517 197 -11 428 492 -628 -1800 24 1014 -76 478 692 289 -1290 -367 -525 -462 819
3273H19J2j080q07J046j055n3R95J141j282O92o48j770Q82J252R7l6J061j284
$$ 819 831 -249 -1056 -10 -1065 -1118 -123 1018 -264 428 -220 -1990 -1108 144 241 205 1266 -18
3291a8j030K46J536j333p7K228m85p91j601M90L29J970M43k092j037K002J182
$$ -18 -1048 -802 734 -599 -676 1552 1067 276 -1325 -835 -506 1464 1907 -185 -1222 780 1962
3308A962j862n39N02M0J423K86l030o76K526L15j042L01M33j838L45J063J33j385
$$ 1962 100 -439 63 103 1526 1812 -1218 -1894 632 947 -95 206 639 -1199 -854 209 342 -1043
3326a043J223N97j082O87l18o23L84J085j002j315J200J056j704O09K36m8O07
$$ -1043 180 777 -305 382 64 -559 -175 910 -92 -1407 -207 849 -855 -246 -10 -58 549
3343E49J462j655j510K038J040j667o67M43j79L73O17l53j386J197Q37j266k17
$$ 549 2011 356 -1154 884 1924 257 -410 33 -146 227 844 491 -895 302 1139 -127 -344
3360c44O81m16k06K32l32j203J346J645j642j37Q40o24m23L10N1l69R6J773j068
$$ -344 337 -79 -285 -53 -385 -1588 -242 1403 -239 -376 464 -160 -583 -273 -222 -591 -495 1278 210
3379B10o71L85n72r1J761M05k642L71J418O3l09k28L52p30J155r11p33J083J296
$$ 210 -461 -76 -648 -739 1022 1427 -1215 -844 574 637 328 100 452 -278 877 -34 -767 316 1612
3398A612r26j688J639O87j545r53O43M89L92M36j657j411J463J427j406p3P15
$$ 1612 686 -1002 637 1324 -221 -1174 -531 -42 350 786 -871 -2282 -819 608 -798 -871 -156
3415a56m98n28R32j079o02J098M88m47p0M52n23n02J594J41j747Q43J735j360
$$ -156 -654 -1182 -250 -1329 -1931 -833 -345 -792 -862 -410 -933 -1435 159 300 -1447 -604 1131 -229
3433b29n80k66M64M97J835j364j762m17K116P24j442P54r52O06K036j843j162
$$ -229 -809 -1075 -611 -114 1721 357 -1405 -1822 294 1018 -424 330 -622 -16 2020 177 -985
3450i85J26J808m16n40L69p07j190J738N93j201R14O79j205k96J065k57r02N63
$$ -985 -859 949 533 -7 362 -345 -1535 203 796 -405 509 1188 -17 -313 752 495 -407 156
3468A56J813p29r21L30p54J34J459k48j745J906P71k376n08J091J403j134J026
$$ 156 1969 1240 319 649 -105 29 1488 1240 -505 1401 2172 -204 -712 379 1782 648 1674
3485A674n83j408P61k98M14o02J649p53j356k10J477q6j522J107m22N14J341j865
$$ 1674 1091 -317 444 146 560 -42 1607 854 -502 -712 765 679 -843 264 -158 356 1697 -168
3503a68j331J57J993q37k84J170r08m86O30M13j327Q09J63k18K53J36r95j117
$$ -168 -1499 -1342 651 -186 -470 700 -208 -694 -64 349 -978 -169 -6 -224 29 165 -830 -1947
3521a947J524J028j704K31Q11k51n00J110j678m06J625M06j358NO50m81O16m35
$$ -1947 -423 605 -1099 -868 -57 -308 -808 302 -1376 -1782 -157 249 -1109 -1104 -454 -935 -319 -754
3539g54o52L27J436N52k443j11J516R7j211J243L06j409O82L97q44M50J036j458
$$ -754 -1406 -1079 357 909 -1534 -1645 -129 -32 -1243 0 306 -1103 -421 -24 -868 -418 618 -840
3557h40O38J27N24j494K44P27kl42J669j118n22m7P76j010J071Q69k018N12M84
$$ -840 -202 -75 449 -1045 -801 -74 -76 -418 1251 133 -389 -436 340 -670 401 1270 -748 -236 248
3576B48N78p74o93J643j04o69Q25j188k15K032k1r70k73N93l33k79M3j03j98J117
$$ 248 826 52 -641 1002 898 229 1054 -134 -349 1683 1662 692 419 1012 679 400 443 340 142 1259
3596A259P88k152R06R30j588N49J288k015q46J507M88r57P4N23n62l79Q88n31
$$ 1259 2047 -105 801 1731 143 692 1980 -35 -881 626 1114 157 231 754 192 -187 701 170
3614A70q14KJ147j94J62L6j034m16Q80k52j101Q33L69j25l54O44r73m67J451k0
$$ 170 -644 -642 505 311 473 509 -525 -941 -61 -313 -1414 -581 -212 -337 -691 -47 -1020 -1487 -36 -56
3634e6o99m63K051p71j676J158R3o37L46N34n82R93J13j395K20J047r80p65N83
$$ -56 -755 -1218 833 62 -1614 -456 -363 -1000 -654 -120 -702 291 404 -991 -771 276 -704 -1469 -886
3653h86L8M65j228J413k01p48J574m70p53L90J075k106Q33J140j67j504J068L32
$$ -886 -848 -383 -1611 -198 -399 -1147 427 -43 -796 -406 669 -1437 -604 536 369 -1135 -67 265
3671B65n05M66l7j210M26J747o78j307J249P49j547P20O06j640Q42N22m56m00
$$ 265 -240 226 189 -1021 -595 1152 474 -833 416 1165 -382 338 944 -696 146 668 212 -188
3689a88O06j90r56J294R66j266o94M62L94q83J1O35l2o55J082r16M1O12k10n60
$$ -188 418 228 -728 566 1532 266 -428 34 428 -455 -444 191 159 -496 586 -330 -289 323 113 -447
3709d47N16p4j060P46O47J85k076J471O88j136P38L13o23m39J338j46j075j40
$$ -447 69 -5 -1065 -319 328 513 -1563 -92 596 -540 198 511 -112 -551 787 641 -434 -574
3727e74R82o77r2R26k30p07J119m28j77k78Q83J6l00P66j328m20R91P04j693Q7
$$ -574 408 -269 -361 565 335 -372 747 319 142 -136 747 763 463 1229 -99 -519 472 1176 -517 -430
3747d30J671j083n54L49J76k48N84K23j705J420P5j24n72N60l38m45O68j53p63
$$ -430 1241 158 -396 -47 129 -119 465 688 -1017 403 478 354 -218 342 4 -441 227 74 -689
3766f89P7K82n60O81O25j231j52P64Q65j032J79J67n60M71m86o54j37J120l6r35
$$ -689 -612 -330 -890 -209 416 -815 -967 -203 662 -370 -191 -24 -584 -113 -599 -1253 -1390 -270 -306 -1241
3786a241L84J139j181J75M66O26q92J31Q06p96p39J353J37p54O7J177k377Q09
$$ -1241 -857 282 -899 -724 -258 368 -524 -393 413 -383 -1122 231 368 -386 -319 858 -1519 -710
3804g10J292p27o30J609L66k253O84K18o42R55O45j120k85P08M99r43l53J216
$$ -710 582 -145 -775 834 1200 -1053 -369 -151 -793 162 807 -313 -598 110 609 -334 -687 529
3822E29q01M11N49j372k43J513K91j474L06O23n80O9J381j342l30J538K90j076
$$ 529 -272 139 688 -684 -927 586 877 -597 -291 332 -248 -179 1202 -140 -470 1068 1358 282
3840B82q8O75o14N02J84j113K74N0N51j311J06Q45r3j241J200M49p76M29M32j184
$$ 282 194 869 255 757 941 -172 102 152 703 -608 -502 343 250 -991 209 658 -118 311 743 -441
3860d41J49Q87q16n36N71N4q73J031N48j287m24Q65n6j4K16J5N97p32J363j984
$$ -441 -292 595 -221 -757 -186 -132 -1005 26 574 -713 -1137 -272 -328 -342 -126 -111 486 -246 1117 -867
3880h67k85J533l23K96m12m31K33J08J463j205n65J594r15l51k29J81m93L30J764
$$ -867 -1152 381 58 354 -58 -489 -256 -148 1315 110 -455 1139 224 -127 -356 -175 -668 -338 1426
3899A426k378J84M3O02m51K89k68k34N44j47L92j798J383j55J42M83o40m03L30
$$ 1426 -952 -768 -725 -123 -574 -285 -553 -787 -243 -390 2 -1796 -413 -568 -426 57 -583 -986 -656
3918f56Q46K53j178P89J88r77L56R07q60j66J195M8j179l4Q97l59p24J181k47
$$ -656 190 443 -735 54 242 -735 -379 528 -332 -498 697 745 -434 -468 429 70 -654 527 280
3937B80k37j8j66m9lJ508j537j46Q25j92j691J756P8q96P37M13p07m21R46O9n00
$$ 280 43 25 -141 -190 -193 1315 -222 -368 457 265 -1426 330 408 -488 249 662 -45 -466 480 549 49
3958D9O50n02k193K123J392j553j218J069J054K73p49j67j123J169J436j016L6
$$ 49 699 197 -1996 127 1519 -34 -1252 -183 871 1144 395 228 -895 274 1710 694 730
3975G30j230K90M88R46K40j928L72P86n10k70J51o2q04P92J796k503k42J600k81
$$ 730 -500 -210 278 1224 1464 -464 -92 694 184 -86 65 3 -801 -9 1787 -716 -958 642 361
3994C61o41J1l43K60J163k79r86p49J859j43j494J381k56m25j66J248p94k89k59
$$ 361 -280 -269 -612 -352 811 532 -454 -1203 656 513 -981 400 144 -281 -447 801 7 -282 -541
4013e41m6m83M38J778j522L30P37p17k7O64k8j736N78R89q94N2P86n06k05J97
$$ -541 -587 -1070 -632 1146 -376 -46 691 -26 -53 611 583 -1153 -575 414 -480 -428 358 -148 -353 -156
4033a56k39j09n76J227q0k36n13k64K72J080p7j997P48K219p06n06J56n38j044
$$ -156 -395 -504 -1080 147 67 -169 -682 -946 -674 406 329 -1668 -920 1299 593 87 243 -295 -1339
4052a339K106l48k330L10J830J92o01Qp56j11J463M00q16q60J129l61j76O43M40
$$ -1339 767 419 -1911 -1601 229 421 -180 -172 -928 -1039 424 824 8 -852 277 -84 -260 383 823
4071H23j956P20J200k71o58N83j72n49K87N86j927J514O71q08j096J244J469k099
$$ 823 -1133 -413 787 516 -142 441 269 -280 7 593 -1334 180 851 43 -1053 191 1660 -439
4089d39O31L87n55P04m89q4m10J086p09l53L84J12k99J13L74j28n66O86N08j271
$$ -439 192 579 24 728 239 155 -255 831 122 -231 153 265 -34 79 453 325 -241 445 953 -318
4109c18k31J345m93j782K351j450J66J259l00r65r95J898l99J51q9o43k10M30
$$ -318 -549 796 303 -1479 872 -578 -412 847 547 -418 -1413 485 86 237 148 -495 -705 -275
4127b75J075q67p78J019M40n26M47o81q89K326l70j071j75K26L27k07P1L55j629
$$ -275 800 -67 -845 174 614 88 535 -146 -1035 1291 921 -150 -325 -99 228 21 92 447 -1182
4146a182O82L40j92j259J434Q01k78n79L21n67k20R74j56j98j04L08r96J217j65
$$ -1182 -500 -160 -352 -1611 -177 624 346 -233 88 -479 -699 275 119 -79 -183 125 -871 346 181
4165A81p28p58K279m10j394K01N52k63k71Q67j71J90r18M26j044J388Q92j183
$$ 181 -547 -1305 974 564 -830 -629 -77 -340 -611 256 85 275 -643 -217 -1261 127 1019 -164
4183a64n17O13K3n55J163l80q91J084l33q18K98j58J29M70K99p6j006N27P47n60
$$ -164 -681 -68 -45 -600 563 183 -708 376 43 -775 -477 -635 -506 -36 263 187 -819 -292 455 -105
4203a05j70K20r2m98J214m38j294R11L46l8j81NK99n99J002k3o16m05J110k08
$$ -105 -275 -55 -147 -645 569 131 -1163 -252 94 56 -125 -120 179 -420 582 559 -57 -462 648 440
4223D40m00J46L31p52R43n9n33j227J547K3K35j00m06l12N17K84m49n23J490r20
$$ 440 40 186 517 -235 708 649 116 -1111 436 459 694 594 188 -124 393 677 228 -295 1195 275
4243B75j214J378j77m05K02L06n17L5O26l90j153J363q1R1RO58j877L5R29J67
$$ 275 -939 439 262 -143 59 365 -152 -117 509 119 -1034 329 248 339 348 1006 -871 -836 93 260
4263B60q15N41j64k18N43R26j309k28J469o47j110L11O85P4q08R96j249O78K15
$$ 260 -555 -14 -178 -396 147 1073 -236 -464 1005 358 -752 -441 244 318 -490 506 -743 -65 150
4282A50P15j659L45O79o04L81P25p14j043J269J342k204m2O08k67j6L77k73o45
$$ 150 865 -794 -449 230 -374 7 732 18 -1025 244 1586 -618 -660 -52 -319 -335 42 -231 -876
4301h76M38L50M64o65J347j629N4N22n92N5J073o50o86N94P93q08l27J235m80
$$ -876 -438 -88 376 -289 1058 -571 -517 5 -587 -532 541 -109 -795 -201 592 -216 -543 692 212
4320B12k24n0K13n69J75L01j87k46N3M18l92P27j7o86l06J225p5j376M22J230
$$ 212 -12 -62 151 -418 -243 58 -129 -375 -322 96 -296 431 414 -272 -578 647 572 -804 -382 848
4340H48p52L81j3m35o43J507r6r19j7K30j23O13k75o0j688K148K38j711Q74M52
$$ 848 96 477 464 29 -614 893 797 -122 -139 91 -32 581 306 246 -1442 706 944 -767 107 559
4360E59n14N03P57j332o60P20N4l83L21L23K31o63M92n20J83k38N00P2J88n4k27
$$ 559 45 548 1305 -27 -687 33 87 -296 25 348 579 -84 408 -112 71 -167 333 405 593 539 312
4381C12k11L83K59j204P08Q86j567M36M79K48j195J157n28m34L40K55o38q4P38
$$ 312 101 484 743 -461 247 1133 -434 2 481 729 -466 691 163 -271 69 324 -314 -398 340
4400C40m50m73N41M69q17J04M24r56K70J019l35m21M63N67j726M48P03q57O07
$$ 340 -110 -583 -42 427 -390 -286 138 -818 -548 471 136 -285 178 745 -981 -533 170 -687 -80
4419h0j40J140j090m60M01k20L46K32k49m59N93j86r17J365m45o92J138N39q40
$$ -80 -220 920 -170 -630 -229 -449 -103 129 -120 -579 14 -172 -1089 276 -169 -861 277 816 -24
4438b4j043P93K36k93o7Q78p35m79J582j277q68J689M46j056Q21M86j497n66O70
$$ -24 -1067 -274 -38 -331 -398 480 -255 -734 848 -429 -1297 392 838 -218 603 1089 -408 -974 -304
4457c04J021r51K85M38n03P3R22j400O66k61M46p97M02J03p06P19R71j016kM64
$$ -304 717 -234 51 489 -14 59 981 -419 247 -14 432 -365 37 140 -566 153 1124 108 106 570
4477E70m54o68J74M28P8Q8n17J42R7J26J81n34L43l47L22j51l77J481j020R14
$$ 570 116 -552 -378 50 128 216 -301 -159 -62 64 245 -289 54 -293 29 -122 -499 982 -38 876
4497H76r42K58p66O79l52N1J042m50l91R91M09j367o61K83N24m51J113q2p18R5
$$ 876 -66 192 -574 105 -247 -196 846 396 5 996 1405 38 -623 -340 184 -267 846 764 46 141
4517A41J3l85Q1M1K64p22Q96J47m80J71r5p42K97K063j112p39o73J153k31n43
$$ 141 154 -231 -150 -109 155 -567 329 476 -4 167 72 -670 -373 1690 578 -161 -834 319 88 -455
4537d55Q26j818P62N80K00r82N80Q15o31o90J094p72j338J554J75K60J19K56l33
$$ -455 371 -1447 -685 -105 95 -887 -307 508 -123 -813 281 -491 -1829 -275 -100 160 279 535 202
4556B02r78P76Oj35J2j69K83j81M43p50M41O62o33o50J051jp91L3P69o49k88Q78
$$ 202 -776 0 6 -129 -117 -286 -3 -184 259 -491 -50 612 -21 -671 380 379 -412 -379 390 -259 -547 331
4578C31R8k55l3R5J9n29J64L80m37M7M31p15r12J896j872J493q3q86R24N50r56
$$ 331 429 174 141 236 255 -274 -110 270 -167 -120 311 -404 -1316 580 -1292 201 118 -768 156 706 -250
4599b50m13L45O08o4l55O67j011L35L50J28o82J77Q49n16j158J377k04m37J01
$$ -250 -663 -318 290 226 -129 538 -473 -138 212 340 -342 -165 684 168 -990 387 183 -254 -153
4618a53O55j786J548N98m49j022R87Q30j035K27k65k62n39J389l36j111J034M19
$$ -153 502 -1284 264 862 413 -609 378 1208 173 400 135 -127 -666 723 387 -724 310 729
4636G29r10J328o44N93k053J983r45q63M23P16m42j61N51q41K12J37J430j500
$$ 729 -181 1147 503 1096 -957 1026 81 -782 -359 357 -85 -246 305 -536 -324 -187 1243 -257
4654b57o31J181k2K26p04n69O21q83J428j091J184P05j692L74k52J44N09j71J73
$$ -257 -888 293 271 497 -207 -776 -155 -1038 390 -701 483 1188 -504 -130 -382 -238 271 100 273
4673B73n67N58j1j308p2J136k98j43k9m42K34J30L64J57l85J315o56K9q92R26
$$ 273 -294 264 253 -1055 -1127 9 -289 -432 -461 -903 -669 -539 -175 -18 -403 912 256 285 -607 319
4693C19o47r9P87n84L59P7O52q06o82Q78j154L29K51K68p21Q22k89J86k32Q32
$$ 319 -328 -427 360 -224 135 212 864 58 -624 254 -900 -571 -320 -52 -773 49 -240 -54 -286 546
4713E46j008J28J613j298q66J203M30n18k9L53p56L37k81k11K43K01k4n5J00R42
$$ 546 -462 -334 1279 -19 -885 318 748 230 201 554 -202 135 -146 -357 -114 87 63 8 108 1050
4733A050j114Q8o4k29N61J07l51m42N43R5k7o96P97K64q98L72j56J46n87J460
$$ 1050 -64 24 -40 -269 292 399 48 -394 149 244 217 -479 318 582 -316 56 -100 46 -541 919
4753I19j406OJ020j19q46Q44Q41j765j67L92M8j75J09J590j390l5j57K43n5J72
$$ 919 -487 -481 539 420 -426 418 1259 -506 -673 -281 -233 -408 -299 1291 -99 -134 -291 -48 -103 69
4773F9O3O46o78J63PJ92M0m52q06N38O31j128Q36O89j039K17J292j485N3L9O64
$$ 69 132 778 100 263 270 462 502 50 -756 -218 413 -715 121 810 -229 -12 1280 -205 -152 -113 551
4794E51j223J61K93J09j202J874p52n76Q72j7r65O71O73j361M45j35M64o38m18
$$ 551 -672 -511 -218 -109 -1311 563 -189 -765 107 90 -875 -204 469 -892 -447 -582 -118 -756 -1174
4813a174J336K15j419J146L39j115L28J32L58J90K49o69n08R37m82Q02n05n92
$$ -1174 162 377 -1042 104 443 -672 -344 -212 146 336 585 -84 -592 345 -137 665 160 -432
4831d32q79J715N12l44j658J231l71k89J042K4m73j004J474j98n20j17Q05o95
$$ -432 -1311 404 916 572 -1086 145 -226 -515 527 551 78 -926 548 350 -170 -287 518 -177
4849a77M66Q6k05m11P01L51j680J911p42j330J96J223k43o01J004l01J95K65l92
$$ -177 289 375 170 -241 460 811 -869 1042 300 -1030 -834 389 146 -455 549 248 443 708 316
4868C16j001M79J88O03m19R3j89o53J101r00O77K23m90p77P22K55l11N59K8N33
$$ 316 -685 -206 -18 585 166 259 70 -583 518 -382 295 518 28 -749 -27 228 -83 476 504 1037
4888A037n60j476J658j133J9P8K77rR25j3j825M67K010o45r37K13O51j185K30
$$ 1037 477 -999 659 -474 -455 -377 -100 -109 816 803 -1022 -555 1455 810 -127 86 737 -448 -218
4907b18O20q72O31O50p35K56L50p41m30J109m43K19p55J165j123L43k72J69o69
$$ -218 402 -470 161 811 76 332 682 -59 -489 620 177 396 -359 806 -317 26 -246 -77 -746
4926g46J050N27j343jQ09l02M58l28p24L33l77J519j340j1L51m6k71P98K93r27
$$ -746 304 831 -512 -513 296 -6 452 124 -600 -267 -644 875 -465 -476 -125 -171 -442 356 649 -278
4946b78l76J700j841j63J074p13L03N7O26j158N53N97o73j03O02m83q70J097l16
$$ -278 -654 1046 -795 -958 116 -597 -294 -237 389 -769 -216 381 -292 -395 207 -276 -1146 -49 -365
4965c65l70Q31m61R28q15O88q85J222j113M10j61p62P21q5K92j554K080j179P2
$$ -365 -735 96 -365 563 -252 436 -449 773 -340 70 -91 -853 -132 -217 75 -1479 601 -578 -506
4984e06R30m93J78q2J63q16N0J394k29m30P5N11j311J70K28J48L91q29K51L93
$$ -506 424 -69 109 27 190 -626 -576 818 589 159 234 745 -566 -396 -168 -20 371 -458 -207 186
5004A86O68k65l5r96O16m70n9Q99m72k19J086p43k71J83n07k6L34J11P56l81j080
$$ 186 854 589 554 -442 174 -296 -355 544 72 -147 939 196 -75 108 -399 -425 -91 20 776 395 -685
5025f85M33N01J80J01J88j654L83J81M5n13Q88Q59j781Q24L61l41N04j359O16
$$ -685 -252 249 429 530 718 -936 -553 -372 -327 -840 48 907 -874 -50 311 -30 474 -885 -269
5044b69N46J66l25k43P03l75J37p99J598j456o6O43n03p90J395l97R49p01j76
$$ -269 277 443 118 -125 578 203 340 -459 1139 -317 -383 260 -243 -1033 362 -35 914 213 37
5063C7k213K321J73j134N63L41n96j37N37L0M26J86m99Q46j065J8N99r72j71P70
$$ 37 -2176 145 318 -816 -253 88 -508 -645 -108 -78 348 534 35 881 -184 -166 433 -539 -710 60
5083F0p27k40R68q9j81P38j25n88k24Q01p63L07k1Kj99Q08l81j049K25J354n52
$$ 60 -667 -907 61 -28 -209 529 404 -184 -408 393 -370 -63 -84 -82 -281 527 146 -903 -678 676 124
5104A24J2L56j078j11R50j78l16O55n16k97L87J238q46j76l32P19j234j44J125
$$ 124 136 492 -586 -697 253 75 -241 414 -102 -399 -12 1226 380 204 -128 591 -643 -787 338
5123C38n36j73m59J43J80J12R97j140O86J029j345r0Q64j115J73R43j080M56K28
$$ 338 -198 -371 -830 -687 -507 -395 602 -538 148 1177 -168 -258 606 -509 -336 607 -473 -17 211
5142B11J261j642N65j170J584j083k88J235L53j966J298L07r28k97m5K5J106M
$$ 211 1472 -170 395 -775 809 -274 -562 673 1026 -940 358 665 -263 -560 -605 -580 526 530
5160E30q93m43j13O75n67J457j135J129o84q19J503j251k7R79l95q0L82n38Q8
$$ 530 -363 -806 -919 -244 -811 646 -489 640 -44 -863 640 -611 -638 341 -54 -134 248 -290 -202
5179b02O13j181l29J858J59j738Q18j56m20P12J00L87j033Q74j62k83j113J76
$$ -202 411 -770 -1099 759 918 -820 -2 -158 -578 134 234 621 -412 462 300 17 -1096 -920
5197i20K51P72K28K43j245J089L80n65o97J1l04P84Q32k17p82K89j11j004J344
$$ -920 -669 103 331 574 -671 418 798 233 -464 -453 -757 27 859 642 -140 149 38 -966 378
5216C78m26p02M33N97j82p73J150l09K88J6l0K39q03M55j164Q14q0P69j254j44
$$ 378 -48 -750 -317 280 98 -675 475 166 454 470 440 679 -124 331 -833 -19 -99 670 -584 -728
5236g28K141j105o59K77p0j17N92J12O61k036J169J199j499j57P07J30O30j613
$$ -728 1413 308 -351 -74 -144 -261 331 443 1104 -932 237 1436 -63 -220 487 617 1247 -366
5254c66O1m4R2J301j768l88J076j097J962K95q13q87Q41M68l14n98J013j08n98
$$ -366 -305 -349 -257 1044 -724 -1112 -36 -1133 829 1124 311 -576 265 733 419 -179 834 726 128
5273A28J67m60m39J501p21n32P10j86l37p33J399o78K09M22m88J82M51N65r89
$$ 128 295 -165 -604 897 176 -356 354 168 -169 -902 497 -181 28 450 -38 144 595 1160 171
5292A71q35M43j87k04l36J149L05p54j322M71O31M79Q96j115k41J141o70m76j28
$$ 171 -664 -221 -408 -612 -948 201 506 -248 -1570 -1099 -468 11 907 -208 -449 692 22 -454 -582
5311e82Q98j103L21l40J44O91j401J57J256o1q47N83O54o68M3j23R86o90l96J41
$$ -582 316 -787 -466 -806 -662 29 -1372 -1215 41 -20 -867 -284 370 -298 -255 -378 608 -82 -478 -337
5331c37J106m99l58Q43j265O53L0R72k243J166r8J53j333J054k15p40J303j14
$$ -337 769 270 -88 755 -510 143 173 1145 -1098 68 -30 123 -1210 -156 -371 -1111 192 78
5349G8L42n61R8L30j028M52Q43o50r42O45Q65n28n79r96K384j75q43O44j16J066
$$ 78 420 -141 -43 287 -741 -289 554 -96 -1038 -393 472 -56 -635 -1631 753 578 -265 379 263 1329
5369A329j558K85m08R28j109J278J56j507Q26M55K32q04K69j18mO1K81l22J14
$$ 1329 -229 56 -352 576 -533 745 901 -606 220 675 907 103 372 254 250 311 592 270 384
5388C84q29Q27j23j830J825m69N71K60j480J587n05l60J90q58N28L00m55O82O62
$$ 384 -445 382 259 -1571 254 -215 356 616 -864 723 218 -142 48 -810 -282 18 -437 245 907
5407I07k38o56J3m56R34j016P77M0j247P71m42Q61o92p52K122o30o05k51L87J4
$$ 907 669 13 26 -430 504 -512 265 305 -942 -171 -613 248 -444 -1196 926 296 -309 -560 -173 -159
5427a59O62l96o63Q78k87m38P43k08N00m47LQ2j044R21N41l66n84p63O49J125
$$ -159 503 107 -556 322 35 -403 340 132 632 185 188 270 -774 147 688 322 -262 -1025 -376 749
5447G49j258J060l20o19J257K72j191R05q64j29j66J229p15j54N06N76o73p08
$$ 749 -509 551 231 -388 869 1141 -50 855 -9 -138 -304 925 210 56 562 1138 465 -243
5465b43N77m49L37l59j63q20J079O03q17J60L28k51K21M00j053O23J3N40q46M65
$$ -243 334 -115 222 -137 -300 -1120 -41 562 -255 -95 233 -18 203 603 -450 173 186 726 -120 345
5485C45L35m70j35J127n70j116N8J149j239K65l94Q83j117R97p24M28K43N16k38
$$ 345 680 210 75 1202 632 -484 -426 723 -516 -251 -645 238 -879 118 -606 -178 65 581 343
5504C43m08L95J06k63L67m45q4l64N99n71m33Q82k37Q07j594J326l11l11J427
$$ 343 -65 330 436 173 540 95 11 -353 246 -325 -758 124 -113 694 -900 426 115 -196 1231
5523A231j279m57P92N76j141k41J209j376O59K81j00j39N34m09j141J241j60l47
$$ 1231 -48 -505 287 863 -278 -519 690 -686 -27 254 154 15 549 140 -1001 240 80 -267
5541b67k48K44J26m14O20J86L69r6J72o88K83jm76k21K54J14p50P66k04P36j130
$$ -267 -515 -271 -145 -559 61 247 616 520 692 4 287 286 -190 -411 -157 -43 -793 -27 -231 505 -625
5562f25Q62K52k20j50K41j107K44k3J601j131R0q4k97J19J201p55r49N36k52L84
$$ -625 237 489 269 119 360 -747 -503 -526 1075 -56 34 -50 -347 -228 973 218 -731 -195 -447 -63
5582f3m12O3n12P21k04O0P15Jp8r16J366r05N5k31N82L00j222R06o79O17k47R65
$$ -63 -475 -412 -924 -203 -407 -347 368 369 291 -625 741 -164 -109 -340 242 542 -680 226 -453 164 -83 882
5604H82j007m36L11N8p49Q40L50j13q56M43n59J198n35R94j344O33l61m4o38P61
$$ 882 -125 -561 -250 -192 -941 -101 249 136 -720 -277 -836 362 -173 821 -523 110 -251 -295 -933 -172
5624a72J35j069J631J96o32O86n90l64k69J429j524O25O35n16m68J6jK83K30J39
$$ -172 -37 -1106 525 721 89 775 185 -179 -448 981 -543 82 717 201 -267 -251 -252 31 261 400
5644D00n4k23J97N87j180K77K6L68p25R5O11q42kM01m4qL99Q3m47J20K84q5k95
$$ 400 346 123 320 907 -273 4 30 398 -327 -232 379 -463 -465 -64 -108 -116 283 366 -81 39 323 238 -57
5667e7P9N46J79j30J44p26M5q7l2K13K46n61n62M47L13j27m61M24j32l31J398
$$ -57 22 568 747 617 761 35 80 -7 -39 174 420 -141 -703 -256 57 -70 -531 -107 -239 -570 828
5688H28m26q10P87q40P51o34K70p68P13N4l0r69O61n0l07R03J19n18K10M27m87
$$ 828 402 -408 379 -461 290 -344 -74 -842 -129 -75 -105 -1074 -413 -463 -770 133 252 -266 -56 371 -116
5709a16k98r2K46P9k55N47N43o75L50m51J55o33P73l41k48J56j4q1P01l43n89
$$ -116 -414 -506 -260 -181 -436 111 654 -21 329 -122 33 -600 173 -168 -416 -260 -274 -355 346 3 -586
5730e86M19L58J71r56N42P54l13K97m24l7o35L04L38J52j025ML16N46j26n53R93
$$ -586 -167 191 362 -594 -52 702 389 686 262 225 -410 -106 232 384 -641 -637 -321 225 99 -454 539
5751E39j24j17m26P37r95o90J969o53p68n88J040K5N02N6l93k23K54O65q32M19
$$ 539 415 298 -128 609 -386 -1076 893 240 -528 -1116 -76 -51 451 507 114 -109 145 810 -22 397
5771C97n8L4o18Q99L18j058j15M09j71j39N88j036M18Q79n92k71P30n95p73P22
$$ 397 339 373 -245 654 972 -86 -201 208 37 -102 486 -550 -132 747 155 -116 614 19 -754 -32
5791c2L18n42L82K27p75M23j55j231N77K58P26j00m07j79K90K31r97K285j887
$$ -32 286 -256 126 353 -422 1 -154 -1385 -808 -550 176 76 -331 -510 -220 11 -986 1299 -588
5810e88P31M33l98p3N13r47J62o4P20o64m37Q07o23K5R95q2j131L68P50l02j145
$$ -588 143 576 178 105 618 -329 -167 -231 489 -175 -612 195 -428 -403 592 510 -621 -253 497 195 -950
5831i50J286j097J53q8J561j390J329n39J70j150L1o68P52J100p73L26o49J158
$$ -950 336 -761 -608 -696 865 -525 804 265 435 -715 -684 -1352 -600 500 -273 53 -596 562
5849E62k65J00K84j5p22M77n41j80N90r05J13J318k087J189j55J85J161r50k88
$$ 562 297 397 681 666 -56 421 -120 -300 290 -615 -502 816 -1271 -82 -237 -52 1109 159 -129
5868a29J26L3j47L44r3r98J001o07p17J344q84M01K3M64l54q1J36L88J8o28k68
$$ -129 -3 30 -117 227 134 -864 137 -470 -1187 157 -727 -326 -303 161 -193 -274 -138 250 268 -360 -628
5889f28J55J15M11l63N60O92j110M03p06J008M37j544J97J095q52O8j221J362
$$ -628 -473 -358 53 -310 250 942 -168 235 -471 537 974 -570 -373 722 -130 -62 -1283 79
5907G9m82MP52m00j68L39P35p84L03k30K25n03j049K45O28Q3m69Q59qq61R98q21
$$ 79 -403 -399 353 -47 -215 124 859 75 378 148 373 -130 -1179 -934 -306 -223 -692 167 159 -702 296 -525
5929e25J128j8r05L08j082J863p35N25j016J36N66j74j289J049j59j88R61l49
$$ -525 603 585 -320 -12 -1094 769 34 559 -457 -321 245 71 -1218 -169 -328 -516 445 96
5947I6p00Q68M80p62j18r4M26K13r29J063r46R27M70q78p85j60M06l02Q37j56
$$ 96 -604 264 744 -18 -136 -230 196 409 -520 543 -403 524 994 116 -669 -829 -423 -725 112 -44
5967d4nj88O88k105L98J369J74j97l68j03J24r08J283J47K27j58o61m61K93Q99
$$ -44 -49 -237 451 -1654 -1256 113 287 90 -278 -381 -257 -1165 118 265 492 334 -327 -788 -495 404
5987D04m52J86j873J580Q0k74k06N00J01o32J160j020k1Q80r17K32L43l58M69
$$ 404 -48 138 -1735 -155 -75 -349 -555 -55 46 -586 574 -446 -467 413 -504 -272 71 -287 182
6006A82N30N21j024M81j347R24k99p19J140n1p4k68m54o86O59P02R8r1K35m92
$$ 182 712 1233 209 690 -657 267 -32 -751 389 338 264 -4 -458 -1144 -485 217 315 224 459 -33
6026c3k7n55R03j48m67J65M12k76l21k7K16n36J620k098K501j783J320K87j687
$$ -33 -60 -615 288 140 -327 -162 250 -26 -347 -374 -158 -694 926 -1172 1329 -454 866 1153 -534
6045e34L09J69p3r0Q55m53l92K19R24q10q26J731m85j180J98M4J083k258J931
$$ -534 -225 -56 -129 -219 636 183 -209 10 934 124 -702 1029 544 -636 -438 -394 689 -1569 362
6064C62q86j86L13k23J843j381n88J234k67K10j260Q99J074j519l27J01J324n15
$$ 362 -524 -710 -397 -620 1223 -158 -746 488 221 431 -829 70 1144 -375 -702 -601 723 208
6082B08l07N10k34r13Q14M92k89l65j773J820p01P23R11q52l5j282J195m69Q45
$$ 208 -99 411 177 -736 78 570 281 -84 -1857 -37 -738 -15 896 44 9 -1273 -78 -547 298
6101B98j003M35L44j64K6L32J58j500R24Kj5N24k84L87o30J147n62o09M02M33
$$ 298 -705 -270 74 -90 -64 268 426 -1074 -150 -148 -163 361 77 464 -166 981 419 -190 212 645
6121F45j93o24j539J900p46J158r9n29N1m8Q00j010L30P82m40j062P66Ko01P32
$$ 645 452 -172 -1711 189 -557 601 502 -27 24 -24 776 -234 96 878 438 -624 142 144 -457 275
6141B75m2o86R4l7Q99j389M92Q15o14N69K91o96j94P86j501L13J647O53k628O64
$$ 275 233 -453 -359 -396 503 -886 -394 421 -193 376 667 -29 -223 563 -938 -625 1022 1675 -953 -289
6161b89N82L47j119o7J54j90R7O34o40J123o09L36q95O34Q7m9p04M35R84j298
$$ -289 293 640 -479 -546 -392 -582 -485 149 -491 632 23 359 -536 98 185 136 -568 -133 851 -447
6181d47n24J358L38m9k82q82J805l1q21m47J122j783L51J003l52j643M31K356
$$ -447 -971 387 725 676 394 -488 1317 1286 465 18 1140 -643 -292 711 359 -1284 -853 1503
6199A503j668n82J31Q79n74J021j250J491k122J467j00Q80j266L55m55j73j39
$$ 1503 -165 -747 -616 263 -311 710 -540 951 -1171 296 196 1076 -190 165 -290 -463 -602
6216f02M83J533j869j20L81L1M47M60q60l6j46L37O31j172j06J016l42l55N05
$$ -602 -119 1414 -455 -575 -194 -163 284 744 -116 -152 -298 39 670 -502 -608 408 66 -289 216
6235B16L79J81q65n7K23n16L15l79J349q60P80k70o90J325j255J49K14kl34m22
$$ 216 595 776 -89 -146 77 -439 -124 -503 846 -14 766 496 -194 1131 -124 25 239 237 -97 -519
6255e19J223j277K14P23O38n43j308J343j15OM70k92q32P02j126J862q15n39j92
$$ -519 704 -573 -359 364 1002 459 -849 494 379 385 855 563 -269 433 -693 1169 354 -185 -377
6274c77J41N46J54l86K31q6M23j427J912L70j891R7O36m45Q50m29o98M31l37J350
$$ -377 -236 310 464 78 309 223 646 -781 1131 1501 -390 -293 343 -102 748 319 -379 52 -285 1065
6294A065L20j646L69j16M93j03k36m37O21l11j31p24J919j329R66o66Q91m34L25
$$ 1065 1385 -261 108 -8 485 382 146 -291 330 19 -112 -836 1083 -246 720 54 945 511 836
6313H36l41K2q04Q1Q31m43m14N03n34M23j344J616n21L30j96r97K050l05j788
$$ 836 495 517 -287 -206 625 182 -232 271 -263 160 -1184 432 -89 241 45 -952 1098 793 -995
6332i95K97J443q06O73o27r76J33J282p43q03O72L53m23J035j113K39J65O34m53
$$ -995 -698 745 -61 612 -15 -991 -858 424 -319 -1122 -450 -97 -520 515 -598 -359 -194 440 -13
6351a3j45J031j893J257k03M27n06j90q72J488p37J261q51n63n72R65m13P49l31
$$ -13 -158 873 -1020 237 34 461 -45 -235 -1107 381 -356 905 54 -509 -1081 -116 -529 220 -111
6370a11J70L58n83L95J51j000K69m70Q00P05r06k05m7J904j309j350K090r08m60
$$ -111 59 417 -166 229 380 -620 -351 -821 -21 684 -222 -427 -474 1430 121 -1229 861 -47 -507
6389e07j046J135O89K5J05j389J59J642j413J298j391J227m34J67P21M26k183
$$ -507 -1553 -418 271 296 401 -988 -829 813 -600 698 -693 534 100 267 988 1414 -769
6406g69M70L50R29l85m25J32k63j42N66j591Q49J124j950K035j659J024L04j147
$$ -769 -299 51 980 595 170 302 39 -103 463 -1128 -279 845 -1105 930 -729 295 599 -548
6424e48M24m78M77Q6K94P72o9j104N6J097p73l08M07k90k18R42j471l62J568k84
$$ -548 -124 -602 -125 -39 255 1027 958 -146 -90 1007 234 -74 333 43 -175 767 -704 -1066 502 218
6444B18R5j455K65Q33K01p40Q12o21J17m96N16L0N48Q5p04J279r89K54l99J201
$$ 218 313 -1142 -877 -44 157 -583 229 -392 -275 -771 -255 -225 323 408 -296 983 -6 248 -151 1050
6464A050r14K0k60n93n88J695N24j298l57J588Q1j351J045j113J175k70J54J72
$$ 1050 136 156 -104 -697 -1285 410 934 -364 -721 867 948 -403 642 -471 704 434 588 760
6482G60j471J672m04r56R06N61j481L14l97Q25j280M83p90J109J323k98j192l22
$$ 760 -711 961 557 -399 507 1068 -413 -99 -496 329 -951 -468 -1258 -149 1174 876 -316 -638
6500f38J461j660P13K72M48j567J277k35L47p16K0j90N8L35O05Mrj03n63K41j97
$$ -638 823 -837 -124 148 596 -971 306 71 418 -298 -278 -468 -410 -75 530 534 525 422 -141 100 -97
6521i7R30l70N12j614r0J007N51j728K102j067l36q10J199O64j097J344p35K64
$$ -97 833 463 975 -639 -729 278 829 -899 1203 136 -200 -1010 189 853 -244 1100 365 629
6539F29k96M72p49K15O6q47J412r43J575o62j014L87K93Q6l3k41r11k09L70P28
$$ 629 333 805 56 271 337 -510 902 -41 1534 872 -142 245 538 624 591 350 -561 -770 -400 328
6559C28j333N33l40N58M53j87r57J775j568Q68J90j567O28M57j070J703Nj018
$$ 328 -1005 -472 -812 -254 199 12 -945 830 -738 130 320 -1247 -619 -162 -1232 471 476 -542
6577e42J301o07q47J034P79j720J362q54O54m57q09J123J04j413J617K27n20Q31
$$ -542 759 152 -695 339 1118 -602 760 -94 560 103 -706 417 521 -892 725 952 432 1263
6595A263o20r65R53j406L31L98J11O3L77Q2j170L17M50k04n76Q15j292J090P0
$$ 1263 643 -322 631 -775 -444 -46 65 128 505 587 -583 -266 184 -20 -596 219 -1073 17 87
6614H7M1j03j233Q65N79K69P4J30k94m86o7p46Q16K49k1l59L0P91j007J38j47
$$ 87 128 25 -1208 -343 236 505 579 709 415 -71 -138 -884 -68 181 160 -199 -169 622 -385 -247 -394
6635c94J032j328Q10k72p14R23K32p84J832k305J499j179Q89O05o30n48m6P26
$$ -394 638 -690 120 -152 -866 57 289 -495 1337 -968 531 -648 241 846 216 -332 -378 348
6653C48L85j083O52N0o31P32q35Q85l61n36P34q21N64R04j240O89j137L44K88
$$ 348 733 -350 302 352 -279 453 -382 503 142 -394 340 -481 83 987 -253 436 -701 -357 -69
6672f9J59K58m45J169j376k99N7J723j081K33l69J57K59o21L23q61R17J049j701
$$ -69 90 348 -97 1072 -304 -603 -546 1177 96 329 -40 117 376 -245 78 -783 134 1183 -518
6691e18K10J248q52j41p31M58K42L5P21p58j43J380j416N47j23o47k3j59k32K230
$$ -518 -308 940 88 -53 -784 -326 -84 -49 672 -86 -229 1151 -265 282 159 -488 -511 -670 -902 1328
6711A328j645M42p40P17R5p41P13l24M10r96J30Q2R37m02l42J101j227L73j19
$$ 1328 -317 125 -615 102 197 -544 169 -155 255 -741 -611 -529 408 6 -336 765 -462 -89 -208
6730b08m65L1O82j133J252J9J53K07j277Q26l36K59m1O14q31K76l70L84M11N30
$$ -208 -673 -642 40 -1093 159 178 331 538 -739 87 -249 10 -31 583 -248 28 -342 42 453 983
6750I83j240L65M7q16L72j56J362q44L08o77K65j083j82J102N69p34J39P04q06
$$ 983 -257 108 155 -661 -289 -445 917 73 381 -296 -31 -1114 -1296 -194 375 -359 -220 484 -322
6769c22r81J847r47K31k6m71Q08j292J635k31m22P50r48j39N51j46p03P61j57
$$ -322 -1303 544 -403 -172 -198 -669 139 -1153 482 251 -171 579 -369 -508 43 -103 -806 -45 -202
6788b02j38N60o43Q00j26J09n08M08O27r08J83n31r8j244K855j431j35O75m81
$$ -202 -340 220 -423 377 251 360 -148 260 887 -21 162 -369 -467 -1711 1144 -287 -422 253 -228
6807b28l24P40j56k99P44j301O63J42n8J43R17j224J81J034j140j007m54K729
$$ -228 -552 188 32 -267 477 -824 -161 -19 -77 66 983 -241 -60 974 -166 -1173 -1627 1102
6825A102q27m42O14M39k24p68o34P6O41J49m82o45R95o88o6J043j81m99K56K88
$$ 1102 275 -167 447 886 662 -106 -740 -664 -23 126 -356 -1001 -6 -694 -760 283 102 -397 -141 147
6845A47m09o36m34J887j019O4P89j143J225P59k058J089P3n62R55j041J5m56O99
$$ 147 -262 -898 -1332 555 -464 -400 389 -754 471 1230 -828 261 334 -228 727 -314 -299 -755 -56
6864e6n36j8J00J152k041P20M73J391j623M19l18J27NL30k27o06Q27K7j773J033
$$ -56 -592 -610 -510 642 -1399 -679 -206 1185 -438 -19 -337 -210 -205 125 -102 -708 119 146 -1627 -594
6884e94N44r3o95J209r32K34M83o36M55Q86j697q7P63M07k54j049J741mK64n98
$$ -594 -50 -143 -838 371 -561 -327 156 -480 -25 861 -836 -923 -160 247 -7 -1056 685 681 945 347
6904C47J61k77n01J249j279p48K483n56j962J245n78J133o11J24p21J33O51m78
$$ 347 508 231 -270 979 -300 -1048 1435 879 -1083 162 -416 717 106 230 -491 -358 293 -185
6922a85J010j114N48o68L9Q13p21L35j63l41J466p90J40j285J629m38k67J367
$$ -185 825 -289 259 -409 -370 443 -278 57 -106 -447 1019 229 369 -916 713 275 8 1375
6940A375k555J535k57l01P30p54o94m1Q70M3q02R56o4J23K36l38k01j33J125r92
$$ 1375 -1180 355 98 -203 527 -227 -921 -962 -92 -49 -851 105 41 164 400 62 -139 -272 853 -139
6960a39J81P48j460Q37p5K99m75o1J004k291J263l88Q73k47j76j83j455J414O83
$$ -139 42 790 -670 167 92 391 -84 -145 859 -1432 -169 -557 316 69 -107 -290 -1745 -331 352
6979C52j717L65J240l46J011q43j72j255K117j306J907j424l71l92k66K87O54
$$ 352 -1365 -1000 240 -106 905 62 -110 -1365 752 -554 1353 -71 -442 -834 -1100 -813 -159
6996a59J49l0P92j055k32Q47p81K96j01J55J90J036j290r4P73j83j112J109j38
$$ -159 -10 -40 752 -303 -535 312 -469 -173 -274 -119 71 1107 -183 -277 496 313 -799 310 172
7015A72m15j19N01q12J270m48M48K43n40n52J780n02j574O02q85J717j151P06
$$ 172 -243 -362 139 -673 597 149 597 840 300 -252 1528 1026 -548 54 -831 886 -265 441
7033D41o55L01K64k75J09J110k275N44m6k1N74q95O92K2j22k62R86r98l34R12
$$ 441 -214 87 351 76 185 1295 -980 -436 -482 -503 71 -824 -132 -110 -232 -494 492 -506 -840 72
7053G2J042j570k23M2J273l00j601Q21J85O68j97j20k83J27j122J215K08K14O7
$$ 72 1114 -456 -679 -637 636 336 -1265 -444 -259 409 212 92 -191 -64 -1186 29 237 451 518
7072E18j53j46j6n46k7L45M81M24j328j29M18O97K39l80L03k21L10m51j039n58
$$ 518 365 219 203 -343 -370 -25 456 880 -448 -577 -159 538 777 397 700 479 789 338 -701 -1259
7092a259J754k50m40m65J091j29n59K87P35n28j344J377j025K32J399o43k61J83
$$ -1259 495 245 -195 -660 431 302 -257 30 765 237 -1107 270 -755 -523 876 233 -28 155
7110A55q91Q91L33k77l43Q48j536K35N83j110K57J568n58m82M87M30m37n05N99
$$ 155 -736 155 488 211 -132 716 -820 -585 -2 -1112 -855 713 155 -327 160 590 153 -352 247
7129B47m95k96l12J010P66q17R8q67M32O2n04J338p16O59kp57j036P36R25l44
$$ 247 -248 -544 -856 154 920 103 201 -666 -234 -172 -676 662 -54 605 603 -154 -1190 -454 471 127
7149A27K14J21p41K45l66p15K153m74j86K7om68p15J978p91o0n87N78qp7L78J7
$$ 127 341 462 -279 -34 -400 -1115 1038 564 378 405 399 -69 -784 1194 403 343 -244 334 326 249 627 644
7171F44Q0J70p16L15j131K3J138q85j39P62N98n57K94o32p80Q58l9j470J437Q30
$$ 644 724 894 178 493 -638 -615 523 -362 -501 261 859 302 596 -36 -816 42 3 -1467 -30 800
7191H00j173Q80j006N20m64O23j80M14n41L02j221O56L80l40O41N34p57k52N39
$$ 800 -373 507 -499 21 -443 180 0 414 -127 175 -1046 -390 -10 -350 291 825 68 -184 355
7210C55J11p62K60k22j66n62J802j038o49J252n96n19j213K217j032m79J897O4
$$ 355 466 -296 -36 -258 -424 -986 816 -222 -871 381 -215 -734 -1947 270 -762 -1241 656 720
7228G20q70K311j964N00l3Q2q13l41K94r43N77P29L88l29j245J607j956Q84P15
$$ 720 -150 2161 197 697 664 746 -67 -408 -114 -1057 -480 249 637 308 -937 670 -1286 -402 313
7247C13rl44l87R14m29k45q15Q18M94k175J081N91Q8L32j021J472o68J67j15j084
$$ 313 304 -40 -427 487 58 -187 -1002 -184 310 -1865 -784 -193 -105 227 -794 678 10 177 62 -1022
7267a022Q42Q7J003j620P58k40Q79m4j182K7J29P94q19m05L56r23J320l35j36
$$ -1022 -180 -93 910 -710 48 -192 687 643 -539 -512 -383 411 -408 -813 -457 -1380 -60 -395 -531
7286e31J053p10P01J05r30M51J54m78J385j629r22J579j21p61pJ332n24p13K23
$$ -531 522 -188 513 618 -312 139 293 -185 1200 -429 -1351 228 107 -654 -661 671 147 -566 -343
7305c43r8J542j421P41N09m60j40j188K66J10L92Q29o46J145m52j664J574l30
$$ -343 -441 1101 -320 421 930 470 330 -858 -592 -482 -90 739 93 1238 786 -878 696 366
7323C66k86k47j94J061j555J083M86Q19k069R58J6K54j249j64J877j122O78p38
$$ 366 80 -167 -361 700 -855 228 714 1533 -536 422 438 692 -557 -721 1156 34 712 -26
7341b6j77o27K138q48M56r90l52P70j05l04O79j647L27J860j951K27J003j031
$$ -26 -203 -830 1308 460 916 -74 -426 344 239 -65 614 -1033 -706 1154 -797 -570 433 -598
7359e98j97P57L63j242Q87n32R44j46j89K51L10j05q88P93N4K73j175J211m0o13
$$ -598 -795 -38 325 -917 -30 -562 382 236 47 298 608 503 -385 408 462 735 -440 771 731 118
7379A18L09P89k795J754p02J138nm63o76M37J062j144m64J208j127K6J089j383
$$ 118 427 1216 -1579 175 -527 611 606 143 -533 -96 966 -178 -642 566 -561 -535 554 -829
7397h29r3J001L88o75P67l14o20J339m10l3j379J143K59j231Q97j51r41J763j448
$$ -829 -922 79 467 -208 559 245 -375 964 554 521 -858 285 544 -687 210 59 -882 881 -567
7416e67J12N17P64k62K98M48q60j735M21J165N36o71R6l09j74J074M89l96p48
$$ -567 -455 62 826 564 862 1310 450 -1285 -864 301 837 166 262 -47 -221 853 1342 946 198
7435A98o25l03J6O28j13O47o58l09R37J02j675J236k67J467n22Mj590N98l74R85
$$ 198 -427 -730 -714 -86 -199 448 -210 -519 418 520 -1155 81 -186 1281 759 763 -827 -229 -603 382
7455C82n61r42J099K00j6p00O66K80K74j209J956p21J061j657p35J020n34O65
$$ 382 -179 -1121 -22 178 162 -538 128 408 682 -527 1429 708 1769 112 -623 397 -137 528
7473E28J055j993J204j344l36M65P83N45m96q21L60r66J446k98j1j49m13M38q40
$$ 528 1583 -410 794 -550 -886 -421 362 907 411 -410 -50 -1016 430 132 121 -28 -441 -3 -843
7492h43L4o75K563o24mk74j106R92m22q69K999k755k10P49o13K13R69l09K51J81
$$ -843 -809 -1484 1079 455 451 177 -929 63 -359 -1228 1771 -984 -1194 -445 -1058 -845 124 -185 66 247
7512B47p66N05k091l38J340J365n26O20m8Q4q24M52k95Q01m37j804K390M5n66
$$ 247 -519 -14 -2105 -2443 -1103 262 -264 356 308 392 -432 20 -275 526 89 -1715 675 720 154
7531A54P16r68R30j393J401j300N74L39n18p80Q05J88N40j547j20R39o89J441
$$ 154 870 -98 832 -561 840 -460 114 453 -65 -845 -40 148 688 -859 -979 -40 -729 712
7549G12m94J56K39j616Q42l0L28J073j520j0m84K1M22J742j30J29k4j367o06P83
$$ 712 218 374 613 -1003 -161 -191 137 1210 -310 -320 -804 -783 -361 1381 1251 1380 1356 -11 -617 166
7569A66J106n55O2L4K01p40j44O67m56j008m9J500j7o15j53J05K9l82r7J57n21
$$ 166 1272 717 779 813 1014 274 130 797 341 -667 -716 784 767 152 -1 104 133 -249 -346 -189 -710
7590g10P72O18n75%O53j533O43N11R24o14r9r70R63P59o55j882J309n31m73J463
$$ -710 62 680 105 105 758 -775 -132 379 1303 689 590 -380 583 1342 687 -1195 114 -417 -890 573
7610E73j311K14Q35j20o26J87J03L68m09J34l00P44m41O0j177J933k197Q12l0
$$ 573 -738 -524 311 191 -435 -248 -145 223 -186 -52 -352 392 -49 11 -1166 767 -1430 -618 -648
7629f48k38K082p12m14O81n46o63K09O29m75N74j411Q14q30N20Q4J503O81j271
$$ -648 -886 1196 484 70 751 205 -458 -249 380 -95 479 -932 -118 -948 -428 -344 1159 1840 569
7648E69j431N50R81j028l6J021o83j334J122N22m34M86r61M24J067o06j027J039
$$ 569 -862 -312 669 -359 -395 626 -57 -1391 -269 253 -181 305 -656 -232 835 229 -798 241
7666B41l04K52K9L5r41n92m5R90J000K05M32q34j168P69p0k001K680j150j052
$$ 241 -63 189 218 253 -688 -1280 -1325 -335 665 870 1302 468 -700 69 -1 -2002 678 -472 -1524
7685a524J718O24j849n17J223Mj235K253k498J969n18J652j095L35p47m55k48
$$ -1524 194 818 -1031 -1548 -325 -321 -1556 697 -1801 168 -350 1302 207 542 -205 -660 -908
7702i08Q92J415j587P6Q71N87r41K80r53J183j252P07m75J9j44J306j697N23K9
$$ -908 -16 1399 -188 -112 759 1346 405 685 -268 915 -337 370 -105 -86 -230 1076 -621 -98 -69
7721f9k82j133M33J564L87K78p88r00J132k47j204J024j071K72Q76n56j812L541
$$ -69 -351 -1484 -1051 513 900 1178 390 -510 622 375 -829 195 -876 -604 272 -284 -2096 1445
7739A445k229J779J03r89r71O7R3Q83O27j043j68n1J102L51j497n52J925l12o99
$$ 1445 -784 995 1098 109 -862 -795 -702 181 808 -235 -403 -454 648 999 -498 -1050 875 563 -136
7758a36o01J905k535J095j93m71Q31n4J101j281j146J788j9k05p36J147K31p98
$$ -136 -737 1168 -1367 -272 -465 -936 -105 -159 942 -339 -1485 303 284 79 -657 490 721 -77
7776g7J190o69o41R73j597J305k36j837J485M01j96j4q48J893k079K35L4P07l15
$$ -77 1113 444 -197 776 -821 484 248 -1589 -104 297 101 87 -761 1132 -947 -712 -678 29 -286
7795b86o06k72L14J019k91L99L27o9o38o26m78Q54l8R1q39M72Q98J264j837J3
$$ -286 -892 -1164 -850 169 -122 277 604 535 -103 -729 -1207 -353 -391 -300 -1139 -667 231 1495 -342 -329
7815c29N61k48j10j78L99J452q42p95o55K63P6r21J557r13J456M3r6M5Q2q65N94
$$ -329 232 -16 -126 -304 95 1547 705 -90 -745 -482 -406 -1327 230 -683 773 816 720 765 847 -18 576
7836E76l97l93j56J076p93J04j058J71m16R09R25q64N72j26j555J371P30p65J81
$$ 576 179 -214 -370 706 -87 17 -1041 -870 -1286 -377 548 -316 256 130 -1425 -54 676 -89 92
7855I2R26j387q4K14p60J203J87q6m17n52J508k154k10P97L00o58J212J091p34
$$ 92 1018 -369 -453 -239 -999 204 391 305 -112 -664 844 -1310 -1520 -723 -423 -1081 131 1222 488
7874D88k82P73o54n52J121j290m00O84j143J184j333K575o45j87J92k87r26N22
$$ 488 206 979 325 -227 894 -396 -796 -112 -1255 -71 -1404 1171 526 339 531 244 -682 -160
7892a60l04J58J621j092l83L05j357J665n17K00j36k76J71M84r5P4R44j655l4
$$ -160 -464 -306 1315 223 -160 145 -1212 453 -64 136 0 -276 -105 379 284 358 1302 -353 -387
7911c87pn54P36N4J208j105j23J008q46L91j032O27J085p20j022P27Ql96K51q21
$$ -387 -394 -948 -212 -158 1050 -55 -178 830 -16 375 -657 -30 1055 335 -687 40 48 -348 -97 -918
7931i18J397j574Q1O60J2l8p79L23J244K72j59k156J980j90O95j550J050p90m75
$$ -918 479 -1095 -1014 -354 -342 -380 -1159 -836 408 680 521 -1635 345 155 850 -700 350 -440 -915
7950i15J589j657J698m93n10J198j41j317N41M46j273J15J108K46r02j545J268
$$ -915 674 -983 715 222 -288 910 769 -548 -7 439 -834 -719 389 635 -267 -1812 -544
7967e44O00J44l23J03j004N70J290p60R68j519L76R85m71J74J4j077Q30P53j412
$$ -544 56 200 -123 -20 -1024 -454 836 76 1044 -475 -99 886 415 589 603 -474 356 1109 -303
7986c03j48P30j114J651K88j196k86P19l77L24J51m92l99Q37r10P57j00M92j457
$$ -303 -451 279 -835 816 1104 -92 -378 341 -36 288 439 -53 -452 385 -525 232 132 624 -833
8005h33N26K73j07j17L85k80j07k32J119p85j37l31P87M33q78N63j268P41o65
$$ -833 -307 -34 -141 -258 127 -153 -260 -492 627 -158 -295 -626 161 594 -284 279 -989 -248 -913
8024i13j42N19Q96r37J203j78r07J098j938L82Q88K3k72N5J009L73m63j654K546
$$ -913 -1055 -536 360 -577 626 448 -459 639 -1299 -917 -29 -6 -278 -223 786 1159 696 -958 1588
8043A588o80L88k053LO56k79L24n58J333r45o29N43j140J007l39J359J12o80j637
$$ 1588 908 1296 -757 -754 -98 -377 -53 -611 722 -223 -852 -309 -1449 -442 -781 578 690 10 -1627
8062a627O52M86Q90J49n48R0k23N07p53n76J160l46L75J72J011j102q87J498k747
$$ -1627 -975 -489 401 550 2 92 -131 376 -377 -953 207 -139 236 408 1419 317 -570 928 -1819
8081a819K032M62q74L37Q57j987J073O35j357N52o64R32m00K31o53J263m56j163
$$ -1819 213 675 -199 138 995 -992 81 716 -641 -89 -753 179 -221 10 -643 620 164 -999
8099i99p03K136k35j378J444n38m1K15o6o2J338q73l64p82j063L58J801o50J445
$$ -999 -1702 434 199 -1179 265 -273 -314 -99 -165 -227 1111 238 -126 -908 -1971 -1613 188 -462 983
8118I83j367o19J087J96n9k65q41j76J348j349J882j455J156N3N46j257K07K95
$$ 983 -384 -1003 84 280 221 -44 -885 -1061 287 -1062 820 -635 521 574 1120 -137 70 365
8136C65k663N97K823j213m04L55J411o58k78r0l60l77o8k48K02J535l03j795M64
$$ 365 -2298 -1701 1122 -91 -495 -140 1271 613 335 245 -115 -492 -560 -808 -606 929 626 -1169 -705
8155g05j35N1q87J720j46J41P05M29o50j864K314j784Q78M72j512P15N05j416
$$ -705 -840 -789 -1676 44 -102 39 744 1173 523 -1341 973 -811 67 539 -973 -258 247 -1169
8173a169J185K43J114j324M16M66q56l27q81M43J343p99k71j24M45L88m27K90
$$ -1169 16 259 1373 49 465 931 75 -252 -1133 -690 653 -146 -417 -541 -96 292 -135 155
8191A55
$$ Imaginary data points
##PAGE= N=2
##DATA TABLE= (X++(I..I)), XYDATA
0@%%%qJ6j6J6k4L4m0N5p1Q5j07J36j63J93k33K76l25L81m43N17o00O88p89R03
$$ 0 0 0 0 -8 8 -8 8 -16 18 -22 33 -38 47 -60 76 -87 106 -127 149 -176 205 -238 279 -321 367 -422 481
27D81j026J162j316J484j666J869k095K339k605K903l228L579l968M398m867N387
$$ 481 -545 617 -699 785 -881 988 -1107 1232 -1373 1530 -1698 1881 -2087 2311 -2556 2831
43B831n967O609p328Q140r062J0115j1335J2771j4482J6571j9186K2566k7134
$$ 2831 -3136 3473 -3855 4285 -4777 5338 -5997 6774 -7708 8863 -10323 12243 -14891
56a4891L3688m3954O2447j06109L90201L37797p48131k61718L22967M57816q5324
$$ -14891 18797 -25157 37290 -68819 321382 659179 -88952 -350670 -27703 430113 344789
67C44789l21157j27397K53484J77611j33606k54217q180J18488Q2946L0506J7080
$$ 344789 23632 -103765 149719 327330 193724 -60493 -68673 49815 132761 163267 180347
78A80347j21990j81206m5154J76594J85276m3813k55751j02020K19298J94396
$$ 180347 58357 -122849 -168003 8591 193867 150054 -105697 -207717 11581 205977
88B05977k15001l03026J02909L75638J04161l06157l01846R3590L51045J15871
$$ 205977 -9024 -312050 -209141 166497 270658 -35499 -337345 -243755 107290 223161
98B23161k61866k21699J42197K26624k3604j61302n4156O1770O6362J9468j202
$$ 223161 -38705 -260404 -118207 108417 84813 -76489 -130645 -68875 -2513 16955 15753
109A5753l230n5543j04335K4317K02272R3049k23830k26416J22254K91361N5311
$$ 15753 12523 -43020 -147355 -123038 79234 172283 -51547 -277963 -155709 135652 190963
120A90963k44676k20110P7490K82023Q9262k21284j82925J19573J93175j9655
$$ 190963 -53713 -273823 -196333 85690 174952 -46332 -229257 -109684 83491 63836
130F3836j56355n0079R6473J08054n049q1902l2468K7197l988J8710R3904L2456
$$ 63836 -92519 -142598 -46125 61929 56880 -25022 -57490 -30293 -34281 -15571 78333 110789
142A10789j26451p4157J20730J13734q1879j51562J6815J97823J31853j54767
$$ 110789 -15662 -89819 30911 144645 62766 -88796 -71981 125842 257695 102928
152A02928k73050K689K88961J53821j71863k10412J5924J67821P9412j06753j47059
$$ 102928 -170122 -167433 121528 275349 103486 -106926 -91002 76819 156231 49478 -97581
163i7581J9700J52236N6572q6716r0861l1782J4427P1245P2389k3028r2281m4954
$$ -97581 -77881 74355 130927 44211 -46650 -78432 -64005 7240 79629 56601 -35680 -80634
175h0634K6667N4959L4535m2130o2951L8555R3309k2758j13894j9040R4208O7215
$$ -80634 -53967 992 35527 -6603 -69554 -30999 62310 39552 -74342 -93382 826 68041
187F8041k6207o7996k0403O0905M2928n7801n9024N2648P6399o471n0956l4813
$$ 68041 41834 -26162 -46565 14340 57268 -533 -59557 -6909 69490 63019 12063 -22750
199b2750j1031L0983N3639j547l9459q431J523j8804P977M1887p278m1862n259
$$ -22750 -33781 -2798 50841 49294 9835 1404 2927 -15877 -7900 33987 26709 -15153 -20412
212b0412K9580J6053p113m3718l5497M2869P5086j1240p1826k2696J9536J8681
$$ -20412 9168 25221 18108 -25610 -61107 -18238 56848 45608 -26218 -48914 -29378 -10697
224a0697K4698J1183k6119k2090Q106L187J796J5716o811k1188K5371L1960l3093
$$ -10697 14001 25184 -935 -23025 -14919 -11732 -9936 5780 -1031 -22219 3152 35112 2019
237B019m6989K0481L8232j731r619l817n47R630r563m0838J912O9401L1825m9972
$$ 2019 -44970 -24489 13743 12012 2393 -1424 -1971 7659 -1904 -42742 -40830 28571 60396 10424
251A0424n7285o680L1391M6693J1612m9584l0684L9315L1055k9347l0107N620
$$ 10424 -46861 -53541 -22150 24543 36155 -13429 -44113 -4798 26257 -3090 -33197 -27577
263b7577J1601L0759K7943l3161n7678N535M4741J8905o277j4997j0826J4273
$$ -27577 -15976 14783 42726 9565 -48113 -42578 2163 21068 14791 -206 -11032 3241
275C241J4665l2242k9236M2987N3456k0611m6641j2466J2564K9657K0791k8835
$$ 3241 17906 -14336 -43572 -585 52871 32260 -14381 -26847 -14283 15374 36165 7330
287G330m2407K0742M9799j476l6065k6690j545L4968M6519k0605o4920n297M9852
$$ 7330 -35077 -14335 35464 33988 -2077 -28767 -30312 4656 51175 30570 -34350 -39647 10205
300A0205J9479j9011k1380j4066J0973L5196O546l0035j1702O659o310N927K3062
$$ 10205 29684 10673 -10707 -24773 -13800 21396 27942 -2093 -13795 -7136 -13446 -7519 15543
313A5543k172j7835Q886O765k6487q001K5988J3486j472K636j1158j9078Q470
$$ 15543 13371 -4464 4422 11187 -15300 -23301 2687 16173 14701 17337 6179 -12899 -4429
326d429O725j3117J1119L8292J278l5264k0331n279M542K9664K2495q666o011
$$ -4429 2296 -10821 298 38590 39868 4604 -15727 -21006 -16464 13200 35695 27029 21018
339B1018l766l7278k8181M1580M9774j244k5455j4994j3313J426J0528q676L01
$$ 21018 17252 -20026 -48207 -6627 43147 41903 16448 1454 -11859 -10433 95 -8581 -8280
352h280L4295K0439k9829l7947j6373k648L0537N3079L982m7630k9723L124N157
$$ -8280 26015 46454 16625 -21322 -37695 -40343 -9806 43273 47255 -375 -30098 -26974 -21817
365b1817J0068J3308k324O507J1781j7205m3251p58L1741J7331P673J999k4658
$$ -21817 -11749 1559 -765 5742 17523 318 -42933 -43691 -11950 5381 13054 15053 -9605
378i605k2931J2446J0539j3085O854K9544O557j9143k2082j7986Q892M1926J3593
$$ -9605 -32536 -20090 -9551 -22636 -15782 13762 20319 1176 -20906 -38892 -30000 11926 25519
391B5519l2536j0883J9745q47j3775L048K449J720J7816N554k2691p688J3871
$$ 25519 -7017 -17900 1845 998 -12777 -9729 -7280 -5560 12256 17810 -4881 -12569 1302
404A302l649o744J6473J2199j2483R5M659j4703j697J5492J67m684P681J179j2272
$$ 1302 -2347 -9091 7382 19581 7098 7193 11852 -2851 -4548 10944 11111 6427 14108 15287 3015
419C015P275O562k5747r172L3386K0658j8017k0108r395j032J6175R528j5770
$$ 3015 10290 16852 -8895 -18067 15319 35977 17960 -2148 -11543 -12575 3600 13128 -2642
432b642m482K3004k547k8018q565J1145K277Q025J4871r825j9399K151O93o673
$$ -2642 -7124 15880 13333 -14685 -23250 -12105 -9828 -1803 13068 3243 -16156 -14005 -13312 -19985
446a9985J0697J2735l101J753K522k3695j5762K5740K4191m453m829K923j0369
$$ -19985 -9288 3447 346 2099 4621 -19074 -34836 -9096 15095 10642 5813 8736 -1633
459a633q330J0809J396k886J7140J2294j3998j0152O51q267M450K3492L968j6757
$$ -1633 -9963 846 2242 -644 16496 28790 14792 4640 5291 -2976 1474 24966 28934 12177
473A2177j205J38j4665l36J7083K407l522M744r396j7743N654J2839j3026j544
$$ 12177 10972 11110 -3555 -3891 13192 15599 12077 16821 7425 -10318 -4664 8175 -4851 -6395
487f395J8273J71j7272o504k824J774J3994J0490j5726q665J2839m494j3883J0205
$$ -6395 11878 12049 -5223 -11727 -14551 -12777 1217 11707 -4019 -12684 155 -4339 -18222 -8017
501h017J1560n505P9Q568r970j2326P900O691N51Q221l841j7145M858J6727j1015
$$ -8017 3543 -1962 -1883 6685 -3285 -15611 -7711 -1020 -469 7752 3911 -13234 -8376 8351 -2664
516b664j7605J5537J2646r405p158j011q257M361J4771p034r730O136m45j0630
$$ -2664 -20269 -4732 7914 -1491 -8649 -9660 -17917 -13556 1215 -5819 -15549 -9413 -9858 -20488
530b0488N774Q737r556l025J7288j730j3148L938N930k096N421R905r143l453
$$ -20488 -14714 -5977 -15533 -18558 -1270 -3000 -16148 -12210 -6280 -8376 -2955 6950 -2193 -5646
544e646J1720J594r635J0931J0004p188p01J0225n766q721J0843L797n657N565
$$ -5646 6074 7668 -1967 8964 18968 11780 11079 21304 15538 6817 17660 21457 15800 21365
558B1365N143j5259k263J2921l846j0252M643N020j0671n57J145j1332k112J2501
$$ 21365 26508 11249 8986 21907 18061 7809 12452 17472 6801 6244 7389 -3943 -6055 6446
572F446l684r671M480k644j4606K474J4505o461j0210Q973M034p995K5l14m336
$$ 6446 2762 -6909 -2429 -5073 -19679 -17205 -2700 -9161 -19371 -10398 -6364 -14359 -14334 -14648 -18984
587a8984R742J1856n962j0137O509J402n243J0965R417j0594k793J5351l617j3426
$$ -18984 -9242 2614 -3348 -13485 -6976 -5574 -10817 148 9565 -1029 -3822 11529 7912 -5514
601e514P38J0477L357Q982j141j8094m163J4340P59q433O926L550j0554N19N004
$$ -5514 -4776 5701 9058 18040 16899 -1195 -5358 8982 9741 1308 8234 11784 1230 1749 6753
616F753j0186p658J2179Q416k336j256j1511j3822J2504K2081q683j8203P953
$$ 6753 -3433 -11091 1088 9504 7168 5912 -5599 -19421 -6917 15164 6481 -11722 -3769
629c769J0992k220m162p249n443J5617J8166r706k0092M241R711j886M250M054
$$ -3769 7223 5003 841 -6408 -11851 3766 21932 12226 -7866 -3625 6086 4200 8450 12504
643A2504j0315m376J3414Q96j1513k780J46N32J5752K595k6093j1555K0374J0494
$$ 12504 2189 -2187 11227 12123 610 -2170 -2024 -1492 14260 16855 -9238 -20793 -419 10075
657A0075j5381r781j059L518J0650L958j8680j4960J5414J2273n318l415j861
$$ 10075 -5306 -15087 -16146 -12628 -1978 1980 -16700 -31660 -16246 -3973 -9291 -12706 -14567
670a4567n771Q567Q965j0834j3041J4692J3200k65n65n448j3998K911K1852P930
$$ -14567 -20338 -11771 -2806 -13640 -26681 -11989 1211 946 381 -5067 -19065 -16154 5698 13628
684A3628r700l27Q90l840Q608L080j5521N77K5224O829j7941j7609R09P847J6324
$$ 13628 3928 3601 4491 651 9259 12339 -3182 -2605 22619 29448 11507 -6102 -5193 2654 18978
699A8978Q809j5550j0531N691q21p226L761N235l624M378P983j1556k0125J672
$$ 18978 27787 12237 1706 7397 6576 -650 3111 8346 4722 9100 17083 5527 -14598 -12926
713a2926J2083J2816Q119r588k9862m49K7086O029j6197o306J3523N573N23j6609
$$ -12926 -843 11973 20092 10504 -19358 -19807 7279 13308 -2889 -9195 4328 9901 10424 -6185
727f185j6589J1834K8543M573k1336q830k76J113J0527J0084j1918j1262R813
$$ -6185 -22774 -10940 17603 22176 840 -7990 -8266 -7153 3374 13458 1540 -9722 91
740I1Q639r216m202m031J231J6449J1245k1249k5093R105K3456O611j0034j0368
$$ 91 8730 -486 -4688 -8719 -7488 8961 20206 -1043 -26136 -17031 6425 13036 3002 -7366
754g366q955J2351J5211j0814j6765R615J4871j369q365q284o521J3754J9948
$$ -7366 -16321 -3970 11241 427 -16338 -6723 8148 6779 -1586 -9870 -16391 -2637 17311
767A7311n797j9899j152Q593j15M791P111j0792n422Q632K956r239L39K847L298
$$ 17311 11514 -8385 -9537 -944 -1059 3732 10843 51 -5371 3261 6217 -3022 -2683 164 3462
782C462Q317M46j8141j0590J3038J6063l066o354o674l923O801P914j0658p867
$$ 3462 11779 12225 -5916 -16506 -3468 12595 9529 3175 -3499 -7422 -621 7293 -3365 -11232
796a1232J4033R107j4148o588L935k965J148J1075K844j2806l556j594Q01J0260
$$ -11232 2801 11908 -2240 -8828 -4893 -7858 -6710 4365 7209 -5597 -9153 -10747 -9946 314
810C14P163j4073n389J3510O316j5323o290N696R395P652l84j9440p231J9743
$$ 314 7477 -6596 -11985 1525 7841 -7482 -13772 -8076 1319 8971 8587 -10853 -18084 1659
824A659P486q800l281J228j141K206O026o922p975R595J1597m285p855l838m523
$$ 1659 9145 345 -2936 -1708 -2849 -643 5383 -1539 -9514 81 11678 7393 -462 -4300 -8823
839h823J0585J2826m951j4947K177J0764j486k550l517o421Q219J6240n405k0984
$$ -8823 1762 14588 9637 -5310 -3133 7631 6145 3595 78 -6343 1876 18116 12711 -8273
853h273P0J4459M001k144k972q856JJ5634K659j7111k912J0674N451m113k740
$$ -8273 -8203 6256 10257 8113 5141 -3715 -3714 11920 14579 -2532 -5444 5230 10681 6568 3828
868C828r440n65J3552M260r483m057M409l431K019N740n390p856P450Q495p264
$$ 3828 -5612 -6177 7375 11635 2152 -1905 2504 -927 1092 6832 1442 -6414 1036 9531 2267
883B267n136q17k843N418J2166n660j5383L089O522J99j490L754m545r63O310
$$ 2267 -2869 -3686 -6529 -1111 11055 5395 -9988 -6899 -377 -178 -1668 2086 -2459 -3422 2888
898B888l829r828J726R191j096L257j42j1371o422J1276R740p105j276K167p022
$$ 2888 -941 -10769 -9043 148 -948 2309 2167 -9204 -15626 -4350 5390 -1715 -2991 -824 -7846
913g846j121O636o44n912N621P372k440o183l948o385P299J8290o45j7829n444
$$ -7846 -8967 -2331 -2975 -8887 -3266 4106 1666 -4517 -8465 -14850 -7551 10739 10094 -7735 -13179
928a3179O073L210K783K174k820K113P959p852j6219M640J3684N510m96K367j0334
$$ -13179 -7106 -3896 -1113 1061 -1759 354 8313 461 -15758 -11118 2566 8076 7580 9947 -387
943c87j3795O502J1859M293M254m831j0864j426P835l345o245J1716J3844n932
$$ -387 -14182 -7680 4179 8472 12726 7895 -2969 -4395 3440 95 -6150 5566 19410 13478
957A3478j1877r731l865J1340J6251m82r835k237j200j0642L795J2088L865p479
$$ 13478 1601 -8130 -11995 -655 15596 15114 5279 3042 1842 -8800 -5005 7083 10948 3469
971C469K881l468p592r99K127J702J0212Q967j2159j9773j62J1728Q831M312m727
$$ 3469 6350 2882 -4710 -5709 -3582 -1880 8332 17299 5140 -14633 -14795 -3067 5764 10076 5349
986E349j3432j48R036m524n180O438R808n177k238k765r943O87J6607P810p646
$$ 5349 -8083 -8231 805 -3719 -8899 -2461 7347 2170 -68 -2833 -12776 -12089 4518 12328 4682
1001D682p717n705m738J2576J6742q836j2262p73P643n35j278l699j084J2363
$$ 4682 -3035 -8740 -13478 -902 15840 7004 -5258 -6031 1612 1077 -201 -3900 -4984 7379
1015G379J0642j4885k0424L903J6201J0775K388p928j6186k973J2329O800l857
$$ 7379 18021 3136 -17288 -13385 2816 13591 15979 8051 -8135 -11108 1221 8021 4164
1028D164K351q95m922K741N98j2493l006K1197J4773r700j6799j5184j105K2264
$$ 4164 6515 5620 698 3439 4037 -8456 -11462 9735 24508 14808 -1991 -17175 -18280 3984
1042C984J8165j1094j5308K436L833l686m711P05J605J3152Q873j4523k1562k820
$$ 3984 22149 11055 -4253 -1817 2016 -1670 -6381 -5676 -4071 9081 17954 3431 -18131 -20951
1056b0951J3843J5053R838o298k2521q263J3829P517n360k320K752M193N128p586
$$ -20951 -7108 7945 17783 11485 -11036 -19299 -5470 2047 -3313 -5633 -2881 1312 6440 -1146
1070a146j9196m819K2372J6030l416j2547j6065k372J4650J2713n881r708M594
$$ -1146 -20342 -25161 -2789 13241 9825 -2722 -18787 -21159 -6509 6204 323 -9385 -4791
1083d791N939m887m359m763l205J3249J5837n625j9144o117N489J1685J1916m769
$$ -4791 1148 -3739 -8098 -12861 -16066 -2817 13020 7395 -11749 -17866 -12377 -692 11224 6455
1097F455j6484l905J5421P270p419o429n71O473J1526J611j7802j0617J5825J4287
$$ 6455 -10029 -13934 1487 8757 1338 -5091 -5662 811 12337 13948 -3854 -14471 1354 15641
1111A5641j914p321r077l178J3161J3959p496j4966j318R148O432K206q717j2352
$$ 15641 13727 6406 -2671 -5849 7312 21271 13775 -1191 -2509 6639 13071 15277 6560 -5792
1125e792P108K0595j285j9557o484N670J2298P796p497j7711j861J7364N267r732
$$ -5792 1316 21911 20626 1069 -5415 255 12553 20349 12852 -4859 -6720 10644 15911 6179
1139F179m815J255R13Q397l45j4525n842J1765J0727k529o589q496n475J2179
$$ 6179 1364 2619 3532 11929 11584 -2941 -8783 2982 13709 11180 4591 -3905 -9380 2799
1153B799J2746q616j3894N69P548L725n54p633q982P214J4081l308j3661m624
$$ 2799 15545 6929 -6965 -6396 1152 4877 4323 -3310 -12292 -5078 9003 5695 -7966 -12590
1167a2590K462K868P331J994j1682p214P197L265j629N5m052n815P311J0602o740
$$ -12590 -10128 -7260 71 2065 -9617 -16831 -9634 -6369 -7998 -7943 -11995 -17810 -10499 103 -6637
1182f637j3781J142O888P870O110j0918j3881M222J6539K14r388p43M318L061
$$ -6637 -20418 -19276 -12388 -4518 1592 -9326 -23207 -18985 -2446 -2232 -11620 -12363 -8045 -4984
1196d984L064l903p930K735J5256K306p507l709m783J102J2686Q795r738q379
$$ -4984 -1920 -5823 -13753 -11018 4238 6544 -963 -4672 -9455 -8353 4333 13128 3390 -4989
1210d989N191N074J350m366n866J253J6401R510j6824j6360L297J3276P415L043
$$ -4989 202 5276 6626 2260 -3606 -2353 14048 23558 6734 -9626 -6329 6947 14362 17405
1224A7405o599r986O91O753j964o95N870K265k019J189j670j1776j924R372Q597
$$ 17405 10806 820 1511 8264 6300 5605 11475 13740 11721 12910 11240 -536 -2460 6912 15509
1239A5509M939j809j3033j1664O504J2987K84k422J823l838n657J35k041k826
$$ 15509 20448 18639 5606 -6058 446 13433 13717 11295 13118 9280 3623 3758 1717 -1109
1253a109P254J0713m027r363n984n114k40J2111N587p455q034K164k122j389l23
$$ -1109 6145 16858 12831 3468 -2516 -7630 -7870 4241 9828 2373 -5661 -3497 -5619 -7008 -7331
1268g331l214K209J2483L23j6194j3535P633J3087O388k560j3083p429J0474J0932
$$ -7331 -10545 -8336 4147 4470 -11724 -25259 -17626 -4539 1849 -711 -13794 -21223 -10749 183
1282A83r421q338M073O255M644K355p266j0085M794J1257J996m988l040l406M129
$$ 183 -9238 -17576 -13503 -7248 -2604 -249 -7515 -17600 -12806 -1549 447 -4541 -7581 -10987 -6858
1297f858Q798J140j1184l046P222M737j21J847m368l830M293K114n469K321Q919
$$ -6858 1940 3080 -8104 -11150 -3928 809 688 2535 -1833 -5663 -1370 744 -4725 -2404 6515
1312F515j099l905j084k091l833M546P632K194l73k747p971n021P983O044k916
$$ 6515 5416 1511 427 -1664 -5497 -951 6681 8875 8502 5755 -2216 -7237 746 6790 3874
1327C874K562M524m490n694l991l194N991J6399O750j3285j4335l889N334R720
$$ 3874 6436 10960 6470 776 -3215 -6409 -418 15981 22731 9446 -4889 -8778 -3444 6276
1341F276R338n070r720L074M453o041p013k99O824J2422N802j3175j9513k781
$$ 6276 15614 10544 824 3898 8351 2310 -4703 -5002 1822 14244 20046 6871 -12642 -15423
1355a5423J3771R618L384k485r612l246M377P61r296L455J1651M771p092o943
$$ -15423 -1652 7966 11350 8865 -747 -3993 384 1145 -8151 -4696 6955 11726 4634 -2309
1369b309q557O8J2339O063n388k449K783n199l803K000l50J797R099J321q945
$$ -2309 -10866 -10798 1541 7604 2216 -233 2550 -2649 -6452 -4452 -4802 -3005 6094 7415 -1530
1384a530n685P59L66M535O474j411r292J196L569j043j038R31j709J99P171J615
$$ -1530 -7215 -6456 -6090 -1555 4919 3508 -5784 -4588 -1019 -2062 -3100 -2169 -3878 -3679 3492 5107
1400E107q388n585K127L428P148M321q026q861M550Q343r77m616l257j488P988
$$ 5107 -3281 -8866 -6739 -3311 3837 8158 132 -8729 -4179 4164 3187 -1429 -4686 -6174 1814
1415A814R019m926j3057N56O938M190J647k540p040R26O168R3q191l16P137L460
$$ 1814 10833 5907 -7150 -6594 344 4534 6181 3641 -3399 -2473 3695 3788 -4403 -4719 2418 5878
1431E878n10m022q274r02J0622L627q180j100L764N45j649m66p359N30J0287N986
$$ 5878 5368 1346 -6928 -7830 2792 6419 -1761 -2861 903 1448 -201 -667 -8026 -7496 2791 8777
1447H777o632r330P38J217M606N770m985o125K314N144l745l572J294l75L798
$$ 8777 2145 -7185 -6447 -5230 -624 5146 161 -5964 -3650 1494 -2251 -5823 -4529 -4904 -1106
1462a106N053k209p571r48M403q24L687M280m781n600K872K660j116K193Q49l052
$$ -1106 3947 1738 -5833 -6781 -2378 -3202 485 4765 -16 -5616 -2744 -84 -1200 993 1842 -1210
1478a210O46N006l213o017L547M480O83J551j559m883n06O933j05m071J633L241
$$ -1210 -564 4442 1229 -4788 -1241 3239 3922 5473 3914 -969 -1475 5458 5353 1282 2915 6156
1494F156o70j636l75l288J343R200l04p435k827J864J483K477L366m992m089N193
$$ 6156 5486 3850 3475 187 1530 10730 10426 2991 164 2028 3511 5988 9354 4362 273 5466
1510E466M102p184k227Q28L46N388L044o824j1591M329P639N86j380j954k746
$$ 5466 9568 2384 157 985 1331 6719 9763 2939 -8652 -4323 3316 3902 2522 568 -2178
1525b178O25K650m509n159O572M004k774m120R86l499k412M820J777k047J848
$$ -2178 -1553 1097 -3412 -8571 -1999 2005 -769 -4889 -3903 -7402 -9814 -4994 -3217 -5264 -3416
1540c416p23n180j448L301L26K88N527K59n005k063R82N64J329N824j578j676
$$ -3416 -4139 -9319 -10767 -7466 -7140 -6852 -1325 -1066 -6071 -8134 -7152 -6588 -5259 565 -1013 -2689
1556b689K668j429n329J898N258N02K57L939k706m855J775J092P2M094L676k611
$$ -2689 -21 -1450 -6779 -4881 377 879 1136 5075 2369 -2486 -711 381 453 4547 8223 5612
1572E612n987J409j76j724K870L726j493O35M43n382m496L801M194l98J914N75
$$ 5612 -375 1034 858 -866 2004 5730 4237 4872 5315 -67 -4563 -762 3432 3034 4948 5523
1588E523m779k783J459M4q38N621K384l307k589p21m695R54O879K627n33j046
$$ 5523 744 -2039 -580 -536 -1374 4247 6631 3324 735 14 -4681 -3727 3152 5779 5246 4200
1604D200j598o175N60K746m78L340M607k135p230j450R72j430K647O354j970l913
$$ 4200 2602 -3573 -3013 -267 -745 2595 7202 5067 -2163 -3613 -2641 -4071 -1424 4930 2960 -953
1620i53o95k473l713K525N251Q25j063J224m403o454K626N322K70M88K492j131
$$ -953 -1648 -4121 -7834 -5309 -58 767 -296 928 -3475 -9929 -7303 -1981 -1711 -1223 1269 138
1636A38k398J14k620j217Q261N680m723j617Q37k650j265N320L254l38K302j451
$$ 138 -2260 -2146 -4766 -5983 2278 7958 3235 1618 2455 -195 -1460 3860 7114 6776 9078 7627
1652G627n586K53K471k314L2O257K769o377m367K03j935J585L383j301lK211m029
$$ 7627 2041 2294 4765 2451 2483 8740 11509 5132 765 968 -967 618 4001 2700 2697 4908 879
1669H79r105M30O551N39r27k1l78l259j940j986j919N661O815k403m090J91j732
$$ 879 -8226 -7796 -1245 -706 -1633 -1654 -2032 -5291 -7231 -9217 -11136 -5475 1340 -1063 -5153 -4962 -6694
1686f694l905K941N499L072J159j117p133k547O234L236j049L610L144m331l622
$$ -6694 -10599 -7658 -2159 913 2072 955 -6178 -8725 -2491 745 -304 3306 6450 2119 -1503
1701a503j298J68Q20N494K848k935L65k592p756j117J0079N854m894m447j202
$$ -1503 -2801 -2633 -1813 3681 6529 3594 3959 1367 -6389 -7506 2573 8427 3533 -914 -2116
1716b116n08J807j534k961L832R270j067j1300l044N317K712R35J248j864J564
$$ -2116 -2624 -817 -2351 -5312 -1480 7790 6723 -4577 -7621 -2304 408 1343 2591 727 2291
1731B291J811l600n315M293P782j258j966J423k555l118J633M680M92o67j758
$$ 2291 4102 502 -4813 -520 7262 6004 4038 5461 2906 -212 1421 6101 6593 5926 4168
1746D168l266J781L714l953o690N043O634j800n505l444Q83K865J303l362l369
$$ 4168 902 2683 6397 2444 -4246 797 7431 5631 126 -3318 -2435 430 1733 -1629 -4998
1761d998M732J623n724l738M834K411k749r05K22J614L039j088p255K080P621
$$ -4998 -266 1357 -4367 -8105 -3271 -860 -3609 -4514 -4292 -2678 361 -727 -7982 -5902 1719
1776A719O80m455k2J016L23J478J173j977J72M641j922j961J780R66k681R70L781
$$ 1719 2399 -2056 -2078 -1062 -739 739 1912 -65 107 4748 2826 865 2645 3611 930 1900 5681
1793E681k350k818J698J024j264k85j259o66L481L430p066p400M718O491p96m144
$$ 5681 3331 513 2211 3235 1971 1686 427 -239 3242 6672 -394 -7794 -3076 3415 2619 -1525
1809a525l844P03M349L246o379m873N583N590l853l844J70N80J864L764k374k541
$$ -1525 -5369 -4666 -317 2929 -3450 -8323 -2740 2850 -1003 -4847 -4677 -4097 -2233 1531 -843 -3384
1825c384K774J104m259n92M219l41L47J547j197k600Q90K260j81j315J856j253
$$ -3384 -610 494 -3765 -4357 -138 -479 -132 1415 218 -2382 -1492 768 587 -728 1128 -125
1841a25P66J858l003n446L501P886k207m231p58o41J196K265p37l531M678M099
$$ -125 641 2499 -504 -5950 -2449 5437 3230 -1001 -1759 -2400 -1204 1061 324 -3207 1471 5570
1857E570m931o250J890M227K221Q80k233m550K267M114m297k877M415N265J29
$$ 5570 639 -5611 -3721 506 2727 3607 1374 -3176 -909 3205 -1092 -3969 446 5711 5840
1872E840k968m103n830M831R244k98m501r15J07j795M45M03j798M445N382l622
$$ 5840 2872 -1231 -7061 -2230 7014 6716 2215 1300 1407 -388 57 460 -1338 3107 8489 4867
1888D867p134l889K671L813M530Q31n069j748K162k646l882L672N871J477j757
$$ 4867 -2267 -6156 -3485 328 4858 5689 620 -1128 1034 -1612 -5494 -1822 4049 5526 3769
1903C769m144o094J954O676J645l261N23K774l374l172m46M56L400O048j590p013
$$ 3769 -375 -6469 -4515 2161 3806 545 1068 3842 468 -2704 -3150 -2694 706 6754 5164 -1849
1919a849j250K559P47n3J523o44R7J911k790n917J865P026Q84m068j655j363J432
$$ -1849 -3099 -540 207 154 1677 1033 1130 3041 251 -5666 -3801 3225 4109 41 -1614 -2977 -1545
1936a545M311j383n794P08N332Q34m203j561L36R97M096j849o720J402O316J934
$$ -1545 2766 1383 -4411 -3703 1629 2463 -1740 -3301 -2965 -1968 2128 279 -6441 -5039 1277 3211
1952C211l458l253k224R17M974K401o118o61M465J233n024l006J463M655N818
$$ 3211 -247 -3500 -5724 -4807 167 2568 -3550 -4211 254 1487 -3537 -6543 -5080 -425 5393
1967E393j870q547l075N237K942r11K81K481L27j182k478o265K099R365M279l240
$$ 5393 3523 -5024 -8099 -2862 80 -831 -550 1931 2258 1076 -1402 -7667 -5568 3797 8076 4836
1983D836m523k246j143L125L083j333R33M519n60q039m177L461N797N297N75p008
$$ 4836 313 -1933 -3076 49 3132 1799 2732 7251 6691 -1348 -5525 -2064 3733 9030 9605 2597
1999B597n444L461J826k959J126M174K840k110m228o002l53Q384M279m165m032
$$ 2597 -2847 614 2440 -519 607 4781 7621 5511 1283 -4719 -5072 3312 7591 3426 -606
2014f06j62r7o14R82r18P1N422J166p076n482K229M889J900O75k804l640K143
$$ -606 -768 -865 -1479 -497 -1415 -1344 4078 5244 -1832 -7314 -5085 -196 1704 2379 -425 -4065 -1922
2031a922K875l231k187L873J990j123q13l107l80L471L767l820k722L092K496
$$ -1922 953 -2278 -4465 -592 1398 275 -538 -3645 -4025 -554 3213 -607 -3329 -237 2259
2046B259j869j670j453J011N191J547o577l319M898N858k019m213k413J113N156
$$ 2259 390 -1280 -2733 -1722 3469 5016 -1561 -4880 18 5876 3857 -356 -2769 -1656 3500
2061C500K343n121m486M233L582j984k435j571J022L941K625n322n682L042N228
$$ 3500 5843 722 -3764 469 4051 2067 -368 -1939 -917 3024 5649 327 -5355 -2313 2915
2076B915j38k670j552j844L858L071n760n054M402O693K26n160m023j294O551
$$ 2915 2777 107 -1445 -3289 569 3640 -2120 -7174 -2772 3921 4147 -1013 -5036 -6330 221
2091B21M364m661n642K366M619l81l198n27R0K506L612k504m686K83K917M12j228
$$ 221 4585 -76 -5718 -3352 1267 886 -2312 -2839 -2749 -243 3369 865 -3821 -3538 -621 -209 -1437
2108a437J492l04m70M16j100k624J883M388j637l249J019M69N11J554j509l039
$$ -1437 55 -249 -719 -303 -1403 -4027 -2144 2244 607 -2642 -1623 -1154 -643 911 -598 -3637
2124c637L476M845l450m142M04L306J806R71j814l700K532N294k978m068J460
$$ -3637 -161 4684 1234 -2908 -2504 802 2608 3579 1765 -1935 597 5891 2913 -1155 305
2139C05M440J794j994m168k960N559O409k062p470M22M073J143p10n004k902M565
$$ 305 4745 6539 4545 377 -2583 2976 9385 7323 -147 275 4348 5491 4781 -223 -3125 1440
2155A440O619k112p961l098L073L333K585k241o015j249M510J937m984j456K757
$$ 1440 8059 5947 -2014 -5112 -2039 1294 3879 1638 -4377 -5626 -1116 821 -4163 -5619 -2862
2170b862K416J10k138n791K10O856K150l825j428J911l36l45m4n10K216M876q20
$$ -2862 -446 -336 -2474 -8265 -8055 -1199 951 -2874 -4302 -2391 -2727 -3072 -3116 -3626 -1410 3466 2646
2187B646n700q12K928L020M35J71k83m23j89N32k377J356L837L40l698n74j453
$$ 2646 -3054 -3866 -938 2082 2517 2688 2405 1982 1793 2325 -52 1304 5141 5481 1783 1209 -244
2204b44j37L122p60k653J383L673k704m885j057K589M077L022l841p365L0O254
$$ -244 -381 2741 1981 -672 711 4384 1680 -3205 -4262 -1673 2404 5426 1585 -5780 -5750 504
2220E04L395l197l064k3J720L700q58n870q64O705L951l908m326k174K506N992
$$ 504 3899 702 -2362 -2385 -665 3035 2177 -3693 -4557 2148 6099 2191 -2135 -4309 -1803 4189
2236D189J479o375k957L739K318k458j886M73M47K522m59n783k852M923M116j976
$$ 4189 5668 -707 -3664 75 2393 -65 -1951 -1478 -1031 1491 1032 -4751 -7603 -2680 1436 -540
2252e40k206k571j135J900K475j122k449K651J731k653j382K48J168J834L204
$$ -540 -2746 -5317 -6452 -4552 -2077 -3199 -5648 -2997 -1266 -3919 -5301 -5053 -3885 -2051 1153
2267A153j856k725J842K56j677L095M343O69k887j670o08J174M820K519l562k092
$$ 1153 -703 -3428 -1586 -1330 -3007 88 4431 5100 2213 543 -65 1109 5929 8448 4886 2794
2283B794J835N69p31q20l07J351N186K17p079m602K968M240J540r93m355l629
$$ 2794 4629 5198 4467 3647 3340 4691 9877 10094 3015 -1587 1381 5621 7161 6168 1813 -1816
2299a816M627J807l768l339M032L121j089l243m262m42N391L654k467m765k95
$$ -1816 2811 4618 850 -2489 1543 4664 3575 332 -3930 -4372 1019 4673 2206 -2559 -2854
2314b854J985P11J26m44k130K538L194j791m488j174L834J414J881k102n018k67
$$ -2854 -869 -158 -32 -476 -2606 -68 3126 1335 -3153 -4327 -493 921 2802 700 -4318 -4585
2330d585M523N89l017Q36R8j051K12r5j646K33K246p46k206Q31P60k684O86K019
$$ -4585 -62 527 -2490 -1654 -1556 -2607 -2395 -2490 -4136 -3903 -1657 -2403 -4609 -3778 -3018 -5702 -5016 -2997
2348b997J82m46J83k415k030M523L352k623k196Q32J709N49J071k777r71M509
$$ -2997 -2815 -3261 -3078 -5493 -7523 -3000 352 -2271 -4467 -3635 -1926 -1377 -306 -3083 -4054 455
2364D55L189l503l825J930K791K553N27l076l206K227M608j313k358r9Q20J785
$$ 455 3644 141 -3684 -1754 1037 3590 4117 1041 -2165 62 4670 3357 999 900 1720 3505
2380C505K112k748m988J285O195J058l462l024o28K601L995k032m212k01M063
$$ 3505 5617 2869 -2119 -834 5361 6419 2957 -67 -695 1906 5901 3869 -343 -544 3519
2395C519N57l073n68j86R95L361m47k877j971K060J567m20o4j80j778J425J745
$$ 3519 4076 1003 435 249 1244 4605 4158 1281 -690 1370 2937 2517 2453 2273 495 1920 3665
2412C665k658m73K157n01j291J260p06j614Q78J019o32k92R70k238j978K103K400
$$ 3665 1007 534 2691 2190 899 2159 1453 -161 717 1736 1104 812 1782 -456 -2434 -331 2069
2429B069k985j448Q93N04PJ476k557k188K414K209j340j687m03n86P98L224j402
$$ 2069 -916 -2364 -1471 -967 -960 516 -2041 -4229 -1815 394 -946 -2633 -3036 -3622 -2824 400 -1002
2446a002l336L08K171J063j068j668j191J800L317Rn008r20M004J758q25j313
$$ -1002 -4338 -4030 -1859 -796 -1864 -3532 -4723 -2923 394 403 -4605 -5525 -1521 237 -588 -1901
2462a901k385N55M275N73l862j345L494R59m33R8j552j045L725J274k410j188
$$ -1901 -4286 -3731 544 1117 -2745 -4090 -596 363 -70 28 -1524 -2569 1156 2430 20 -1168
2478a168J012K45J48J506k72k559J287K601r15j021P78j401P57K369j002k709
$$ -1168 -156 89 237 1743 1471 -1088 199 2800 1885 864 1642 241 998 3367 2365 -344
2494c44M19K500q54j443J406m90m20P38o45r19J353J283k844k89K705j7l017j029
$$ -344 75 2575 1721 278 1684 1194 774 1512 867 -52 1301 2584 -260 -549 2156 2139 -878 -1907
2512a907K226J116K23j933j696L43M046r11k838J009K243j038j716O98k53n62
$$ -1907 319 1435 1658 -275 -1971 -1628 2418 1507 -1331 -322 1921 883 -833 -135 -388 -950
2528i50K868l88j686q67J488k232J497K812j118k165J31K859j444m85k45p72J190
$$ -950 1918 1530 -156 -1023 465 -1767 -270 2542 1424 -741 -610 2249 805 320 75 -697 493
2545D93K609k492k919J173K347L52q77j9k90J17K64n94p56Q71J767k349J39J510
$$ 493 3102 610 -2309 -1136 1211 1563 686 667 377 494 758 164 -592 279 2046 -303 -164 1346
2563A346q76j402K91J970j293L63J01j702j81K300K26l297J572J344j02j945J807
$$ 1346 470 -932 -641 1329 36 399 500 -1202 -1383 917 1143 -2154 -582 762 660 -1285 522
2580E22k367L6K061N76k522J143M00p38m16J562j274j867R39J804j337K26l54
$$ 522 -1845 -1809 252 828 -1694 -551 -151 -889 -1305 257 -1017 -2884 -1945 -141 -1478 -1252 -1606
2597a606k362K423K734k172k427P76J994j290M59k7l09J016J796k188k571K074
$$ -1606 -3968 -1545 1189 -983 -3410 -2634 -640 -1930 -1471 -1498 -1807 -791 1005 -1183 -3754 -1680
2613a680K354o88j86J078j523k08J120L80j218M16Q01j61N83J015l004m64K933
$$ -1680 674 -14 -200 878 -645 -853 267 647 -571 -155 646 485 1068 2083 -921 -1385 1548
2630A548J153j473k75M15p34M83J002j509o37K789K92j522n72O79k091R85K265
$$ 1548 2701 1228 953 1368 634 1117 2119 610 -27 2762 3054 1532 960 1639 -452 533 2798
2647B798K2k166N33N49j595l8J223r44J55J859p05k435M48J117j337L71J735j170
$$ 2798 2820 654 1187 1736 141 103 1326 382 537 2396 1691 -744 -296 821 -516 -145 1590 420
2665D20q62Q47L7j327N49P57n24J81J454j847j718J582J790j156k36R52j139K73
$$ 420 -442 405 442 -885 -336 421 -103 78 1532 -315 -2033 -451 1339 183 -53 899 -240 33
2683C3J328j782j362K046J590j234m21j15j155j89K234p9j614J496K76k013m60
$$ 33 1361 -421 -1783 263 1853 619 198 83 -1072 -1261 973 894 -720 776 1052 -961 -1421
2700a421J478l54p48J977m34k063J6M65p81R99K021k218j581K472P21k290q72
$$ -1421 57 -297 -1045 932 498 -1565 -1549 -1084 -1865 -866 1155 -1063 -2644 -172 549 -1741 -2613
2717b613J547M80R12K48k572o14K610J208k134mO85l41l45J060o5j509P85J125
$$ -2613 -1066 -586 326 574 -1998 -2612 -2 1206 -928 -932 -247 -588 -933 127 62 -1447 -662 463
2735D63l48Q4j15j969j36L322O38l435l96J935R5l93M87j480j45L188n94k900
$$ 463 115 199 84 -1885 -2021 1301 1939 -1496 -1892 43 138 -255 232 -1248 -1393 1795 1201 -1699
2753a699l84K504n49j55R23q17j079J866N67j230k44J086k47K43J380j744j672
$$ -1699 -2083 421 -128 -283 640 -177 -1256 610 1177 -53 -297 789 542 785 2165 421 -1251
2770a251J589K511p65l74k09j249N89K048k55k441K37K437j206n86M08j064m07
$$ -1251 338 2849 2084 1710 1501 252 841 2889 2634 193 430 2867 1661 1075 1483 419 12
2787A2K611pk619n87J365j015K96J554r71j445N70J092j906L24J081j575Q59J865
$$ 12 2623 2616 -3 -590 775 -240 56 1610 639 -806 -236 856 -1050 -726 355 -1220 -361 1504
2805A504j191k688J201J721k71j114K57n97Q86J477j048k147J173K053j005k18
$$ 1504 313 -2375 -1174 547 276 -838 -581 -1178 -292 1185 137 -2010 -837 1216 211 -7
2821gR78j901n52K116r5j048k31O24m62L22J821k454k019K214J686j004l00o2
$$ -7 971 -930 -1482 634 539 -509 -740 -116 -578 -256 1565 -889 -2908 -694 992 -12 -312 -374
2839c74p92O17J168p57j872K442O89j235q31L48j667J008K301O67k235l84P72
$$ -374 -1166 -549 619 -138 -2010 432 1121 -114 -945 -597 -2264 -1256 1045 1712 -523 -907 -135
2856a35j311J57J671l16l16J670l09k089p19J394J7P07K192k313k743J526M07
$$ -135 -1446 -1289 382 66 -250 1420 1111 -978 -1697 -303 -286 421 2613 300 -2443 -917 -510
2873e10k61Q89J192p86j80R34k121k085J670K846J5m08m30k497j328K376J505
$$ -510 -771 118 1310 524 344 1278 -843 -2928 -1258 1588 1603 1195 765 -1732 -3060 -684 821
2890H21j10K28l45j204J68P30j682N60K338J211j685j559n45m97J491K673p48
$$ 821 711 939 594 -610 -442 288 -1394 -834 1504 2715 1030 -529 -1074 -1571 -80 2593 1845
2907A845k055R24j13j445N31J608j483J50K623p98k453k66J104O7J631K64j952
$$ 1845 -210 714 601 -844 -313 1295 -188 -38 2585 1787 -666 -932 172 239 1870 2134 182
2924A82j084J493P75j815L96L87R7RJ435j383j594J600rj25J71jj268J166J370
$$ 182 -902 591 1366 -449 -53 334 431 440 1875 492 -1102 498 489 364 535 534 -734 432 1802
2943A802j484j494L92P87Q10l12N42j802q42J828k67p70J179O80j404J126o13
$$ 1802 318 -1176 -784 3 813 501 1043 -759 -1601 227 -40 -810 369 1049 -355 771 158
2960A58j237j446K434J602p98p97l97j116N20J601m31r21J311j00k386N65N72
$$ 158 -1079 -2525 -91 1511 713 -84 -481 -1597 -1077 524 93 -828 483 383 -2003 -1438 -866
2977h66j296J497K567l83k895n23J84k41J915J212q45j220J226r63j296R89J409
$$ -866 -2162 -665 1902 1519 -1376 -1899 -1715 -1956 -41 1171 326 -894 332 -631 -1927 -938 471
2994D71q35J632J20j934j909J147J498r7J534p52k269J18K324j459p12J500J382
$$ 471 -364 1268 1388 -546 -2455 -1308 190 93 1627 875 -1394 -1276 1048 -411 -1123 377 1759
3011A759j085n18m25j566J052K613l34j071M51l85j528J411Q87j542m84J828N84
$$ 1759 674 156 -269 -1835 -783 1830 1496 425 876 491 -1037 374 1261 -281 -765 1063 1647
3028A647q63l74l13k71R75J595k164j088J236J295j510J005M1j543N37J855j551
$$ 1647 784 410 97 -174 801 2396 232 -856 380 1675 165 1170 1211 -332 205 2060 509
3045E09j442J440m0j99K51L90j412L96J149q67o07P32j47p80P53J003j394J2R84
$$ 509 -933 507 467 268 519 909 -503 -107 1042 175 -432 300 153 -627 126 1129 -265 -253 731
3064G31J36j506J050K48j635N1K408j025j027J058k22r00J027J62q09K95N86n86
$$ 731 867 -639 411 659 -976 -925 1483 458 -569 489 267 -633 394 556 -253 42 628 42
3082D2q84J203m86o37J107J059k132j045J689O11j057O51p09m94J365J186k222
$$ 42 -842 361 -125 -762 345 1404 -728 -1773 -84 527 -530 121 -588 -1082 283 1469 -753
3099g53j156J518R32j246O96j60m66K91J453q29j526Q41l80K60L39M82j993N48
$$ -753 -1909 -391 541 -705 -9 -169 -635 -344 1109 280 -1246 -405 -785 -525 -186 296 -1697 -1149
3117a149K035p93j101O18Q90j348N13K23j380M06J853k34j335O39M16j365j56
$$ -1149 886 93 -1008 -390 500 -848 -335 -112 -1492 -1086 767 533 -802 -163 253 -1112 -1268
3134a268K023j519K70J203p16j735J332J543j293J41J071o67m68N84j222j142
$$ -1268 755 -764 -494 709 -7 -1742 -410 1133 -160 -19 1052 385 -83 501 -721 -1863
3150a863J724K047j376j097R39p79p3R37L58j087J363J084k732n13J455l12M61
$$ -1863 -139 1908 532 -565 374 -405 -478 459 817 -270 1093 2177 -555 -1068 387 75 536
3167E36K050m57k456k86P42l92Q97J603r48m30j81m92j888P27L280k35j232l99
$$ 536 2586 2129 -327 -613 129 -263 634 2237 1289 859 678 186 -1702 -975 2305 2070 838 439
3185D39o80o30R86M09O9M66J231k249j108P53k9k07J330O83j447p89J527j220
$$ 439 -241 -871 115 524 593 1059 2290 41 -1067 -314 -343 -550 780 1463 16 -773 754 -466
3203d66k72L93O52K01m50n09j911O89J993K29r87J90k22k05J57J21j038K74K156
$$ -466 -738 -345 307 508 58 -451 -2362 -1673 320 549 -438 -248 -470 -675 -518 -397 -1435 -1161 995
3222I95j061j595R12J24l75P84L11j138j52K005M22k478J08P00q3J31P75j021
$$ 995 -66 -1661 -749 -625 -1000 -216 95 -1043 -1195 810 1232 -1246 -1138 -438 -521 -390 385 -636
3240f36o02K511j54j972n33N09J078M11O45j170j064R37O74j282Q63J251j415
$$ -636 -1238 1273 1119 -853 -1386 -877 201 612 1257 87 -977 -40 634 -648 215 1466 51
3257E1l40M28o36j616K144R45q32l62O82j181j097J619L57l00J246j54k582K01
$$ 51 -289 139 -497 -2113 31 976 144 -218 464 -717 -1814 -195 162 -138 1108 954 -1628 -1427
3275a427J327N91r54J587M3j315L91J89j480K51K253L02j076K36r64j013O69J408
$$ -1427 -100 491 -463 1124 1167 -148 243 432 -1048 -797 1456 1758 682 918 -46 -1059 -390 1018
3293A018L02j204J644q12j309k56L12R67N17J093k706q89J894Q78j999J21J652
$$ 1018 1320 116 1760 948 -361 -617 -305 662 1179 2272 -434 -1323 571 1449 -550 -429 1223
3310A223j094O89o22j947j76K527N78j701p3O55n43J43P34k82j105O80J883j824
$$ 1223 129 818 196 -1751 -1927 600 1178 -523 -596 59 -484 -341 393 111 -994 -314 1569 -255
3328b55r9O90j061M44J365q05j547R40J553j091j376J642j10P35Q02j729j733
$$ -255 -354 336 -725 -281 1084 279 -1268 -328 1225 134 -1242 400 290 1025 1827 98 -1635
3345a635J761J355j835Q1O27o1o98R93j262r34J542O11j493Q1J297l24q44p9R36
$$ -1635 126 1481 -354 -273 354 293 -405 588 -674 -1608 -66 545 -948 -867 430 106 -738 -817 119
3364A19p69R00L90j409k42J406k67l69l1J015j470O98P54j157j86J266lo00J782
$$ 119 -650 250 640 -769 -1011 395 128 -241 -272 743 -727 -29 725 -432 -618 648 645 45 1827
3383A827l81k079j03J754k98q23K75j51L75l20o2r11P56M3J6j677J525P95j852
$$ 1827 1446 -633 -736 1018 720 -103 172 21 396 76 14 -897 -141 -98 -82 -1759 -234 561 -1291
3402a291k74J352l63O52j29j456N9J891Q48j588j086J641K3o83P96n92n17J047
$$ -1291 -1565 -213 -576 76 -53 -1509 -1450 441 1289 -299 -1385 256 279 -404 392 -200 -717 330
3420C30M71n80k17O02o50j07K072o04k411J182J376o59j723Q93L87O45N64p32
$$ 330 801 221 4 606 -44 -151 1921 1317 -1094 88 1464 805 -918 -25 362 1007 1571 839
3438H39k329J712J375m23o93o29K74O42M96K52l042J209K587j169q28l1m16m43
$$ 839 -1490 222 1597 1174 481 -148 126 768 1264 1516 -1526 -317 2270 1101 273 242 -174 -617
3456f17J766J86j140q52K104m12j080M57P2j043J502M90r77j656R48M79J72r8
$$ -617 1149 1335 195 -657 1447 1035 -45 412 484 -559 943 1433 456 -1200 -252 227 399 301
3474C01N9q43Q99R64k439m99K461P3r88j79J24j036R13m7m1o0J026k09k606J782
$$ 301 360 -483 416 1380 -1059 -1558 903 976 -12 -191 -67 -1103 -190 -237 -278 -338 688 479 -2127 -345
3494c45M35p53l00P31l5J3J7p02j027R52J797j082k09M99r09l97J184O89j688
$$ -345 90 -663 -963 -232 -267 -254 -237 -939 -1966 -1014 783 -299 -508 -9 -918 -1315 -131 558 -1130
3513a130N68N46o61k04J014q69o79K037K57j566p23J308N1r38O90L0n60J281M83
$$ -1130 -562 -16 -677 -881 133 -736 -1415 622 879 -687 -1410 -102 -51 -989 -299 -269 -829 452 935
3532I35j658P6Q66k75K54O36n25o20R84M56j264n91J074M41j28L44n28r42M94
$$ 935 -723 -647 219 -56 198 834 309 -311 673 1129 -135 -726 348 789 661 1005 477 -465 29
3551B9N43n10n23J637m74p55K22P13n78m63J228J29o45P33n50j387J271O11j203
$$ 29 572 62 -461 1176 702 -53 169 882 304 -159 1069 1198 553 1286 736 -651 620 1231 28
3570B8N62J193j293j257J582M18p24M0K52J77k80J66q43r55K485q99o81m08J532
$$ 28 590 1783 490 -767 815 1233 509 549 801 978 698 864 21 -934 1551 652 -29 -437 1095
3589A095j150PM01k81j01M99L65j490K35K54j03P0O70n51j065P26j52k72N50k99
$$ 1095 -55 -48 353 72 -29 470 835 -655 -420 -166 -269 -199 471 -80 -1145 -419 -571 -843 -293 -592
3609e92j92l44J091l89j037n5J449p41j22R79p97o08P26L19m47K02O49m16l96
$$ -592 -784 -1128 -37 -426 -1463 -1518 -69 -810 -932 47 -750 -1358 -632 -313 -760 -558 91 -325 -721
3628g21J453j479O65M23J31j639J399j32L57j178R91J24j29l27N50q02K69k3m02
$$ -721 732 -747 -82 341 472 -1167 232 100 457 -721 270 394 265 -62 488 -314 -45 -68 -470
3647d70O95P16l03j022J331p65j49K87K7M17j484J186N84j153K00J009o21q71
$$ -470 225 941 638 -384 947 182 33 320 347 764 -720 466 1050 -103 97 1106 485 -386
3665c86J685j101o03Q63M79l79M54p3j047R71K00p03p89j41J546q47j5P51r05
$$ -386 1299 198 -405 458 937 558 1012 939 -108 863 1063 360 -429 -570 976 129 114 865 -40
3684d0r43J938q5j198R94l82m38n17J629j070q58R29L55p55k80J325p81j95N53
$$ -40 -983 955 870 -328 666 284 -154 -671 958 -112 -970 -41 314 -441 -721 604 -177 -372 181
3703A81P16j456N48M96j195J020M47j001n19J765p22j372P37Q40j10J00j64L06
$$ 181 897 -559 -11 485 -710 310 757 -244 -763 1002 280 -1092 -355 485 375 475 311 617
3721F17k16J077o43j803J288O10m31l38N37L31j813J527j4n79o05J406o96L90
$$ 617 401 1478 835 -968 320 930 499 161 698 1029 -784 743 729 150 -455 951 255 645
3739F45p5j405J75J454j107N1l32J159l06j755R35K60p87J255n32n29L49K90n45
$$ 645 570 -835 -660 794 -313 -262 -594 565 259 -1496 -561 -301 -1088 167 -365 -894 -545 -255 -800
3758h00p73J741J46j003N2M37j76r82Q91k1n27J488q82n18K72J374j229K4J12
$$ -800 -1573 168 314 -689 -637 -200 -376 -1358 -467 -488 -1015 473 -409 -927 -655 719 -510 -486 -374
3777c74M2p21Q34O71r69O95Q50r91N44J57r74n90J346R09j974J038L52o82K67
$$ -374 -332 -1053 -219 452 -517 178 1028 37 581 738 -236 -826 520 1429 -545 493 845 163 430
3796D30l17R08j614O49J276j262m11J111p03j38J176j49j065j64P53o83l08J426
$$ 430 113 1021 -593 56 1332 70 -341 770 67 -71 1105 956 -109 -273 480 -203 -511 915
3814I15l18m59Q61j86j333J254jJ47p27J059q04j068J064M57j925J72J170L75
$$ 915 597 138 999 813 -520 734 733 880 153 1212 408 -660 404 861 -1064 -892 278 653
3832F53O4J37k30p50P13J084j151r11N86K23j024O88J067k231K15J745r80k99
$$ 653 717 854 624 -126 587 1671 520 -391 195 418 -606 82 1149 -1082 -867 878 -102 -401
3850d01J219j505m70J099R90j249q7p7j75m32R25L43p09N37o66L93M96J62m43
$$ -401 818 -687 -1157 -58 932 -317 -404 -481 -656 -1088 -163 180 -529 8 -658 -265 231 393 -50
3869e0p21k55J826R5j302J263j506J059j79J59j075J970m68j306K10J09K93n34
$$ -50 -771 -1026 800 895 -407 856 -650 409 230 389 -686 1284 816 -490 -280 -171 122 -412
3887d12J098l85k178J749J438k216k9L77l95J079O23j498l41Q66J558j683m52
$$ -412 686 301 -1877 -128 1310 -906 -935 -558 -953 126 749 -749 -1090 -224 1334 -349 -801
3904h01J432k270N13J425K83j870P31J261q50K94L4q14O36J383l67r70l83O21
$$ -801 631 -1639 -1126 299 582 -1288 -557 704 -146 148 182 -632 4 1387 1020 50 -333 288
3922B88m08Q08J43l42m90J041K72j724R25J437k175K26K73K44r77N31O41l77l28
$$ 288 -120 688 831 489 -1 1040 1312 -412 513 1950 -225 1 274 518 -459 72 713 336 8
3941HQ40j443K61P22l79q81J240l8l54M5M17q61q05J689M25N46q18j229M11k2
$$ 8 848 -595 -334 388 9 -872 368 330 -24 21 438 -423 -1228 461 886 1432 614 -615 -204 -226
3961b26J657j261j076L96J117l27J96Q49j412L62J207j061j161J06J191q09Q31
$$ -226 1431 170 -906 -510 607 280 476 1325 -87 275 1482 421 -740 -634 557 -252 579
3978E79k82n85p56J168M82r03j08R29k72j84l94j075k53K342n39r57J83M85K22
$$ 579 297 -288 -1044 124 606 -297 -405 524 252 68 -326 -1401 -1654 688 149 -808 -625 -140 82
3997H2k36N4J88j255J822L24j835J382J14m6j166J009M68q61k46J196j666n11
$$ 82 -154 -100 88 -1167 655 979 -856 526 640 594 -572 437 905 44 -202 994 -672 -1183
4015a183K815j552l90J54P87J20j65o85J83L6N35m81j595Q76J833k075J142o35
$$ -1183 1632 80 -310 -156 631 751 586 -99 84 120 655 174 -1421 -545 1288 -787 355 -280
4033b80l38J96M54k53K77j039K090j565R98Rj204M76Q63oj332j38K88J097L8J00
$$ -280 -618 -422 32 -221 56 -983 1107 -458 540 549 -655 -179 684 678 -654 -792 -504 593 631 731
4053G31r21k42K204j028o07q43R48l5J144r11n54L72j06L20R1n35J05j140N52
$$ 731 -190 -432 1772 744 137 -706 242 207 1351 440 -114 258 152 472 563 28 133 -1007 -455
4072d55R28L37j068J292l4o18m75O42o63mJ095m86m22j36Q95r45j83N82l25L14
$$ -455 473 810 -258 1034 1000 382 -93 549 -114 -118 977 491 69 -67 828 -117 -300 282 -43 271
4092B71L32k09q98M14N89j525M76K171j745k14L77Q9m32L20P67k147O41Q62l99
$$ 271 603 394 -504 -90 499 -1026 -550 1621 -124 -338 39 128 -304 16 783 -1364 -723 139 -260
4111b60k91Q5L59L30L81m22q81p0Q66J088q93j53r73m49J867L01o09p70R25K5
$$ -260 -551 -466 -107 223 604 182 -699 -769 97 1185 292 139 -834 -1283 584 885 276 -494 431 456
4131D56r1N38j438n6J075P14j098j818J385P70m72j64n21O9k74J666j183o10Q45
$$ 456 365 903 -535 -591 484 1198 100 -1718 -333 437 -35 -199 -720 -651 -925 741 -442 -1052 -207
4150b07R46k57o97m32n24J341N8O39j542J177o8j202R59K58o78k14J371J11j939
$$ -207 739 482 -215 -647 -1171 170 228 867 -675 502 434 -768 191 449 -229 -443 928 1039 -900
4169i00M86O71j08j76J168p21N70q07p23K53J207O86k128L98K74o64Q03J23r80
$$ -900 -414 257 149 -27 1141 420 990 183 -540 -287 920 1606 -522 -124 150 -514 289 412 -568
4188e68k63P02J049r28r29J264j31L75K34J79j683M20J340j106k02N38M78j034
$$ -568 -831 -129 920 -8 -937 327 196 571 805 984 -699 -279 1061 -45 -247 291 769 -265
4206b65J002p7j182P13Q96p82o7N08p10j13Q27L75j508R20R34o43j137P29m22
$$ -265 737 660 -522 191 1087 305 238 746 36 -77 750 1125 -383 537 1471 828 -309 420 -2
4225bn30J136k36q10L39O73k82n81J032k67j231L57J435j945M77J009p2j909J108
$$ -2 -532 604 368 -442 -103 570 288 -293 739 472 -759 -402 1033 -912 -435 574 502 -1407 -299
4244b99N53j118P85O8N37q94O91n63o35L75P24l57k79O00l64l97J253p45p79N12
$$ -299 254 -864 -79 -11 526 -368 323 -240 -875 -500 224 -133 -412 188 -176 -573 680 -65 -844 -332
4264c32R78j295N03N16p59j26L64O29j614M35L22L3o20J671o95j030J687o8j127
$$ -332 646 -649 -146 370 -389 -515 -151 478 -1136 -701 -379 -346 -966 705 10 -1020 667 599 -528
4283e28j3J336r99l07R90j338p5P96J076j310l10Q90l99m4R9K07q5K44L73m75
$$ -528 -541 795 -204 -511 479 -859 -934 -138 938 -372 -682 208 -191 -235 -136 71 -14 230 603 128
4303A28o98J386l67r87Q21Q9n90j16N89p3m47Q56O0j050K93P49r61J27L80J25
$$ 128 -570 816 449 -538 283 372 -218 -334 255 182 -265 591 651 -399 -106 643 -318 -191 189 314
4323C14n08Q43N5q62K88K30n35K43K28k94l57J153j288J42K34L91o0M20l31n38
$$ 314 -194 649 704 -158 130 360 -175 68 296 2 -355 798 -490 -348 -114 277 217 637 306 -232
4343b32k6N28K29p85j61R74l76K54L36q95m23Q54M23k20o72Q89o35r1O13n51o94
$$ -232 -258 270 499 -286 -447 527 151 405 741 -154 -577 277 700 480 -192 697 62 -29 584 33 -661
4364f61R45P51q02j84K10P6m85K32J3p42M47r6M06J05r7pr34J865j255n43K09
$$ -661 284 1035 233 49 259 335 -150 82 95 -647 -200 -296 110 215 118 111 -823 1042 -213 -756 -547
4385e47J097o78o90Q03Jj89J79N89j111Q45J01q90j8M61l24p77N92Q84n58n1O47
$$ -547 550 -128 -818 -15 -14 -203 -24 565 -546 299 400 -490 -508 -47 -371 -1148 -556 328 -230 -281 366
4406C66r87N18L7l9o47J267J71m46M32n71J48n26k78J614j183O4J70l42L58L00
$$ 366 -621 -103 -66 -105 -752 515 686 240 672 101 249 -277 -555 1059 -124 -60 110 -232 126 426
4426D26m08J0l58J055o39l9J233j409J81N13j5r38L26O96l80mK4o27l17J269k43
$$ 426 18 28 -330 725 86 47 1280 -129 52 565 550 -388 -62 634 254 250 274 -353 -670 599 356
4447C56n32J024N30j938K88M69n8p92J708J68k074J303O6j427P02Q03j75n6M44
$$ 356 -176 848 1378 -560 -272 197 139 -653 1055 1223 -851 452 518 -909 -207 596 421 365 809
4466H09J28m20j406R28j58l66J155o76j29K35O21k086O83M77k87L87L99L55q93
$$ 809 937 517 -889 39 -119 -485 670 -6 -135 100 721 -1365 -682 -205 -492 -105 294 649 -244
4485b44m4O52m11M0J251j255o54J212J52j910K101q2o80j38J58K4j28j31J60n44
$$ -244 -288 364 -47 -7 1244 -11 -665 547 699 -1211 890 808 128 -10 148 172 44 -87 73 -471
4505d71O63O04j280L99J74L63q22N98j94q30M43J99J13q53J392o23n75M75l9P16
$$ -471 192 796 -484 -85 89 452 -370 228 34 -796 -353 -154 -41 -894 498 -125 -700 -225 -264 452
4525D52j207L16ml86J041j091O35n53J835n44j284J435o69p92R60K88k175K430
$$ 452 -755 -439 -443 -829 212 -879 -244 -797 1038 494 -790 645 -24 -816 144 432 -1743 687
4543F87m96p4N87j288K10Q3N51j063R58n7L39o10MM14K10l91L99j31O63p02o91
$$ 687 191 117 704 -584 -374 -291 260 -803 155 98 437 -173 -169 245 455 64 463 332 995 293 -398
4564c98j01J19J224n60j067O9J768j496J28J211r94m2K60O68j140O12L1m80j015
$$ -398 -499 -380 844 284 -783 -714 1054 -442 -314 897 -97 -139 121 789 -351 261 292 -188 -1203
4583a203J797m53o61J732j069n70O95J063j570L72J089j231l22P8O35m88k21O79
$$ -1203 594 141 -520 1212 143 -427 268 1331 -239 133 1222 -9 -331 -253 382 -106 -327 352
4601C52K81j076J605p98K05p33Q18k54m63O45M90j462O66J16p93L67l27J2K63
$$ 352 633 -443 1162 364 569 -164 654 400 -63 582 1072 -390 276 392 -401 -34 -361 -349 -86
4620h6P14Kj575J161R0p01l86J280p46j13J199p78q72M10J116q34n99J499j125
$$ -86 628 630 -945 216 306 -395 -781 499 -247 -360 839 61 -811 -401 715 -119 -718 781 -344
4639c44m95J051l95o63R04n8j71p75J002j03p25J510J84j404N72m38N77M77M2
$$ -344 -839 212 -183 -846 58 0 -171 -946 56 -47 -772 738 922 -482 90 -348 229 706 748
4658G48p18Q3J51Q1R6n63J097j323M5K43m08j005J722q17P27m03K89o16m69J478
$$ 748 30 113 264 345 441 -122 975 -348 -303 -60 -468 -1473 249 -568 159 -244 45 -571 -1040 438
4678D38j222L82J80k5L2j53k16J72p20J013P62j501J204Pl36j12N87q19j0N24
$$ 438 -784 -402 -222 -247 -215 -368 -584 -412 -1132 -119 643 -858 346 353 17 -95 492 -327 -337 187
4698A87Q05r83K87Q68q55o21L48L13j71L81k34K63p45m68P34o06J167M97j136
$$ 187 992 9 296 1164 309 -312 36 349 178 559 325 588 -157 -625 109 -497 670 1167 31
4717C1J20k5m08L18l82L01m59R14M60o70l21Q32P2n13M5Q3j309J305M28k273L68
$$ 31 151 126 -282 36 -346 -45 -504 410 870 200 -121 711 783 270 315 398 -911 394 822 -1451 -1083
4738a083J529q33J68P15j60j075J96J401r06R3j04m12O73k4J357j910O90o26L38
$$ -1083 446 -387 -219 496 336 -739 -543 858 -48 45 -59 -471 202 178 1535 -375 315 -311 27
4757B7j39R64n63K4m64L82j47l8P2j011R70o25J89j27J507l99m23J95J22o97j82
$$ 27 -112 852 289 313 -151 231 84 46 118 -893 77 -548 -359 -486 1021 622 199 394 516 -181 -363
4778c63L58k16K04R49r70q29k2J318j330O86O64K66o75k77M94p88N77m33J118
$$ -363 -5 -221 -17 932 -38 -867 -889 429 -901 -215 449 715 40 -237 257 -531 46 -387 731
4797G31q03P11l29o60O92r42N39L05n66N81j063M04L61J98L63o0j081Q27M9j015
$$ 731 -72 639 310 -350 342 -600 -61 244 -322 259 -804 -400 -39 159 522 462 -619 208 257 -758
$$ [...]
##END NTUPLES=NMR FID
##END=
