##TITLE=1H_TBC 2702
 CDCl3, 8 sc, 
 28.2.2020
##JCAMPDX= 6.0         $$ Bruker NMR JCAMP-DX V2.0
##DATA TYPE= NMR FID
##DATA CLASS= NTUPLES
##ORIGIN= UXNMR, Bruker Analytische Messtechnik GmbH
##OWNER= root
$$ XWIN-NMR		Version 3.5
$$ Fri Feb 28 14:27:46 2020 Russian Standard Time (UT+4h)  she@DPX200
##.OBSERVE FREQUENCY= 200.1315
##.OBSERVE NUCLEUS= ^1H
##.DELAY= (6, 6)
##.ACQUISITION MODE= SIMULTANEOUS
##.ACQUISITION SCHEME= undefined
##.AVERAGES= 8
##.DIGITISER RES= 18
##SPECTROMETER/DATA SYSTEM= spect
##.PULSE SEQUENCE= zg30
##.SOLVENT NAME= D2O
##.SHIFT REFERENCE= (INTERNAL, D2O, 0, 15.7039)
##AUDIT TRAIL= $$ (NUMBER, WHEN, WHO, WHERE, WHAT)
$$ ##TITLE= Audit trail, XWIN-NMR		Version 3.5
$$ ##JCAMPDX= 5.01
$$ ##ORIGIN= Bruker BioSpin GmbH
$$ ##OWNER= she
$$ F:/spectra/data/she/nmr/H-F/1/audita.txt
$$ ##AUDIT TRAIL=  $$ (NUMBER, WHEN, WHO, WHERE, WHAT)
(   1,<2020-02-28 14:26:42.90 +0400>,<she>,<DPX200>,
      <created by zg, POWCHK disabled, PULCHK disabled
       configuration hash MD5:
       00 E9 B6 7A A2 85 ED C7 34 08 36 98 17 FE 4E 26
       data hash MD5: 16K
       84 84 7F B3 26 F2 03 E9 85 F2 89 01 AF 96 15 E4>)
$$ ##END=
$$ 
$$ hash MD5
$$ 2C E8 4E 0A C0 53 48 91 9C 68 04 6D 1D 9D 62 1A
##$RELAX= 
##$RELAX= 
##$RELAX= 
##$RELAX= 
##$RELAX= 
##$RELAX= 
$$ Bruker specific parameters
$$ --------------------------
##$DU= <F:/spectra>
##$EXPNO= 1
##$NAME= <H-F>
##$PROCNO= 1
##$TYPE= <nmr>
##$USER= <she>
##$AMP= (0..31)
100 100 100 100 100 100 100 100 100 100 100 100 100 100 100 100 100 100 
100 100 100 100 100 100 100 100 100 100 100 100 100 100 
##$AQSEQ= 0
##$AQ_mod= 1
##$AUNM= <au_zg>
##$AUTOPOS= <>
##$BF1= 200.13
##$BF2= 200.13
##$BF3= 200.13
##$BF4= 200.13
##$BF5= 200.13
##$BF6= 200.13
##$BF7= 200.13
##$BF8= 200.13
##$BYTORDA= 1
##$CFDGTYP= 0
##$CFRGTYP= 5
##$CHEMSTR= <none>
##$CNST= (0..31)
1 1 145 1 1 1 1 1 1 1 1 1 1 1 1 1 1 1 1 1 1 1 1 1 1 1 1 1 1 1 1 1 
##$CPDPRG= <>
##$CPDPRG1= <>
##$CPDPRG2= <>
##$CPDPRG3= <>
##$CPDPRG4= <mlev>
##$CPDPRG5= <mlev>
##$CPDPRG6= <mlev>
##$CPDPRG7= <mlev>
##$CPDPRG8= <mlev>
##$CPDPRGB= <>
##$CPDPRGT= <>
##$D= (0..31)
0 1.2 0 0 0 0 0 0 0 0.06 0 0.03 0 0 0 0 0.0002 0 0 0 0 0 0 0 0 0 0 0 0 
0 0 0 
##$DATE= 1582885602
##$DBL= (0..7)
120 120 120 120 120 120 120 120 
##$DBP= (0..7)
150 150 150 150 150 150 150 150 
##$DBP07= 0
##$DBPNAM0= <>
##$DBPNAM1= <>
##$DBPNAM2= <>
##$DBPNAM3= <>
##$DBPNAM4= <>
##$DBPNAM5= <>
##$DBPNAM6= <>
##$DBPNAM7= <>
##$DBPOAL= (0..7)
0.5 0.5 0.5 0.5 0.5 0.5 0.5 0.5 
##$DBPOFFS= (0..7)
0 0 0 0 0 0 0 0 
##$DE= 6
##$DECBNUC= <off>
##$DECIM= 24
##$DECNUC= <off>
##$DECSTAT= 4
##$DIGMOD= 1
##$DIGTYP= 9
##$DL= (0..7)
0 120 120 120 120 120 120 120 
##$DP= (0..7)
150 150 150 150 150 150 150 150 
##$DP07= 0
##$DPNAME0= <>
##$DPNAME1= <>
##$DPNAME2= <>
##$DPNAME3= <>
##$DPNAME4= <>
##$DPNAME5= <>
##$DPNAME6= <>
##$DPNAME7= <>
##$DPOAL= (0..7)
0.5 0.5 0.5 0.5 0.5 0.5 0.5 0.5 
##$DPOFFS= (0..7)
0 0 0 0 0 0 0 0 
##$DQDMODE= 0
##$DR= 18
##$DS= 0
##$DSLIST= <SSSSSSSSSSSSSSS>
##$DSPFIRM= 0
$$ [...]
##$SUBNAM2= <"">
##$SUBNAM3= <"">
##$SUBNAM4= <"">
##$SUBNAM5= <"">
##$SUBNAM6= <"">
##$SUBNAM7= <"">
##$SUBNAM8= <"">
##$SUBNAM9= <"">
##$SW= 24.9337058887773
##$SWIBOX= (0..15)
0 0 2 0 0 0 0 0 0 0 0 0 0 0 0 0 
##$SW_h= 4990.01996007984
##$TD= 16384
##$TD0= 1
##$TE= 0
##$TE2= 300
##$TE3= 300
##$TEG= 300
##$TL= (0..7)
0 120 120 120 120 120 120 120 
##$TP= (0..7)
150 150 150 150 150 150 150 150 
##$TP07= 0
##$TPNAME0= <>
##$TPNAME1= <>
##$TPNAME2= <>
##$TPNAME3= <>
##$TPNAME4= <>
##$TPNAME5= <>
##$TPNAME6= <>
##$TPNAME7= <>
##$TPOAL= (0..7)
0.5 0.5 0.5 0.5 0.5 0.5 0.5 0.5 
##$TPOFFS= (0..7)
0 0 0 0 0 0 0 0 
##$TUNHIN= 0
##$TUNHOUT= 0
##$TUNXOUT= 0
##$USERA1= <user>
##$USERA2= <user>
##$USERA3= <user>
##$USERA4= <user>
##$USERA5= <user>
##$V9= 5
##$VALIST= <valist>
##$VCLIST= <CCCCCCCCCCCCCCC>
##$VD= 0
##$VDLIST= <DDDDDDDDDDDDDDD>
##$VPLIST= <PPPPPPPPPPPPPPP>
##$VTLIST= <TTTTTTTTTTTTTTT>
##$WBST= 1024
##$WBSW= 4
##$XGAIN= (0..3)
0 0 0 0 
##$XL= 0
##$YL= 0
##$YMAX_a= 641675
##$YMIN_a= -667558
##$ZGOPTNS= <>
##$ZL1= 120
##$ZL2= 120
##$ZL3= 120
##$ZL4= 120
##$ABSF1= 10
##$ABSF2= 0
##$ABSG= 5
##$ABSL= 3
##$ALPHA= 0
##$AQORDER= 0
##$ASSFAC= 0
##$ASSFACI= 0
##$ASSFACX= 0
##$ASSWID= 0
##$AUNMP= <proc_1d>
##$AZFE= 0.1
##$AZFW= 0.1
##$BCFW= 1
##$BC_mod= 2
##$BYTORDP= 1
##$COROFFS= 0
##$CY= 11.3945322036743
##$DATMOD= 1
##$DC= 2
##$DFILT= <>
##$DTYPP= 0
##$F1P= 16.9975609425685
##$F2P= -3.02152046262296
##$FCOR= 0.5
##$FTSIZE= 0
##$FT_mod= 4
##$GAMMA= 1
##$GB= 0.15
##$INTBC= 1
##$INTSCL= 1
##$ISEN= 128
##$LB= 0.24
##$LEV0= 0
##$LPBIN= 0
##$MAXI= 10000
##$MC2= 0
##$MEAN= 0
##$ME_mod= 0
##$MI= 1.114404
##$NCOEF= 0
##$NC_proc= 0
##$NLEV= 6
##$NOISF1= 3.799351
##$NOISF2= 2.8
##$NSP= 1
##$NTH_PI= 0
##$NZP= 0
##$OFFSET= 15.70392
##$PC= 1
##$PHC0= -9791.174
##$PHC1= 19.40082
##$PH_mod= 1
##$PKNL= yes
##$PPARMOD= 0
##$PSCAL= 0
##$PSIGN= 0
##$REVERSE= no
##$SF= 200.130013532006
##$SI= 16384
##$SIGF1= 3
##$SIGF2= 2
##$SINO= 400
##$SIOLD= 16384
##$SREGLST= <1H.CDCl3>
##$SSB= 0
##$STSI= 0
##$STSR= 0
##$SW_p= 3612.71676300578
##$SYMM= 0
##$S_DEV= 0
##$TDeff= 0
##$TDoff= 0
##$TI= <>
##$TILT= no
##$TM1= 0
##$TM2= 0
##$TOPLEV= 0
##$USERP1= <user>
##$USERP2= <user>
##$USERP3= <user>
##$USERP4= <user>
##$USERP5= <user>
##$WDW= 1
##$XDIM= 8192
##$YMAX_p= 0
##$YMIN_p= 0
$$ End of Bruker specific parameters
$$ ---------------------------------
##NTUPLES= NMR FID
##VAR_NAME=  TIME,          FID/REAL,        FID/IMAG
##SYMBOL=    X,             R,               I
##VAR_TYPE=  INDEPENDENT,   DEPENDENT,       DEPENDENT
##VAR_FORM=  AFFN,          ASDF,            ASDF
##VAR_DIM=   8192,          8192,            8192
##UNITS=     SECONDS,       ARBITRARY UNITS, ARBITRARY UNITS
##FACTOR=    0.0002004,     1,               1
##FIRST=     0,             0,               0
##LAST=      1.6414764,     0,               0
##MIN=       0,             -667558,         0
##MAX=       1.6414764,     641675,          0
$$ Real data points
##PAGE= N=1
##DATA TABLE= (X++(R..R)), XYDATA
0@%%%%qJ6j6J6k4L2l2M0o2P8q8J07j35J65j89K23k71L15l59M17m89N63o37P27
$$ 0 0 0 0 0 -8 8 -8 8 -16 16 -16 24 -38 40 -48 59 -76 89 -100 123 -148 167 -192 225 -264 299 -338 389
28C89q34R44j056J191j347J507j682J882k099K330k585K871l186L525l898M320
$$ 389 -445 499 -557 634 -713 794 -888 994 -1105 1225 -1360 1511 -1675 1850 -2048 2272
44B272m787N298n872O532p281Q130r124J0303j1714J3443j5630J8499k2433K8200
$$ 2272 -2515 2783 -3089 3443 -3838 4292 -4832 5471 -6243 7200 -8430 10069 -12364 15836
58A5836l7589N6056j46641N09536J49827q49858m8648P31040R0778q81285k26619
$$ 15836 -21753 34303 -112338 397198 547025 -302833 -351481 379559 470337 -410948 -637567
69f37567P95477L78012o83694l22695O91257M05857p23032n53031N71303N86005
$$ -637567 157910 535922 -147772 -470467 220790 626647 -96385 -649416 -78113 507892
79E07892m92337n51119N09851O67388m32833p39896K77104O95434k48481p04666
$$ 507892 15555 -535564 -25713 641675 208842 -531054 -253950 441484 193003 -511663
89e11663K21632P93610q5400p71538j5029P14951K6996p47243j08439P62617K34452
$$ -511663 -290031 503579 418179 -353359 -368388 346563 373559 -373684 -482123 280494 514946
100E14946o85677k78841O44699L04572o58146m06686O02838M84093n11257m91342
$$ 514946 -170731 -449572 195127 499699 -158447 -565133 37705 521798 10541 -480801
110d80801M85847N37966m54459o20165L54645O37034k80771o34733K50405O83209
$$ -480801 5046 543012 88553 -531612 -176967 460067 179296 -455437 -205032 478177
120D78177j72946p12122P2376O88396j9478o85032l1087P05706J25568o81856
$$ 478177 305231 -406891 -334515 353881 334403 -350629 -381716 323990 449558 -232298
130b32298k01893O35994K41052o25559l05898O04465L87027n41114m29319M91535
$$ -232298 -434191 201803 442855 -182704 -488602 115863 502890 -38224 -467543 23992
140B3992M61582m62913n23132M00711N65747l25647n79358K75722O04168k22496
$$ 23992 485574 22661 -500471 -99760 465987 140340 -439018 -163296 440872 218376
150B18376o38580J42093O40802p3006o32961K2226O40912M5600o38729j22500
$$ 218376 -420204 -278111 362691 289685 -343276 -321050 319862 365462 -273267 -395767
160c95767O08947J74964n86146k25272N71108K92580n32780l46697M85529L83735
$$ -395767 213180 388144 -198002 -423274 147834 440414 -92366 -439063 46466 430201
170D30201m50779m29044M09180M76333l49107n04017K95541N25488k48306n54586
$$ 430201 -20578 -449622 -40442 435891 86784 -417233 -121692 403796 155490 -399096
180c99096J88539N73703j22687n75764O8920N80775j4216n86278n2274N75691
$$ -399096 -210557 363146 240459 -335305 -266385 314390 300174 -286104 -338378 237313
190B37313J10468n57482j60211N44711K16153n22583k73043M88474L17948m54610
$$ 237313 347781 -209701 -369912 174799 390952 -131631 -404674 83800 401748 -52862
200e2862l59898M21855M04991l77019m42787L28206M70044k82358m96594K33022
$$ -52862 -412760 9095 414086 37067 -405720 -77514 392530 110172 -386422 -153400
210a53400N23294j75528n35841J21083N43435o8526n50953J1879N50408M6968
$$ -153400 369894 194366 -341475 -220392 323043 254517 -296436 -284557 265851 312819
220C12819n39582r8448N27770J50008n11711k03456M87339K51923m57420k94376
$$ 312819 -226763 -325211 202559 352567 -159144 -362600 124739 376662 -80758 -375134
230c75134M27013L35544l91158l75319L48538M06613l05582m33645K61727M59486
$$ -375134 51879 387423 -3735 -379054 -30516 376097 70515 -363130 -101403 358083
240C58083k13246m78245J61878M89346j13244m98930O2773N03553j0132n00979
$$ 358083 144837 -333408 -171530 317816 204572 -294358 -231585 271968 261836 -239143
250b39143m0267M93270Q8261m83237j37233M67087J85081m45485k27767M20327
$$ -239143 -279410 213860 302121 -181116 -318349 148738 333819 -111666 -339433 80894
260H0894K68575l92774l09073L59770L43576l22418l74558K84537M03103k44027
$$ 80894 349469 -43305 -352378 7392 350968 28550 -346008 -61471 341632 97605
270I7605m27356J99021M45149j53771m59848J07430M70125o0078m75050J1100
$$ 97605 -329751 -130730 314419 160648 -299200 -191770 278355 218277 -256773 -245673
280b45673M74369L5476m69942q3208M61326J29531m46810j74488M27330K16211
$$ -245673 228696 264172 -205770 -288978 172348 301879 -144931 -319419 107911 324122
290C24122m05428k57142L78419K94966l47387l27959L13269L58586k76963l84968
$$ 324122 -81306 -338448 39971 334937 -12450 -340409 -27140 331446 54483 -330485
300c30485K37120M07254j94882m24708J52226M37787j06590m47168O1465M51234
$$ -330485 -93365 313889 119007 -305701 -153475 284312 177722 -269446 -207981 243253
310B43253j6042m49793k8873M45448P3812m35656j17652M21675J59159m03861
$$ 243253 227211 -222582 -251455 193993 267805 -167851 -285503 136172 295331 -108530
320a08530j98397L81752K36474l55683k71064L27178L02544k95412l30839K61498
$$ -108530 -306927 74825 311299 -44384 -315448 11730 314274 18862 -311977 -50479
330e0479L55684k24197l76743J85960L93882j45756m07731J05033M17123o2677
$$ -50479 305205 81008 -295735 -109775 284107 138351 -269380 -164347 252776 190099
340A90099m21469K0244M23154K2732m20104o4430M12753J06028m01733j45283
$$ 190099 -231370 -211126 212028 234760 -185344 -249774 162979 269007 -132726 -278009
350b78009L86299J84765l67321k20945L44965K55033l19004k86893K90589L15376
$$ -278009 108290 293055 -74266 -295211 49754 304787 -14217 -301110 -10521 304855
360C04855k57991l41027K23446L62940j87404l81230J49055L95556j09502m05307
$$ 304855 46864 -294163 -70717 292223 104819 -276411 -127356 268200 158698 -246609
370b46609O7927M11709k7367m13656j4414M11226N5380m04866r5666L93874J34207
$$ -246609 -178682 233027 205660 -207996 -222410 188816 244196 -160670 -256336 137538 271745
381B71745l78768j72434L60704K07674l38947k41081L13436K71284k85362k98989
$$ 271745 -107023 -279457 81247 288921 -50026 -291107 22329 293613 8251 -290738
391b90738K54063L23256k20923l43948J85186L60904j48114l74814J10538L83575
$$ -290738 -36675 286581 65658 -278290 -93104 267800 119686 -255128 -144590 238985
401B38985p1296l89850L1779L91080P857l89416m6883L83216Q4993l74030j22135
$$ 238985 167689 -222161 -190382 200698 208555 -180861 -227744 155472 240465 -133565 -255700
412b55700L60172J58334l43967j92201L23536K24123l00962k53905K74695K81100
$$ -255700 104472 262806 -81161 -273362 50174 274297 -26665 -280570 -5875 275225
422B75225k46566l05502K15918L26302j82560l44506J48223L59278j12551l70312
$$ 275225 28659 -276843 -60925 265377 82817 -261689 -113466 245812 133261 -237051
432b37051P5673L77673l7767l81351k59L81381L8154l77302p5820L70069J12773
$$ -237051 -161378 216295 178528 -202823 -203082 178299 216453 -160849 -236669 133400 246173
443B46173l57904j48393L43056J83039l24396k15046L02465K45097k77170k72649
$$ 246173 -111731 -260124 82932 265971 -58425 -273471 28994 274091 -3079 -275728
453b75728K49729K97442k19526l18360J86802L37273j52927l51328J16928L62622
$$ -275728 -25999 271443 51917 -266443 -79641 257632 104705 -246623 -129695 232927
463B32927q0147l69334M3314L72353n524l71512l2484L68381O8704l59481j04331
$$ 232927 152780 -216554 -173240 199113 193589 -177923 -210407 157974 226678 -132803 -237134
474b37134L47411J39936l32768j72293L14115K03508k92064k32419K68304K58356
$$ -237134 110277 250213 -82555 -254848 59267 262775 -29289 -261708 6596 264952
484B64952k40781k82036K11491L03267j80971l20159J47873L34497j13512l45359
$$ 264952 24171 -257865 -46374 256893 75922 -244237 -96364 238133 124621 -220738
494b20738P8436L52744m2743l56551O548L56782K9214l53544o5202L46519J00002
$$ -220738 -142302 210442 167699 -188852 -182304 174478 203692 -149852 -215054 131465 231467
505B31467l36434j34034L22908J66422l05988j97619K85677K26263k63070k52961
$$ 231467 -104967 -239001 83907 250329 -55659 -253278 32399 258662 -4408 -257369
515b57369K37341K76839k09609k98251J79961L15622j47705l30990J14212L41984
$$ -257369 -20028 256811 47202 -251049 -71088 244534 96829 -234161 -119949 222035
525B22035p9996l49798M4256L53924q903l54212k7346L51044O2046l43766r7083
$$ 222035 142039 -207759 -163503 190421 181518 -172694 -200040 151004 213050 -130716 -227799
536b27799L33558J30534l19775j62884L02225J93260k82429k20779K58508K46485
$$ -227799 105759 236293 -83482 -246366 55859 249119 -33310 -254089 4419 250904
546B50904k32936k69531K04784K89445j74781l06539J43396L20069j10696l30098
$$ 250904 17968 -251563 -46779 242666 67885 -238654 -95258 224811 114115 -215983
556b15983P6829L36692m2412l39699P875L39138K7194l35989o0700L28469R4228
$$ -215983 -139154 197538 155126 -184573 -176698 162440 189634 -146355 -207055 121414 215642
567B15642l18316j26041L04619J57174k88145j85981K68918K12955k46433k37653
$$ 215642 -102674 -228715 75904 233078 -55067 -241048 27870 240825 -5608 -243261
577b43261K22295K60115j95878k79032J67376K96077j37011l09963J05822L20372
$$ -243261 -20966 239149 43271 -235761 -68385 227692 90681 -219282 -113460 206912
587B06912p2817l27753M0181L31580n887l32413k7178L29077O0996l22698r3767
$$ 206912 134095 -193658 -153477 178103 172216 -160197 -187375 141702 202698 -120000 -213767
598b13767L13901J24877l00619j55102K84483J84363k65443k11115K44085K35548
$$ -213767 100134 225011 -75608 -230710 53773 238136 -27307 -238422 5663 241211
608B41211k20070k57233J93503K76439j64348k93077J34625L06366j03747l15829
$$ 241211 21141 -236092 -42589 233850 69502 -223575 -88950 217416 113669 -202160
618b02160P1195L22485l8298l25119M862L24411K8472l20602o0684L13114R2508
$$ -202160 -130965 191520 153222 -171897 -167035 157376 185848 -134754 -195438 117676 210184
629B10184l02805j23196K89318J52081k72620j79715K53162K04702k31389k27975
$$ 210184 -92621 -215817 73501 225582 -47038 -226753 26409 231111 -278 -228253
639b28253K07710K47542j81550k65424J53464K80054j24602k92027R4649L00944
$$ -228253 -20543 226999 45449 -219975 -66511 213543 88941 -203086 -108437 192507
649A92507o4022l06721L2089L09124l66l09160l0664L04951O1722k98586r1894
$$ 192507 128485 -178236 -146147 162977 162611 -146549 -177213 127738 189460 -109126 -201020
660b01020K88311J21192k76111j48801K60234J74880k41870k00084K21871K21710
$$ -201020 87291 208483 -67628 -216429 43805 218685 -23185 -223269 -1398 220312
670B20312j98671k42188J74193K59214j47652k74161J19436K86032r0246k94639
$$ 220312 21641 -220547 -46354 212860 65208 -208953 -89517 196515 106269 -188370
680a88370O0095L00174k9419l02913j684L02384L2269k98118o2766K91205R2452
$$ -188370 -128275 171899 142480 -160433 -162117 140267 172536 -125582 -188348 102857 195309
691A95309k81050j20928K67842J48275k52173j73126K33777J96390k12998k17300
$$ 195309 -85741 -206669 61173 209448 -42725 -215851 17926 214316 1318 -215982
701b15982J89927K36040j64879k51632J38322K65344j10783k75554Q2777K82570
$$ -215982 -26055 209985 45106 -206526 -68204 197140 86357 -189197 -106420 176150
711A76150n3030k86868K4044K88003N593k86237l4478K81916O2999k74041r0451
$$ 176150 123120 -163748 -139704 148299 153892 -132345 -166823 115093 178092 -95949 -186400
722a86400K63485J17580k50549j42631K35282J66386k17626j87905J97921K07625
$$ -186400 77085 194665 -55884 -198515 36767 203153 -14473 -202378 -4457 203168
732B03168j75985k24606J52292K40324j27937k52767J01946K62896p5029k69728
$$ 203168 27183 -197423 -45131 195193 67256 -185511 -83565 179331 104302 -165426
742a65426M7339K74301j9858k75432q250K74526L6056k70325o3345K63220R0200
$$ -165426 -118087 156214 136356 -139076 -147326 127200 163256 -107069 -170414 92806 183006
753A83006k54046j15423K41598J39830k27028j62863K10259J83644j90992k02565
$$ 183006 -71040 -186463 55135 194965 -32063 -194926 15333 198977 7985 -194580
763a94580J69538K19236j47011k33996J23108K45457r7491k54837P1137K61069
$$ -194580 -25042 194194 47183 -186813 -63705 181752 84261 -170576 -99439 161630
773A61630m4521k64841J7354K65040J0151k63803l6502K58468O2649k50852q8416
$$ 161630 117109 -147732 -130378 134662 144813 -118990 -155492 102976 165625 -85227 -173643
784a73643K41107J12023k28244j35336K13167J56393j96915j75564J77662J93183
$$ -173643 67464 179487 -48757 -184093 29074 185467 -11448 -187012 -9350 183833
794A83833j57661k07923J34805K21639j12489k31636Q8318K39504o3717k45295
$$ 183833 26172 -181751 -46946 174693 62204 -169432 -81114 158390 94673 -150622
804a50622L8605K48068j3188k48810j1976K46574L7178k42026o1682K34761Q5641
$$ -150622 -112017 136051 122863 -125947 -137923 108651 145829 -96197 -157879 76882 162523
815A62523k25780j07897K14145J29325k00687j49264J85209J67593j67577j84580
$$ 162523 -63257 -171154 42991 172316 -28371 -177635 7574 175167 7590 -176990
825a76990J48881J99399j28750k11525J06837K22460q4033k30600O1212K35711
$$ -176990 -28109 171290 42540 -168985 -62148 160312 76279 -154321 -93109 142602
835A42602l6921k39148J2940K40057J1437k38286l5053K34278N8691k27725q1420
$$ 142602 105681 -133467 -120527 119530 130967 -107319 -142372 91906 150597 -77128 -158548
846a58548K18934J03744k07739j24310J94869J43348j79652j60591J62753J76300
$$ -158548 60386 164130 -43609 -167919 26950 170298 -9354 -169945 -7192 169108
856A69108j43759j90105J24203K01810j02897k11582Q1071K19170n8558k23876
$$ 169108 25349 -164756 -40553 161257 58360 -153222 -72151 147019 88461 -135415
866a35415L5759K26597j2649k26915j0040K24452L3367k20605n5230K14362P6365
$$ -135415 -99656 126941 114292 -112623 -122663 101789 135156 -85449 -140679 73683 150048
877A50048k05616r7032J94927J16285j82077j34454J67715J51091j52126j65688
$$ 150048 -55568 -152600 42327 158612 -23465 -157919 9796 160887 8761 -156927
887a56927J34852J78638j16648j89736R7013J99174p7118k06582N6195K11550
$$ -156927 -22075 156563 39915 -149821 -52808 146366 69248 -137334 -81139 130411
897A30411l4685k14759J3208K15561Q180k14663k9312K11229N0130k06182p1029
$$ 130411 95726 -119033 -105825 109736 117916 -96747 -126059 85170 135300 -70882 -141911
908a41911J98825R0301j89079j09391J77991J27134j65725j43021J50550J58064
$$ -141911 56914 147215 -41864 -151255 26736 153870 -11855 -154876 -4326 153738
918A53738j35289j70827J17784J81934r9017j91900P9910J99002n9827k04764
$$ 153738 18449 -152378 -34594 147340 48323 -143577 -63667 135335 75508 -129256
928a29256L9084K08071j8323k09247k852K08413K3447k05330m4024K00147O4136
$$ -129256 -90172 117899 99576 -109671 -112523 95890 119337 -85993 -130017 70130 134266
939A34266j93462q2570J84249J00872j73598j17636J60577J33707j47197j47594
$$ 134266 -59196 -141766 42483 143355 -30243 -147879 12698 146405 -792 -148386
949a48386J31812J60110j14870j71253R7407J80610p9213j87704O0178J93154
$$ -148386 -16574 143536 28666 -142587 -45180 135430 56217 -131487 -71309 121845
959A21845m0627j96117K0575J98163j017j97436j8680J95258L8079j90738n7133
$$ 121845 81218 -114899 -94324 103839 102822 -94614 -113294 81964 120043 -70695 -127828
970a27828J85232P5427j77343r2935J67804J09726j56516j24763J43674J39406
$$ -127828 57404 132831 -44512 -137447 30357 140083 -16433 -141196 2478 141884
980A41884j30201j51434J14676J63069r8188j72754Q1198J80875o3169j86800
$$ 141884 11683 -139751 -25075 137994 39806 -132948 -51750 129125 65956 -120844
990a20844M4518J91146k5615j93441O429J93977J3257j92360l2521J88959N1029
$$ -120844 -76326 114820 89205 -104236 -97807 96170 109427 -82933 -115454 73505 124534
1001A24534j83092o9485J76333Q6600j67277j03257J56787J18681j44289j33103
$$ 124534 -58558 -128043 48290 134890 -32387 -135644 21143 139824 -4465 -137568
1011a37568J30590J46179j16010j57007R9643J66765q2841j74997O5144J80987
$$ -137568 -6978 139201 23191 -133816 -34173 132592 49751 -125246 -60102 120885
1021A20885m7164j84725K8077J87114r199j87689j0161J86295K8503j82785m7008
$$ 120885 73721 -111004 -82927 104187 94988 -92701 -102862 83433 111936 -70849 -117857
1032a17857J77578O4652j70851q1324J61714R7465j51616j13140J40407J26759
$$ -117857 59721 124373 -46478 -127802 33912 131377 -20239 -133379 7028 133787
1042A33787j27299j39163J12596J50340r7861j59855Q1276J68156o4807j74140
$$ 133787 6488 -132675 -20079 130261 32400 -127455 -46179 121977 57170 -116970
1052a16970M6863J78606k8792j82072J1378J82249P098j81912k5115J78830M3188
$$ -116970 -70107 108499 79707 -102365 -90987 91262 98360 -83552 -108667 70163 113351
1063A13351j74359o0603J68321P7671j61325r3210J51241J08920j40710j22408
$$ 113351 -61008 -121611 46710 124381 -36944 -130154 21087 130007 -10703 -133111
1073a33111J28104J35162j14635j46501J00139J56516q4417j64707O7506J71638
$$ -133111 -5007 130155 15520 -130981 -30842 125674 41257 -123450 -55944 115694
1083A15694n0348j76324L2689J79259j4440j80396l381J79734K1725j77266l9524
$$ 115694 65346 -110978 -78289 100970 86530 -93866 -97247 82487 104212 -73054 -112578
1094a12578J72959N6810j66325p3984J58921Q9765j49393j04190J38136J18574
$$ -112578 60381 117191 -49134 -123118 35803 125568 -23825 -128015 10121 128695
1104A28695j25903j30590J12214J41821r7793j51135Q2152J59663o5598j65687
$$ 128695 2792 -127798 -15584 126237 28444 -122691 -40539 119124 53526 -112161
1114a12161M8712J69930l1337j72818J3805J74223L722j73436k1078J71237L8236
$$ -112161 -63449 106481 75144 -97674 -83869 90354 94076 -79360 -100438 70799 109035
1125A09035j66790n5107J61367P0867j53805q6655J45335J01379j34789j14884
$$ 109035 -57755 -112862 48505 119372 -34433 -121088 24247 125626 -9163 -124047
1135a24047J23229J26754j10291j37964R6462J47962q1951j56102O6176J62502
$$ -124047 -818 125936 15645 -122319 -25857 122105 40154 -115948 -49772 112730
1145A12730m9732j67526L3060J70934j6175j72354j582J72361J8617j70302l5869
$$ 112730 62998 -104528 -71468 99466 83291 -89063 -90645 81716 100333 -69969 -105838
1156a05838J66910N2065j61176o8646J54131Q3871j45558r8657J35210J12123
$$ -105838 61072 113137 -48039 -116685 37446 121317 -24241 -122898 12312 124435
1166A24435j23693j24215J10642J35392r7248j45251Q2655J52723o6638j59441
$$ 124435 742 -123473 -12831 122561 25313 -119938 -37283 115440 48802 -110639
1176a10639N0147J63674l2979j67350J6237J68595N44j67839j7778J65540L4535
$$ -110639 -60492 103182 70203 -97147 -80910 87685 88229 -79610 -97388 68152 102687
1187A02687j61470n1189J55972O7108j49104q1849J40336R5757j30347j08948
$$ 102687 -58783 -109972 46000 113108 -35996 -117845 22491 118248 -12099 -121047
1197a21047J18796J20916j06502j31235R2707J40773p8596j48191O3233J54608
$$ -121047 -2251 118665 12163 -119072 -26365 114408 35812 -112379 -49146 105462
1207A05462m7562j59249L1586J62335j5389j63259j552J63269J7984j61001l4541
$$ 105462 57900 -101349 -69763 92572 77183 -86076 -87628 75641 93625 -67376 -101917
1218a01917J57787N0375j52460o5516J45744Q0128j37155r4330J27847J07243
$$ -101917 55870 106245 -46215 -111731 34013 114141 -23014 -117344 10503 117746
1228A17746j17079j18720J05171J29041r1794j38308P7681J46289o2635j52354
$$ 117746 667 -118053 -12882 116159 24365 -113943 -36262 110027 47392 -104962
1238a04962M7140J57221l1383j59317J4540J61223J592j60930j7557J58292L3997
$$ -104962 -57822 99399 68016 -91301 -76761 84462 86054 -74876 -92433 65859 99856
1249I9856j53962m9960J48778O5458j42259p9280J33721R2498j23452j05010J12505
$$ 99856 -54106 -104066 44712 110170 -32089 -111369 22352 114850 -8602 -113612 -1107
1260a107J15989j00079j26161Q7221J34595p3358j41696N8663J47136m2886j51663
$$ -1107 114882 14803 -111358 -24137 110458 37100 -104596 -45933 101203 58317 -93346
1271i3346K7588J53846j1886j54606m265J54130J9440j51518l4635J47409M9450
$$ -93346 -65758 88088 76202 -78404 -82669 71461 90901 -60617 -95252 52157 101607
1282A01607j42029o3924J35341P7931j27766r0756J17865J02930j07771j13100
$$ 101607 -40422 -104346 30995 108926 -18840 -109596 8269 111199 3428 -109672
1292a09672R5447J22872q3133j31183O9799J37624n5848j43216M1596J47195k6447
$$ -109672 -14225 108647 25514 -105669 -35870 101754 45906 -97310 -55714 91481 65034
1303F5034j50364J1795J50605L524j49807j9238J48237L3759j44815m8187J39339
$$ 65034 -85330 -73535 77070 80594 -69213 -88451 59786 93545 -51270 -99457 39882
1314C9882O2165j33061p5492J25396Q7921j16489r9145J05707J09808r4438j19320
$$ 39882 102047 -31014 -106506 18890 106811 -9678 -108823 -3116 106692 12254 -107066
1325a07066Q2340J27044o8893j33913N5493J38910m0999j42797K6254J45288j1588
$$ -107066 -24726 102318 33425 -100488 -44995 93915 52916 -89881 -63627 81661 70073
1336G0073j46052k835J44445J8359j42378l2689J38595M6722j33207o0288J27002
$$ 70073 -75979 -78814 65631 83990 -58388 -91077 47518 94240 -38967 -99255 27747
1347B7747P2723j18861q4636J09894R5820r9683j05695Q8981J14341p7277j21571
$$ 27747 100470 -18391 -103027 6867 102687 3004 -102691 -13710 100631 23354 -98217
1358i8217O4487J27806n1036j32690L7628J36475k3815j38440R906J39380L933
$$ -98217 -33730 94076 43040 -89650 -52022 84453 60638 -77802 -67896 71484 75417
1369G5417j38497j7995J36389L1946j32928m4987J28309N7454j21730p0271J15076
$$ 75417 -63080 -81075 55314 87260 -45668 -90655 37654 95108 -26622 -96893 18183
1380A8183Q1438j06291r1957R6990J01563q6881j10075P5590J17651o3432j23763
$$ 18183 99621 -6670 -98627 -1637 99926 13045 -97030 -21440 96211 32779 -90984
1391i0984N1031J28468l7929j31959K4661J34029j0664j35285k672J34136J5754
$$ -90984 -39953 88515 50586 -81373 -56712 77317 66653 -68632 -71304 62832 78586
1402G8586j31890k9387J28816M2264j24124n4566J17988O6479j10892p7804J02838
$$ 78586 -53304 -82691 46125 88389 -35735 -90301 27687 94166 -16726 -94530 8308
1413H308Q7594r3575r6897Q3442J05019p2714j12104O1158J17408m8601j22375
$$ 8308 95902 2327 -94570 -11128 93891 21177 -90927 -29769 87639 39038 -83337
1424h3337L6133J25538k3411j27445J0412J27991K592j27644j5167J25084K8104
$$ -83337 -47204 78334 54923 -72522 -62110 65881 68473 -59171 -74338 50746 78850
1435G8850j22275m0452J18061N2252j12974o2759J05746P3297r7847q3483Q9688
$$ 78850 -43425 -83877 34184 86436 -26538 -89297 16449 89746 -8101 -91584 -1896
1446a896R1773q0126r9685O9726J06362n8841j12320M7742J16910l6338j19896
$$ -1896 89877 9751 -89934 -20208 86154 27313 -85007 -37265 79645 43307 -76589
1457g6589K4049J22327j2166j22859m35J22546J2934j21294k5046J18727L6477
$$ -76589 -52540 69787 57621 -65238 -65673 56873 69807 -51487 -76533 42194 78671
1468G8671j14445m7604J09093N9193j03670o8929R6196P8583q8427q6920P9524
$$ 78671 -35774 -83378 25715 84908 -18762 -87691 8505 87088 -1339 -88259 -8735
1479h735R4875o9729j01223N9008J07566m8607j11407L6703J15163k5065j17652
$$ -8735 86140 16411 -84812 -25804 81762 33155 -78252 -41549 73614 48549 -69103
1490f9103J3524J18705j386j18035j0477J16671K2055j13891l3641J10193M4810
$$ -69103 -55579 63126 61740 -56295 -66772 49899 71954 -41937 -75578 34615 79425
1501G9425j05171n5140R9471O4916r2382p4364Q4741Q2849p6368q9863O6994R6234
$$ 79425 -25746 -80886 18585 83501 -8881 -83245 1496 84345 7977 -81886 -14892 81342
1513H1342n7143j01706M6608J06394l5922j09308K4640J11735j3310j13294K534
$$ 81342 24199 -77507 -30899 75495 39573 -69735 -45095 66640 53330 -59964 -57430
1524e7430J13052Q910j12071j9802J09313L1075j06383m1618J01951N1706r6861
$$ -57430 55622 64532 -47539 -67341 41972 73047 -33336 -74954 26997 78703 -18158
1535a8158o0877R0508O9960q3427p8105P5311Q5740o6973r2393N8088R7252m8006
$$ -18158 -79035 11473 81433 -1994 -80099 -4788 80952 13979 -78414 -20326 76926 28920
1547B8920j02056L7512J05650k7385j07935J6592J09403n840j09840n556J09496
$$ 28920 -73136 -35624 70026 42641 -65294 -48702 60701 54861 -54979 -60535 48961
1558D8961J6199j07379k7209J04204L7531j00267m7558R5242N7068q9897o5221
$$ 48961 65160 -42219 -69428 34776 72307 -27960 -75518 19724 76792 -13105 -78326
1569g8326Q2330P4059p5320q0965O6653Q7634n7804r3236M8491R7253l8194j01487
$$ -78326 4004 78063 2743 -78222 -11569 76065 18261 -74975 -26484 70769 32575 -68912
1581f8912K8250J03788j7659j05337P355J05549L459j05095j4225J03661K4311
$$ -68912 -40662 63126 45467 -59870 -52515 53034 56493 -48602 -62827 40834 65145
1592F5145j00668l4528R7168M4297r2755n3331Q7228O1956q0765o9948P3720P7489
$$ 65145 -35523 -70051 27117 71414 -21341 -74672 12556 74512 -6253 -76201 -2481 75008
1604G5008o6088q3455N7586Q9219m8796r3679L9152R7812k9574j00649J9565J02521
$$ 75008 8920 -74535 -16949 72270 23474 -70205 -31053 66759 37185 -63464 -43899 58622
1616E8622q860j03732q18J03214J1042j01702k1409R9825L1405r6804m0683R2793
$$ 58622 49762 -53970 -54788 48426 59468 -42234 -63643 36182 67587 -29217 -69900 22893
1628B2893M9632q7459n8187Q1108O6519p4638p3410O7081Q0253n8899q6402N0603
$$ 22893 72525 -14934 -73121 7987 74506 -132 -73542 -6461 73792 14893 -71509 -20906
1640b0906R1225m1329r4924L1360R8473k1795j00136J1599J01137j639j01020
$$ -20906 70319 28990 -65934 -34574 63899 42104 -58032 -46433 54704 53065 -47955
1651d7955q352J00017J8431r7938k8589R5028L7874r1015m6885Q6151N5607q0822
$$ -47955 -56307 43710 62141 -35797 -64386 30642 68516 -22499 -69384 16767 72374 -8448
1663h448o3475P3839P1039o6892p7410N8993Q3021n0438q8070M1178R2331l2337
$$ -8448 -71923 1916 72955 6063 -71347 -12354 70667 20229 -67841 -26663 65668 33331
1675C3331r4894K2412R7147j2513r8819L094R8719O362r7549j6850R5870K6723
$$ 33331 -61563 -39151 57996 45483 -53336 -50242 48477 54839 -42710 -59560 36310 63033
1687F3033r3644l5706R0037M4593q5386n3346Q0025O0963p3672o8523O7039P5101
$$ 63033 -30611 -66317 23720 68313 -17073 -70419 9606 70569 -3103 -71626 -4587 70514
1699G0514n9740q0778N1360Q6024m2756r0562L3970R3347k4313r5963J4855R7107
$$ 70514 10774 -70004 -18644 67380 24624 -65938 -31968 61379 37066 -58897 -44042 53065
1711E3065m511r8222m962R7616J4226r5401k4381R3342L3354q9685m2336Q5068
$$ 53065 48554 -49668 -54630 42986 57212 -38189 -62570 30772 64126 -25559 -67895 17173
1723A7173N1146q0026n8926P3775O6823o7058p3643N9847P9048n1261q4152M2637
$$ 17173 68319 -11707 -70633 3142 69965 2907 -70736 -10889 68159 16898 -67254 -24617
1735b4617Q8850l3767r1758K4212R4229j4805r5901N487R6053M338r4977j4218
$$ -24617 64233 30466 -61292 -37080 57149 42344 -53557 -48070 47983 52321 -42656 -56874
1747e6874R3822K3402r1080l2663Q7795M1803q3614n0335P8715N8003p2346o5319
$$ -56874 36948 60350 -30730 -63393 24402 66205 -17409 -67744 10971 68974 -3372 -68691
1759f8691O5733P1980n8612p7516N0564Q2965m2492q6696L3389Q9845k4109r2470
$$ -68691 -2958 69022 10410 -67106 -16542 66423 23931 -62765 -29376 60469 36360 -56110
1771e6110J5304R3721n405r4561m042R4192J3469r2793k2305Q9969L1850q7325
$$ -56110 -40806 52915 47510 -47051 -51093 43099 56568 -36225 -58530 31439 63289 -24036
1783b4036m0339Q2914M8990p8074n6462P1987O3812o5444p0749N8294P6792n0623
$$ -24036 -64375 18539 67529 -10545 -67007 4980 68792 3348 -67401 -9107 67685 17062
1795A7062q1519M1833Q5753l3508q9055K4615R1130j5280r2809N926R2979L910
$$ 17062 -64457 -22624 63129 29621 -59434 -34819 56311 41031 -51778 -45852 47127 51037
1807E1037r2994j2842R1015K2296q8452l1763Q5408M0679q1755m8551P6530N5687
$$ 51037 -41957 -54799 36216 58512 -29940 -61703 23705 64384 -17371 -65922 10608 66295
1819F6295p0417o2837O4000O8845n6493p4909M9162P9366m0807q3813L2437Q6811
$$ 66295 -4122 -66959 -2959 65886 9393 -65516 -16354 63012 22205 -61608 -29171 57640
1831E7640k3396q9136J4453R0284n337r0827m006R0431J3118q9091k1881Q6563
$$ 57640 34244 -54892 -40439 49845 44508 -46319 -50325 40106 53224 -35867 -57748 28815
1843B8815L0892q3783l8976P9379M7232p4461n4908O9263O1465o2976o7770N6298
$$ 28815 59707 -24076 -63052 16327 63559 -10902 -65810 3453 64918 1942 -65828 -9530
1855i530P3301m8713p8110M0392Q2633l2600q5206K3632Q7744j4712q9209O015
$$ -9530 63771 15058 -63052 -22660 59973 27373 -57833 -34201 53543 38831 -50378 -44363
1867d4363Q9476L476q9233j2130Q7654K0908q5069k9612Q2364L7511p7872m5957
$$ -44363 45113 48589 -40644 -52774 34880 55788 -29281 -58893 23471 60982 -16890 -62847
1879f2847P3485N2988o7835n9642O1735O6195n4985p1458M7348P6524l9363q0607
$$ -62847 10638 63626 -4209 -63851 -2116 64079 9094 -62364 -15016 61508 22145 -58462
1891e8462L1130Q3500k2375q5381J3656Q6598n055q7121l269Q5795J3148q4904
$$ -58462 -27332 56168 33793 -51588 -37932 48666 43611 -43510 -46779 39016 52164 -32740
1903c2740k1278Q2227K9888p9239l7778P5359M5162p0577n2265O4615N9189n8669
$$ -32740 -54018 28209 58097 -21142 -58920 16439 61601 -8976 -61241 3374 62563 3894
1915C894o5015N1993P0231m5201p4444L7668P7723k9162q1099K1195Q3072j2798
$$ 3894 -61121 -9128 61103 15902 -58542 -20874 56849 27687 -53412 -32217 50855 38057
1927C8057q4239M266Q4356M379q4113j2807Q2928K0806q0434k9090P6787L7348
$$ 38057 -46182 -41916 42440 46819 -37294 -50101 32827 53633 -26801 -55891 20896 58244
1939E8244p3433m4250O8702N1364o3689n7453N7217O3419n1280o8000M3982P2390
$$ 58244 -15189 -59439 9263 60627 -3062 -60515 -3298 60121 8841 -59159 -15177 57213
1951E7213l6521p5990K8550P8800k0852q0571J2373Q1775m385q1697l895Q0728
$$ 57213 20692 -55298 -26748 52052 31200 -49371 -36998 44777 40392 -41305 -45200 35528
1963C5528J2547p9720k0720P7494K8451p4684l5619P0784M2523o5963m9197O0939
$$ 35528 48075 -31645 -52365 25129 53580 -21104 -56723 14061 56584 -9379 -58576 2363
1975B363N5200n4905o0956M8706O5977m2164o9385L4048P3491k7252p5623J9642
$$ 2363 57563 2658 -58298 -9592 56385 14221 -55164 -21116 52375 25123 -50500 -30858
1987c0858P7237j1642p8226L549P8763M672p8487j2167P6320K0379p4657k7243
$$ -30858 46379 34737 -43489 -39940 38823 43495 -34992 -47159 29161 49540 -25117 -52360
1999e2360P1430L4840o8003m0988O3596M7670n8924n3062N3161N8329m7188o3057
$$ -52360 19070 53910 -14093 -55081 8515 56185 -2739 -55801 -2640 55689 8501 -54556
2011e4556M0702O7159l3966p0204K6980P2784j9384p5008J2210P5668m250p5977
$$ -54556 -13854 53305 19339 -50865 -23885 48899 29515 -45493 -33283 42385 38135 -37842
2023c7842l512P5844J1160p4253j8855P2276K5680o9288l2849O6157L8966o1491
$$ -37842 -41354 34490 45650 -28603 -47458 24818 50498 -18790 -51639 14518 53484 -8007
2035h007m5597N7350N0995n1780n6322M6070O0783l9653o5010L3565O7579k6322
$$ -8007 -53604 3746 54741 2961 -53361 -7291 53492 13839 -51171 -17606 49973 23651
2047B3651p0250J9535P1395j1655p2721M306P2843K851p2252j0495P1380J7479
$$ 23651 -46599 -27064 44331 32676 -40045 -35739 37104 39955 -32297 -42792 28588 46067
2059D6067o9387k4595O6875L0768o3255l7423N9671M2673n4583m8484M9892N3398
$$ 46067 -23320 -47915 18960 49728 -13527 -50950 8721 51394 -3189 -51673 -1781 51617
2071E1617m4551n7674L8089O1713l2181o4707K5478O7210j8810o8811J1765O9897
$$ 51617 7066 -50608 -12519 49194 17013 -47694 -22216 44994 26184 -42627 -30862 39035
2083C9035n051p0131j811O9511Q954o8962j5451O6833K2409o4317k9197O1763
$$ 39035 33984 -36147 -37958 31553 40507 -28455 -43906 22927 45336 -18981 -48178 13585
2095A3585L4823n7937m0933N3759M6126m9187n0599M3969N5223l8481n8407L2242
$$ 13585 48408 -9529 -50462 3297 49423 236 -50363 -6394 48829 10348 -48059 -15817
2107a5817O1357k5786o4438J9625O6233j2688o7540O074O7650Q77o7352p441O6249
$$ -15817 45540 19754 -44684 -25059 41174 28486 -39054 -32980 34670 35547 -31805 -39246 27003
2120B7003J4369o4784k0964O2795K7341o0014l2964N6320L8782n2550m3710M7644
$$ 27003 41372 -23412 -44376 18419 45760 -14254 -47218 9102 47884 -4666 -48376 -732
2132g32M8759m2787n2609L7356N6484l1442n9586K5779O1793j9740o3228J2987
$$ -732 48027 5240 -47369 -10013 46471 15029 -44557 -18778 43015 23275 -39953 -26966
2144b6966O4699o477o5063n5O4988O556o4409j2891O2676J9305o0837k5240N8787
$$ -26966 37733 31256 -33807 -33862 31126 37682 -26727 -39618 23058 42363 -18474 -43714 15073
2157A5073L0638n5143l6143N1137M1428m6930m6452M2978M9943l7588n3489L2243
$$ 15073 45711 -9432 -45575 5562 46990 60 -46392 -3414 46529 8941 -44548 -12305
2169a2305N6422k6229n9422K0639O0943j4188o2446Q110O3333j978o3180m817
$$ -12305 44117 17888 -41534 -20895 40048 25860 -36586 -28476 34857 32879 -30301 -35118
2181c5118O2800J0703o1574j6940N9899K2518n7129k8567N4431L3666n0905l8788
$$ -35118 27682 38385 -23189 -40129 19770 42288 -14841 -43408 11023 44689 -6216 -45004
2193d5004M7233M2962m2770m7277L7711N1461l3012n4129K6996N6732k1074n8895
$$ -45004 2229 45191 2421 -44856 -7145 44316 11304 -42825 -15829 40903 19829 -39066
2205c9066J4954O0552q899o1584L000O1539L093o1128r151N9968J5330n8433k1196
$$ -39066 -24112 36440 27541 -34043 -31043 30496 33589 -27539 -36690 23278 38608 -19825 -41021
2218d1021N6133K6922n3816l1751N0490L6696m6309m1809M2271M5482l7595m8957
$$ -41021 15112 42034 -11782 -43533 6957 43653 -2656 -44465 -2194 43288 5693 -43264
2230d3264L2408N2380k7264n5254K1707N7368j6215n8452R812N9952m325n9651
$$ -43264 -10856 41524 14260 -40994 -19287 38081 21866 -36586 -26774 33178 28853 -30798
2242c0798k217N9835Q221n9350j3555N7487J9454n5262k5197N3220L0112m9918
$$ -30798 -33015 26820 35041 -24309 -37864 19623 39077 -16185 -41382 11838 41950 -7968
2254g968l5146M6342L9889m2511m3608L7665M7815l3114n0575K7654N3509k2208
$$ -7968 -43114 3228 43117 606 -43002 -5337 42478 9364 -41211 -13557 39952 17744
2266A7744n5932J7012N7504j1217n8507N463N8655Q11n8684o581N7876J2426n6506
$$ 17744 -38188 -21176 36328 25111 -33396 -27933 30722 31533 -27151 -33732 24144 36570 -19936
2279a9936j7964N4901K3495n2582k8819M9693L3451m6223l7640M1939M2381l7740
$$ -19936 -37900 17001 40496 -12086 -40905 8788 42239 -3984 -41624 315 42696 4956
2291D956m6171L3211M9311k8301n2039K2870N4521j7676n6082J1929N7088n666
$$ 4956 -41215 -8004 41307 13006 -39033 -16163 38358 20682 -35400 -23471 33617 27951
2303B7951n7964K5N8015N553n7460j1253N6147J6655n4512k1830N1818K7659m9393
$$ 27951 -30013 -29988 28027 33580 -23880 -35133 21014 37669 -16843 -38673 13145 40804 -8589
2316h589l2364M6033L6348m1894m0809L8066M4525l3535m8397K8887N1136k3786
$$ -8589 -40953 5080 41428 -466 -41275 -3209 41316 7781 -40616 -11729 39407 15621
2328A5621n3431J8601N5100j2970n6716P517N6894j698n6965m042N6545R811n5911
$$ 15621 -37810 -19209 35891 22921 -33795 -26278 30616 28918 -28047 -32089 24456 34267 -21644
2341b1644j4893N4226K0091n1971k5610M9295L0333m6165l4920M2620L9460l8387
$$ -21644 -36537 17689 37780 -14191 -39801 9494 39827 -6338 -41258 1362 40822 2435
2353B435m3582L4108M6385k9246m9507K4518N1860j8931n4075J3735N5308q134
$$ 2435 -41147 -7039 39346 10100 -39407 -14889 36971 18040 -36035 -22300 33008 24874
2365B4874n6369K644N6071L643n6280q628N5011J4323n3440j9708N1535K4782
$$ 24874 -31495 -28851 27220 30863 -25417 -34045 20966 35289 -18151 -37859 13676 38458
2377C8458m8821k9540M5736L4396m2287l8352L7752M2592l3448m6247K9498M8558
$$ 38458 -10363 -39903 5833 40229 -2058 -40410 -2658 39934 6486 -39761 -10263 38295
2389C8295k4197n0919J8720N3392j3833n4625Q392N5556k695n5911k504N5244
$$ 38295 14098 -36821 -18101 35291 21458 -33167 -24775 30781 28086 -27825 -30329 24915
2401B4915Q318n4250j3855N2811J9139n0451k4681M8450K8944m5290l3243M1588
$$ 24915 33233 -21017 -34872 17939 37078 -13373 -38054 10396 39340 -5950 -39193 2395
2413B395L7967l8138m1578L3972M5167k9699m7600K4404M9927j8990n2284J4160
$$ 2395 40362 2224 -39354 -5382 39785 10086 -37514 -13110 36817 17827 -34457 -20297
2425b0297N3538q828n4275L195N4322K478n4408p835N3807J2968n2364j8048N0129
$$ -20297 33241 24413 -29862 -26667 27655 30133 -24275 -32110 21697 34665 -17699 -35747 14382
2438A4382K3381m7876k8084M4661L2535m1172l6902L7448M0600l3301m3864K8793
$$ 14382 37763 -10113 -38197 6464 38999 -2173 -39075 -1627 38973 5672 -38192 -9399
2450i399M6767k4073m9032J8889N0870j3563n2910Q913N3524l469n3617k265N3285
$$ -9399 37368 13295 -35737 -16848 34022 20459 -32451 -23538 29986 26517 -27100 -29365 23920
2463B3920P537n2359j2762N0721J7992m8872k3117M6907K6958m3147l2279M0599
$$ 23920 31457 -20902 -33664 17057 35049 -13823 -36940 9967 36925 -6222 -38501 2098
2475B098L6063l7194l9311L2643M2865k8396m5778K3888M8017j8847m9786J3599
$$ 2098 38161 967 -38344 -5701 37164 8768 -37010 -13122 34895 16048 -33738 -20139
2487b0139N1065q158n2282L210N2734J420n1772p420N1310J2502m9852j7204M7807
$$ -20139 30926 22768 -29514 -26304 26430 27850 -23922 -31342 19968 32470 -17382 -34586 13221
2500A3221K2260m5575k6729M2359L1609l9589l5366L5854L9117l2391m1629K7610
$$ 13221 35481 -10094 -36823 5536 37145 -2444 -37810 -1956 37161 4770 -36859 -9249
2512i249M4907k3223m6763J8535M8546j3510m9733Q380N0302l260n0569k097N0721
$$ -9249 35658 12435 -34328 -15793 32753 19243 -30490 -22110 28192 24932 -25637 -27734 22987
2525B2987P121m9706j2298M8423J7289m6963k1395M4313K5953m1253l0457L8130
$$ 22987 30108 -19598 -31896 16527 33816 -13147 -34542 9771 35724 -5529 -35986 2144
2537B144L4212l4592l7458L0771M0568k6589m3257K2229M5785j8030m6928J2533
$$ 2144 36356 1764 -35694 -4923 35645 9056 -34201 -11972 33813 15783 -31145 -18612
2549a8612M8402p572m9250K970M9223K113m9070o958M7989J2071m7070j6482M5235
$$ -18612 29790 22218 -27032 -24062 25161 27274 -21796 -28754 19235 31306 -15764 -32246 12989
2562A2989K0909m2778k5515M0517K9416l7380l2981L3577L6558l0352l9291K5913
$$ 12989 33898 -8880 -34395 6122 35538 -1842 -34823 -1246 35312 4960 -34331 -8418
2574h418M2306k2085m4088J7462M5434j2511m6950P945M7494l071m7526k120M7497
$$ -8418 33888 11803 -32285 -14823 30611 18100 -28850 -20905 26589 23518 -24008 -26128 21369
2587B1369O499m6539j1268M5677J5692m3908j9949M1346K4430l9018k8276L6102
$$ 21369 27868 -18671 -29939 15738 31430 -12478 -32427 8919 33349 -5669 -33945 2157
2599B157L1432l2600l4974K8898L8048k5465m0326K1283M2382j6581m4470J2696
$$ 2157 33589 989 -33985 -5087 32961 7496 -32830 -11547 30835 14254 -30216 -17520
2611a7520M4950p788m5772L204M5977J533m5741n823M4559J0937m4100j4930M2389
$$ -17520 27430 19642 -26130 -22926 23051 24584 -21157 -26980 17579 28516 -15584 -30514 11875
2624A1875J8964m0102k3239L7955K6692l4861l0081L1765L3504k8572l6312K4899
$$ 11875 30839 -9263 -32502 5453 32145 -2716 -32797 -1032 32472 3900 -32412 -7513
2636g513L8593k0598m0839J6837M2259j2563m3007Q075M3752l569m4190q74M4019
$$ -7513 31080 10482 -30357 -13520 28739 16176 -26831 -18756 24996 21427 -22763 -23637 20382
2649B0382N343m3823r444M2327J3835m0536j8025L9220K1560l6783k5175L4219
$$ 20382 25725 -18098 -27542 14785 28620 -11916 -29941 9279 30839 -5944 -31119 3100
2661C100K8646l1491l1546K8251L4136k4249l6938K1106L8459j6835m0053J2315
$$ 3100 31746 255 -31291 -3040 31096 6847 -30091 -8985 29474 12639 -27414 -15099
2673a5099M1646q431m1977M005M2638k9m2462m313M1880Q327m0837j2587L9465
$$ -15099 26547 18116 -23861 -19856 22782 22753 -19709 -24022 17858 26185 -14652 -27239 12226
2686A2226J6735l7995k0040L5665K3741l3473k6748L0307L0087k7377l2423K3641
$$ 12226 28961 -9034 -29074 6591 30332 -3141 -29889 418 30505 3128 -29295 -5654
2698e654L5108k0729l6716J6744L8175j2629l9548Q698M0343m597m0951N00M0891
$$ -5654 29454 8725 -27991 -11247 26928 14299 -25249 -16551 23792 19195 -21756 -21256 19635
2711A9635L386m0504p256L9791J1228l8403j5293L6754J8739l4885k2021L2484
$$ 19635 23021 -17483 -24739 15052 26280 -12123 -27416 9338 28077 -6808 -28829 3655
2723C655K5140k9828k8311K7074L0642k3547l3314K0671L4766j6734l6801J3236
$$ 3655 28795 -1033 -29344 -2270 28372 4825 -28489 -7818 26948 10214 -26587 -13351
2735a3351L8286j0188l8426N452L9325j472l9366k336L9200N996l8392r695L7086
$$ -13351 24935 14747 -23679 -18227 21098 19626 -19740 -22076 17124 23120 -15272 -24967 12119
2748A2119J3698l5820j7235L4033K0231l1616k3632K9642K6264k6562k9224K3553
$$ 12119 25817 -10003 -27238 6795 27026 -4590 -28222 1420 27684 1122 -28102 -4549
2760d549L1843k0692l3335J7375L4712j3533l6260R928L7369o240l7818K464L7751
$$ -4549 27294 6602 -26733 -9358 25354 11821 -24439 -14511 22858 16618 -21200 -18736 19015
2773A9015J283l7727m599L6995Q609l6104j2500L5099J5774l3305j8668L0989
$$ 19015 20298 -17429 -22028 14967 23576 -12528 -25028 10071 25845 -7460 -26128 4861
2785D861K2150k9189k4477K6544K7308k3977k9744K0779L1713j7543l3210J4441
$$ 4861 27011 -2178 -26655 -111 27197 3220 -26524 -5745 25968 8425 -24785 -10344
2797a0344L4983j1358l5438O993L6515l619l6507k97L6376L846l5761p231L5041
$$ -10344 24639 13281 -22157 -15164 21351 17732 -18775 -19072 17304 21150 -14611 -21842 13199
2810A3199J0917l3965j4622L2798J7469l0823k0583K8657K3502k6198k6221K3357
$$ 13199 24116 -9849 -24471 8327 25796 -5027 -25610 3047 26549 351 -25870 -2513
2822b513K8598k0875l0367J7874L2240j5016l3085J1138L4371p964l5146M135
$$ -2513 26085 5210 -25157 -7283 24957 9941 -23144 -12006 22365 14401 -20745 -16610
2834a6610L5946q81l5774k478L5056O589l5033r736L3994J2466l1845j6088L0158
$$ -16610 19336 18455 -17319 -19797 15259 21848 -13185 -22921 11073 23539 -8306 -24394 5764
2847E764J9502k8718k2162K6438K4552k3678k7234K1195K9340j8295l1068J5230
$$ 5764 25266 -3452 -25614 824 25376 1698 -25536 -4341 24999 6704 -24364 -9134
2859i134L2223j1622l3750Q782L3813n106l4462J626L4575J603l4236n459L4180
$$ -9134 23089 11467 -22283 -13501 20312 15206 -19256 -17630 16945 18548 -15688 -21147 13033
2872A3033Q462l3004j1762L2065J5040l0122j8674K8469K1287k6462k3667K4010
$$ 13033 21495 -11509 -23271 8794 23834 -6288 -24962 3507 24794 -1668 -25335 -1325
2884a325K6123k1325k8168J8550K9569j5150l1523J2683L2290r254l3234N722
$$ -1325 24798 3473 -24695 -6145 23424 8274 -23249 -10566 21724 12470 -20764 -15042
2896a5042L4064k302l4199j126L4227M485l3410p917L2609J1032l1479j4246L0000
$$ -15042 19022 16720 -17479 -18605 15622 20107 -13303 -21220 11389 22421 -9058 -23304 6696
2909F696J7473k8193k0270K6010K3120k4029k4890K1270K7107j8955k8695J5646
$$ 6696 24169 -4024 -24294 1716 24836 807 -24083 -2813 24294 5339 -23356 -7710
2921g710L0371j2612l1498R629L2685o460l3206K930L3352M53l3400l642L3068
$$ -7710 22661 10049 -21449 -11820 20865 14405 -18801 -15871 17481 17934 -15466 -19108 13960
2934A3960O781l1839j0361L1238J3076k9704j6351K7813J9782k6439k1704K3779
$$ 13960 20741 -11098 -21459 9779 22855 -6849 -23200 4613 24395 -2044 -23748 31
2946C1K4278k1440k6466J9113K7782j5615k9883J2899L1150j0022l2194O855L2623
$$ 31 24309 2869 -23597 -4484 23298 7683 -22200 -9301 21849 11827 -20367 -13512 19111
2959A9111l094l3504K65L2829L496l2904o465L2097R386l0546j3193K9715J5427
$$ 19111 16017 -17487 -17222 15607 19103 -13801 -20266 11831 21217 -9329 -22522 7193 22620
2972B2620k7563j8529K6169K1277k4225k3459K1132K5801j8852k7345J6191K8885
$$ 22620 -4943 -23472 2697 23974 -251 -23710 -2578 23223 4371 -22974 -6783 22102
2984B2102j3110l0163R849L1252o947l2143L848L2343k51l2222l403L2602N882
$$ 22102 8992 -21171 -11322 19930 12983 -19160 -15312 17031 16780 -15442 -18845 13757 19639
2997A9639l1410r528L0570J2438k9406j5203K7697J7871k5787k0267K3646K2816
$$ 19639 -11771 -21299 9271 21709 -7697 -22900 4797 22668 -3119 -23386 260 23076
3009B3076k1708k4779J8851K6791j5825k8907J3888K9612j0506l0338O885L1629
$$ 23076 1368 -23411 -4560 22231 6406 -22501 -8613 20999 10493 -19845 -12960 18669
3021A8669l783l2358R42L2034K445l1532n691L0576R052l0030j1931K9131J4659
$$ 18669 14886 -17472 -16530 15504 17949 -13583 -19274 11302 20354 -9676 -21607 7524 22183
3034B2183k7385j7074K5290J9635k3301k2356K1410K4259j8714k6166J6023K7918
$$ 22183 -5202 -22276 3014 22649 -652 -23008 -1598 22661 3947 -22219 -6196 21722
3046B1722j3177k9130J0559K9861p140l0886M327L1004r04l1290j688L0483N265
$$ 21722 8545 -20585 -10026 19835 12695 -18191 -13864 17140 16236 -15054 -16742 13741 19006
3059A9006l0540q286K9709J1398k8492j4299K6924J7163k5284j9259K2848K1756
$$ 19006 -11534 -19820 9889 21287 -7205 -21504 5420 22583 -2701 -21960 888 22644
3071B2644k0947k3649J8234K5658j5638k7134J3118K8198j0231k9474P177L0380
$$ 22644 1697 -21952 -3718 21940 6302 -20832 -7714 20484 10253 -19221 -12044 18336
3083A8336m229l0245N86L0424K289l0398m796K9374Q053k8649j1164K7857J3697
$$ 18336 14107 -16138 -15552 14872 17161 -13237 -18033 11341 19394 -9255 -20419 7438 21135
3096B1135k6098j6669K4482J8736k2376k1228K0367K3362j8271k4773J5679K5999
$$ 21135 -4963 -21632 2850 21586 -790 -22018 -1651 21711 3440 -21333 -5654 20345
3108B0345j2345k7814R770K8664p494k8916M230K9352q10k9689j771K9326M630
$$ 20345 8000 -19814 -10044 18620 11126 -17790 -13560 15792 14982 -14707 -16478 12848 17478
3121A7478k8945p597K8159J0010k6493j3309K5497J5989k4122j8246K2157K0267
$$ 17478 -11467 -19064 9095 19105 -7388 -20697 4800 20789 -3333 -21579 578 20845
3133B0845j9829k2323J7612K4146j5196k5592J2674K6642r797k7615P208K8208
$$ 20845 1016 -21307 -3695 20451 5255 -20337 -7663 18979 9182 -18433 -11225 16983
3145A6983m225k8582J165K8713J770k8259n017K8303P543k7269j0325K6242J2729
$$ 16983 12758 -15824 -14659 14054 15824 -12435 -17452 10851 18394 -8875 -19200 7042 19771
3158A9771k4928j5179K3080J7914k1527j9709J9295K1705j7032k3345J4653K4511
$$ 19771 -5157 -20336 2744 20658 -869 -20578 -1283 20422 3390 -19955 -5302 19209
3170A9209j1952k5955R886K6798o965k7281L869K8036j377k8028j310K7744L872
$$ 19209 7257 -18698 -8812 17986 11021 -16260 -12391 15645 14268 -13760 -15070 12674 16546
3183A6546k7072o946K6391R695k5160j2305K3941J4715k2636j6969K0983J9169
$$ 16546 -10526 -17472 8919 18614 -6546 -18851 5090 19805 -2831 -19800 1183 20352
3195B0352j8939k0954J6553K2498j4445k3739J2217K4799r445k5780O617K6671
$$ 20352 1413 -19541 -2988 19510 5065 -18674 -6457 18342 8897 -16883 -10266 16405
3207A6405m253k6627J324K6754J332k6477m450K6539O227k5311q783K4173J1477
$$ 16405 12152 -14475 -13151 13603 14935 -11542 -15992 10547 16774 -8537 -17320 6853 18330
3220A8330k3417j3869K2049J5908j9981j8085J8315J9753j6282k1339J3940K2706
$$ 18330 -5087 -18956 3093 19001 -980 -19065 -750 19003 2721 -18618 -4678 18028
3232A8028j1627k4160R253K4931o781k5388M405K5520j687k5545j405K6119L296
$$ 18028 6401 -17759 -8506 16425 9644 -15744 -11339 14181 12494 -13051 -14456 11663 14959
3245A4959k5280n878K4260Q764k3627j1046K2285J3135k0651j5421J9624J6956
$$ 14959 -10321 -16199 8061 16825 -6802 -17848 4437 17572 -3079 -18500 1124 18080
3257A8080j7601j8779J5786K0561j3833k1763J1153K2974r008k3685O548K4511
$$ 18080 479 -18300 -2514 18047 4214 -17549 -6396 16578 7570 -16115 -9567 14944
3269A4944m007k5077J888K4844P14k4707l473K4419N691k3441p998K2755J0367
$$ 14944 10937 -14140 -12252 12592 13306 -11401 -14874 9545 15236 -8205 -16203 6552 16919
3282A6919k1937j2479K0297J4664j8851j6523J7529J8017j5668j9240J3156K1031
$$ 16919 -5018 -17497 2800 17464 -1387 -17910 -381 17636 1968 -17272 -4116 16915
3294A6915j1335k1678Q943K2952o920k3680M385K4188k040k4113n14K4167K479
$$ 16915 5580 -16098 -7155 15797 8877 -14803 -10418 13770 11730 -12383 -12897 11270 13749
3307A3749k3193n286K3047P504k2469r696K1422J2009k0039j3667J8329J5505
$$ 13749 -9444 -14730 8317 15821 -6648 -16344 5078 17087 -2952 -16619 1710 17215
3319A7215j6922j6904J4957J8850j3536j9554J0935K0768q876k2248P072K2934
$$ 17215 293 -16611 -1654 17196 3660 -15894 -4959 15809 6933 -15315 -8243 14691
3331A4691m966k2928K192K3483L5k3319k202K2560N000k2605o452K1171Q660k0330
$$ 14691 9725 -13203 -11011 12472 12507 -10812 -13014 9546 14546 -8059 -14511 6660 15320 -5010
3345e010j0986J9529J3297j8826j4622J6819J6332j4922j7858J3139J8468j0795
$$ -5010 -15996 3533 16830 -1996 -16618 201 16533 1611 -16247 -3108 15360 4565
3357D565j9722R199K0792p335k1509M728K1903k816k1710J78K2546J585k2099
$$ 4565 -15157 -5958 14834 7499 -14010 -9282 12621 9805 -11905 -11727 10819 12404 -9695
3370i695l854K1243O294k1009p739K0012J0008j9321j1927J7953J3806j6560j5438
$$ -9695 -13549 7694 13988 -7021 -14760 5252 15260 -4061 -15988 1965 15771 -789 -16227
3383a6227J5226J6549j3381j7696J1315J9240r445k0274P417K0841n303k1272
$$ -16227 -1001 15548 2167 -15529 -4214 15026 5581 -14693 -7276 13565 8262 -13010
3395a3010K989K1872j346k1305j047K1286L263k1153n158K0503P088j9629r093
$$ -13010 -10021 11851 10505 -10800 -11847 9439 12702 -8451 -13609 6894 13982 -5647 -14740
3408a4740J8811J1043j7755j2608J5932J4925j4935j5929J3125J7151j1302j8440
$$ -14740 4071 15114 -2641 -15249 683 15608 673 -15256 -2131 15020 3718 -14722
3420a4722J0041J8964p868j9972O055K0524l804k1059J817K0946M60k0864k673
$$ -14722 -4681 14283 6415 -13557 -7502 13022 9218 -11841 -10024 10922 11382 -9482 -12155
3433a2155K0844M595k0132o560J9371Q351j8484j0369J7684J1933j6206j3529
$$ -12155 8689 13284 -6848 -13408 5963 14314 -4170 -14539 3145 15078 -1128 -14657
3445a4657J4677J5034j3347j6358J1772J7604r787j8711Q097J9234o175j9837
$$ -14657 20 15054 1707 -14651 -2879 14725 4938 -13773 -5676 13558 7383 -12454
3457a2454M210K0214k486j9988n9K0817J883k0456l771J9456N851j9500p394J8455
$$ -12454 -8244 11970 9484 -10504 -10563 10254 12137 -8319 -12090 7366 13217 -6283 -13677 4778
3471D778R426j7560j1017J6193J3011j5120j4063J2997J5670j1736j7055J0699
$$ 4778 14204 -3356 -14373 1820 14831 -289 -14352 -1355 14315 2579 -14476 -3777
3483c777J7743q479j8890O715J9234m711j9843L133J9645q69j9513j766K0231
$$ -3777 13966 5487 -13403 -6688 12546 7835 -12008 -8875 10770 9901 -9612 -11378 8853
3496H853K745j8977n552J9098O906j8356q690J7556J0459j6367j2059J4890J3960
$$ 8853 11598 -7379 -12931 6167 13073 -5283 -13973 3583 14042 -2325 -14384 506 14466
3509A4466j3822j4841J1895J6234j0758j7024Q675J8358p219j8608M901J9347
$$ 14466 644 -14197 -2302 13932 3174 -13850 -5175 13183 5964 -12644 -7743 11604
3521A1604k967j9685J036J9461J116j9711k517J9354M371j8797o160J7932Q449
$$ 11604 8637 -11048 -10012 9449 10565 -9146 -11663 7691 12062 -6735 -12895 5037 13486
3534A3486j7413j0018J6473J1684j5485j3197J4063J4482j2437j5645J0741J6750
$$ 13486 -3927 -13945 2528 14212 -1273 -14470 -407 14075 1638 -14007 -3266 13484
3546A3484q818j7288O871J8096n264j8823L729J9142j626j9588l66J9409K381
$$ 13484 4666 -12622 -5751 12345 7081 -11742 -8013 11129 9503 -10085 -10451 8958 11339
3559A1339j8950m450J8848O173j8376p650J7122R747j6313j1138J5353J2430j3993
$$ 11339 -7611 -12061 6787 12960 -5416 -13066 4056 13803 -2510 -13648 1705 14135 142
3572A42j3765J2473J5062j1019j5952Q942J7194p407j8013N635J8790l937j8912
$$ 142 -13623 -1150 13912 2893 -13059 -4117 13077 5670 -12343 -6708 12082 8145 -10767
3585a0767J912J9074Jj9028k002J8846L828j8391n680J7785P582j7437q902J6223
$$ -10767 -8855 10219 10220 -8808 -10810 8036 11864 -6527 -12207 5578 13160 -4277 -13179 3044
3599C044J0502j5096j2558J4606J3148j2285j4818J0929J5959r477j6708P737
$$ 3044 13546 -1550 -14108 498 13646 1361 -13457 -2528 13431 3954 -12754 -5017
3611e017J7364n899j8272M204J8670k096j9183M56J8974J258j8327l727J8499
$$ -5017 12347 6448 -11824 -7620 11050 8954 -10229 -9773 9201 10459 -7868 -11595 6904
3624F904N117j7464p194J6658Q932j6307j0130J4949J1763j3532j3702J2567J4516
$$ 6904 12021 -5443 -12637 4021 12953 -3354 -13484 1465 13228 -304 -14006 -1439 13077
3637A3077j0883j5554R566J6122p582j7280N812J7954l850j8406K215J8573o46
$$ 13077 2194 -13360 -3794 12328 4746 -12534 -6722 11232 7382 -11024 -8809 9764 9118
3650I118j8063j762J8644K856j7832n172J7542P196j6814q473J5632J0440j5413
$$ 9118 -8945 -10707 7937 10793 -7039 -12211 5331 12527 -4287 -12760 2872 13312 -2101
3663b101j1145J3930J2407j2196j4124J1050J5184r412j6130P566J7170o421j7275
$$ -2101 -13246 684 13091 895 -13229 -2179 13005 3593 -12537 -4971 12199 5778 -11497
3676a1497M403J7982k413j8491R02J8225J225j8127l143J7802M755j7123o613
$$ -11497 -7094 10888 8475 -10016 -9114 9111 10336 -7791 -10934 6868 11623 -5500 -12113
3689a2113J6577Q030j5649r651J4995J0911j3425j2455J1954J3825j0878j4733
$$ -12113 4464 12494 -3155 -12806 2189 13100 -325 -12780 -826 12999 2121 -12612
3701a2612R559J5531p736j6304N762J7094m548j7360K813J7856p92j8126o48J7379
$$ -12612 -3053 12478 4742 -11562 -5800 11294 6746 -10614 -7801 10055 9263 -8863 -9511 7868
3715G868K854j7559m431J7117O196j6374p932J5620R404j4621j0667J3364J2065
$$ 7868 10722 -6837 -11268 5849 12045 -4329 -12261 3359 12763 -1858 -12525 839 12904
3728A2904j2149j3114J0337J4739r443j5299P612J6107o271j6669M629J6785k375
$$ 12904 755 -12359 -2022 12717 3274 -12025 -4413 11694 5423 -11246 -6617 10168 7793
3741G793j7544J001J7330R24j7427k422J7157L853j6347o065J6233P260j4945
$$ 7793 -9751 -8750 8580 9504 -7923 -10345 6812 10665 -5682 -11747 4486 11746 -3199
3754c199r398J4418J0190j2978j1589J1738J3247j0624j4090R011J5256p762j6011
$$ -3199 -12597 1821 12011 -967 -12556 -818 12429 1805 -12285 -3274 11982 4220 -11791
3767a1791O198J6327m515j6402K729J6613p26j7175l23J6513K265j6474l808J5618
$$ -11791 -5593 10734 6219 -10183 -7454 9159 8433 -8742 -9065 7448 9713 -6761 -10569 5049
3781E049O081j5519p230J4831Q551j3743j0003J2706J1307j1804j2534J0716J3204
$$ 5049 11130 -4389 -11619 3212 11763 -1980 -11983 723 12030 226 -12308 -1592 11612
3794A1612q913j4321P886J5088o082j5982M276J6460k821j6518J379J6268O27
$$ 11612 2699 -11622 -3736 11352 5270 -10712 -6436 10024 7203 -9315 -7936 8332 8959
3807H959j6123k378J5880L785j5554n257J4865P196j4252q672J3943R507j2945
$$ 8959 -7164 -9542 6338 10123 -5431 -10688 4177 11373 -2879 -11551 2392 11899 -1046
3820a046j0313J1347J1935j0207j3070Q887J3952p832j4216N700J5128m065j5997
$$ -1046 -11359 -12 11923 1716 -11354 -2467 11485 3653 -10563 -4863 10265 6200 -9797
3833i797L116J6091j583j5588r38J6204J778j5353l706J5256M880j4495o277J3558
$$ -9797 -6681 9410 7827 -7761 -8699 7505 9283 -6070 -9776 5480 10360 -4135 -10412 3146
3847C146Q092j3261r130J2234J0293j1074j1449J0017J2376q853j3097P084J4334
$$ 3146 11238 -2023 -11153 1081 11374 300 -11149 -1132 11244 2391 -10706 -3622 10712
3860A0712o213j4444M541J4938l245j5079J509J5128M79j5733j561J5122L364
$$ 10712 4499 -9945 -5404 9534 6289 -8790 -7281 7847 8326 -7407 -8968 6154 9518
3873I518j4666n032J4386O165j3827p322J3235Q289j2012r924J1261J0622r540
$$ 9518 -5148 -10180 4206 10371 -3456 -10778 2457 10746 -1266 -11190 71 10693 1153
3886A153j2107Q883J2475p324j3540N615J4449m806j4582L576J4679j828j4641
$$ 1153 -10954 -2071 10404 3080 -10460 -4845 9604 4798 -9784 -6208 8471 6643 -7998
3899g998Q9J4705J438j4535k722J4564M194j4166n641J3584O558j2608p871J1660
$$ -7998 -7909 6796 8234 -6301 -9023 5541 9735 -4431 -10072 3512 10070 -2538 -10409 1251
3913A251R282j0934j0430R802J1557q687j2311P433J2899o256j3373N254J3728
$$ 1251 10533 -401 -10831 -1029 10528 1841 -10470 -3037 9862 3606 -9767 -4513 9215
3926I215l883j4396K729J4367o54j4609o99J4350K294j3954l927J3556N519j3083
$$ 9215 5332 -9064 -6335 8032 7378 -7231 -7930 6420 8714 -5240 -9167 4389 9908 -3175
3940c175o580J2326P736j1755q591J0658R631r607j0933Q755J1682p463j2216
$$ -3175 -9755 2571 10307 -1448 -10039 619 10250 643 -10290 -1535 10147 2684 -9532
3953i532O169J3035n063j3338L685J3869k822j3465Q91J3759O61j4096j589J3753
$$ -9532 -3363 9672 4609 -8729 -5044 8825 6003 -7462 -6571 7188 7849 -6247 -7836 5917
3967E917L139j3533m568J3045N904j2740o916J1483P943j0591r101R982J0049
$$ 5917 9056 -4477 -9045 4000 9904 -2836 -9752 1731 9674 -917 -10018 -36 10013
3980A0013q716j1178Q111J1501o700j2308N436J2733l775j3290K352J3542j468
$$ 10013 1297 -9881 -1770 9731 3031 -9277 -3841 8892 5117 -8173 -5821 7721 6253
3993F253j3591L13J3513R55j3211k530J3209L641j2094n646J2083O537j1599p408
$$ 6253 -7338 -7025 6488 7443 -5768 -8298 4911 8552 -3542 -9188 2895 9432 -2167 -9575
4007i575J0758Q353j0129r050Q622J0498p867j0913O540J1825n565j2376M673
$$ -9575 1183 9536 -593 -9643 -1021 9477 1610 -9303 -2763 9062 3497 -8879 -4206
4020d206J2191l000j2923J820J2867j69j3081q39J2752K116j2479l625J2339N041
$$ -4206 7985 4985 -7938 -6118 6749 6580 -6501 -7340 5412 7528 -4951 -8576 3763 8804
4034H804j2302n710J1554O897j0579q221R925Q901q900r790P833J1005o928j1657
$$ 8804 -3498 -9208 2346 9243 -1336 -9557 368 9269 369 -9421 -1588 9417 2489 -9168
4048i168N932J1999m625j2709L824J2506k205j2655N93J2954L72j2525j931J2756
$$ -9168 -3236 8763 4138 -8571 -4747 7759 5554 -7101 -6508 6446 6818 -5707 -7638 5118
4062E118K809j2352m102J2175N204j1375o509J0969P480j0396q047Q997R338q085
$$ 5118 7927 -4425 -8527 3648 8852 -2523 -9032 1937 9417 -979 -9026 -29 9309 1224
4076A224j0135P108J0934n950j2061N220J2092l692j2490K564J2497j099j2969
$$ 1224 -8911 -1803 9131 3181 -8880 -3660 8432 4740 -7750 -5186 7311 6212 -6757
4089f757K49J2762J152j2720k103J2007L574j1852m951J1575N988j0986o639J0324
$$ -6757 -6508 6254 7406 -5314 -7417 4590 8164 -3688 -8639 2936 8924 -2062 -8701 1623
4103A623P399r246q771Q425R637p495j0449O470J0799m896j1949M501J2023l231
$$ 1623 9022 -224 -8995 -570 9067 1572 -8877 -2407 8392 3496 -8453 -3952 8071 4840
4117D840j2351K054J2296n62j2342p50J2520J728j2263k988J1723M310j1380n566
$$ 4840 -7511 -5457 6839 6277 -6065 -6815 5705 7433 -4830 -7818 3905 8215 -3165 -8731
4131h731J0806O518j0108p744R852Q509q959r175P657J0218o873j0647N767J1236
$$ -8731 2075 8593 -1515 -9259 593 9102 143 -9032 -1375 8843 1970 -8677 -2910 8326
4145H326m630j1678L594J1907k339j2415J398J2010N68j2530j579J2258L041j2138
$$ 8326 3696 -7982 -4388 7519 5180 -7235 -5837 6173 6741 -5789 -7368 4890 7931 -4207
4159d207m132J1589N209j0857o499J0514P283j0183p855Q986Q832p831r691O865
$$ -4207 -8339 3250 8459 -2398 -8897 1617 8900 -1283 -9138 -152 8680 849 -8842 -1977
4173a977J0363n619j1367N127J1568l735j1820K238J2164j037j2388K0J2358J168
$$ -1977 8386 2767 -8600 -3473 8095 4360 -7460 -5222 6942 5905 -6483 -6463 5895 7063
4187G063j2006k537J1898L666j1673m675J1224N553j0411o794R752P938r267q479
$$ 7063 -4943 -7480 4418 8084 -3589 -8264 2960 8513 -1898 -8692 1060 8998 -269 -8748
4201h748Q135R589p100j0444O230J0949n417j1114M033J1805l071j1959J249J2437
$$ -8748 -613 8976 1876 -8568 -2338 8611 3194 -7920 -3887 7918 4847 -7112 -5863 6574
4215F574k16j2287p52J1879K326j1745l291J1429M047j0771n859J0919O516r739
$$ 6574 6358 -5929 -6681 5198 7524 -4221 -7512 3917 7964 -2807 -8666 2253 8769 -970
4229i70p643Q743Q726q176r333P122J0129o151j0757N110J1325m413j1616L193
$$ -970 -8613 130 8856 680 -8653 -1531 8598 2447 -8310 -3200 8125 3712 -7904 -4711
4243d711J1683j460j1802J95J2133P71j2004j995J1658L035j1361m099J0768N546
$$ -4711 6972 5512 -6290 -6095 6038 6809 -5195 -7190 4468 7503 -3858 -7957 2811 8357
4257H357j0525o060R507P350r117q163Q150R100p226r859O240J0472n451j0839
$$ 8357 -2168 -8228 1279 8629 -488 -8651 -501 8599 1373 -8486 -2246 8226 2775 -8064
4271h064M010J1445k877j2215K420J1893o41j1994n85J2226J430j1803k896J1411
$$ -8064 -4054 7391 4514 -7701 -5281 6612 5971 -6023 -6608 5618 7048 -4755 -7651 3760
4285C760M200j1417n335J1207N892r650p311Q758Q285q463q489P346R796o393
$$ 3760 7960 -3457 -8792 2415 8307 -1343 -8654 104 8389 -74 -8563 -1217 8579 2186
4299B186j0355N392J0501m040j1461L573J1252j946j1946J010J2248k29j1510
$$ 2186 -8169 -2777 7724 3684 -7777 -4204 7048 5102 -6844 -5834 6414 6185 -5325
4312e325j630J1499K793j1248l908J0857N046j0407n789R868O358q961p340Q173
$$ -5325 -6955 4544 7337 -3911 -7819 3038 8084 -2323 -8112 1756 8114 -847 -8187 -14
4326a4Q654p513r074O040J0234n736j0459M465J0810l048j1357J867J1838j031
$$ -14 8640 1127 -7947 -1907 8327 2591 -7868 -3403 7407 4359 -6998 -5131 6707 5676
4340E676j1588l54J1595J346j1371k361J1049L757j1187m292J0216N667r686o379
$$ 5676 -5912 -6266 5329 6675 -4696 -7057 3992 7749 -3438 -7730 2486 8153 -1533 -7912
4354g912Q704P824q572q047P013R159o367r834N224J0745m263j0797L292J0962
$$ -7912 792 8616 44 -8003 -990 8169 1802 -8032 -2808 7937 3674 -7123 -3831 7131
4368G131k314j1457Q92J1768J30j1272j355J1092K420j1092l308J0634M325r987
$$ 7131 4817 -6640 -5748 6020 6150 -5122 -6477 4615 7035 -4057 -7365 3269 7594 -2393
4382b393n398R216O376q669p146P850Q130p123r119O535R194n114r963M323J0188
$$ -2393 -7791 1425 7801 -868 -8014 -164 7966 843 -8276 -1741 7453 2339 -7624 -3301 6887
4397F887l054j0737K089J1125j257j1020j04J1198P31j0313k312J0612L085r927
$$ 6887 3833 -6904 -4815 6310 5053 -5967 -6071 5127 5858 -4455 -6767 3845 6930 -2997
4411b997m342R687N475r382o336Q610P157p930p511O868Q592o506q732M930R882
$$ -2997 -7339 2348 7823 -1559 -7895 715 7872 -58 -7569 -701 7891 1385 -7347 -2417 7465
4426G465m490j0097L379J0308k287j0720J437J0448L81j0838j341J0876K005j0438
$$ 7465 2975 -7122 -3743 6565 4278 -6442 -5005 5443 5824 -5014 -6355 4521 6526 -3912
4440c912k935R999M167r826m936R118O079q846o555P701P771p063q390O595Q554
$$ -3912 -6847 3152 7319 -2507 -7443 1675 7754 -1092 -7647 54 7825 762 -7628 -1033 7521
4455G521n586q951M351R614l198j0149K170J0346j253j0450K61J0923J75j0460
$$ 7521 1935 -7016 -2665 6949 3751 -6398 -4228 6118 4865 -5585 -5324 5599 5774 -4686
4469d686j768J0364L123r940l866R172M718q794n465Q207O568p933o990O934P759
$$ -4686 -6454 3910 7033 -2907 -6773 2399 7117 -1677 -7142 1065 7633 -300 -7290 -356 7403
4484G403o271q158N243Q980m424r507L612R588k306j0223J667R904n35j0083l97
$$ 7403 1132 -7026 -1783 7197 2773 -6734 -3122 6466 4160 -6063 -4396 5508 4973 -5110 -5507
4499e507J0091J570r633k799R322L403r128m397Q786N279q348n677P460O883p116
$$ -5507 4584 6154 -3479 -6278 3044 6447 -2681 -7078 1708 6987 -1361 -7038 422 7305 189
4514A89p383O138Q033n552q414M520R014l869r107K763R391j339r901O19R936
$$ 189 -7194 -1056 6977 1425 -6989 -2469 6545 2676 -6431 -3668 5723 4384 -5517 -4898 5038
4529E038j16r328j068R482K145r806k778R070L925q667m937Q201N827q011o241
$$ 5038 4922 -4406 -5474 4008 6153 -3653 -6431 2639 6564 -2103 -7040 1161 6988 -1023 -7264
4544g264P380O700o297p263N140Q338m750q456L495R086k588r698K099R387j058
$$ -7264 116 6816 519 -6744 -1604 6734 1984 -6472 -2977 6109 3521 -6177 -4078 5309 4251
4559D251r185j07R596N72r294j658R425K658r102l641Q721M270q324m895P652
$$ 4251 -4934 -5041 4555 5127 -4167 -5825 3600 6258 -2844 -6485 2236 6506 -1818 -6713 939
4574I39N977p266o376O026P387n495p915N104Q174m253q385L141Q648k000r129
$$ 939 6916 -350 -6726 -700 6687 1192 -6723 -1619 6555 2302 -6083 -2942 5706 3706 -5423
4589e423J304R124k3r442m74Q842J625q936k271Q618K920q250l694P841N127p868
$$ -5423 -4119 5005 4982 -4460 -4934 3908 5533 -3403 -5674 2944 5864 -2386 -6080 1761 6888 -980
4605i80n441P067N754o117o659N678P348m723q306M614P977l059q908K350R079
$$ -980 -6421 646 6400 283 -6376 -698 6650 1927 -6379 -1765 6212 3153 -5755 -3405 5674
4620E674j878q935Q28R042L5q836r46Q937J724q716k804Q364L643q039m200P411
$$ 5674 3796 -5139 -4311 4731 4766 -4070 -5016 3921 5645 -3071 -5875 2489 6132 -1907 -6107 1304
4636A304M790o459o215O708O306n955p049N033P780m456p759L389Q288k689q525
$$ 1304 6094 -365 -6580 128 6434 479 -6570 -1537 6243 1787 -5972 -2583 5705 3016 -5509
4651e509J726Q852j094q954K84Q866P98q854j455Q711K243q411l399Q267L973
$$ -5509 -3783 5069 3975 -4979 -4695 4171 4969 -3885 -5340 3371 5614 -2797 -6196 2071 6044
4666F044p614m530O713N648o406o108N840O532n083p248M463P565l894p639K861
$$ 6044 -1570 -6100 613 6261 -145 -6253 -413 6119 1036 -6212 -1749 5816 1922 -5717 -2856
4681b856Q405k159q519R01Q969n34q518j90Q193J512q648k088Q280K985q182l519
$$ -2856 5549 3390 -5129 -4228 4741 4207 -4311 -4501 3692 5204 -3444 -5532 2748 5733 -2449 -5968
4697e968P629M075o769m920O224O097o179o243N458O903m883p332M216P447l114
$$ -5968 1661 5736 -1033 -5953 271 6368 189 -6054 -596 6307 1424 -5908 -1692 5755 2641
4712B641q254K756Q150j657q301O94Q597rq331j300Q371K014q378k484Q211L078
$$ 2641 -5613 -2857 5293 3636 -4665 -3971 4626 4617 -3714 -5014 3357 5371 -3007 -5491 2720 5798
4728E798p413m071O942N018o975n219O174O277n917o804M843P317l728q101L522
$$ 5798 -1615 -5686 1256 6274 -701 -5920 254 6531 614 -6190 -1347 5970 2242 -5859 -2337
4743b337Q125l015p879J812Q369r68q609K55Q393N76q244j583Q048K513q107k912
$$ -2337 5788 2773 -5106 -3294 5075 4107 -4502 -4247 4146 4722 -3522 -5105 2943 5456 -2651 -5563
4759e563P489L864p232m558O846N437o186o311N853O613n124p211M500P364l597
$$ -5563 1926 5790 -1442 -6000 846 6283 97 -6214 -361 6252 1128 -6083 -1583 5781 2184
4774B184p651K371Q482j970q677J321Q518k62q540n49Q418J151q299k191Q252
$$ 2184 -5467 -3096 5386 3416 -5261 -3940 4578 4316 -4224 -4773 3645 4796 -3503 -5694 2558
4789B558K765p397l696P294M281o579n346O626N376n643o316M915O936m406p274
$$ 2558 5323 -2074 -5770 1524 5805 -774 -6120 506 5882 239 -6077 -1162 5774 1368 -5906
4804e906L600P959l292p691K065Q406j487q317M45Q234M33p714j970Q727J805
$$ -5906 -2306 5653 2361 -5330 -3265 5141 3654 -4663 -4218 4016 4449 -3265 -5235 3492 5297
4819E297q015k621P549L494p261m336O698N221o648n392N711O319n305o624M865
$$ 5297 -2718 -5339 2210 5704 -1557 -5893 805 6026 -622 -6014 -303 6016 711 -5913 -1048
4834a048O853m086p272L121P830k044q332J628Q375p57q345l50Q045J372q253
$$ -1048 5805 1719 -5553 -2432 5398 3354 -4978 -3350 5025 4268 -4077 -4427 3618 4990 -3263
4849c263j776P991K494p503l531P538L812o712n002O492N413n787o218N347O813
$$ -3263 -5039 2952 5446 -2057 -5588 1950 5762 -950 -5952 540 5953 166 -6052 -705 6108
4864F108m936o907L797P769l197p967K195Q039j343q056N60Q236L42q610p84Q237
$$ 6108 1172 -5735 -1938 5831 2634 -5333 -3138 4901 3558 -4498 -3938 4298 4640 -3970 -4754 3483
4880C483J606p932k536P784L068p222m186P036N035o973n337O401N667n275o334
$$ 3483 5089 -2843 -5379 2405 5473 -1749 -5935 1101 6136 -837 -6174 227 5894 619 -5715
4895e715M503P261m433p346L445P565k612p415J359P869o04q409Q8Q160J019q068
$$ -5715 -1212 6049 1616 -5730 -2285 5280 2668 -4747 -3388 4481 3877 -4532 -4444 3716 4735 -3333
4911c333j479P915K153p873l020P545L521p019m232O451N058o035n654N462O346
$$ -3333 -4812 3103 5256 -2617 -5637 1908 5429 -1590 -5822 629 5687 -348 -6002 -540 5806
4926E806m771o915L985P256l363p430K874P528j956p856J100P882M4q129l58P961
$$ 5806 1035 -5880 -1895 5361 1998 -5432 -2558 4970 3014 -4842 -3742 4140 4184 -3945 -4303 3658
4942C658J149p602k223P617K938p589l551O920M701o717n341O173N794n601o026
$$ 3658 4807 -2795 -5018 2599 5537 -2052 -5603 1317 6018 -699 -6040 133 5927 326 -5700
4957e700M919O481m493o260L129P081k650p329J771P464r70p792M42P658O60p698
$$ -5700 -781 5700 1207 -5053 -1924 5157 2507 -4822 -3051 4413 3443 -4349 -3907 3751 4411 -3287
4973c287j385Q008J778p533k913P399L371o776m160O435M679n890n057N255N876
$$ -3287 -4672 3336 5114 -2419 -5332 2067 5438 -1338 -5498 937 5616 -274 -5331 -76 5800
4988E800m597o597M185O663l369p196K454P511j761p959J343Q157p06q094J34
$$ 5800 1203 -5394 -1209 5454 2085 -5111 -2657 4854 3093 -4866 -3523 4634 3928 -4166 -4032
5003d032P656R66p404k050P315K710p211l400O734L990o129m854N854N484n195
$$ -4032 3624 4590 -2814 -4864 2451 5161 -2050 -5450 1284 5274 -855 -5709 145 5629 434
5018D34o337M951O284l939o839L686O916k790p276K046P544j572p055l0P797M63
$$ 434 -5903 -952 5332 1393 -5446 -1760 5156 2366 -4910 -2864 4680 3108 -3947 -3977 3820 4283
5034D283p981p86P076K442p559k440O677L249o843l739O741M408o100m673N032
$$ 4283 -3698 -4484 2592 5034 -2525 -4965 1712 4961 -1882 -5621 1120 5528 -572 -5245 -213
5049b13N729m957n887M253O484l580o890K802P290k542o971J503P296p12p364
$$ -213 5516 559 -5328 -1075 5409 1829 -5061 -2259 5031 2489 -4482 -2979 4317 3605 -3759
5064c759k95P309J060p343j513P088K375p052k720O372L667o133m400N867M993
$$ -3759 -4054 3255 4315 -3028 -4541 2547 4922 -2130 -4850 1522 5189 -944 -5344 523 5516
5079E516n344n285M682N645m058o279L628O439k619p374K471P381j602p304O24
$$ 5516 172 -5113 -431 5214 1156 -5123 -1495 4944 2325 -5049 -2578 4803 3201 -4103 -3479
5094c479P581k59p258n81P135J490o849k512P143K378o189l601O071M123n805
$$ -3479 4102 3843 -3415 -3996 3139 4629 -2220 -4732 2411 4789 -1400 -5001 1070 5193 -612
5109f12m079M820N454n166n793M452N854l392o450L149O556k572o432J229P062
$$ -612 -4691 129 5583 417 -5376 -924 4930 1538 -4912 -1763 4793 2221 -4211 -2982 4080
5124D080r75o861L3P435K39o741j494O908K091o941k355O150L679o320m092O003
$$ 4080 3105 -3756 -3723 3712 3951 -2790 -4284 2624 4715 -2226 -4581 1569 5248 -1072 -5164 839
5140H39M243n129n329N157N572m447n664L411O311l277o363K167O736j503o853
$$ 839 5082 -47 -5376 -219 5353 906 -4758 -1347 4964 1687 -4676 -2509 4227 2724 -4129
5155d129J151O685j63p026m77O929J287p111j560O282K770o317l087N955L568
$$ -4129 -2978 3707 3544 -3482 -3959 2970 4257 -2854 -4414 1868 4638 -1679 -4766 1189 4757
5170D757n830l882M921M732m499n049M307N428l390o617L144O602k838o177J552
$$ 4757 -1073 -4955 -34 4698 199 -4850 -543 4885 1495 -5122 -1978 4624 1786 -4391 -2839
5185b839O826q41o984L93O834K96o940q29O804J482o268k407O323L008o311l315
$$ -2839 3987 3146 -3838 -3445 3389 3685 -3255 -4084 2720 4202 -2066 -4473 1850 4858 -1453 -4768
5201d768N704L733n097m510M747N176m511n395L626N871k970o092K797O094j989
$$ -4768 936 4669 -428 -4938 -191 4985 474 -4921 -1295 4576 1606 -4486 -1689 4405 2416
5216B416o093J180O388p47o542n2O468R73o524j691O423K108o180k573O057L139
$$ 2416 -3677 -2497 3891 3144 -3398 -3450 3018 3991 -2533 -4224 2199 4307 -1873 -4446 1611 4750
5232D750n584l748N212M066m886m356M460M398l383n513L274N907k736o325K232
$$ 4750 -834 -4582 630 4696 -190 -4546 -86 4312 929 -4584 -1310 4597 1861 -4464 -2232
5247b232O353j386o412Q47O656m95o416q64O861R78o212j839O385K042n972k805
$$ -2232 4121 2735 -3677 -2830 3826 3331 -3085 -3949 2912 3890 -2322 -4161 2224 4266 -1706 -4511
5263d511N470L646n235l988M878M451m404n224M158N394l636n503K970N975k453
$$ -4511 959 4605 -630 -4618 260 4711 307 -4917 -759 4635 999 -4504 -1534 4441 1988
5278A988o051J473O535j167o359L41O379M80o451j102O443J327n678k630O035
$$ 1988 -4063 -2590 3945 2778 -3581 -3240 3139 3619 -2832 -3934 2509 3836 -1842 -4472 1563
5293A563K749n661l252N489L765m999m263M270M668l827m970L337N539k899n964
$$ 1563 4312 -1349 -4601 888 4653 -346 -4609 -339 4329 502 -4468 -1131 4408 1509 -4455
5308d455K455O328k259o025R48O710q65o090k09O538O67o419j107N759K220n951
$$ -4455 -2000 4328 2069 -3956 -3008 3702 2837 -3253 -3462 3076 3743 -2676 -3783 1976 4196 -1755
5324a755k664N815L287n413l954M862M479m559m918M444N038l698n375L159N569
$$ -1755 -4419 1396 4683 -730 -4684 178 4657 98 -4820 -376 4662 964 -4411 -1252 4317
5339D317k404n770J658O441j487o206M65O307j90o292l13O067R86n861j778N990
$$ 4317 1913 -3857 -2199 4242 2755 -3451 -2986 3321 3131 -3161 -3474 2593 3579 -2282 -4060 1930
5355A930K366n807k858N316L582m796m234M588M448m116m921L804N136l073n423
$$ 1930 4296 -1511 -4369 947 4529 -267 -4501 87 4535 419 -4502 -698 4438 1365 -4058
5370d058K766N462j982o000J319O381j109o214L40O386L30o151r28N839J553n875
$$ -4058 -1292 4170 2188 -3812 -2493 3888 2779 -3435 -3095 3291 3621 -2530 -3458 2381 3934 -1941
5386a941k463N910K733n317l390N181L929m981m429M337M800l751m950L298N081
$$ -1941 -4404 1506 4239 -1078 -4468 713 4642 -339 -4768 -431 4369 618 -4332 -1034 4047
5401D047k440n914K378O026j785n912N72O479n37o282L3O174Q47o154j561O260
$$ 4047 1607 -4307 -1929 4097 2312 -3600 -3028 3451 2914 -3368 -3335 2839 3686 -2468 -4029 2231
5417B231J971n651k920N600L290n125m082M936M262m176n250M110N132l194n441
$$ 2231 4202 -1449 -4369 1231 4521 -604 -4686 250 4512 336 -4914 -804 4328 1134 -4307
5432d307K928N608k138o171J551O254j083o144N32N971K56o444m79O028J251n742
$$ -4307 -1379 4229 2091 -4080 -2529 3725 2642 -3502 -2970 3001 3257 -3187 -3666 2362 3613 -2129
5448b129j894N882K360n428l129N251L751m862m039M185M633m007m811L538M949
$$ -2129 -4023 1859 4219 -1209 -4338 913 4664 -198 -4237 -52 4581 574 -4237 -699 4250
5463D250k511n891K231N771j752o033J234O317q08o049M2O194M89o077j526O271
$$ 4250 1739 -4152 -1921 3850 2098 -3935 -2701 3616 2808 -3241 -3199 2995 3484 -2593 -4119 2152
5479B152J997n820k548N305L489n116l723M471M331m091m969L947N057l358n187
$$ 2152 4149 -1671 -4219 1086 4575 -541 -4264 207 4538 447 -4522 -575 4482 1124 -4063
5494d063K973N165j955n944J730N849r66o026J75N998N15o359o46O243J097n897
$$ -4063 -1090 4075 2120 -3824 -2094 3755 2789 -3237 -3062 2936 3451 -2908 -3554 2689 3786 -2111
5510b111k003N745K530n683k980N078M005m969m342M653M271l646m963L305N332
$$ -2111 -4114 1631 4161 -1522 -4502 576 4581 -388 -4730 -77 4194 548 -4415 -1110 4222
5525D222k694n763K374N660j562o228J560O007m03o247q2N757N33n939o14N483
$$ 4222 1528 -4235 -1861 3799 2237 -3991 -2431 3576 3173 -3074 -3156 2601 3134 -2805 -3419 2064
5541B064J741n374k817N513K857n003l292M506M175m216m423L458N104l254n063
$$ 2064 3805 -1569 -4386 1127 3984 -1019 -4311 195 4370 154 -4269 -811 4293 1039 -4024
5556d024K403N539k114n749J892N603j095n847L48O182J01o101n96N800J060n461
$$ -4024 -1621 3918 1804 -3945 -2053 3550 2455 -3392 -3044 3138 3239 -2862 -3458 2342 3402 -2059
5572b059j917N556K625n446k789M881L614m875l914M101M662l965m562L389M729
$$ -2059 -3976 1580 4205 -1241 -4030 851 4465 -410 -4324 -223 4439 474 -4088 -699 4030
5587D030k692n612K432N885k168n435R11N945m84n867k27O043O32n989j075N770
$$ 4030 1338 -4274 -1842 4043 1875 -3560 -2649 3296 2812 -3055 -3282 2761 3393 -2596 -3671 2099
5603B099J816n744k048N137K999m972l127M149L898m027m535L840M689l013n331
$$ 2099 3915 -1829 -3877 1260 4259 -713 -3840 309 4207 180 -4355 -515 4174 1161 -4170
5618d170K868N091j888n629J716N483p32o054L25O100J80o043n69N870J009n284
$$ -4170 -1302 3789 1901 -3728 -2012 3471 2739 -3315 -2990 3110 3290 -2753 -3322 2548 3557 -1727
5634a727k177N691K216n117l127N172L217m445l962M384M194l852m515L034M873
$$ -1727 -3904 1787 4003 -1114 -4241 931 4148 -297 -4259 125 4319 467 -4048 -1014 3859
5649C859k664n185K275N581j707n653R49N665l08n567m24N901L16n440r77N368
$$ 3859 1195 -3990 -1715 3866 2159 -3494 -2545 3120 2812 -2755 -3179 2722 3038 -2402 -3379 1989
5665A989J738n459k075N037K555m644l111M212L792l970l783L448L954k707m576
$$ 1989 3727 -1732 -3807 1230 3785 -859 -3970 242 4034 64 -3719 -271 3683 976 -3600
5680c600K655M946k572n241J990N253j092n540N54N606L7n340q21N323R65n140
$$ -3600 -945 4001 1429 -3812 -1822 3431 2339 -3201 -2647 2959 2996 -2344 -3165 2158 3123 -2017
5696b017j431M965K047m638k871M733L081m556l139L854L911l720m264L196M854
$$ -2017 -3448 1517 3564 -1074 -3945 788 3869 -687 -3826 28 3939 219 -4045 -849 4005
5711D005k736m882K054N148j834n046J208N316o92n215N0N284K31n168p94N362
$$ 4005 1269 -3613 -1559 3589 1755 -3291 -2083 3233 2541 -2674 -2624 2660 2891 -2277 -3071 2291
5727B291J099m915j818M397K418m038l185M318L647m077l807L153M399l217m421
$$ 2291 3390 -1525 -3343 1054 3472 -566 -3751 567 4214 137 -3670 -517 3882 665 -3756
5742c756K627M813k154n002J831M946j236n047O26N182k16n245l6N259N77n001
$$ -3756 -1129 3684 1530 -3472 -1641 3305 2069 -2978 -2352 2830 2614 -2631 -2667 2592 3169 -1832
5758a832j660N206J861m849k052M376K741m109l762M244L672l738l813L359L972
$$ -1832 -3492 1714 3575 -1274 -3326 1050 3791 -318 -4080 164 3836 98 -3715 -356 3616
5773C616k724m381K529M258j394n215J515M831p05m977l1N087L79m972p94M972
$$ 3616 892 -3489 -960 3298 1904 -3311 -1796 3035 2330 -2647 -2678 2409 2788 -2184 -2978 1994
5789A994J106m937j759M984K211m608k643M060L278m103l707M089L549l013m114
$$ 1994 3100 -1837 -3596 1388 3599 -1009 -3652 408 3686 -417 -4124 -35 3514 501 -3613
5804c613K943L851j923m932J750N131j456m743P56M980m40m909l22N134Q24n099
$$ -3613 -670 3181 1258 -3674 -1924 3207 1751 -2992 -2236 2744 2304 -2605 -2927 2207 3031 -2068
5820b068j369N103J636m745k114M427K781m155l328M077L133l533l221K830L991
$$ -2068 -3437 1666 3302 -1443 -3557 870 3651 -504 -3832 245 3378 -155 -3376 -546 3445
5835C445k697m116K423M053j690m431J054M910r98m834P15M560K62m838p07N001
$$ 3445 748 -3368 -945 3108 1418 -3013 -1959 2951 1953 -2881 -2166 2394 2656 -2182 -2889 2112
5851B112J039m717j474M436J807m055k522L678L126l739l263L826L114l011l791
$$ 2112 3151 -1566 -3040 1396 3203 -852 -3374 304 3430 -309 -3572 254 3368 357 -3434
5866c434K962M021k362m365J856M407j500m717R42M926n20m512k88M958L45m837
$$ -3434 -472 3549 1187 -3178 -1322 3085 1585 -3132 -2190 2736 2216 -2296 -2584 2374 2719 -2118
5882b118o09M696J031m182j803L995K431m186k549L642L148l558l519L206L797
$$ -2118 -2727 1969 3000 -1182 -2985 1010 3441 -745 -3294 348 3496 -62 -3581 -375 3422
5897C422k636m367K773M068k095m361J676M619q95n100J024M603l61m880l5M677
$$ 3422 786 -3581 -808 3260 1165 -3196 -1520 3099 2204 -2896 -1872 2731 2370 -2510 -2545 2132
5913B132N76m471j459M729J833m498j989M039K290l633l031L631L395l338l694
$$ 2132 2708 -1763 -3222 1507 3340 -1158 -3147 892 3182 -451 -3482 149 3544 206 -3488
5928c488K724M094k443m475K127M682j834m350J196M534m76m872L97M555J43m590
$$ -3488 -764 3330 887 -3588 -1461 3221 1387 -2963 -1767 2767 2291 -2581 -2184 2371 2514 -2076
5944b076q56M678J328m778j291M192J971m064k253L514K921l483l318L584L363
$$ -2076 -2932 1746 3074 -1704 -2995 1197 3168 -896 -3149 365 3286 -197 -3515 69 3432
5959C432l049l575K202M159j969m301J791M225j187m502P24M651k88m828J94M340
$$ 3432 383 -3192 -990 3169 1200 -3101 -1310 2915 1728 -2774 -2050 2601 2313 -2515 -2321 2019
5975B019M70m126j452M729J211m103k060M242K209l351l223L889K574k901l441
$$ 2019 2489 -1637 -3089 1640 2851 -1252 -3312 930 3139 -212 -3435 454 3028 127 -3314
5990c314K809L491k250l961K142M209j673m303J078M540q47m594N04M483N7m566
$$ -3314 -505 2986 736 -3225 -1083 3126 1453 -2850 -1772 2768 1921 -2673 -2169 2314 2371 -2195
6006b195k26M615P47m651j174M232J822l933k174L597K370l221k959L149L258
$$ -2195 -2421 2194 2941 -1710 -2884 1348 3170 -763 -2937 660 3030 -191 -3150 -1 3257
6021C257k960l225K376L656k096m127J946M086j405m304J146M415o34m416K07
$$ 3257 297 -2928 -552 3104 1008 -3119 -1173 2913 1508 -2796 -1650 2765 2131 -2285 -2078
6036b078M174N16m604r31M600J260m233k059M350K155l782k673L525K938l310
$$ -2078 2096 2612 -1992 -2923 1677 2937 -1296 -3355 995 3150 -632 -3305 220 3158 -152
6051a52l046K848L658k475m063K475L660j535m186R71M525q96m518O82M141J80
$$ -152 -3198 -350 3308 833 -3230 -755 2905 1370 -2816 -1845 2680 1784 -2734 -2052 2089 2269
6067B269m441n96M664J044m546j436M300J822m020k006L655K346l571k414L049
$$ 2269 -2172 -2768 1896 2940 -1606 -3042 1258 3080 -940 -2946 709 3055 -516 -2930 119
6082A19L120l139l312K672L522j962l957J412M429j135m775J070M312m53m338
$$ 119 3239 100 -3212 -540 2982 1020 -2937 -1525 2904 1769 -3006 -1936 2376 1923 -2415
6097b415J4M382L73l936j279M373J588m216k007M104J976l855k406L728K853l149
$$ -2415 -2401 1981 2354 -1582 -2861 1512 3100 -1116 -3123 981 2957 -898 -3304 424 3277 128
6113A28l242K688L769k480l747K110L995j863m105J343M259r48m121J09M563j32
$$ 128 -3114 -426 3343 863 -2884 -774 3221 1358 -2747 -1404 2855 1907 -2214 -2105 2458 2326
6129B326m393j78M115Q44m481j237M387J659m192j709L771K484l933k691L405
$$ 2326 -2067 -2245 1870 2714 -1767 -3004 1383 3042 -1150 -2859 912 3396 -537 -3228 177
6144A77K948l037l036K358L594j879m231J848M107j456m319J309M086m49m461
$$ 177 3125 88 -2948 -590 3004 1125 -3106 -1258 2849 1393 -2926 -1617 2469 2020 -2441
6159b441J22M747L0m212p61L922J518m471j571M144K246l783k618L362K891k910
$$ -2441 -2319 2428 2458 -1754 -2515 1407 2925 -1546 -3117 1027 3273 -510 -3128 234 3125 215
6175B15l430K967L192k627l309K108L838j819l895R78M264p50m307P59M123k0
$$ 215 -3215 -248 2944 317 -2992 -884 2954 1135 -2760 -1782 2482 1732 -2575 -1816 2307 2287
6191B287m454k77M200R26m195j120L862J625l954k006L607K643l657k513K887
$$ 2287 -2167 -2444 1756 2682 -1513 -2633 1229 2854 -1100 -3106 501 3144 -513 -3026 -139
6206a39K972k580l190K220L580j832l976J734M032j386m049Q59M235n99m067J95
$$ -139 2833 253 -2937 -717 2863 1031 -2945 -1211 2821 1435 -2614 -1755 2480 1881 -2186 -1991
6222a991M372L44m715o29M021J273l843j626L818J886l658j939K833K772l269
$$ -1991 2381 2725 -1990 -2619 1402 2675 -1168 -2794 1024 2910 -748 -2687 146 2918 -351
6237c51k722K830L279k187l824J840L992j687l921J383M067j142l876L80M035
$$ -351 -3073 -243 3036 849 -2975 -1135 2857 1170 -2751 -1368 2699 1557 -2319 -1939 2096
6252B096K04l885q53M034R61l951j017L590J668l816j840L445K629l749k506L000
$$ 2096 2300 -1585 -2438 1596 2557 -1394 -2411 1179 2847 -969 -2809 636 3265 -484 -2990 10
6268A0K955k586l395K647L310k322l347J889L404j008l864R36L718k25m185M7
$$ 10 2965 379 -3016 -369 2941 619 -2728 -839 2565 1557 -2307 -1371 2347 2122 -2063 -2016
6284b016L802M97m189r96M478J125l863j456L482J901l449k141L169K650l024
$$ -2016 1786 2283 -1906 -2902 1576 2701 -1162 -2618 864 2765 -684 -2825 344 2994 -30
6299c0k822K771K683k270l042J833L569j342m039J559L580p72l985N10M050l00
$$ -30 -2852 -81 2602 332 -2710 -877 2692 1350 -2689 -1130 2450 1678 -2307 -1797 2253 1953
6315A953l752o00M006P78l897r62L453J542l615j717L279K446l085k674K825K791
$$ 1953 -1799 -2399 1607 2385 -1512 -2474 979 2521 -1094 -2811 468 2914 -171 -2845 -20 2771
6331B771k252l024K035L004j746l658J812L496j086l823P12M033o29l758L8L796
$$ 2771 519 -2505 -470 2534 788 -2870 -1058 2438 1352 -2471 -1759 2274 1645 -2113 -2075 1721
6347A721K19l521m89L130J571l594j613L558J759l065k465K897K582k705k640
$$ 1721 1940 -1581 -2070 1060 2631 -963 -2576 982 2741 -324 -2789 108 2690 -15 -2655
6362b655K710K673k204l446K237L373j586l708J029M008p87l906O21L424J91l852
$$ -2655 55 2728 524 -2922 -685 2688 1102 -2606 -1577 2431 1644 -2262 -1641 1783 1974 -1878
6378a878n3L650O70l819p31L147J441l201j574K888J871k613k488K886K536k395
$$ -1878 -1931 1719 2389 -1430 -2161 986 2427 -774 -2348 540 2411 -202 -2690 196 2732 337
6394C37k828K136L065j843l251J423L336r72l536Q12L620q30l570qL925n8l310
$$ 337 -2491 -355 2710 867 -2384 -961 2375 1403 -2133 -1321 2299 1469 -2101 -2109 1816 1758 -1552
6411a552p12L813N21k996j508L239K022l486j817K903K642l050k561K467K637
$$ -1552 -2264 1549 2070 -926 -2434 805 2827 -659 -2476 427 3069 19 -2542 -75 2562
6426B562k231k966K100K978j907l114J384L427p82l849O11L814j57l879K17L246
$$ 2562 331 -2635 -535 2443 536 -2578 -1194 2233 1451 -2398 -1787 2027 1870 -2009 -1792 1454
6442A454M17l523n95L134J586l172k026L317J768k914k139K950K177k384k495
$$ 1454 1871 -1652 -2247 887 2473 -699 -2725 592 2360 -554 -2693 257 2434 50 -2445
6457b445K076K822j966k735J661L098j449l209Q57L006j74l511j0L714n3l011
$$ -2445 -369 2453 487 -2248 -587 2511 1062 -2147 -1290 1716 1542 -1969 -1979 1735 1682 -1329
6473a329o74L217Q77l181j363L298J364l033j598K808J989k774k114K827K268
$$ -1329 -2003 1214 2091 -1090 -2453 845 2209 -824 -2422 386 2375 -399 -2513 314 2582
6488B582k467k282J681K993j560l140J350L169r99l111K25L425k62l211j90L418
$$ 2582 115 -2167 -486 2507 947 -2193 -843 2326 1327 -1784 -1559 1866 1604 -1607 -1797 1621
6504A621K39l110q84L221J230l226j310L021J633l188j755K435K579k553k344
$$ 1621 1860 -1250 -2134 1087 2317 -909 -2219 802 2435 -753 -2508 -73 2506 -47 -2391
6519b391K153K466j641k972J783L040j248l206Q76L189p86k963M77K935L31l686
$$ -2391 -238 2228 587 -2385 -602 2438 1190 -2016 -1140 2049 1263 -1700 -1223 1712 2043 -1643
6535a643m48L429Q17l238j214L422J074l145j280K663J781k426k171K393K448
$$ -1643 -2091 1338 2155 -1083 -2297 1125 2199 -946 -2226 437 2218 -208 -2379 14 2462
6550B462k368k408J637L007j839k850J436L305j498k747N34L300k11l740K16L152
$$ 2462 94 -2314 -677 2330 491 -2359 -923 2382 884 -1863 -1329 1971 1760 -1980 -1764 1388
6566A388L07k952o82L119Q28l088j201L304J303k745k046K524K641k626k413K308
$$ 1388 1695 -1257 -1939 1180 2008 -1080 -2281 1023 2326 -419 -2465 59 2700 74 -2339 -31
6582c1K497k295k245J413L004j390l258J130L016m97l149L49L211O9l395l32L641
$$ -31 2466 171 -2074 -661 2343 953 -2305 -1175 1841 1344 -1805 -1456 1755 1824 -1571 -1903 1738
6599A738K68l485l30K728J333l187j335L023J653k529k215K256K430j947k637
$$ 1738 2006 -1479 -1809 919 2252 -935 -2270 753 2406 -123 -2338 -82 2348 401 -2236
6614b236K042K646j864k973J421L122p92l413J037K898l37l246M5L410L30l256
$$ -2236 -194 2452 588 -2385 -964 2158 1366 -2047 -1010 1888 1551 -1695 -1650 1760 2090 -1166
6630a166q89L175J205l098j109K709J438k722j742K716J857k195k319J889K559
$$ -1166 -2055 1120 2325 -773 -1882 827 2265 -457 -2199 517 2374 179 -2140 -251 2308
6645B308j763k779J963K741j625k964J144L064q85l345J063K729N8l260J04L078
$$ 2308 545 -2234 -271 2470 845 -2119 -975 2089 1204 -2141 -1078 1651 1709 -1551 -1447 1631
6661A631L71l222q30L330Q30l026j216K915J174k168k182K710K159k043k670J884
$$ 1631 2002 -1220 -2050 1280 2110 -916 -2132 783 1957 -211 -2393 317 2476 433 -2237 -353
6677c53K678j893k427J107L148j216k927Q40K782n84k705J50K913R3l103n42L262
$$ -353 2325 432 -1995 -888 2260 1044 -1883 -1043 1739 1155 -1550 -1400 1513 1606 -1497 -2039 1223
6694A223J144l435q10K734J265k705j732K474K110k641j992K242K231j767k569
$$ 1223 2367 -1068 -1878 856 2121 -584 -2316 158 2268 -373 -2365 -123 2108 341 -2228
6709b228J695K745j666k810J164L113j025l106P19L228l64l008k05K826O52l161
$$ -2228 -533 2212 546 -2264 -1100 2013 988 -2118 -1399 1829 1465 -1543 -1748 1078 1730 -1431
6725a431l87K802J025k876j365K694J950k609k267K704J886k092k376J751K819
$$ -1431 -1818 984 2009 -867 -2232 462 2412 -197 -2464 240 2126 34 -2342 -591 2228
6740B228j742k386J120K857r90k841O76K910n06l056L41L024J87l421k53L135
$$ 2228 486 -1900 -780 2077 1087 -1754 -1078 1832 1326 -1730 -1389 1635 1822 -1599 -1852 1283
6756A283N56k892j012K758J715k916j449K315J948k525k132K254K190j844k481
$$ 1283 1839 -1053 -2065 693 2408 -508 -1957 358 2306 -219 -2351 -97 2093 249 -2232
6771b232J943K123j119k803J137L222r39l288N05L085l2k767p39L136Q78l304
$$ -2232 -289 1834 715 -2088 -951 2271 1332 -1956 -1451 1634 1602 -1165 -1904 1232 2110 -1194
6787a194q16L067J203l058j169K599J335k321j958K358K231k298k239J813K638
$$ -1194 -2010 1057 2260 -798 -1967 632 1967 -354 -2312 46 2277 -21 -2260 -447 2191
6802B191j830k377J415K855j246k598N37L004p12l011M81K733K28k844m63K610
$$ 2191 361 -2016 -601 2254 1008 -1590 -1053 1951 1239 -1772 -1291 1442 1670 -1174 -1637 973
6818I73P38k721j207K810J292k249j898K414J861j958k030J919J976j861k172
$$ 973 1711 -1010 -2217 593 1885 -364 -2262 152 2013 55 -1975 -56 1920 59 -2113
6833b113J470K605j359k434P62K794o89k610K96K621K2k873%K971M08l031o90
$$ -2113 -643 1962 603 -1831 -1069 1725 1036 -1574 -1278 1343 1365 -1508 -1508 1463 1871 -1160 -1850
6850a850K517J266k743j287K575J308j935k001K061K394k312k237J775K102j206
$$ -1850 667 1933 -810 -2097 478 1786 -149 -2150 -89 2305 -7 -2244 -469 1633 427
6865D27k248R43K618p42k603M08K881n44k627L15K297M38k677n72K438R64k126
$$ 427 -1821 -878 1740 998 -1605 -1197 1684 1140 -1487 -1172 1125 1563 -1114 -1686 752 1716 -410
6882d10j565K518J531k201j988K241J729j694k188J795K181j704k119J499K295
$$ -410 -1975 543 2074 -127 -2115 126 1855 161 -2027 -232 1949 245 -1874 -375 1920
6897A920j158k500Q78K910r82k739O23K561o9k877j92K828M43k696q27K841R62
$$ 1920 762 -1738 -860 2050 1068 -1671 -1048 1513 1444 -1433 -1625 1203 1646 -1050 -1877 964 1926
6914A926k565j175K219J241j705j751K151J674j613k136J457K230j530k082J300
$$ 1926 -639 -1814 405 1646 -59 -1810 341 2015 402 -1734 -277 1953 423 -1659 -359
6929c59J917p61k469N55K454M3k663m0K351L85k496m04K409R78k555j061K391
$$ -359 1558 797 -1672 -1117 1337 1380 -1283 -1323 1028 1413 -1083 -1487 922 1900 -655 -1716 675
6946F75Q02j788j728K291J406j672j700J482J960j425k184J078K411q87k423R43
$$ 675 1477 -311 -2039 252 1658 -14 -1714 -232 1728 303 -1881 -803 1608 721 -1702 -759
6962g59K285p23k441M04K737n40k286J13K461L38k560n74K458Q42k327j188K325
$$ -759 1526 803 -1638 -1234 1503 963 -1323 -1210 1251 1589 -971 -1545 913 1755 -572 -1760 565
6979E65J169j697j621J366J844j777j786J766J872j391j902Q74K455j148k376
$$ 565 1734 37 -1584 -218 1626 -151 -1937 -171 1701 310 -1592 -718 1737 589 -1787
6994a787J017K243j66k642K60K140l6k142k79K351N96k240j016K124J164k214
$$ -1787 -770 1473 1307 -1335 -1075 1065 1029 -1113 -1392 959 1555 -685 -1701 423 1587 -627
7010f27j129K113J530k071j560J671J930j506j868J176K028j229j840O88K083
$$ -627 -1756 357 1887 -184 -1744 -73 1857 351 -1517 -341 1687 458 -1382 -694 1389
7025A389n38j950L08K237l35k256j53K089L15k306j33K091Q66k215j056K185J312
$$ 1389 851 -1099 -791 1446 1111 -1145 -1298 791 1106 -1200 -1333 758 1624 -591 -1647 538 1850
7042A850k023j602K009J252j419j912J460K088j526j857J093K156j065j732N51
$$ 1850 -173 -1775 234 1486 67 -1845 -385 1703 177 -1680 -587 1569 504 -1228 -677
7057f77K310q09k037J82K259Lk230l85K255K52j976p48K314N41j887p42J424J499
$$ -677 1633 824 -1213 -1031 1228 1231 -999 -1384 871 1123 -853 -1601 713 1254 -633 -1375 49 1548
7075A548j651j502J559J391j139j529R92J829q79k045Q69J873p82k088P03K029
$$ 1548 -103 -1605 -46 1345 206 -1323 -331 1498 619 -1426 -557 1316 534 -1554 -851 1178
7091A178k24k052n2K247J07k256m08K128P64k202o00J678J342k116j028J813Q67
$$ 1178 954 -1098 -1150 1097 1204 -1052 -1460 668 1432 -770 -1370 308 1650 -466 -1494 319 1186
7108A186j014j717J539J569j424j907J299J574o86k034R93J897m70j728RK208
$$ 1186 172 -1545 -6 1563 139 -1768 -469 1105 419 -1615 -622 1275 805 -923 -914 1294
7124A294k23j877n32K248J48j636r74K374Q63k322q31K091J077j909j395J464
$$ 1294 1071 -806 -1338 910 1058 -578 -1552 822 1685 -637 -1468 623 1700 -209 -1604 -140
7140a40J567j339j713J475J812j027j837N91J726l43k137N98J781j85j722j96
$$ -140 1427 88 -1625 -150 1662 635 -1202 -611 1115 772 -1365 -767 1014 829 -893 -1089
7156a089K029k4j463m81J883M27j937p65J828J073j938q71J735R93j425j433J543
$$ -1089 940 916 -547 -1028 855 1282 -655 -1420 408 1481 -457 -1328 407 1400 -25 -1458 85
7173H5J319j016j752J048J860j090j880O23K386j095j845P79J868j47k222j41
$$ 85 1404 388 -1364 -316 1544 454 -1426 -803 1583 488 -1357 -578 1290 1143 -1079 -1220
7189a220K087N27k293l59J888P26k061o81J747R12j386j126J189J452j361j266
$$ -1220 867 1394 -899 -1258 630 1356 -705 -1386 361 1273 -113 -1239 -50 1402 41 -1225
7205a225J169J297q71j740Q82J730n81j751K40J770j70j710j1J921L30k035m65
$$ -1225 -56 1241 370 -1370 -488 1242 661 -1090 -850 920 750 -960 -971 950 1280 -755 -1220
7222a220J995N89j668q23J546Q60j846q79J733J192j864j017J359J563j367j658
$$ -1220 775 1364 -304 -1127 419 1279 -567 -1446 287 1479 -385 -1402 -43 1520 153 -1505
7238a505J065J509n72j676Q03J356j75j640J00J578m8j571j78J867L73k150n21
$$ -1505 -440 1069 497 -1179 -376 980 805 -835 -735 843 795 -776 -954 913 1286 -864 -1385
7255a385J928L80j245j020J802P71j775q45J614J287j173j697J008J625q32j722
$$ -1385 543 923 -322 -1342 460 1231 -544 -1389 225 1512 339 -1358 -350 1275 443 -1279
7271a279O26J820n07j951O85J835l30k040K49J955j18j695j88J904K61j772o98
$$ -1279 -653 1167 660 -1291 -606 1229 899 -1141 -892 1063 945 -750 -938 966 1227 -545 -1243
7288a243J837P73j406j135J378J119j357j311J121J574j179j566J169J639j051
$$ -1243 594 1367 -39 -1174 204 1323 -34 -1345 -224 1350 171 -1395 -226 1413 362
7303C62j641J030J062l28j618L16J818j65k061K37J628L03j554k95J554L60j213
$$ 362 -1279 -249 813 485 -1133 -817 1001 836 -1225 -988 640 943 -611 -906 648 1008 -205
7320b05q60J459O61j338r51J145J120j024j276J555P23j035j431R42J722o78j671
$$ -205 -1065 394 1055 -283 -1234 -89 1031 7 -1269 286 1009 -26 -1457 -515 1207 529 -1142
7337a142N80J640o11j400J12J514J01j562p8J544N11j763m25J508P09j348j268
$$ -1142 -562 1078 467 -933 -821 693 794 -768 -846 698 1209 -554 -979 529 1238 -110 -1378
7354a378J758J139j266j414R73J592j447j036J114J078r96j511J120J249n23j406
$$ -1378 380 1519 253 -1161 -188 1404 -43 -1079 35 1113 117 -1394 -274 975 452 -954
7370i54m2K002k26j644K98J450O1j414m78J514O54j415q42J295J097j362j332
$$ -954 -996 1006 780 -864 -566 884 945 -469 -947 567 1221 -194 -1036 259 1356 -6 -1338
7387a338J698J030j250j251J063J340r41j285M95J848p48j921M09K029p37j468
$$ -1338 360 1390 140 -1111 -48 1292 351 -934 -439 1409 661 -1260 -851 1178 441 -1027
7403a027K80J605p7j314n28J674M19j543o44J645O70j445p75J138J050j383q79
$$ -1027 -747 858 781 -533 -1061 613 1032 -511 -1155 490 1160 -285 -1060 78 1128 -255 -1134
7420a134J283J182j708p04Q04J267p99j325O51J338m06j486P1J887j64j416o4
$$ -1134 149 1331 -377 -1081 -277 990 191 -1134 -483 855 449 -1037 -966 921 757 -659 -723
7437g23J656q2j575k35J747Q9j199p74J587P98j557q99Q84J536j362r03N58J623
$$ -723 933 851 -724 -959 788 877 -322 -1096 491 1289 -268 -1167 -283 1253 -109 -1012 -454 1169
7455A169j105j008O08J561p69j454O19J236j07j864J39J610j23j121j98J631M9
$$ 1169 64 -944 -336 1225 456 -998 -379 857 750 -1114 -975 635 512 -609 -807 824 873
7472H73j471j79J230P13j436j018J265J263j312r23J155R17p64j197P06J225n68
$$ 873 -598 -777 453 1166 -270 -1288 -23 1240 -72 -995 160 1077 313 -884 -178 1047 479
7489D79j418N00J483o27j522L35J603k59j215n0J326J55j565j88J664K03j038
$$ 479 -939 -439 1044 417 -1105 -770 833 574 -641 -691 635 790 -775 -963 701 904 -134
7506a34p51J142N47j025j035J565M28o72q14Q05J022p57j375P98J317m39j474
$$ -134 -885 257 804 -221 -1256 309 737 65 -749 56 1078 321 -1054 -256 1061 622 -852
7523h52J78J514l65j125R2J298j4j346K5J191L84j325m89J308L80j178p99R83
$$ -852 -674 840 475 -650 -558 740 726 -620 -595 596 980 -345 -834 474 854 -324 -1123 -140
7541a40R86o35r02P49J219j053j198Q63Q67j56j411N35J165j96j425K13J267k60
$$ -140 846 211 -691 58 1277 224 -974 -111 756 600 -811 -276 889 693 -732 -519 748 488
7559D88j072LJ218j44r36l11J292M17j263l70J197N38j307j038J367P77o60j077
$$ 488 -584 -581 637 493 -443 -754 538 955 -308 -678 519 1057 -250 -1288 79 856 196 -881
7577h81R11R53q68j061O43J126l93j101P3J264n1j109j70J138J66j149m35J400
$$ -881 30 983 115 -946 -303 823 430 -671 -598 666 615 -494 -664 474 640 -509 -944 456
7595D56M52j538k32R98Q01j217p03J062R36q88j009Q47Q10p91q02K71J212j44
$$ 456 908 -630 -862 136 937 -280 -983 79 1015 127 -882 -35 775 -16 -818 -547 665 521
7613E21j473M37J371m72j111M44N99j60n70k52J026L43j114k38J098O33j483N
$$ 521 -952 -515 856 384 -727 -283 316 156 -414 -666 360 703 -411 -649 449 1082 -401 -396
7631c96Q79M59j049o33N60R49p10q79O17Q65m90q72L66R02k03j038M13R13l43
$$ -396 483 942 -107 -740 -180 769 59 -820 -203 662 172 -700 -334 568 365 -673 -260 653 310
7650C10q59K10R36j33j021J78P43L14j212n3Q79M41r64l15J040K13q53p47R34
$$ 310 -549 -339 597 464 -557 -379 364 678 -534 -587 292 733 -231 -546 494 707 -146 -893 41
7669D1O71m39q18N15P08m27r66M98O58O9q76P0J027l80q22O0P88J74j281K30R60
$$ 41 712 273 -545 -30 678 251 -715 -217 441 510 -366 -296 731 351 -471 -411 377 551 -730 -500 460
7690D60L32j087k14J023O0n44p94J219M74r27r90P52R82l70j140O27R18q16o12
$$ 460 792 -295 -509 514 574 30 -764 455 929 2 -988 -236 746 376 -764 -137 781 -35 -647
7709f47J96J154m01r16K57Q81k33r04L38P67l2n98l25J046K6p06o14R35M59p46
$$ -647 -451 703 302 -614 -357 524 291 -613 -275 492 460 -138 -463 583 609 -97 -711 224 683 -63
7729f3o06Q79M03p04o54M56Q34n47m32L25O53l33q76K00R66j48r60MJ475j93j056
$$ -63 -669 210 613 -91 -745 -289 545 -2 -434 -109 544 211 -665 -465 501 353 -607 -603 872 679 -377
7750c77q3R80K52j199j76P97M57q18n04N44M82m98o60Q23P68o12p56K99R00n04
$$ -377 -460 520 772 -427 -603 194 651 -167 -671 -127 355 -143 -803 20 788 176 -580 -281 619 115
7770A15n86M45O10l19r27M90O59q1n48J6P70j50o31l80Q45J81q27j19O70L81p08
$$ 115 -471 -26 584 265 -662 -172 487 406 -142 -126 644 494 -137 -517 328 509 -318 -437 233 614 -94
7791i4l40L35P63o90n65L70O15j80q76J48J350m71o70J24R50k94q33J09M06J42
$$ -94 -434 -99 664 -26 -591 -221 394 214 -662 -514 836 365 -305 -181 769 475 -358 -249 157 299
7811B99q14R7J147j8p89l34M76L00o81m10R32O76q59m10M54P77q81m74O70N79
$$ 299 -515 -418 729 711 -78 -412 64 364 -317 -727 205 881 22 -388 66 843 -38 -512 158 737
7831G37o01p54N61N49k05q63L55N74J94j105q0J189k20p30j45O83N00n09m69N91
$$ 737 136 -618 -57 492 287 -576 -221 353 547 -558 -638 551 331 -399 -544 139 639 130 -339 252
7851B52K19k60q95N47P41p70l25M96N81n08m78J38O99n8j135N64Q88n27o57J19
$$ 252 471 211 -684 -137 604 -166 -491 5 586 78 -400 -262 437 379 -756 -192 696 169 -488 -369
7871c69R66j61q30R5N27L75q44m91Q26N89r21k28O33K57q13M9M58L01n44j19L29
$$ -369 597 436 -394 -299 228 603 -241 -732 94 683 -238 -466 167 424 -389 -340 118 419 -125 -244 85
7892H5N03n40n50L22N97j49n56R3P03n26Qj83N51r9l40l78P18J31n19k80O56L94
$$ 85 588 48 -502 -180 417 268 -288 -195 508 -18 -10 -193 358 259 -81 -459 259 390 -129 -409 247 641
7914F41q26j99N32L54m59l46M40L15k05n83j02Q66j55m52n8O58j25p48L29N89
$$ 641 -185 -384 148 502 43 -303 137 452 247 -336 -438 428 273 -179 -237 421 296 -452 -123 466
7934D66q6o56l1M67K59l91l49K44O62m79m72N18M69o35l46K98M35o07k51L91L46
$$ 466 380 -276 -307 160 419 28 -321 -77 585 106 -366 152 621 -14 -360 -62 373 -234 -485 -94 252
7955B52l10o83M42O14J81j097M20N04j66n43J80QM47o94O5O77K43o62n05Q80K12
$$ 252 -58 -741 -299 315 496 -601 -181 323 157 -386 -206 -198 249 -445 -380 297 540 -122 -627 253 465
7976D65n51k80M05L90n97k06L47O38m90q48M60N41k27m43J16L97j34m47K78N04
$$ 465 -86 -366 39 429 -168 -374 -27 611 121 -727 -267 274 47 -396 -280 117 -17 -464 -186 318
7996C18J46m41m86O82K34n53k58L89M6k48k69M30L33m35k64N51L9j14m76N48K51
$$ 318 464 23 -463 219 453 -100 -358 31 77 -171 -440 -10 323 -112 -376 175 214 100 -376 172 423
$$ [...]
8191f5
##END NTUPLES=NMR FID
##END=
